##TITLE=31Pdec_DE-99oil
 CDCl3, 64 sc
 2.7.2025
##JCAMPDX= 6.0         $$ Bruker NMR JCAMP-DX V2.0
##DATA TYPE= NMR SPECTRUM
##DATA CLASS= NTUPLES
##ORIGIN= UXNMR, Bruker Analytische Messtechnik GmbH
##OWNER= root
$$ XWIN-NMR		Version 3.5
$$ Wed Jul  2 16:53:11 2025 Russian Standard Time (UT+4h)  she@DPX200
##.OBSERVE FREQUENCY= 81.013821
##.OBSERVE NUCLEUS= ^31P
##.ACQUISITION MODE= SIMULTANEOUS
##.ACQUISITION SCHEME= undefined
##.AVERAGES= 64
##.DIGITISER RES= 17
##SPECTROMETER/DATA SYSTEM= spect
##.PULSE SEQUENCE= zgpg30
##.SOLVENT NAME= CDCl3
##.SHIFT REFERENCE= (INTERNAL, CDCl3, 0, 198.062)
##AUDIT TRAIL= $$ (NUMBER, WHEN, WHO, WHERE, WHAT)
$$ ##TITLE= Audit trail, XWIN-NMR		Version 3.5
$$ ##JCAMPDX= 5.01
$$ ##ORIGIN= Bruker BioSpin GmbH
$$ ##OWNER= she
$$ F:/spectra/data/she/nmr/P31/2/pdata/1/auditp.txt
$$ ##AUDIT TRAIL=  $$ (NUMBER, WHEN, WHO, WHERE, WHAT)
(   1,<2025-07-02 16:52:14.79 +0400>,<she>,<DPX200>,
      <created by zg, POWCHK disabled, PULCHK disabled
       configuration hash MD5:
       00 E9 B6 7A A2 85 ED C7 34 08 36 98 17 FE 4E 26
       data hash MD5: 32K
       19 96 98 FA B9 1D 5C D5 67 E3 CC 66 A2 C7 2E 3E>)
(   2,<2025-07-02 16:52:17.28 +0400>,<she>,<DPX200>,
      <Start of raw data processing
       efp BC_mod = 2 LB = 1.5 FT_mod = 6 PKNL = 1 PHC0 = 1298.547 PHC1 = 351.894 SI = 64K 
       data hash MD5: 64K
       FB 50 B5 8C A6 E0 6D 6D 5E EB 19 74 9E D7 FC 9B>)
(   3,<2025-07-02 16:52:33.51 +0400>,<she>,<DPX200>,
      <pk PHC0 = 6.440078 PHC1 = 0 
       data hash MD5: 64K
       CE 92 C9 E2 17 79 C7 05 63 5A 4A 5C D1 AA BD 2E>)
$$ ##END=
$$ 
$$ hash MD5
$$ A4 6D 13 2B 68 99 81 03 BA 0A C4 28 96 3E F1 D8
##$RELAX= 
##$RELAX= 
##$RELAX= 
##$RELAX= 
##$RELAX= 
##$RELAX= 
##$RELAX= 
##$RELAX= 
$$ Bruker specific parameters
$$ --------------------------
##$DU= <F:/spectra>
##$EXPNO= 2
##$NAME= <P31>
##$PROCNO= 1
##$TYPE= <nmr>
##$USER= <she>
##$AMP= (0..31)
100 100 100 100 100 100 100 100 100 100 100 100 100 100 100 100 100 100 
100 100 100 100 100 100 100 100 100 100 100 100 100 100 
##$AQSEQ= 0
##$AQ_mod= 1
##$AUNM= <au_zg>
##$AUTOPOS= <>
##$BF1= 81.014009
##$BF2= 200.13
##$BF3= 200.13
##$BF4= 200.13
##$BF5= 200.13
##$BF6= 200.13
##$BF7= 200.13
##$BF8= 200.13
##$BYTORDA= 1
##$CFDGTYP= 0
##$CFRGTYP= 5
##$CHEMSTR= <none>
##$CNST= (0..31)
1 1 145 1 1 1 1 1 1 1 1 1 1 1 1 1 1 1 1 1 1 1 1 1 1 1 1 1 1 1 1 1 
##$CPDPRG= <waltz16>
##$CPDPRG1= <>
##$CPDPRG2= <waltz16>
##$CPDPRG3= <>
##$CPDPRG4= <mlev>
##$CPDPRG5= <mlev>
##$CPDPRG6= <mlev>
##$CPDPRG7= <mlev>
##$CPDPRG8= <mlev>
##$CPDPRGB= <>
##$CPDPRGT= <>
##$D= (0..31)
0 1 0 0 0 0 0 0 0 0.06 0 0.03 2e-05 3e-06 0 0 0.0002 0 0 0 0 0 0 0 0 0 
0 0 0 0 0 0 
##$DATE= 1751460734
##$DBL= (0..7)
120 120 120 11 120 120 24 19 
##$DBP= (0..7)
150 150 150 150 150 150 150 150 
##$DBP07= 0
##$DBPNAM0= <>
##$DBPNAM1= <>
##$DBPNAM2= <>
##$DBPNAM3= <>
##$DBPNAM4= <>
##$DBPNAM5= <>
##$DBPNAM6= <>
##$DBPNAM7= <>
##$DBPOAL= (0..7)
0.5 0.5 0.5 0.5 0.5 0.5 0.5 0.5 
##$DBPOFFS= (0..7)
$$ [...]
##$SUBNAM2= <"">
##$SUBNAM3= <"">
##$SUBNAM4= <"">
##$SUBNAM5= <"">
##$SUBNAM6= <"">
##$SUBNAM7= <"">
##$SUBNAM8= <"">
##$SUBNAM9= <"">
##$SW= 400.765351723535
##$SWIBOX= (0..15)
0 1 3 0 0 0 0 0 0 0 0 0 0 0 0 0 
##$SW_h= 32467.5324675325
##$TD= 32768
##$TD0= 1
##$TE= 0
##$TE2= 300
##$TE3= 300
##$TEG= 300
##$TL= (0..7)
0 120 53 12 22 120 120 120 
##$TP= (0..7)
150 150 150 150 150 150 150 150 
##$TP07= 0
##$TPNAME0= <>
##$TPNAME1= <>
##$TPNAME2= <>
##$TPNAME3= <>
##$TPNAME4= <>
##$TPNAME5= <>
##$TPNAME6= <>
##$TPNAME7= <>
##$TPOAL= (0..7)
0.5 0.5 0.5 0.5 0.5 0.5 0.5 0.5 
##$TPOFFS= (0..7)
0 0 0 0 0 0 0 0 
##$TUNHIN= 0
##$TUNHOUT= 0
##$TUNXOUT= 0
##$USERA1= <user>
##$USERA2= <user>
##$USERA3= <user>
##$USERA4= <user>
##$USERA5= <user>
##$V9= 5
##$VALIST= <valist>
##$VCLIST= <CCCCCCCCCCCCCCC>
##$VD= 0
##$VDLIST= <DDDDDDDDDDDDDDD>
##$VPLIST= <PPPPPPPPPPPPPPP>
##$VTLIST= <TTTTTTTTTTTTTTT>
##$WBST= 1024
##$WBSW= 4
##$XGAIN= (0..3)
0 0 0 0 
##$XL= 0
##$YL= 0
##$YMAX_a= 7969
##$YMIN_a= -9116
##$ZGOPTNS= <>
##$ZL1= 120
##$ZL2= 120
##$ZL3= 120
##$ZL4= 120
##$ABSF1= 0
##$ABSF2= 0
##$ABSG= 0
##$ABSL= 0
##$ALPHA= 0
##$AQORDER= 0
##$ASSFAC= 0
##$ASSFACI= 0
##$ASSFACX= 0
##$ASSWID= 0
##$AUNMP= <proc_1d>
##$AZFE= 0.1
##$AZFW= 0.5
##$BCFW= 0
##$BC_mod= 2
##$BYTORDP= 0
##$COROFFS= 0
##$CY= -3
##$DATMOD= 1
##$DC= 0
##$DFILT= <>
##$DTYPP= 0
##$F1P= 0
##$F2P= 0
##$FCOR= 1
##$FTSIZE= 65536
##$FT_mod= 6
##$GAMMA= 0
##$GB= 0
##$INTBC= 1
##$INTSCL= 9.790993e-09
##$ISEN= 30
##$LB= 1.5
##$LEV0= 0
##$LPBIN= 0
##$MAXI= 10000
##$MC2= 0
##$MEAN= 0
##$ME_mod= 0
##$MI= 50
##$NCOEF= 0
##$NC_proc= -7
##$NLEV= 6
##$NOISF1= 182.463
##$NOISF2= 159.3651
##$NSP= 0
##$NTH_PI= 0
##$NZP= 0
##$OFFSET= 198.0616
##$PC= 4
##$PHC0= 1304.987
##$PHC1= 351.894
##$PH_mod= 1
##$PKNL= yes
##$PPARMOD= 0
##$PSCAL= 0
##$PSIGN= 0
##$REVERSE= no
##$SF= 81.0140089999434
##$SI= 65536
##$SIGF1= 159.3651
##$SIGF2= -187.1042
##$SINO= 113.3802
##$SIOLD= 16384
##$SREGLST= <1H.CDCl3>
##$SSB= 0
##$STSI= 65536
##$STSR= 0
##$SW_p= 32467.5324675325
##$SYMM= 0
##$S_DEV= 0
##$TDeff= 32768
##$TDoff= 0
##$TI= <>
##$TILT= no
##$TM1= 0
##$TM2= 0
##$TOPLEV= 0
##$USERP1= <user>
##$USERP2= <user>
##$USERP3= <user>
##$USERP4= <user>
##$USERP5= <user>
##$WDW= 1
##$XDIM= 65536
##$YMAX_p= 350547534
##$YMIN_p= -65785158
$$ End of Bruker specific parameters
$$ ---------------------------------
##NTUPLES= NMR SPECTRUM
##VAR_NAME=  FREQUENCY,     SPECTRUM/REAL,   SPECTRUM/IMAG
##SYMBOL=    X,             R,               I
##VAR_TYPE=  INDEPENDENT,   DEPENDENT,       DEPENDENT
##VAR_FORM=  AFFN,          ASDF,            ASDF
##VAR_DIM=   65536,         65536,           65536
##UNITS=     HZ,            ARBITRARY UNITS, ARBITRARY UNITS
##FACTOR=    0.49542278885378, 1,            1
##FIRST=     16045.7642231865, 0,            0
##LAST=      -16421.768244346, 0,            0
##MIN=       -16421.768244346, -65785158,    0
##MAX=       16045.7642231865, 350547534,    0
$$ Real data points
##PAGE= N=1
##DATA TABLE= (X++(R..R)), XYDATA
$$ [...]
44865B858287K0484j93813m06617m3333K63726l58933j271050j044995K10513
44856C4269Q77490M17056K50042J295675K183430J264387o72085j388139m56147
44847C805978K20642o86371k066309k110309p85264M33092O80983M88968N52046
44838E33456O61249K41258n77094j013132o98870j38320J49700M38735J094091
44829F91073J396228J91126k042064l020056j421388J165108K253864J624152
44821H38043R37184P86538J65389j084214j485931l65200Q26818P71342K30539
44812A620508L60711N82414j09713r21239m36741P21718O54557o75331j323383
44803D73501n48133J00382m70419j058115j92828J519311K362769J777652M83837
$$ y = [2858287, 2878771, 2684958, 2278341, 2235008, 2498734, 2139801, 868751, -176244, 34269, 911759, 1328815, 1578857, 2874532, 5057962, 6322349, 5650264, 4262125, 3805978, 4026620, 3340249, 1273940, -836369, -1621633, -1188541, -507558, -18590, 533456, 1194705, 1435963, 858869, -154263, -853133, -991453, -841753, -403018, 691073, 2087301, 2278427, 236363, -2783693, -4205081, -3039973, -786109, 838043, 1775227, 2561765, 2727154, 1642940, 157009, -208191, 618627, 1389969, 1620508, 1981219, 2563633, 2453920, 1532681, 1095940, 1817658, 2472215, 1796884, 473501, -74632, 25750, -444669, -1502784, -1695612, -176301, 2186468, 3964120, 4447957]
44794D447957q39944j864452k193719j713038j016406o80576m55877J60971R97502
44785c157582J536041J708077J626772R84685m25836j864128k135921q87789J085112
44776a530569K596814K744160J335561p23078j931084j751803j198223j229407
44768a687629j322045o41634J74237o0218q19823l75661J362213K382466J511988
44759E23894Q6944k50474J13620p3948o79426o81166j24606R6574l286L67704
44749f24170J011747P96889k81091p35296R1344Q35471K37098p93753n89518O25005
44739E73726J067672P7789j088813j274344q18910m76195j71569L60433O65406
44730a084805L27679J7394O43476J740982J855086O03817o78256p08146J55837
$$ y = [4447957, 3608013, 1743561, -450158, -2163196, -3179602, -3860178, -4316055, -4155084, -3157582, -1621541, 86536, 1713308, 2697993, 2272157, 408029, -1727892, -2615681, -1530569, 1066245, 3810405, 5145966, 4422888, 2491804, 740001, -458222, -1687629, -3009674, -3651308, -3477071, -3537289, -4357112, -4732773, -3370560, -988094, 523894, 610838, 360364, 473984, 400036, -279390, -960556, -1085162, -988588, -991874, -624170, 387577, 1184466, 903375, 168079, 259423, 1094894, 1331992, 538239, -51279, 573726, 1641398, 1719187, 630374, -643970, -1462880, -1939075, -2110644, -1750211, -1084805, -757126, -739732, -96256, 1644726, 3499812, 4103629, 3425373, 2717227, 2873064]
44721B873064O11158J16216o98631j007925o35736l0964K21148j05128o50935
44712F92267q01107l34214M03515R93821J282065J110010K02877j275093k388972
44703a14831k197304p98467P41978J457190J197690M29665k86946o22211o18973
44694h12209n95607p22806p27838k50772N30710R21028M69317m37284q76323k98543
44684b800327Q80839J649189J405477N02556l15655p59588r38643p62350j01705
44675a240207N07841K25285p55318j118295k14068Q95908R12023O1034n27220
44666a253017n49458n17220m93477j06203M06778M37246K09539M79550J054614
44657c31648R90755L71218L46859J031792R89405m52090j919713k033745j287552
$$ y = [2873064, 3484222, 3600438, 2901807, 1893882, 1258146, 1227182, 1448330, 1343202, 692267, -108840, -443054, -39539, 954282, 2236347, 3346357, 3549234, 2274141, -114831, -2312135, -3110602, -2368624, -911434, 286256, 715921, 428975, -193236, -812209, -1407816, -2130622, -2858460, -3109232, -2578522, -1657494, -1188177, -1625461, -2501784, -2800327, -1919488, -270299, 1135178, 1637734, 1322079, 562491, -376152, -1138502, -1240207, -732366, -507081, -1262399, -2380694, -2594762, -1698854, -786831, -725797, -1253017, -1802475, -2319695, -2813172, -2919375, -2512597, -2075351, -1865812, -1386262, -331648, 659107, 1030325, 1377184, 2408976, 3398381, 2946291, 1026578, -1007167, -2294719]
44648b294719o64306K16367J921632L307303K807600J010471r5562j73440p30410
44639E304936k166687k824666j682095q7412K90878k46296m27346q4784J60430
44630a763042L81110R85503J397723O34603r07423j618783q19473L93256P52656
44621e63870K97518k06381m54327n30872k26123P44684J955185K373623J473899
44612D863336o1041r84805p77280j13050M9203l10096l20727L95694Q95467N5444
44602C692145j662445k433181j328721L92765Q94141J32842l04795M13265J277561
44593A073577J141591M89410N27236J091875P80949p49846j872618j043697J033530
44584B472007K166580J213309q79993k338646k182324p77620N64069O65570k56296
$$ y = [-2294719, -2959025, -2742658, -821026, 2486277, 5293877, 6304348, 6208786, 6035346, 5304936, 3138249, 313583, -1368512, -1455924, -1165046, -1411342, -1838688, -1923472, -1763042, -1381932, -396429, 1001294, 1635897, 728474, -890309, -1709782, -1316526, -563870, -266352, -472733, -927060, -1457932, -1684055, -939371, 1015814, 3389437, 4863336, 4802295, 3817490, 3040210, 2927160, 2976363, 2666267, 2345540, 2741234, 3636701, 3692145, 2029700, -403481, -1732202, -1339437, -445296, -312454, -617249, -203984, 1073577, 2215168, 2704578, 3231814, 4323689, 5104638, 4354792, 2482174, 1438477, 2472007, 4638587, 5851896, 4971903, 2633257, 450933, -326687, 237382, 902952, 646656]
44575F46656o58908L40778J511007J109765m44689j081457k74530J94833o72937
44566F70518j296559k56603R71509K46021j459681j217574J241155K884940J841014
44557C624740j20686o97878l34564o44337j360248j079111p130L34458k27245
44548e12001k69655P08382J415735R16947Q6400J14670O83281N44567o91838k080758
44538I15730k382456j245176M06798J123725M31142n71849o33705J008K52803
44529a701980J05242M46010J126148R48709k0043o9002J256245J779737j49196
44520C721870k698857k897833q95282N54373L70405K49704J275684K069577J369309
44511C118950K83372M19333J290897J288029K51798n68518n74058l56679m61542
$$ y = [646656, -12252, 328526, 1839533, 2949298, 2504609, 1423152, 1148622, 1343455, 670518, -626041, -882644, 88865, 334886, -1124795, -2342369, -1101214, 1783726, 3624740, 3504054, 2806176, 2471612, 1827275, 467027, -612084, -619214, -284756, -512001, -781656, -73274, 1342461, 2259408, 2345808, 2460478, 3143759, 3688326, 2996488, 915730, -1466726, -2711902, -2305104, -1181379, -750237, -1322086, -1955791, -1954783, -1701980, -1596738, -1150728, -24580, 924129, 904086, 835084, 2091329, 3871066, 3721870, 1023013, -1874820, -2770102, -2215729, -1845324, -1595620, -319936, 1749641, 3118950, 3402322, 3821655, 5112552, 6400581, 6652379, 6083861, 5509803, 5153124, 4691582]
44502D691582q51575j409918j877744j512130N0833J714979J878605N05015q70997
44493B318650j282543j275119j449795j343677m25231Q22757J646257K067415
44485A078714K327922J967552N15826j287060k085430j677342j177117j248081
44477a585016j133957N1805J767518K505622J598651j1020q41397l70582O07489
44468B589113R07443J19268j062368j582085j064646r4771N04877N45757N10672
44459A373260P58116R01153K48653j071284j789148q10244J165071K035153P60813
44450C571543j152171j470140j93620N01140n52712j760605j077997J018872K274056
44441A158366J784264P52833J83186m21368j502290k172328j562665l20109M05465
$$ y = [4691582, 3840007, 2430089, 552345, -959785, -908952, 806027, 2684632, 3189647, 2318650, 1036107, -239012, -1688807, -3032484, -3457715, -2634958, -988701, 1078714, 3406636, 5374188, 5890014, 4602954, 2517524, 840182, -336935, -1585016, -2718973, -2667168, -899650, 1605972, 3204623, 3193603, 2352206, 1981624, 2589113, 3496556, 3615824, 2553456, 971371, -93275, -188046, 316831, 862588, 1373260, 2131376, 3032529, 3281182, 2209898, 420750, -389494, 775577, 2810730, 3571543, 2419372, 949232, 755612, 1256752, 704040, -1056565, -2134562, -1115690, 1158366, 2942630, 3695463, 3878649, 3457281, 1954991, -217337, -1780002, -2100111, -1694646]
44432a694646N82776O96117L79363q13442j844522j160641Q97631K325037K160888
44423A528561J323916N95419l54794j426334j537737n66849j7314n45307o39127
44414a639566O73381J632235M30348j424923j158116P97269J414984r0503j227670
44405e92561m84913M80273P9347n71540j1163Q67125N97638j38690J25164Q55333
44395A206013M94100n93100n70167P73564J614469Q58548o10046j648768k065286
44386e40673j789639n29252J166400J900438J161891K097m88502l28408J10012
44377F64364Q16305J518864J418124K66683j062815j636940j376653n89778M89488
44368E07642J311105J182598L28046k27834k74126o97617j577567j485685K37606
$$ y = [-1694646, -1111870, -415753, -36390, -849832, -2694354, -3854995, -2957364, -632327, 1528561, 2852477, 3447896, 3093102, 1666768, 129031, -437818, -455132, -1000439, -1639566, -966185, 666050, 1096398, -328525, -1486641, -689372, 725612, 635109, -592561, -1077474, -597201, -517854, -1089394, -1100557, -233432, 364206, 225516, 350680, 1206013, 1700113, 1107013, 536846, 1310410, 2924879, 3783427, 3173381, 1524613, -540673, -2330312, -2859564, -1693164, 207274, 1369165, 1371262, 882760, 554352, 664364, 1480669, 2999533, 4417657, 4684340, 3621525, 1984585, 607932, 18154, 507642, 1818747, 3001345, 3329391, 3101557, 2827431, 2129814, 552247, -933438, -695832]
44359f95832J872100J448187n09655j889768j813591r49040K31663J600261K189424
44350A483749R40304j237292k018903o93254R71144J344755Q38488N40237M77176
44341B646404J88920j90614m45279q79402j436669j170126K99689J600746J147114
44332A760783o17469j704518j047809N57303J764101J883656Q96670o56359j642796
44323A193562j136291L96550J362298Q24224m76296j154390p81350j06377J1906
44314A33836m83430r33320p12473J68910J122996J512082J064687k7324j133187
44305G12777j441167o65066M80115R81103P15649L48375P2340n93240j489908
44296h79022j474125j32684J191290J136830K39259j05683J95341L10042L82396
$$ y = [-695832, 1176268, 2624455, 2114800, 225032, -1588559, -2537599, -2305936, -705675, 1483749, 2424053, 1186761, -832142, -1525396, -554252, 790503, 1628991, 2169228, 2646404, 2835324, 2644710, 2199431, 1320029, -116640, -1286766, -987077, 613669, 1760783, 1143314, -561204, -1609013, -1051710, 712391, 2596047, 3492717, 2836358, 1193562, 57271, 453821, 1816119, 2640343, 2164047, 1009657, 228307, 121930, 133836, -349594, -1282914, -1995387, -1826477, -703481, 808601, 1873288, 1845964, 712777, -728390, -1393456, -913341, 67762, 783411, 1131786, 1204126, 610886, -879022, -2353147, -2485831, -1294541, -157711, 81548, -24135, 171206, 481248, 863644]
44287H63644J153201J895314R15613j435187k388294m89156K044737K206403J77154
44278D943429j294876p34540O26760J054096L37437o48988j212765j184448p34298
44269A151807k90940k70886o72399j125902j272137q79677J07517J253306J718774
44260b80537J194940M11794J34964O3513m87706j182843j012869L7770Q26879
44251b94095P78602O55757J100162J425502P51760l36178m03888O66683J183445
44242E527750k21421k568301l392254j641616R25484J723521L77680j007397o86394
44233i62948N76002Q63369j07146p09561J83069J645570K009021J023678P4530
44224D595584M05344J564076J827532K34947k012144k723086j390096J36907J72962
$$ y = [863644, 2016845, 3912159, 4827772, 3392585, 1004291, 515135, 2559872, 4766275, 4943429, 3648553, 2914013, 3540773, 4594869, 4932306, 4283318, 3070553, 1886105, 1151807, 860867, 589981, -82418, -1208320, -2480457, -3360134, -3252617, -1999311, -280537, 914403, 1326197, 1461161, 1524674, 1036968, -145875, -1158744, -1120974, -294095, 484507, 1140264, 2240426, 3665928, 4417688, 4081510, 3677622, 4344305, 5527750, 5306329, 2738028, -654226, -2295842, -1370358, 353163, 730843, -276554, -962948, -386946, 476423, 369277, -340284, -157215, 1488355, 3497376, 4521054, 4595584, 5000928, 6565004, 8392536, 8627483, 6615339, 3892253, 2502157, 2639064, 2812026]
44215B812026n66176l59615O76265Q17063m27199j556280j486299r25699o41448
44206a657362p3860J170544J940328J178602j68563n69356m14355j216212k721429
44197b531663k886366r64827J206984J684829P62750K1467J63150P74447J433093
44188c36136J942188J828833O34907j207628k424535k045887l05453J586738K402624
44179B075651J749646K54322j019413j415313j047420m82257k05506l10721n06314
44170i07325m30812p5455J85507R1552j56084k16673n1203K10875N92688J108764
44160C51834J498278J510497J273449R89679M98854l68728j202869j343470p08999
44151B498525J80710Q25522Q80064L0396j437699k215344j250561M73932O70669
$$ y = [2812026, 2245850, 1886235, 2562500, 3379563, 2952364, 1396084, -90215, -1015914, -1657362, -1731222, -560678, 1379650, 2558252, 2389689, 1820333, 1405978, 189766, -2531663, -5418029, -6382856, -5175872, -3491043, -2728293, -2706826, -2543676, -1769229, -336136, 1606052, 3434885, 4069792, 2862164, 437629, -1608258, -1913711, -326973, 2075651, 3825297, 4079619, 3060206, 1644893, 597473, 115216, -90290, -401011, -907325, -1338137, -1413592, -1228085, -1136533, -1292617, -1509290, -1560493, -1349618, -756930, 351834, 1850112, 3360609, 4634058, 5623737, 6122591, 5753863, 4550994, 3207524, 2498525, 2679235, 3504757, 4384821, 4415217, 2977518, 762174, -488387, -14455, 656214]
44142F56214j276715l186254k731892l60476J487523J554239R58190J195373K008665
44133C04867J846686N0421k029075k318868l07986K241772L057085J635102n31506
44124C948498j791153j834322j372485j013429q33478o62456l51673J55981Q16510
44115b938007J540869K180403K350708J574065r790j358561j525887p45513Q9812
44106A158099P22324J422158J834091J143203m78260j769491k042072j832475
44098A57577j567314q52894L18219R36827M25278l67914n32760m24623o63439
44089b571043q75527n78959l19686o27695p63837N1792R98921Q46911P6953O2598
44079c699572O86721P00737J33678K72034J228909J599773Q47304N8787j69738
$$ y = [656214, -620501, -3806755, -6538647, -6899123, -5411600, -3857361, -2899171, -1703798, 304867, 2151553, 2201974, 172899, -2145969, -2453955, -212183, 2844902, 4480004, 3948498, 2157345, 323023, -1049462, -2062891, -2896369, -3558825, -3910498, -3754517, -2938007, -1397138, 783265, 3133973, 4708038, 4698248, 3339687, 1813800, 1068287, 1158099, 1880423, 3302581, 5136672, 6279875, 5801615, 4032124, 1990052, 157577, -1409737, -2262631, -1944412, -1007585, -582307, -950221, -1482981, -1907604, -2571043, -3446570, -4025529, -4345215, -4972910, -5736747, -5684955, -4686034, -3839123, -3762170, -3699572, -3012851, -2312114, -2178436, -1906402, -677493, 922280, 1769584, 1828371, 1658633]
44070A658633o65822j753277k232181j300823Q8109Q68576J373974K025712J969255
44061B032156N36699j062992j189004j83057K37761m84850j325072j479203j125739
44052d043301m36311P75868K136387K534804J374041n85793j935282j841105n73266
44043b593958P83366J179222N40398j72679p1520P08229J379517J431225Q20451
44034D004251l12994j574486k251736j879755p63246L58341R36074P47939q4309
44025h19921r20897j015957m68940j55105l56210k87280M62475R85177M65174
44016b111484l00124L6462J333053K174243J776108N71964p61916j690230j500707
44007d72631P6449J904657K284394R50504p01921j428459j204267m79562M96781
$$ y = [1658633, 992811, -760466, -2992647, -4293470, -4205361, -3336785, -1962811, 62901, 2032156, 2568855, 1505863, 316859, 133802, 371563, -113287, -1438359, -2917562, -4043301, -4479612, -3703744, -1567357, 967447, 2341488, 1755695, -179587, -2020692, -2593958, -1810592, -631370, -90972, -263651, -335171, 373058, 1752575, 3183800, 4004251, 3691257, 2116771, -134965, -2014720, -2777966, -2419625, -1483551, -735612, -819921, -1740818, -2756775, -3225715, -3380820, -3737030, -4024310, -3561835, -2576658, -2111484, -2411608, -2375146, -1042093, 1132150, 2908258, 3480222, 2718306, 1028076, -472631, -396182, 1508475, 3792869, 4743373, 4041452, 2612993, 1408726, 929164, 1425945]
43998A425945J327545J405360O14488n07544j430680j870293j542181n63471N5903
43989a084928n61251j623074j382822L73973J790154J368909j40126r23990l23225
43980b506380P86617J217641N49192n81182j007030k76633O76049P19015J18110
43971c04601l0693L12492J91512m41258m99124K78671P97265N23078K38055K52878
43961A318275k86441j403088j559081k11144Q35523K88150l07016P73975K154695
43952A603848J433780o58803j219089K59669J365331Q35180R9621K07990J24291
43943D051818q02293j244874k95280O77784K86004n14035j75776P09507M35853
43934C128708r96584k020294j913255j322705p20529K0170O32166N44796N0312
$$ y = [1425945, 2753490, 4158850, 4773338, 4265794, 2835114, 964821, -577360, -1140831, -1084928, -1646179, -3269253, -4652075, -4278102, -2487948, -1119039, -1259165, -2183155, -2506380, -1719763, -502122, 47070, -534112, -1541142, -1817775, -1141726, -422711, -304601, -335294, -22802, 168710, -272548, -771672, -493001, 304264, 827342, 1065397, 1318275, 1031834, -371254, -1930335, -2141479, -1305956, -1017806, -1324822, -550847, 1603848, 3037628, 2378825, 1159736, 1419405, 2784736, 3619916, 3719537, 3927527, 4051818, 3249525, 2004651, 1709371, 2387155, 2673159, 2159124, 1983348, 2692855, 3128708, 2132124, 111830, -1801425, -3124130, -3844659, -3824489, -3192323, -2647527, -2597215]
43925b597215J21805R34676J621249J556249R07854n2396j135141j758106j434320
43916a835345p98955r49730j631647j419427k4192J068073R20379O10367J300051
43907b760426K174663J787451M86124k21029j34457l49065r79581q60066J97787
43898f58599P31519m1188q68277n01342L26158L01813k19674K1061R07949J133430
43888A132850L51973m48964o62263o46829n43658j4612N97546L53912o01493r25779
43878a407317k41095J06451o70894j288158m47656R20379J160886O58015J084293
43869a25096K326964K345010L91398j567560j550250k46657K08104p02976j383517
43860c04580n24261J117845J737262P07887p68350j176611l65580N90517Q79833
$$ y = [-2597215, -2475410, -1540734, 80515, 1636764, 2544618, 2492222, 1357081, -401025, -1835345, -2634300, -3584030, -5215677, -6635104, -6659296, -5591223, -4670844, -4060477, -2760426, -585763, 1201688, 1687812, 1466783, 1332326, 983261, 3680, -856386, -658599, 72920, 31732, -836545, -1337887, -1011729, -709916, -929590, -908529, -580, 1132850, 1484823, 1035859, 373596, -273233, -816891, -831503, -233957, 119955, -481538, -1407317, -1648412, -1541961, -2212855, -3501013, -3948669, -3028290, -1867404, -1209389, -125096, 2201868, 4546878, 4938276, 3370716, 1820466, 1573809, 1781913, 1078937, -304580, -828841, 289004, 2026266, 2734153, 1965803, 789192, 423612, 1014129, 1893962]
43851A893962P06673N78812N24163K92222k01748r21557j674404j815548p31834
43842a349259J001166J806365J044289j09658m55058m23451q77529j245555l80924
43833i89614J305810K199265J723724P69423Q1097l16342l01278J42187P0235
43824D684507j308368k725937k063225L41276J757621R53168k72196l30971k27039
43815H08836j178567k041261j197836N66117J315431R82753R22210J261717R52642
43806B392042K3927l69459l0495P0105l35650m91069j93516l0171l2920K23220
43796A226014K41905p50489j717082o36503K031626L094518J038671j480842j330764
43787A717054O89491J383950m1825j311988r26957j26364l86320j013590m99907
$$ y = [1893962, 2600635, 3179447, 3703610, 3995832, 3794084, 2872527, 1198123, -617425, -1349259, -348093, 1458272, 2502561, 2392903, 1937845, 1514394, 636865, -608690, -989614, 316196, 2515461, 4239185, 5008608, 5089705, 4773363, 4472085, 4614272, 4684507, 3376139, 650202, -1413023, -1071747, 685874, 1639042, 1366846, 1035875, 808836, -369731, -2410992, -3608828, -3042711, -1727280, -744527, 177683, 1439400, 2392042, 2415969, 2046510, 2016015, 2086120, 1750470, 1259401, 1065885, 1035714, 1002794, 1226014, 1467919, 717430, -999652, -1636155, 395471, 3489989, 4528660, 3047818, 1717054, 2406545, 3790495, 3748670, 2436682, 1509725, 1383361, 997041, -16549, -516456]
43778e16456R86496J875344J408254L78015j82368p1403L65652P56887P12654
43769E713075R579q77755j012358k33989L39141l17504j618270k003771r61899
43760i63751M03772Q94314N16111L4714m8590K78750P51146R12891M97565n3021
43750C223901m4328L26896J02099q59925j413985q01105J95242N35687M15086
43741A679568N01228N75257J18376m54706m35380j49650l53298p83156o61839
43732C6400k00341j33417j49018N82367J563363J447802L25798l36178j83643
43723B953133m23878j393027j747709q48176O5513J47593M55331J753660K581126
43714C543566J373112p78619j503366m74841N61912N49704K9096m48834r91008
$$ y = [-516456, 470040, 2345384, 3753638, 4131653, 3949285, 3877882, 4243534, 5000421, 5713075, 5722654, 4844899, 3832541, 3598552, 3937693, 3620189, 2001919, -1852, -963751, -559979, 334335, 850446, 885160, 836570, 1115320, 1866466, 2779357, 3276922, 3223901, 3179573, 3506469, 3608568, 2748643, 1334658, 533553, 728795, 1264482, 1679568, 2180796, 2756053, 2874429, 2419723, 1984343, 1834693, 1481395, 698239, 36400, -163941, -297358, -446376, 135991, 1699354, 3147156, 3472954, 3136776, 2953133, 2529255, 1136228, -611481, -1459657, -1394144, -1246551, -791220, 962440, 3543566, 4916678, 4138059, 2634693, 2159852, 2721764, 3271468, 3300564, 2851730, 1860722]
43705A860722j352204q61234K90774R34568M76134l89928p75116n47972n296N82808
43695B13256Q84991O58566J45184k32126m96635q09425p71270N4732J050273J059474
43685A757020J05641n00903n3915O20559N91482J51366P658j997m59628j155492
43675A061791j286956o66937J01732O25553J113311J589263J411429R0381j724712
43666B314855k647266k004629n35079M93100N48007J3134n38949p85363n59681
43657c701871P7314O43411O60345L37315K46967K87935j99851j056092j065519
43648c770046K72099J710919J947255J498252J632830K048089J239927q87258
43640E692067k443880k065885o49327J69691J98141L98316J120994J644887J231808
$$ y = [1860722, 508518, -352716, -61942, 872626, 1348760, 958832, 183716, -364256, -369552, 213256, 1098247, 1756813, 1901997, 1669871, 1173236, 363811, -407459, -352727, 697546, 1757020, 1862661, 1361758, 1307843, 1928402, 2519884, 2671250, 2678908, 2676911, 2217283, 1061791, -225165, -892102, -790370, -164817, 948494, 2537757, 3949186, 4039567, 2314855, -332411, -2337040, -2872119, -2379019, -1831012, -1817878, -2356827, -3142190, -3701871, -3624557, -2981146, -2320801, -1983486, -1736519, -1448584, -1648435, -2704527, -3770046, -3497947, -1787028, 160227, 1658479, 3291309, 5339398, 6579325, 5692067, 3248187, 1182302, 532975, 702666, 900807, 1299123, 2420117, 4065004, 5296812]
43631E296812r2278j674763k641754k376869j118478O3116L41612M8032Q4261
43622b070309O35185J062484J019760R54372J229694J346770N95545p90090j718638
43613B264773j471197l58813Q79890J747328J857077Q98310o05830j108050L11820
43604D415308K277606K328551O5679k113135k063884n81904M853r02132j722230
43595A708712j224437o5701M78928K01922j97786k52637q4116K3753q0055m02769
43585A05814p82945r39808p35470l69672j88989k28935p894R42963K153592K242631
43575B191287N23944j658498k190545q60923L71277J54564n01732m2695J320608
43566f92713K300207K467696K072593Q57343j185387k514257j545311O79449J339498
$$ y = [5296812, 5204534, 3529771, 888017, -1488852, -2607330, -2544214, -2202602, -2154570, -2070309, -1435124, -372640, 647120, 1601492, 2831186, 4177956, 4773501, 3983411, 2264773, 793576, 434763, 1314653, 3061981, 4919058, 5817368, 5211538, 4103488, 4415308, 6692914, 9021465, 9087144, 6974009, 4910125, 4328221, 4333074, 3430942, 1708712, 484275, 418574, 897502, 1099424, 901638, 649001, 564885, 588638, 508583, 105814, -677131, -1616939, -2352409, -2722081, -2911070, -3140005, -3147899, -2204936, -51344, 2191287, 2715231, 1056733, -1133812, -1994735, -1623458, -1468894, -1970626, -2013321, -692713, 1607494, 4075190, 6147783, 7005126, 5819739, 3305482, 1760171, 2439620, 3779118]
43557C779118m04256k332733k279883n83066J160698K084056J955846O66715j061633
43548B984862j637795m08149J331553J981119J422305M35107n97320j434937j407285
43539B669460k58242J050729J358341O37820l80062j228779j628930j188949o7981
43530I63407P26474N34863p0625k75000j29142K509J81156L35311J7632m70190
43520A816395k2366J138941Q78182j632565l647653k186373J365586K773269P72016
43511A255432j486432j205527N38632J154376K33189o59580n00845L64903J130204
43502H24352J157709K64821q86833j236156o38709o4565j23670k72520O0444N24280
43492c90847O23689N41006N16709K79133j88714j80674N86791J147269N71099
$$ y = [3779118, 3374862, 1042129, -1237754, -1820820, -660122, 1423934, 3379780, 4046495, 2984862, 1347067, 938918, 2270471, 4251590, 5673895, 6109002, 5511682, 4076745, 2669460, 2411218, 3461947, 4820288, 5458108, 5078046, 3849267, 2220337, 1031388, 963407, 1689881, 2224744, 2154119, 1879119, 1749977, 1752486, 1933642, 2268953, 2286585, 1816395, 1794029, 2932970, 3811152, 2178587, -1469066, -3655439, -2289853, 483416, 1255432, -231000, -1436527, -897895, 256481, 489670, -169910, -670755, -305852, 824352, 1982061, 2246882, 1360049, 123893, -514816, -579381, -703051, -975571, -915127, -390847, 232842, 773848, 1290557, 1569690, 1380976, 1200302, 1787093, 2934362, 3505461]
43483C505461n60232r96324o37526m20366o93117q29566m11045K37882Q32848
43474B8015J524921K173070J980514M43041j686520k909009k426701q16619O94732
43465i94556J345200J154045M68007l71203r40927q77146m09397l00602p72742
43456a699321r02227K04990J885891K461317J352657k06834q25871n11793j27978
43447A630831J1973L19717J017441J675633J688310R16739j79669r73375j220002
43438D887598j092616o79177J39104J055722J179225J55858j041002j312696r93967
43429B298049j093359j323562m03363J584721K753630J896862M2272j182796j464643
43420C107811j265440o48121K70241P37973M04883P1988L28123M10570l36822
$$ y = [3505461, 2945229, 1948905, 1311379, 891013, 197896, -631670, -1042715, -804833, 28015, 1552936, 3726006, 5706520, 6149561, 4463041, 1554032, -872669, -1689288, -994556, 350644, 1504689, 1972696, 1601493, 660566, -216580, -625977, -926579, -1699321, -2601548, -2396558, -510667, 1950650, 3303307, 3096473, 2270602, 1758809, 1630831, 1642804, 1962521, 2979962, 4655595, 6343905, 7260644, 7080975, 6107600, 4887598, 3794982, 3115805, 3254909, 4310631, 5489856, 5645714, 4604712, 3292016, 2298049, 1204690, -118872, -522235, 1062486, 3816116, 5712978, 5755250, 4572454, 3107811, 1842371, 1194250, 1464491, 2202464, 2607347, 2679335, 3007458, 3418028, 3081206]
43411C081206r36550l47089L45750o21416k492483k564632j65859K160968K205819
43402F65714Q68789K11713L77759J10592o94171q72968k04392j3421j110062k338425
43392b998872k020824k47568J191511J113523L74737N52532J700465K259592J263822
43383C188918k45830o13881J80395N42183n70939k299006k921769j750942K61649
43374d229222J512443J200747J1182n98599O5526J213982J589184R74387L06432
43365B046062M20348J101752J375116M78186j316647k649256k202561k70305J228491
43356B11186Q49037o91617j598414j280491n91899j63965K52405P76036R62717
43347a275005O67802L09899M784n33405r79279n00342O77035J117418L32358k12872
$$ y = [3081206, 2144656, 1797567, 2143317, 1521901, -970582, -3535214, -3701073, -1540105, 665714, 1534503, 1746216, 2123975, 2234567, 1540396, 667428, 463036, 449615, -660447, -2998872, -5019696, -5267264, -4075753, -2962230, -2587493, -2034961, -334496, 1925096, 3188918, 2943088, 2329207, 2509602, 3051785, 2480846, 181840, -2739929, -4490871, -4229222, -2716779, -1516032, -1504850, -2103449, -2037923, -823941, 765243, 1739630, 2046062, 2466410, 3568162, 4943278, 5421464, 4104817, 1455561, -747000, -1017305, 211186, 1060223, 368606, -1229808, -2510299, -3102198, -3266163, -3013758, -2237722, -1275005, -607203, -297304, -292520, -825925, -1805204, -2305546, -1628511, -511093, -178735, -391607]
43337c91607O81022J884834J504513l29326j794839j983090j546807r89206k6004
43328b990510J148951J558560R85822N56682J057602J674336J213514j62874j229753
43319C812330j231968m54805L48821N46824P152o32369m48635N81416J316407
43310C845173Q26069m50207j413948j602675j143970q8168J236305J716378N92107
43301C517064j020106j092463N77612J883200J233326l09024o57895L96869J160147
43292E688730N46581o22055j003367m63462N9284j26377q34615j520698j937156
43283b13135k082153j751099o18514J020312K010030J436936j28545j128803q03353
43274b258324J80519R34972J305682J333901P78149j89991p11042m58396k96850
$$ y = [-391607, 289415, 2174249, 3678762, 3349436, 1554597, -428493, -1975300, -2964506, -2990510, -1841559, -282999, 702823, 1259505, 2317107, 3991443, 5204957, 5042083, 3812330, 2580362, 2125557, 2474378, 3021202, 3028354, 2395985, 1947350, 2528766, 3845173, 4671242, 4221035, 2807087, 1204412, 60442, -27726, 1208579, 2924957, 3517064, 2496958, 1404495, 1982107, 3865307, 5098633, 4789609, 4131714, 4528583, 5688730, 6235311, 5613256, 4609889, 4146427, 4205711, 4079334, 3244719, 1724021, -213135, -2295288, -4046387, -4664901, -3644589, -1634559, -197623, -326168, -1454971, -2258324, -2077805, -1142833, 162849, 1496750, 2274899, 2084908, 1373866, 915470, 618620]
43265F18620q13638j115554l24045N98150J55731j107791j243628O9919J109977
43256b052259Q87937L27781J95568o9200n73605p4571J743975K860866J585513
43247D832005o42946j070211N70404J967584J490342k31631j789474k435760k006226
43238F84087p84328L59602O79028M20593K32300Q8843k55395l25899K84984P07922
43228B091737j01931j393141j427198j36811P70785M37226k14066m27022o36417
43219a036838j000551p25093L12204Q88696L69447j73576J34574L80216m65790
43210a316711j472640r50023R75554K478597K388307J220094R6711l34523n1757
43201C033609M61869N87966L12697K71679O84282Q68018L32361l75588n86695
$$ y = [618620, -195018, -1310572, -1634617, -1036467, -880736, -1988527, -3232155, -3162236, -2052259, -1164322, -836541, -640973, -710173, -1283778, -1358349, 385626, 3246492, 4832005, 4189059, 3118848, 3689252, 5656836, 7147178, 6915547, 5126073, 2690313, 684087, -100241, 259361, 938389, 1358982, 1591282, 1680125, 1424730, 1098831, 1383815, 2091737, 1989806, 596665, -830533, -967344, -196559, 240667, 26601, -400421, -1036838, -2037389, -2762482, -2450278, -1561582, -1192135, -1365711, -1231137, -850921, -1316711, -2789351, -3739374, -2763820, -285223, 2103084, 3323178, 3419889, 3085366, 3033609, 3495478, 4083444, 4396141, 4667820, 5352102, 6220120, 6552481, 6176893, 5590198]
43192E590198n41649p54088j054271j067080r33005p47144r5323R31067J182645
43183B511350Q7086j051994q02575J43612J43519n81644l05769J166187J907595
43174C217367P57055r87029j520711p94887J6291K17812r4850o43182j108490
43165i40624j138508o80490N6650J019302K037507K242920Q46856j318193k230580
43156a05160j131600N13677J035767M68906k00416n73256p12645m27457K43210
43147h88974N33674J981n10909m8178Q57198R22843Q9777n22369m78483n05356
43137e48796r49568j044720k33290P94986J089319P65032O15190Q54882R87630
43128B330665P12016L01658Q5503M8161K4020q5460l62921p70106q56992j9717
$$ y = [5590198, 5048549, 4294461, 3240190, 2173110, 1240105, 492961, 397638, 1328705, 2511350, 2598436, 1546442, 743867, 887479, 1030998, 449354, 143585, 1309772, 3217367, 3974422, 2987393, 1466682, 671795, 688086, 905898, 811048, 167866, -940624, -2079132, -2759622, -2702972, -1683670, 353837, 2596757, 3443613, 2125420, -105160, -1236760, -723083, 312684, 781590, 581174, 7918, -704727, -1132184, -888974, -355300, -353319, -864228, -912406, -55208, 867635, 957412, 435043, -43440, -548796, -1498364, -2543084, -2776374, -1981388, -892069, -127037, 488153, 1343035, 2330665, 3042681, 3344339, 3429842, 3478003, 3502023, 3416563, 3053642, 2283536, 1426544, 1406827]
43118A406827J552172K509492J611480n72335j925627j173386N32310J063997
43110E004930k2713j186459j186759n96452n94654j173864j398691r24504k76926
43101b356092K23629Q30392J471376J366040J09366j394528j792041r11725R9295
43092b354288L12010P2103K25031Q16667J160390R34012M58211j34385j130362
43083C59389k218105k098875p1991K410420K947890J067736j121193j530609m42027
43074f97365L75021J15339m72373n99836m63819n71912q33611p82239l21359J81523
43064d070631M35245N50483P78675J102785J256739J156971J096096J288269J388402
43055D983034Q80685o9450o95240p49178r43183j816042k686113k441490j103179
$$ y = [1406827, 2958999, 5468491, 7079971, 6507636, 4582009, 3408623, 3940933, 5004930, 4982217, 3795758, 2608999, 2012547, 1417893, 244029, -1154662, -2079166, -2356092, -2132463, -1302071, 169305, 1535345, 1644711, 250183, -1541858, -2453583, -2354288, -2042278, -1970175, -1745144, -928477, 231913, 1165925, 1624136, 1489751, 359389, -1858716, -3957591, -4029582, -1619162, 1328728, 2396464, 1275271, -255338, -697365, -322344, -207005, -679378, -1279214, -1743033, -2314945, -3148556, -3930795, -4252154, -4070631, -3635386, -3084903, -2306228, -1203443, 53296, 1210267, 2306363, 3594632, 4983034, 5863719, 5794269, 5099029, 4349851, 3406668, 1590626, -1095487, -3536977, -4640156]
43046d640156J52017M48432o130n50262p13270j76939J037330K093031J938188
43037d17759Q12248K41976Q80618J317937J19654j742510k028398m89086P40146
43028e65174K65491p49276o95291N4538J47189l83671l77264L37860P50520N49345
43018f65733O27864J351918J704093Q56320m44608q96623l33574M02174P51163
43009C352994Q07322P16314M20730j03707q19889j683598k403544k431283j545943
43000c690604j84173J058449J857986J912912R85772l33601p10057K74250J200192
42991B371126N80280r55503j467657m47191O17761N13209k14070m92913k59071
42982B45971o059K76536P80684J059001N05943n22646r16088k47390N84215M13115
$$ y = [-4640156, -4488139, -4039707, -4045837, -4596099, -5309369, -5486308, -4448978, -2355947, -417759, 394489, 636465, 1517083, 2835020, 2954674, 1212164, -816234, -1305320, -565174, -299683, -1048959, -1744250, -1689712, -1542523, -1926194, -2303458, -1965598, -1215078, -665733, -37869, 1314049, 3018142, 3874462, 3429854, 2533231, 2199657, 2601831, 3352994, 4160316, 4876630, 5297360, 5193653, 4373764, 2690166, 286622, -2144661, -3690604, -3874777, -2816328, -958342, 954570, 1940342, 1606741, 896684, 1170934, 2371126, 2951406, 1995903, 528246, 81055, 698816, 1212025, 997955, 505042, 245971, 239912, 516448, 1297132, 2356133, 2862076, 2339430, 1423342, 1175952, 1760167, 2173282]
42972B173282p93187j870564j733550n14454O78386J035077Q18011P86143J143197
42963A722341J342023Q08927l77416j466582j600650o02961O91869J189727P18879
42954B426157N3516k98213o17875j041720j065608o21901o51969j571297k048189
42945e437099p17323J490177K362409J491778O19037Q26820J157661N18886o06562
42936A705784j125177p94009K3287J015921J659878J277782N2287q91701r86321
42927A937731q84406j112390j141563m99269K23357K82215j69541o34506r64177
42918b962549q76429J23729J574176J976034Q40574l15845j05941P09394N85763
42909A548906m34807j113798r47305l07489O16473J607620J799890O98523o88726
$$ y = [2173282, 1380095, -490469, -2224019, -2738473, -2060087, -1025010, -206999, 579144, 1722341, 3064364, 3873291, 3495875, 2029293, 428643, -174318, 517551, 1707278, 2426157, 2479673, 2181460, 1563585, 521865, -543743, -1165644, -1817613, -3388910, -5437099, -6154422, -4664245, -2301836, -810058, -191021, 635799, 1793460, 2312346, 1705784, 580607, -213402, -190115, 825806, 2485684, 3763466, 3815753, 2924052, 1937731, 1053325, -59065, -1200628, -1699897, -1476540, -1194325, -1363866, -1998372, -2962549, -3838978, -3715249, -2141073, -165039, 675535, 359690, 253749, 963143, 1548906, 1114099, 301, -947004, -1254493, -638020, 969600, 2769490, 3468013, 2779287]
42900B779287j036271m64044P5616L80965N98145J53336j215588k163464j375088
42891b267106J62060N49665K7581L09968J287086J073118n29499j355924l68429
42882a111480O71287J13570j117497j289967l95809M22440O71926N57662K76425
42873a201443J73426O40223J235232R93428N5150l42170P7951J69247m82356p27973
42863E90715Q293O12638L65557L05939J199770J892897J225625L1107l85608l16969
42853E529964n67545p41620l58638k54945r98270j340193l21487N56126k99019
42844A204373j411604l84192J802272J963340j81897j522717m62321J005289R64432
42835B976975K54179J47419L7246q49612j560533j035332J7478M73009N59502
$$ y = [2779287, 1743016, 1278972, 1354588, 1735553, 2333698, 2487034, 1271446, -892018, -2267106, -2105046, -1555381, -1527800, -1217832, 69254, 1142372, 612873, -743051, -1111480, -440193, -326623, -1444120, -2734087, -3129896, -2707456, -2035530, -1477868, -1201443, -1028017, -387794, 847438, 1840866, 1896016, 1553846, 1631797, 1801044, 1318688, 590715, 599008, 1211646, 1577203, 1883142, 3082912, 4975809, 6201434, 6232541, 5846933, 5529964, 4962419, 4220799, 3862161, 3607216, 2608946, 1268753, 947266, 1503392, 1204373, -207231, -591423, 1210849, 3174189, 2992292, 1469575, 1007254, 2012543, 2976975, 3231154, 3378573, 3415819, 2566207, 1005674, -29658, -12180, 460829, 1020331]
42826A020331P72986M98053o06814j152330J68868K222251K698362J125975r59220
42817E788462k217535k285300j025137J121463K366082J141431j426217k386455
42809A076794o96998J486774J802151M79877o84071r00057p46700o96083n14056
42800F07631n324N04917N74248J47332l56813l29762M09590J127962P24351r06675
42790B497457k460701k613386j467540j10016Q53260J529572J781111J152056
42782A161813k6486n34316J14657Q13917M69227k81106j04744P52342P05960o39798
42772B431466j735625j371108l49336J251j51050K05085J037720J373068Q91171
42763B332642J86777l61157q27778r70431m04106L89285L58072n94043j375208
$$ y = [1020331, 1793317, 2291370, 1684556, 532226, 701094, 2923345, 5621707, 6747682, 5788462, 3570927, 1285627, 260490, 1381953, 3748035, 4889466, 3463249, 1076794, 379796, 1866570, 3668721, 4148598, 3464527, 2564470, 1817770, 1121687, 607631, 602307, 1107224, 1681472, 1828804, 1471991, 1142229, 1551819, 2679781, 3404132, 2497457, 36756, -2576630, -4044170, -4154186, -3300926, -1771354, 9757, 1161813, 1135327, 601011, 715668, 1529585, 1998812, 1717706, 1612962, 2365304, 3071264, 2431466, 695841, -675267, -1024603, -1023352, -1174402, -969317, 68403, 1441471, 2332642, 2519419, 2158262, 1330484, 360053, -44053, 345232, 703304, 109261, -1265947]
42754a265947j233105n55213J13126Q30028J596632J854423J236831J89761o01496
42745B165040q62677n84906Q2934O07931N27690K76006O13409J137213O38195
42736D600835p56469j349074m60964L83740o5289p69809l73630L41736m7797q84144
42726F19135n64958L92026P6730j277508j275968P37178K405368J878057K65811
42717C255871n72825n53394k90836M53508J504698J285244p73670k303451r29249
42708A075896J876079K518961L74928j600544j419039m54668n50489j240728j248330
42699f67934q23120q71792j038947l86777P57929J186434O39753l2876k86100
42690a523430l16820k61064J6888L91989O03542Q35173J358928J712848J123803
$$ y = [-1265947, -2499052, -3054265, -2941139, -2111111, -514479, 1339944, 2576775, 2766536, 2165040, 1302363, 717457, 800391, 1408322, 1936012, 2212018, 2825427, 3962640, 4600835, 3844366, 2495292, 2034328, 2418068, 2352779, 1582970, 1209340, 1551076, 1503279, 619135, 54177, 446203, 522933, -754575, -2030543, -1293365, 1112003, 2990060, 3255871, 2683046, 2129652, 1838816, 2292324, 3797022, 5082266, 4308596, 2005145, 1075896, 2951975, 5470936, 5845864, 4245320, 2826281, 2371613, 1821124, 580396, -667934, -1491054, -2362846, -3401793, -3788570, -3030641, -1844207, -1204454, -1237330, -1523430, -1840250, -2101314, -2084426, -1692437, -1088895, -253722, 1105206, 2818054, 3941857]
42681C941857k30062j246263j336622j058133j073842j204491r05800j78459M33391
42672b858424N12464J59726j75906j63143O7671J55500J34002M41724J064382
42663f62004J235762N73270k5420N03965J720057K119273J104247m91214j719644
42654D358292k215344j625152K08060K127452K182154P3493k034100k014897j68091
42645H91867J684583K444954K070903O89507j223669k392951j899457n35937J89840
42636A919640J48517M63933J458995K044228J331344k06485j436513j628334p33928
42627C361397N99141J278477Q27527J28740K57677P89003M23619p85245j285438
42618E594898m10887N54071L92150k62057j72493M47335L74669o21165j384324
$$ y = [3941857, 3711795, 2465532, 1128910, 70777, -1003065, -2207556, -3113356, -3291815, -2858424, -2345960, -2186234, -2362140, -2525283, -2457612, -2302112, -2168110, -1726386, -662004, 573758, 1147028, 1121608, 1625573, 3345630, 5464903, 6569150, 6077936, 4358292, 2142948, 517796, 725856, 2853308, 5035462, 5108955, 3074855, 1059958, 891867, 2576450, 5021404, 7092307, 7781814, 6558145, 4165194, 2265737, 1729800, 1919640, 2068157, 2532090, 3991085, 6035313, 7366657, 7160172, 5723659, 4095325, 3361397, 3960538, 5239015, 6066542, 6195282, 6452959, 7241962, 7665581, 6880336, 5594898, 5184011, 5738082, 6130232, 5868175, 5695682, 6143017, 6517686, 5896521, 4512197]
42609D512197r50481K61787R63173L35558j135283k049222j515780j92164N09103
42600G38888J87125k68165j98194J119o8527J6189N51685Q24186J36894q81695
42590A039505r96157l6869J028887J420086J121754M10259l62378o89080m05054
42581B530953j23922m49136r64486q28550j63610J25526j48478k12430K52638
42572A8505N28324J06890m12813k81241K58893M38763O2251m60897p52364n68846
42562a062535K95490J535334K105400J261148k90442j043061n18871K72083L10999
42553B865545k37170n99421m64769k2896M74492O44505J0281j215839j865877
42544d11149j146622J71368Q44223J019532J710400K614566K164780J17004j646696
$$ y = [4512197, 3561716, 3823503, 4786676, 5122234, 3986951, 1937729, 421949, 229785, 738888, 926013, 657848, 459654, 460773, 392246, 408435, 960120, 1784306, 1921200, 1039505, 43348, 6479, 1035366, 2455452, 3577206, 3987465, 3625087, 2936007, 2530953, 2407031, 1957895, 993409, 164859, 1249, 126775, -21703, -234133, 18505, 546829, 653719, 240906, -40335, 218558, 657321, 719572, 258675, -493689, -1062535, -767045, 768289, 2873689, 4134837, 3844395, 2801334, 2282463, 2554546, 2865545, 2628375, 2028954, 1564185, 1541289, 2015781, 2660286, 2670567, 1454728, -411149, -1557771, -1386403, -542180, 477352, 2187752, 4802318, 6967098, 7084102, 5437406]
42535E437406j733781j048805q62856p12594J60539P74123j3299r62790o6459
42526I71484J846012J905737l42438k111559j592209k53969J68712L71301J454817
42517B417888K375400J534010n35787k033083k348391j961712j008345L11663
42509a248357R44210M00645J0773R55607K044290J445141l01384j239586j202268
42500A809071j557846k210798j588602K84785J349935O98990j34878J71302Q85308
42491b92733R15054M71283M9047o00267j453396j603698o65866M10814P58121
42482b011641O84232P18227P82820Q85616J311184J601192Q33360n27788p68205
42473C508997L65089R76989M1737q99991m48122K31460m72751j789921k015557
$$ y = [5437406, 3703625, 2654820, 1791964, 1079370, 1239909, 2014032, 2000733, 1037943, 971484, 2817496, 4723233, 4380795, 2269236, 677027, 423058, 591770, 963071, 2417888, 4793288, 6327298, 5791511, 3758428, 1410037, -551675, -1560020, -1248357, -304147, 96498, 107271, 1062878, 3107168, 4552309, 4250925, 3011339, 1809071, 251225, -1959573, -3548175, -3263390, -1913455, -1214465, -1349343, -1178041, -292733, 622321, 1093604, 1142651, 542384, -911012, -2514710, -3180576, -2769762, -2011641, -1327409, -609182, 173638, 1059254, 2370438, 3971630, 4804990, 4277202, 3508997, 3874086, 4851075, 4892812, 3992821, 3544699, 3776159, 3303408, 1513487, -502070]
42464e02070j416369j336384j419728k53165J732804K484616J434290K42697K23249
42455A189940Q42589J066992O47528j70221q66825n38948J051372K389895J711328
42446G323650m32659j764377j489131j034889j265645j035729N37447K153701
42438B992368K068182N56614p21794j034265r91037j145442j319587j194598p85643
42429a575202l26345o4356m1475Q1700O45607J333936J393002O56647j89904n17815
42419A395795l48714N9897N25373O89309K44321l50779k05796O36815J032475
42410C678696L49982o06415q29334m33538r3224P6346K73831K60623k52584q30136
42400A594247p44408k1743N82475N57718J22324j66771J7754M45413M33454l96246
$$ y = [-502070, -1918439, -3254823, -4674551, -4927716, -3194912, -710296, 723994, 966691, 1189940, 2032529, 3099521, 3747049, 3576828, 2710003, 2171055, 3222427, 5612322, 7323650, 6890991, 5126614, 3637483, 2602594, 1336949, 301220, 838667, 2992368, 5060550, 5617164, 4895370, 3861105, 2870068, 1724626, 405039, -789559, -1575202, -1901547, -1965903, -2007378, -1925678, -1280071, 53865, 1446867, 2103514, 1913610, 1395795, 1047081, 1106978, 1632351, 2321660, 2565981, 2215202, 2009406, 2646221, 3678696, 4028678, 3422263, 2592929, 2159391, 2066167, 2142513, 2416344, 2676967, 2424383, 1594247, 849839, 828096, 1410571, 1968289, 2090613, 1923842, 1941596, 2387009, 2820463, 2424217]
42390B424217j392758j430853l28057R08919J403225J216956O66252j78952r25305
42381B363644q96643l55197n10707j488049j585227K09796K209174K220578P80729
42372B948098J53717P09060O81143m82454j063237q6409Q85377K95751q60778
42363C180268p07753N43287J095463L41200n94672q24517o66122n70858l59983
42354A436313J79956Q46386J394060J661299J292514J25076j113901j394549q12474
42345C614680m75150p00978m47078Q33759J846400J086348q41018j854541j145964
42336A916458N700K93534l2351j50350p6642j85188j67964L90663R11155N34927
42326C439942k74476j85452Q43404J258845K53642r45672j006797m73049n37875
$$ y = [2424217, 1031459, -399394, -727451, 181468, 1584693, 2801649, 3467901, 3288949, 2363644, 1467001, 1111804, 601097, -886952, -2472179, -2262383, -53209, 2167369, 2948098, 3101815, 3810875, 4492018, 4009564, 2946327, 2859918, 3745295, 4041046, 3180268, 2472515, 3015802, 4111265, 4452465, 3857793, 3033276, 2367154, 1796296, 1436313, 1616269, 2462655, 3856715, 5518014, 6810528, 6935604, 5821703, 4427154, 3614680, 3139530, 2438552, 1991474, 2825233, 4671633, 5757981, 4916963, 3062422, 1916458, 1922158, 2215692, 2183341, 2032991, 1956349, 1771161, 1603197, 1993860, 2905015, 3439942, 3165466, 2980014, 3823418, 5082263, 5335905, 4390233, 3383436, 2910387, 2372512]
42317B372512q49340k64675P57051N61955q05620j197823M01082K090979J770356
42308D836477J28418p07229l82339k11302m98136j54751R82791J561071R87303
42299F542303M53939Q09369J066328K49687p01187m42554M34025L86568m00559
42290H397919k98299R48659J640353P22928p36249j317807j005599l68375N99452
42281H582982J697205J776037K29995j510142j463389K84114J797577J880773
42273A3275152J056245O2436j043168j915851j571673J08715J576420J364675
42265A2912951K6488o56286k4831Q49303Q00209m7505p10571n93726k6215K00949
42255A2730766l15341j120262j322962n80489M81484R56446N73325k06987p27853
$$ y = [2372512, 1523172, 1258497, 2015548, 2577503, 1771883, 574060, 975142, 3066121, 4836477, 4964895, 4257666, 3875327, 3664025, 3165889, 3011138, 3993929, 5555000, 6542303, 6996242, 7805611, 8871939, 9121626, 8420439, 7977885, 8411910, 8798478, 8397919, 8099620, 9048279, 10688632, 11411560, 10675311, 9357504, 8351905, 7983530, 8582982, 10280187, 12056224, 12286219, 10776077, 9312688, 9596802, 11394379, 13275152, 14331397, 14393833, 13350665, 11434814, 9863141, 9971856, 11548276, 12912951, 12939439, 12283153, 12258322, 13107625, 13907834, 13860329, 13149758, 12556032, 12529817, 12730766, 12415425, 11295163, 9972201, 9391712, 9873196, 10829642, 11402967, 11195980, 10468127]
42246A0468127n61519K64725J148545J345478Q98864P58646J450650K045894J281963
42237A9101373n07260j622283j273999n32996n27520p48450q2977J197237J727032
42228A6730157J127068N87547J137273K282347K828798K393257J597170J208271
42220B9891888J502414K107108K170164J132490l43047p68750L83405J883006
42212C7958678K338705J977515J983198K632122L245422L647768M281229M895066
42204F2959703M646708L851198M079274N763466P130692O601022N027060M219718
42196A04278841M281435M003667L165661K624700K502870K189743K111381L510125
42188A28668423O047407P518718O809275N531164N635396O784128P453412P570791
$$ y = [10468127, 9906608, 10171333, 11319878, 12665356, 13564220, 14322866, 15773516, 17819410, 19101373, 18594113, 16971830, 15697831, 15164835, 14637315, 13888865, 13805888, 15003125, 16730157, 17857225, 18444772, 19582045, 21864392, 24693190, 27086447, 28683617, 29891888, 31394302, 33501410, 35671574, 36804064, 36461017, 35692267, 36075672, 37958678, 40297383, 42274898, 44258096, 46890218, 50135640, 53783408, 58064637, 62959703, 67606411, 71457609, 75536883, 81300349, 88431041, 95032063, 100059123, 104278841, 108560276, 112563943, 115729604, 118354304, 120857174, 123046917, 125158298, 128668423, 134715830, 142234548, 149043823, 154574987, 160210383, 166994511, 174447923, 182018714]
42180A82018714Q432258J0499702J2794493J4423030J5521172J6559837J7572983
42173B77822189J8194656J7839220J5851328J2043117P052481J744543l523770
42166C47023764q598590j2935568j6072110j8390136k0518025k2086376k1996039
42159B26426920k0024887j7373635j5404671j4445659j3970231j3349607j2248813
42152A19609417j0801959r550507q808964q151725p057359n886660n410668n417001
42144E8524574m812488l350729k186862k168779k562221k298781j680459j746985
42136C7717270k421473k520026j574904n22528k84268n96105p63051q23390j204294
42127B7007231j673368j551995r16905o85275j194358j484714o46649O78084J063186
$$ y = [182018714, 190450972, 200950674, 213745167, 228168197, 243689369, 260249206, 277822189, 296016845, 313856065, 329707393, 341750510, 348802991, 350547534, 347023764, 338425174, 325489606, 309417496, 291027360, 270509335, 248422959, 226426920, 206402033, 189028398, 173623727, 159178068, 145207837, 131858230, 119609417, 108807458, 99256951, 90447987, 82296262, 75238903, 69352243, 63941575, 58524574, 53712086, 50361357, 48174495, 46005716, 43443495, 41144714, 39464255, 37717270, 35295797, 32775771, 31200867, 30678339, 30394071, 29797966, 29034915, 28211525, 27007231, 25333863, 23781868, 22864963, 22179688, 20985330, 19500616, 18853967, 19532051, 20595237]
42118B0595237L43047j96484J45343L89589n03862j844218k124151j256649o64391
42109A4883461j104302j536170o67979J085830J903410O89895j536268k610482
42101A1107395j569830K40093Q14748L9224l32178N84677J424318Q39198j97082
42092A2950563l3273O84073j2470j769074j937710J92234J875640J037649m43436
42083A2544196K80258K524416L209289J566458n8748K0832Q11625Q60051L25974
42074B2084351l8583k91440o46191o68482j33159K48416j55630r00984j226664
42065A8271634j119884r67086q36329p51294r86638j427124j329611m43508L17913
42056A0728073J32048m55655m34601L9650k4772q15399j448189j235946l53077
$$ y = [20595237, 20938284, 20741800, 20887143, 21276732, 20772870, 18928652, 16804501, 15547852, 14883461, 13779159, 12242989, 11575010, 12660840, 14564250, 15254145, 13717877, 11107395, 9537565, 9777658, 10592406, 10631630, 10299452, 10884129, 12308447, 13147645, 12950563, 12917290, 13601363, 13588893, 11819819, 9882109, 10074343, 11949983, 12987632, 12544196, 12824454, 15348870, 18558159, 20124617, 20065869, 20086701, 20898326, 21758377, 22084351, 22045768, 21754328, 21108137, 20439655, 20306496, 20554912, 20399282, 19498298, 18271634, 17151750, 16184664, 15348335, 14597041, 13610403, 12183279, 10853668, 10410160, 10728073, 10860121, 10404466, 9969865, 10009515, 9984743, 9169344, 7721155, 6485209, 6132132]
42047F132132O77783J382103J358016P08816L06806P86282J431801J018881l47805
42038A3454815j329178j318371j108836j335087j484710j014286l33333M9661
42030E580675L75820Q08819P15104j92384q30048j61996R23355O35351j005757
42021F848939j996675j127147M47466R91959M29168n4629J12546L85341J97926
42012F234894k58785m32462j23686L30195M32584O7688l46164l70475j35456j30651
42002E267682m63283p23161o03410k26224J79713M33942K11112o47005j447801
41993A981565j029064P36533K441493K675734J539388J08463j011968j857451
41985E584693k299097k023607j232071n74422l20083j61675J46251M79505O92295
$$ y = [6132132, 6809915, 8192018, 9550034, 10258850, 10565656, 11351938, 12783739, 13802620, 13454815, 12125637, 10807266, 9698430, 8363343, 6878633, 5864347, 5531014, 5580675, 5956495, 6765314, 7480418, 7288034, 6457986, 6295990, 7219345, 7854696, 6848939, 4852264, 3725117, 4172583, 5164542, 5593710, 5539081, 5651627, 6036968, 6234894, 5976109, 5543647, 5419961, 5750156, 6182740, 6250428, 5904264, 5533789, 5398333, 5267682, 4804399, 4081238, 3477828, 3251604, 3431317, 3865259, 4076371, 3429366, 1981565, 952501, 1689034, 4130527, 6806261, 8345649, 8454112, 7442144, 5584693, 3285596, 1261989, 29918, -544504, -864587, -1026262, -880011, -400506, 291789]
41976B91789Q03612Q07278O65060M52687K14421j56484n70057n79878k8803M67695
41966B367320K42889m98162j037984j088215p61867o7173P66385R40403J05897
41957I69493o53444n9258J404197K087780J526983O76846q7318j325547k606998
41948A932734k313017k59788J361337R31701l13475m05049M22489O66782K49656
41939B273370K48579O35019L18527p74175j440704j034292j28464N80046P65897
41930A443803J33022j070542j550444n02361P35513L55758r22488p33186J045458
41921a065467J832673M47079r12046j73480J375934J339437j7910n71001J22555
41912B377774N02286j20794o42188l61095j49601o96288j052300j2505J832702
$$ y = [291789, 1095401, 1902679, 2567739, 3020426, 3234847, 3078363, 2508306, 1928428, 1899625, 2367320, 2610209, 2112047, 1074063, -14152, -776019, -843192, -76807, 863596, 969493, 316049, 256791, 1660988, 3748768, 5275751, 5952597, 5865279, 4539732, 1932734, -380283, -640071, 721266, 1652967, 1339492, 934443, 1356932, 2023714, 2273370, 2521949, 3156968, 3475495, 2701320, 1260616, 226324, 97860, 677906, 1443803, 1576825, 506283, -1044161, -1546522, -811009, -455251, -1377739, -2110925, -1065467, 767206, 1214285, 302239, 128759, 1504693, 2844130, 2826220, 2255219, 2377774, 2880060, 2759266, 2117078, 1755983, 1606382, 910094, -142206, -154711, 1677991]
41903A677991K503028R81651j494553k677107j599566N52425J814525J413891
41895C172285J58504q31499j195854j160919r53850o47808j85496N53213J328272
41886B36848J356158K74950q61965o27539O76581J243394M20598l11457K45498
41877B653066J080667O43956p57516j643080j532117r79751j95991Q15667J296741
41868A381642N13114q29933j416083j198366r47475m10088J157189K798478K430562
41859C479040M6289j717908j096741M76503O90812m56447j182595o27604M13341
41850B4690R91908J004812P68644M45284J6743n20662r68707r60480m32272R8306
41840D68266J76080O0149R7022j23093r83396j633903r57290M55634R16673K52483
$$ y = [1677991, 4181019, 5162670, 3668117, 991010, -608556, -56131, 1758394, 3172285, 3330789, 2499290, 1303436, 142517, -811333, -1459141, -1644637, -1091424, 236848, 1593006, 1867956, 1005991, 378452, 1055033, 2298427, 2719025, 2407568, 2653066, 3733733, 4377689, 3620173, 1977093, 444976, -534775, -730766, 84901, 1381642, 1894756, 1064823, -351260, -1549626, -2497101, -2907189, -1750000, 1048478, 3479040, 3525329, 1807421, 710680, 1187183, 1877995, 1421548, 238953, -388651, 24690, 1016598, 2021410, 2790054, 3235338, 3252081, 2731419, 1762712, 802232, 369960, 468266, 644346, 704495, 801517, 678424, -304972, -1938875, -2896165, -2440531, -1523858, -1271375]
41830a271375j6536N94043O43711o47536j885225j683280o37501R3045N32876
41821d277778R15574O30859l39993n49326O61498J605295Q30087l35390k5371
41812h84545R03450N04550o20685l64610R83551J123840k15032q65993k7950O88878
41802A225454N18559O98062J509643J242046o03706j902543j262046k13366l48879
41793H63224p49195k06490L46346j14055l57369Q50107J986509J053880q68328
41784B804629j319612n67559q26138k035669j823517K43114J594478O06926j100740
41775b424088j412767n46326R5989J26175n8578l63780o89157n41861J12957M96455
41765e204981K44489R4791O52695J346872J346736P79561L51663L62624O39328
$$ y = [-1271375, -1287911, -693868, -50157, -697693, -2582918, -4266198, -4903699, -4810654, -4277778, -3362204, -2731345, -3071338, -3620664, -2959166, -1353871, -523784, -859174, -884545, 18905, 523455, -97230, -461840, 521711, 1645551, 1430519, 564526, 536576, 1225454, 1744013, 2442075, 3951718, 5193764, 4590058, 2687515, 1425469, 1212103, 863224, 114029, -92461, 253885, 139830, -217539, 632568, 2619077, 3672957, 2804629, 1485017, 917458, 91320, -1944349, -3767866, -3524752, -1930274, -1323348, -2424088, -3836855, -4383181, -4287192, -4161017, -4219595, -4583375, -5272532, -5814393, -5701436, -5204981, -4960492, -4865701, -4213006, -2866134, -1519398, -739837, -388174, -25550, 613778]
41756F13778Q91003P32169n0226r48531j110097m95213P9806K26916L94220P39314
41746A073139O59459p3558p00149n83240p1280K77107M30678L07455n28438j854783
41736a063610k420357j473839Q2216Q82257P22356K38271j87353k83978M52545
41727c051492J799525K250456P89045j272389j686712k83534Q93287N30345l38344
41718c69813j48895R60289J583298J057898J75058j2049M79998O52379j61353
41709D216810j338659j648746q32873K1340j27050j055226j784062j756352j083084
41700e387902j53429N01391M66218O2954J63089R08661J357707J001541O88137
41691c91633J106053J349136L51879j044822j144858n3398N36708O3781k94903
$$ y = [613778, 1504781, 2236950, 2186724, 1238193, 128096, -367117, -287311, -60395, 333825, 1073139, 1732598, 1659040, 958891, 375651, 304371, 581478, 1012156, 1319611, 791173, -1063610, -3483967, -4957806, -4875590, -3993333, -3270977, -3032706, -3220059, -3504037, -3051492, -1251967, 998489, 1787534, 515145, -1171567, -1455101, -561814, -31469, -369813, -518708, 441581, 2024879, 3082777, 3257835, 3245786, 3725784, 4378163, 4216810, 2878151, 1229405, 396532, 417872, 290822, -764404, -2548466, -4304818, -5387902, -5541331, -5039940, -4573722, -4510768, -4347679, -3439018, -2081311, -1079770, -391633, 714420, 2063556, 2415435, 1370613, 225755, 172357, 709065, 772846, 477943]
41682D77943J10975M77056L89706O84177J566231J642728J01280j593065j684003
41673B173028p00569m24258j073063j257720l67435P06115J218473J382042J261563
41664B918176L18917j304108k227751j495326o0206L85804l01352o31023L07300
41655b089569J539137J626067O87981J18891N20922R75469O53080J18838K19610
41646D370426M24261m94760k346585l370875k446239m09243J212854J850940J784126
41637E74905J280158N84137J59358K15387L68586K75301J63306K85093L77804
41628D284035J69225j40807m26090j003500j817060j974834r58066L48980Q34057
41619f84060P83750J161294J729029J331514p0914j158573j281249j299823j834501
$$ y = [477943, 588918, 1065974, 1455680, 2139857, 3706088, 5348816, 5450096, 3857031, 2173028, 1472459, 1048201, -24862, -1282582, -1650017, -943902, 274571, 1656613, 2918176, 3237093, 1932985, -294766, -1790092, -1850298, -1464494, -1765846, -2396869, -2089569, -550432, 1075635, 1763616, 1882507, 2403429, 3378898, 4031978, 4150816, 4370426, 4794687, 4299927, 1953342, -1417533, -3863772, -4273015, -3060161, -1209221, 574905, 1855063, 2439200, 2598558, 2813945, 3182531, 3457832, 3621138, 3906231, 4284035, 4453260, 4312453, 3886363, 2882863, 1065803, -909031, -1867097, -1518117, -684060, 99690, 1260984, 2990013, 4321527, 4250613, 3092040, 1810791, 510968, -1323533]
41610a323533j959941o14604J519585K621604J893418K80449q60063j133441j042488
41601f19014j000614p61443Q2662J185861J484580M75439r10317j290292m85641
41592a838779M61839P81957O92342O12852N17287K85791j5448m12668r07665r91917
41582h14409j30180J121095J500068Q53004M34410R12049J327836Q22463R0284
41573F116620k9375j82202j177004k027526j227192N74393J232780L21231l93637
41564C208088R3420O96092M63710O3267n885p21674k520504l596357k195201M49685
41554d065359J564169O25556l61995j25048M88004N74495N55351P77992N33309
41545E66474m68025j049945k56778R47001R73560j01979q51663o41556j87621
$$ y = [-1323533, -3283474, -3898078, -2378493, 243111, 2136529, 2416978, 1556915, 423474, -619014, -1619628, -2381071, -2298409, -1112548, 372032, 847471, -62846, -1353138, -1838779, -1376940, -594983, 97359, 710211, 1227498, 1513289, 1497841, 1085173, 177508, -814409, -944589, 176506, 1676574, 2529578, 2963988, 3876037, 5203873, 6026336, 6116620, 6087245, 5905043, 4728039, 2700513, 1473321, 2047714, 3280494, 3601725, 3208088, 3301508, 3997600, 4461310, 4524577, 4518692, 3797018, 1276514, -2319843, -4515044, -4065359, -2501190, -1875634, -2237629, -2362677, -1874673, -1300178, -744827, 33165, 566474, 98449, -951496, -1208274, -261273, 712287, 610308, -241355, -882911, -1070532]
41536a070532j41298l15098m05971m81392m93368j05198O61432J173235Q99325
41527b78865L1972p64244r31290l32814O38813J247651J061770M16525p9820l58087
41517F51611p43293j140755j012631k37692N88412Q77559O18514J33988k51582
41508e15869k43375J66552L72835k85191j434701j783323o72099J016147J872412
41499a506612J446587M14337k71057q3923P30131J191467M59564j032466j883005
41490e34977j449162n25622R7635P55037J765628K163739R13727j144564k046854
41481e413j268838j37437L59511O65652J167034J133453O9144j023411r01489
41472E8206J04621O97098N65936N24902Q70903Q63155P9891p66706r06083o34571
$$ y = [-1070532, -1211830, -1526928, -1932899, -2414291, -2907659, -3012857, -2351425, -1178190, -278865, -246893, -1011137, -1942427, -2275241, -1636428, -388777, 672993, 1089518, 1009698, 651611, -91682, -1232437, -2245068, -2482760, -1894348, -1016789, -398275, -264287, -515869, -759244, -592692, -219857, -505048, -1939749, -3723072, -4395171, -3379024, -1506612, -60025, 354312, 83255, -668, 729463, 1920930, 2380494, 1348028, -534977, -1984139, -2509761, -2412126, -1657089, 108539, 2272278, 3186005, 2041441, -5413, -1274251, -1411688, -1052177, -386525, 780509, 1913962, 1983106, 959695, 58206, 162827, 859925, 1425861, 1950763, 2821666, 3684821, 3764712, 2998006, 2091923, 1457352]
41462A457352o93704j012640q20667J49209J226542J629388J250797N32422l7486
41453C681213j80804J7430L2884o27713j622319j848267p41574Q12284J401392
41444I24526P53390q1073j41018M40668Q95919P05401j28207j158313j632457
41435E78836j038927K24281J127317J146075O87858K46098k54851r52362j492075
41426B72250j469724r95528m07570J48574N14523M63563K74604O85606J671121
41417A157419J975835P23883j084564j717611r89822l01982n53059j111850r83710
41408b885461o6805J013344J632054J506932Q39809K53231J88241L85855L02806
41399C170006j85398q64838j513359j646878o14349J239346K245557J390814n8621
$$ y = [1457352, 763648, -248992, -1069659, -920450, 306092, 1935480, 3186277, 3718699, 3681213, 3500409, 3517839, 3550723, 2923010, 1300691, -547576, -1289150, -476866, 924526, 1677916, 1596843, 1455825, 1896493, 2792412, 3497813, 3369606, 2211293, 578836, -460091, -235810, 891507, 2037582, 2725440, 2971538, 2716687, 1764325, 272250, -1197474, -2193002, -2600572, -2451998, -1937475, -1473912, -1199308, -513702, 1157419, 3133254, 3857137, 2772573, 1054962, 65140, -236842, -789901, -1901751, -2885461, -2952266, -1938922, -306868, 1200064, 2039873, 2293104, 2481345, 2867200, 3170006, 2984608, 2119770, 606411, -1040467, -1654816, -415470, 1830087, 3220901, 3162280]
41390C162280l39820L9597p88017k667216l219604j405012Q89361J659221J232323
41381a436887P92047K76091p04215j254463l07654J429599K204392J439798K6024
41372B464732j104782j555821j107843M1099R49762Q18572R017n00394l25023
41363c10681K16078O82637O99825K17197l2310O95105J524717N63861k065973
41354B190456l519136j940617P39229J559989O19467J54532P19606R54545N18518
41345A996589M40032O47121j17824j608894j863218l10492J190935J207375N52106
41336B133730M23106O59558P54381P94825N04152q54311k673691k939761j094523
41327b292534P66075P80167k32755n06494Q6797O41540R86390J324442J287163
$$ y = [3162280, 2822460, 2862057, 2074040, -593176, -3812780, -5217792, -4328431, -2669210, -1436887, -644840, -368749, -1072964, -2327427, -2635081, -1205482, 998910, 2438708, 2464732, 1359950, -195871, -1303714, -1262615, -312853, 505719, 514736, 14342, -310681, -94603, 588034, 1287859, 1505056, 1472746, 2167851, 3692568, 4256429, 2190456, -1328680, -3269297, -2530068, -970079, -350612, -196080, 523526, 1478071, 1996589, 2436621, 3083742, 2965918, 1357024, -506194, -816686, 374249, 1581624, 2133730, 2556836, 3216394, 3970775, 4765600, 5269752, 4415441, 1741750, -1198011, -2292534, -1526459, -746292, -979047, -1485541, -1398744, -757204, 229186, 1553628, 2840791]
41318B840791P08603K17760m4539q66204k004456j656498N54685K087698J047589
41309B885429p33697p42789j628r51870k585716j703784J422683K821828Q21549
41300A232005j555093j465779j17950P4145o39295n77006L27121R65557J119675
41291f36620J118002N79931p38234j802812j577185n78765J74469P69364J577260
41282a114590J935116J255090M93012P77408J355436P08730q96310j838904j696928
41273I78060j467737j477159j029597j74531J19294j50023J76185J188352J301603
41264e35553k06820j610319r38012J275413K694902K002538o0043j993975k851841
41255b223710k457065j245042p757P20154J108201J602466K146264K141587J204814
$$ y = [2840791, 3549394, 3767154, 3722615, 2856411, 851955, -804543, -249858, 1837840, 2885429, 2151732, 1408943, 1407315, 455445, -2130271, -3834055, -2411372, 410456, 1232005, -323088, -1788867, -1906817, -1832672, -2471967, -3048973, -2721852, -1756295, -636620, 481382, 1061313, 323079, -1479733, -3056918, -3635683, -3461214, -2691850, -1114590, 820526, 2075616, 2568628, 3346036, 4701472, 5410202, 4513892, 2674988, 978060, -489677, -1966836, -2996433, -3170964, -3051670, -3201693, -3025508, -1837156, -535553, -742373, -2352692, -3290704, -2015291, 679611, 2682149, 2622106, 628131, -2223710, -4680775, -5925817, -5933574, -5213420, -4105219, -2502753, -356489, 1785098, 2989912]
41246B989912k19453j098866p70486K90023Q85659M65763k63726m21054j48834
41237A708938j06148k42873n2418K07902k84480j445254k156383j844354j091005
41228e306075l87067N16744J540865J839913J217209Q16818J410116J993563J247858
41219D889944m09738j459674j352065p30696j11756L95899M45686j81865q04051
41210F81684o10182L5619K25525P5320L01389N94404R0763o66538j67951J396121
41200A956154J912347M94022j051521r83847j19433j27378q15195q89713l80092
41191d656l63632q39426p78404j28055N368o65525j021111l26071O96824J086021
41181b338667Q33989L26332l95859j116389j009226M01229K237600K946218J874748
$$ y = [2989912, 2770459, 1671593, 901107, 1191130, 2076789, 2542552, 2278826, 1857772, 1708938, 1602790, 1359917, 1307499, 1515401, 1230921, -214333, -2370716, -4215070, -5306075, -5693142, -5176398, -3635533, -1795620, -578411, 238407, 1648523, 3642086, 4889944, 4480206, 3020532, 1668467, 937771, 826015, 1221914, 1667600, 1485735, 681684, 71502, 107121, 332646, 407966, 709355, 1303759, 1394522, 727984, 560033, 1956154, 3868501, 4362523, 3311002, 2327155, 2207722, 2080344, 1265149, 375436, -4656, -368288, -1207714, -1986118, -2114173, -2108805, -2774330, -3795441, -4121512, -3424688, -2338667, -1504678, -1178346, -1574205, -2690594, -3699820, -3298591, -1060991, 1885227, 3759975]
41172C759975j77461j781767j999456r72034K86418Q33975O67392M38381L76303
41163A431726O3750n71529p95696j60134N30901J92822q49400j108541j9233J130967
41153a54367R00752l23831q77203p5315J012381J188665O17169J54440p5224n53311
41143A814156j170555j171685l60942N00116P45931N36409K50263j22576n57640
41134D63477o35509j78960K51628Q1467m55418p53294p14796o40467n74773l18156
41124c474801J69713Q19319J549620J909524J176275n55101j902844j622644j50082
41115b081021J029893J177368O58900o0907p74941j107077p62278j65057J5831
41106b069289j21235j8222K24779K8213m92161n68387J8783P36564J205344J333912
$$ y = [3759975, 3582514, 1800747, -198709, -1170743, -884325, -50350, 617042, 1055423, 1431726, 1495476, 923947, 128251, -31883, 499018, 691840, -157560, -1266101, -1285334, -154367, 746385, 422554, -454649, -529964, 482417, 1671082, 2288251, 2442691, 2367467, 1814156, 643601, -528084, -889026, -388910, 357021, 893430, 1143693, 1021117, 463477, -172032, -350992, -99364, -17897, -473315, -1226609, -1941405, -2581872, -3156645, -3474801, -3305088, -2485769, -936149, 973375, 2149650, 1594549, -308295, -1930939, -2081021, -1051128, 126240, 785140, 724233, -50708, -1157785, -1920063, -2085120, -2069289, -2190524, -2208746, -1983967, -1955754, -2447915, -3016302, -2997519, -2260955, -1055611, 278301]
41096B78301P94364m31158j215174m69107R26769J057505p1230m42075O73385
41087A101580J438548M74180q37144n93784O71082J092614M06406j25944m4530
41078C583008r6027n76640q94001p83390o20618m27921K72530J395502K019536
41069C871979J513587L60272m07176l05629J68469J63054m23226p41627l37297
41060C862406j57087j128857k185624j462333N58765J319072J53771n19754P60842
41051A201201J886224O92357j242196j150919L19651L49008j267210j998329q66702
41042b076915M35736P55419P03879M60267n62349j438360l15116J973141K160038
41033B095740l78045k072699m48229K116366K219805L67980o70296l34024j15160
$$ y = [278301, 1072665, 641507, -573667, -1042774, -116005, 941500, 870270, 428195, 1101580, 2540128, 3014308, 2177164, 1583380, 2254462, 3347076, 3753482, 3627538, 3583008, 3486981, 2910341, 2016340, 1232950, 612332, 184411, 456941, 1852443, 3871979, 5385566, 5745838, 5338662, 5033033, 5201502, 5364556, 4941330, 4199703, 3862406, 3705319, 2576462, 390838, -1071495, -512730, 806342, 960113, 440359, 1201201, 3087425, 3779782, 2537586, 1386667, 1706318, 2055326, 788116, -1210213, -2076915, -1641179, -885760, -181881, 278386, -283963, -1722323, -2037439, -64298, 2095740, 1717695, -355004, -803233, 1313133, 3532938, 3900918, 3230622, 2896598, 2781438]
41024B781438l83674l05913n2435m38778r59391n29637L69369N02295K16061O64176
41014A863511J279578N43612j051935j461595m90476m3828o72008o52361O77981
41005g521J381549J14011j436090j102249N01246J210105N56464j64193k72392
40996G80930k68382l89052k77976l8006k16862o56293n34398K76258R01010P20166
40986B97395M8652o42677j274360j578981q99880P35710J993682J602051J13969
40977C95561o09031K02615J191022P40686p63256j446045n30130O54384O39870
40968D75676j35983j89685O24507Q75802j54374j202369q45921K52689J63497
40959a36161j461785k667161j756328M65063J880162J814368J423074J536257
$$ y = [2781438, 2397764, 2091851, 2039416, 1600638, 641247, 111610, 480979, 983274, 1199335, 1863511, 3143089, 3686701, 2634766, 1173171, 682695, 638867, -33141, -685502, -7521, 1374028, 1488039, 51949, -1050300, -549054, 661051, 1217515, 1053322, 780930, 512548, 123496, -154480, -192486, -409348, -1065641, -1600039, -1323781, -422771, 297395, 346047, -296630, -1570990, -3149971, -4049851, -3314141, -1320459, 281592, 395561, -213470, -10855, 1180167, 1920853, 1157597, -288448, -818578, -164194, 475676, 339693, 150008, 774515, 1650317, 1495943, 293574, -552347, -299658, -136161, -1597946, -4265107, -6021435, -5556372, -3676210, -1861842, -438768, 1097489]
40951A097489J459361L62984j206535k008001j631577n77644O07414J435997J292070
40942H31558K13629n21080K06206J562886J656148J63229j315828j632906j269474
40933a05632q09461K4852J054286J106985P432m67861Q38294K312774J843807
40924E805476R4194o82426k58289l11305j033503p28073P71248J131817p59446
40915D029693k563138j872691L8551J96864j504761k309481q73628R37320J052930
40906b868341j0965m31195K33574R37623R83520O84002M14233O9165m12236p47484
40896a148104p77585o93758n64086j20789O67649J248261J162860P94731R14597
40887A483776J578130J966844J383193N4500j116287j373064p34411j6262m4633
$$ y = [1097489, 2556850, 2919834, 1713299, -294702, -1926279, -2503923, -1896509, -460512, 831558, 1045187, 524107, 730313, 2293199, 3949347, 4112576, 2796748, 1163842, -105632, -915093, -890241, 164045, 1271030, 1278462, 810601, 1648895, 3961669, 5805476, 5899670, 5217244, 4958955, 4647650, 3614147, 2886074, 3657322, 4789139, 4029693, 1466555, -406136, -367585, -170721, -1675482, -3984963, -4858591, -3921271, -2868341, -2879306, -3310501, -3076927, -2139304, -1155784, -471782, -57549, 11616, -400620, -1148104, -1925689, -2619447, -3183533, -3304322, -2636673, -1388412, -225552, 569179, 1483776, 3061906, 5028750, 6411943, 6466443, 5350156, 3977092, 3242681, 3226419, 3181786]
40878C181786n99073n44549N15757J302741N06337j081676j424139j44716R74349
40869B686817P10208m2805j83732k24817r36368j555844r98992R4400L02526j90622
40859c39229K7345J111096J680764J115308M22892M27685N50634K7138p58110
40850D265523q48343J0495J084762J247149r8900k149730l063271j976297k57992
40841a786604K43562l14369l90395L13781O47537L21130L91833J072571J059738
40832A558784j49680j063757m20141Q59294J145233L77375l13683l56449n6320
40823A580656J23891j88721j019409j500660n69688J269052K095201J125372k39423
40814B676271o58702n75227o90525m45887N14562R54401p8517j292835r99951
$$ y = [3181786, 2582713, 2038164, 2553921, 3856662, 4362999, 3281323, 1857184, 1712468, 2686817, 3397025, 3354220, 3170488, 2945671, 2009303, 453459, -545533, -451133, -148607, -339229, -311884, 799212, 2479976, 3595284, 4018176, 4445861, 4996495, 5023633, 4265523, 3417180, 3427675, 4512437, 5759586, 5660686, 3510956, 447685, -1528612, -1786604, -1543042, -1857411, -2247806, -1934025, -1286488, -965358, -573525, 499046, 1558784, 1409104, 345347, -74794, 784500, 1929733, 2307108, 1993425, 1636976, 1580656, 1704547, 1515826, 496417, -1004243, -1573931, -304879, 1790322, 2915694, 2676271, 2017569, 1442342, 751817, 305930, 820492, 1774893, 1696376, 403541, -596410]
40805e96410J99851N97580K12182K13457L64368m51125j617167j323372L20832
40796b079804J226942O38117Q1422N13950Q69985K73526m49446n17449n65942
40787h699j132810j461871j021580o59931r45329q05044O94223K416953K619349
40778c04739J449693M07823k6497o12373j528651j862235j013472M45773J457947
40769a586731J386334L74989o31555n37612O57426J667440J531609Q14009M86419
40760D162328L73955k33094j074136j356937j289804j692352k232861j686609
40752e029510j73434N32509l81328j329144n97513J124878J901397J457708J254373
40743a240064J841282J916402N95807q25539n60312J000456J665840L84426j403225
$$ y = [-596410, -396559, 201021, 413203, 626660, 991028, 539903, -1077264, -2400636, -2079804, -852862, -214745, -133323, 380627, 1250612, 1524138, 1074692, 557243, -8699, -1141509, -2603380, -3624960, -4284891, -5230220, -6035264, -5341041, -2924088, -304739, 1144954, 1552777, 1526280, 913907, -614744, -2476979, -3490451, -3044678, -1586731, -200397, 174592, -456963, -994575, -337149, 1330291, 2861900, 3675909, 4162328, 4536283, 4303189, 3229053, 1872116, 582312, -1110040, -3342901, -5029510, -5202944, -4670435, -5051763, -6380907, -6978420, -5853542, -3952145, -2494437, -1240064, 601218, 2517620, 3113427, 2287888, 1727576, 2728032, 4393872, 4778298, 3375073]
40734C375073j703603l46510J178823J631860J019092K6996p42149r75596p21136
40725B742850l95897l42936l73859j41219J42990n0813o12878q03055m20871k01724
40715d57412n94440q66638j69744J030757J546755J238873J085063J374106J053632
40706E240952m62412j893178j706008n46700m93637j846140k388395o94626J373703
40697c416441J099752j079603k078797n45715J439481J654193O72799K19527K78444
40688a756360k37995r61531m15218J329397K350995J560161P3193o00617l87093
40679I54932m0418J19689J02559k23012p33204q48403l59454J30781J19794n0422
40669h27158J09323M10684M50381L50640M30016N99503O51113O92590P41428L81623
$$ y = [3375073, 1671470, 1324960, 2503783, 4135643, 5154735, 5181731, 4439582, 3463986, 2742850, 2346953, 2004017, 1630158, 1488939, 1631929, 1581116, 968238, 165183, -255688, -457412, -1051852, -1918490, -2088234, -1057477, 489278, 1728151, 2813214, 4187320, 5240952, 4778540, 2885362, 1179354, 632654, 139017, -1707123, -4095518, -4790144, -3416441, -2316689, -3396292, -5475089, -6020804, -4581323, -2927130, -2254331, -2034804, -1756360, -1994355, -2955886, -3371104, -2041707, 309288, 1869449, 1942642, 1342025, 954932, 914514, 1034203, 1136762, 913750, 180546, -667857, -1027311, -896530, -776736, -827158, -717835, -307151, 143230, 493870, 923886, 1523389, 2174502, 2867092, 3608520, 3990143]
40659C990143n20462j199631q60596R9273M99880p8769q41966q99786k64983M17156
40649C40259P13640P18647O67260M61247k21897j257718j816009j240704o7759
40640a703034M63480j9011o16898n30096r0147p376k40797k08644L05278J000137
40630a647108J504703J555155J049496K92681j50049j51005j74870m85182p36239
40621A057582o69431n67656n76866k69325N30720J155466J025581N53200L43173
40612B582444J17571o12590j307153r41317M15959J564272J634491P70214m69572
40603C754319j501109j672908q18750J54915J66481n17004n79390M39544J521457
40594I47555J675708J085837L48906m92204j486088k041701j532829l94834J33357
$$ y = [3990143, 3469681, 2270050, 1409454, 1508727, 2008607, 1929838, 1087872, 188086, -76897, 340259, 1053899, 1772546, 2439806, 2901053, 2679156, 1421438, -394571, -1635275, -1703034, -1239554, -1258565, -1875463, -2405559, -2495706, -2503082, -2743879, -2952523, -2647245, -1647108, -142405, 1412750, 2462246, 2754927, 2604878, 2453873, 2279003, 1793821, 1057582, 388151, -179505, -756371, -1025696, -494976, 660490, 1686071, 2239271, 2582444, 2700015, 2087425, 780272, -161045, 254914, 1819186, 3453677, 4223891, 3754319, 2253210, 580302, -238448, -83533, 82948, -434056, -1013446, -573902, 947555, 2623263, 3709100, 4058006, 3565802, 2079714, 38013, -1494816, -1889650, -1756293]
40585a756293n14658j452904j314970J14249J551304J686512P38411L1378J21265
40576g95706J64295n58055j400505j364249o22087q4715N1552K87058P03325R70565
40566b648522J254804J948502K551360K030333M51771q69642j108133p68416n24747
40557B317310l30322j13202k57229p30889o67473M00138J579582J659882O04723
40548D462520o39144j344451j388736q85344j18999L95009L41773m3783l78711
40539D00134o11743q18518q80470p03842m25779j05068M29888J140059J587355
40530A2016J500182J127395P30520J85622n36343r65151p07767r6525K29828J67184
40520A646961J30675L44431N26366K72187m06634r12673n36236O51373J552108
$$ y = [-1756293, -2270951, -3723855, -5038825, -4924576, -3373272, -1686760, -948349, -916971, -795706, -631411, -1189466, -2589971, -3954220, -4576307, -4661022, -4609470, -4322412, -3619087, -2648522, -1393718, 554784, 3106144, 5136477, 5588248, 4718606, 3610473, 2842057, 2317310, 1986988, 1873786, 1616557, 885668, 218195, 618333, 2197915, 3857797, 4462520, 3823376, 2478925, 1090189, 204845, 85846, 480855, 822628, 778845, 400134, -211609, -1030127, -1910597, -2614439, -3040218, -3145286, -2715398, -1575339, 12016, 1512198, 2639593, 3370113, 3555735, 3019392, 2054241, 1346474, 1249949, 1479777, 1646961, 1777636, 2122067, 2648433, 2920620, 2513986, 1601313, 1065077, 1716450, 3268558]
40511C268558J163723j58710j135745j142283o19753r781P09399J252892R08836
40502D237136l00028j258438j158779m74247L718K40976M32563K87311l13871
40493A696341o67286j47794P92767J306084J247440Q63680R1538r49395j460222
40484B773153r80031k96900k88523m63217J48252J197738J493458R08173L66746
40475D858849J11531n01566j410234j552690n41865O10450Q80230L14593n78002
40466B191296j425629j612879m77465J474582K531238J719906Q8161o45591j33395
40457C710224N66349N17171j98787q76159r85355o39624m21481o11107p10001
40448C51230j20091Q92005J503386J427805R69362K20657p82170j257437l71676
$$ y = [3268558, 4432281, 4273571, 3137826, 1995543, 1375790, 1366009, 2075408, 3328300, 4237136, 3937108, 2678670, 1519891, 1045644, 1049362, 1290338, 1722901, 2010212, 1696341, 1029055, 881261, 1674028, 2980112, 4227552, 5091232, 5182770, 4233375, 2773153, 1793122, 1496222, 1207699, 744482, 892734, 2090472, 3583930, 4492103, 4858849, 4970380, 4468814, 3058580, 1505890, 964025, 1574475, 2454705, 2769298, 2191296, 765667, -847212, -1324677, 149905, 2681143, 4401049, 4489210, 3843619, 3710224, 4276573, 4793744, 4594957, 3718798, 2733443, 2093819, 1672338, 1061231, 351230, 231139, 1123144, 2626530, 4054335, 5023697, 5244354, 4462184, 3204747, 2833071]
40439B833071J082438J153357n89493k236405k158199j058705l65367M6792R89529
40430c02982J878311J447478J24201k49932P85791J493611M65680j371346k084245
40421B186567j166755J94476P67569M27381j49148l56742j39503J61611K57808
40412B183264Q6684l78354j065053j394032n79425J107684K013590J003546p21921
40403B255983r71062L63936J074613r9661j536495j158892M26097Q70979l86728
40394H38770j397841o96468O72376R50777K11557j57143K16727L25118l72189
40385E91684j085516j026771n16583j80994O5324M67566O02613R2350l68296J17402
40375a241221R69148O68232q36375j632608m34705J474290J937634Q00875j42694
$$ y = [2833071, 3915509, 5068866, 4479373, 2242968, 84769, -973936, -1339303, -1292511, -302982, 1575329, 3022807, 3147008, 2897076, 3682867, 5176478, 5642158, 4270812, 2186567, 1019812, 1214288, 1981857, 2409238, 2260090, 1903348, 1763845, 1925456, 2183264, 2269948, 1891594, 826541, -567491, -1146916, -39232, 1974358, 2977904, 2255983, 1284921, 1648857, 2723470, 2623809, 1087314, -71578, 354519, 1225498, 838770, -559071, -1255539, -583163, 367614, 579171, 422028, 638755, 963873, 591684, -493832, -1520603, -2037186, -2218180, -2152856, -1685290, -1082677, -990327, -1358623, -1241221, -272073, 396159, -440216, -2072824, -2507529, -1033239, 904395, 1705270, 1562576]
40366A562576K47173J157229J230836K63516q75526j324446q51362J19775P80203
40357B309974N89576j13438m83393k87308k04090p64724j472263j431704n71075
40348b428445K72707M16295M8403j83578K7688M74097Q98457J318394J712122
40339B556140J580283L22284j703179k953555k199518j58847J091543N33702o50203
40330a581350p76862J44105O68348K4730r40025j003367j9145J166049J747782
40321e69735J582104J092257Q40668R92821J078267N44637m12690j012622r83516
40312C152191q90543j081925j043594m20346L4224m52453j087551l60759J502968
40303f47788K367557J028271r82900j384428q1418J028300P01484m03780j047148
$$ y = [1562576, 1809749, 2966978, 4197814, 4461330, 3585804, 2261358, 1409996, 1529771, 2309974, 2899550, 2786112, 2302719, 2015411, 1811321, 1046597, -425666, -1857370, -2428445, -2155738, -1739443, -1691040, -1874618, -1846930, -1372833, -474376, 844018, 2556140, 4136423, 4458707, 2755528, -198027, -2397545, -2556392, -1464849, -931147, -1581350, -2358212, -2214107, -1545759, -1521029, -2461054, -3464421, -3483566, -2317517, -569735, 1012369, 2104626, 2945294, 3938115, 5016382, 5561019, 5148329, 4135707, 3152191, 2261648, 1179723, 136129, -284217, -249993, -702446, -1789997, -2150756, -647788, 1719769, 2748040, 1765140, 380712, 299294, 1327594, 2029078, 1625298, 578150]
40294E78150q83511l57102J18147M77957Q49122J233132J204537K02849j458521
40285A964760k306528j269631O60767J321708K3216j664609k019165j086318m0524
40276d416324M50535N23901M94643P11503J514961K562737K644553J055297j093432
40267D448374j855436p70812N77641N19883q13495j879895j590371l81772M88135
40258a257748M16744R780J26485O81636Q43494L23049k06048j79692N6804k2581
40248G91923k14481o4825K09446O4721l72675m63259j04338J56157Q3530R5578
40238A81777M60985P79147N53846j18324o92655p88439n40736m69629r23330j520152
40228c077510j441019n57784J74716j8511n39260k80391O69932J218471J027877
$$ y = [578150, -305361, -662463, -544316, -66359, 782763, 2015895, 3220432, 3423281, 1964760, -341768, -1611399, -950632, 371076, 394292, -1270317, -3289482, -4375800, -4416324, -3965789, -3441888, -2947245, -2235742, -720781, 1841956, 4486509, 5541806, 4448374, 2592938, 1822126, 2399767, 2919650, 2106155, 226260, -1364111, -1745883, -1257748, -841004, -831224, -704739, -23103, 820391, 1143440, 937392, 757700, 814504, 791923, 577442, 512617, 722063, 786784, 414109, -49150, -153488, 2669, 86199, 181777, 642762, 1421909, 1975755, 1857431, 1164776, 376337, -164399, -634028, -1557358, -3077510, -4518529, -5076313, -4901597, -4920108, -5459368, -5739759, -5069827, -3851356, -2823479]
40219b823479Q99745J219404J221217L12914r02970j592561j765971j635424q12852
40210e879977P86521J939698J375086j93762o50837P26124K262750K174052Q20276
40201C359931j42318j37892p6031n65338q86045k04450R61803J282391L59676
40192C951727q17758j214301q67691m11190q2648K73896N89487N55074J19531
40183B096127m32898p95852o90526J15700J311815J836065R22828o82347j316413
40174B364499l40251J163568J750326R97054n74462k115322k682684j733460K2741
40165a147991R24856J58392j236784j698692r33016K34219J170253J731908J682157
40156H85302Q39471k66825p60415m98646j08407M1960J72142L47773K19369k31880
$$ y = [-2823479, -1923734, -704330, 516887, 829801, -73169, -1665730, -3431701, -5067125, -5879977, -5093456, -3153758, -1778672, -1972434, -2623271, -1897147, 365603, 2539655, 3359931, 3217613, 3079721, 3003690, 2438352, 1552307, 1347857, 2309660, 3592051, 3951727, 3133969, 1919668, 1051977, 640787, 558139, 832035, 1421522, 1976596, 2096127, 1663229, 867377, 176851, 292551, 1604366, 3440431, 4363259, 3680912, 2364499, 2024248, 3187816, 4938142, 5935196, 5360734, 3245412, 562728, -1170732, -1147991, -223135, -64743, -1301527, -3000219, -3933235, -3699016, -2528763, -796855, 885302, 1724773, 1457948, 697533, 198887, 90480, 132440, 304582, 652355, 871724, 639844]
40146F39844l90034J31007Q22004R30759M40780l9624j57395j63664m31173r39999
40136H42505j299480j122150l65274N48282R24900L37518q03437j342111m86621
40127b765868J024741J410097J4260j483833r51869J302107K737010J929045L55182
40118C570872K1860N86909K89423j035519j695973q54609K07772P4711q68372
40109B97074j261832o27814M06610J108792J106800L12615q98087j689285j527406
40100b772533p55903O399P18815J629149K392408K186159P92706r27533j842386
40091A427281j580409o67620J22681L92296K22469j07156l69124m24005k49785
40082a233372p0237k29582o80176q04418j53175P68730R96459M28564P5428P24135
$$ y = [639844, 249810, 380817, 1202821, 2133580, 2574360, 2534736, 2377341, 2213677, 1782504, 842505, -456975, -1579125, -1944399, -1396117, -471217, -133699, -937136, -2279247, -2765868, -1741127, -331030, -316770, -1800603, -2752472, -1450365, 1286645, 3215690, 3570872, 3592732, 4179641, 4469064, 3433545, 1737572, 882963, 1090735, 1165446, 297074, -964758, -1592572, -1185962, -77170, 1029630, 1342245, 444158, -1245127, -2772533, -3528436, -3522037, -2803222, -1174073, 1218335, 3404494, 4197200, 3269667, 1427281, -153128, -820748, -698067, -305771, -83302, -190458, -559582, -983587, -1233372, -1303609, -1533191, -2213367, -3017785, -3170960, -2402230, -1405771, -977207, -901779, -177644]
40072a77644J829811K151489J236747j29739q93653q57518p48227j197367j766244
40063e52345j314025M39099K120913K090416M50989j034355j044138N4628J164128
40054B375310J723873J607897O82407p41484j624282j258552l04350J4144m83322
40045A991641r07076p37992m40938n26889p62002o62196k70516o620K5788J71978
40035b124822O27539R70070N66352n17415j351748j224220o08971m78275q10161
40026d951651o25774L85988J266964J235734P74908O10510N26039J06567j56401
40017h27116L39677J028685R73544M83152N27855Q52437K71544j155539j892114
40008F02125j172679M8713Q12128J229457J261814J63286j800643k688668j400447
$$ y = [-177644, 1652167, 3803656, 5040403, 4910664, 4017011, 3159493, 2411266, 1213899, -552345, -1866370, -1427271, 693642, 2784058, 3235047, 2200692, 1156554, 1211182, 2375310, 4099183, 5707080, 6389487, 5648003, 4023721, 2765169, 2460819, 2474963, 1991641, 1084565, 346573, -94365, -621254, -1383256, -2045452, -2315968, -2322588, -2296800, -2124822, -1497283, -527213, 39139, -478276, -1830024, -3054244, -3663215, -4141490, -4951651, -5577425, -5191437, -3924473, -2688739, -1913831, -1303321, -777282, -670715, -827116, -487439, 541246, 1514790, 1997942, 2525797, 3378234, 3649778, 2494239, 602125, -570554, -521841, 290287, 1519744, 2781558, 2944844, 1144201, -1544467, -2944914]
39999b944914M18016O18335l64846n25398M39755J012705O35200L34521M61393
39990H4767P4925q25091o45036J099215K329036J215707j010986j845587j010313
39981e33363k03948p7299K95023J046960R34867k92945r51399O1621J381751J191273
39971B852541q3834o84964l09680j91833p33519r43388m51398k97396r81986j263741
39961c089198q1206J432877J331339l15409j466864q98686M33325J064744Q42531
39952g46547N18771M82374O44794R42875J185445Q49158j98725j094715r19236
39943A664194p2962J72453m77990r06798l38356L86729L2270j148989j724278
39934b413727j074952r4853K49612J39647K17969M27059K71215j95057m48194
$$ y = [-2944914, -2526898, -1908563, -2273409, -2798807, -2359052, -1346347, -711147, -376626, 84767, 159692, -665399, -1310435, -211220, 2117816, 3333523, 2322537, 476950, -533363, -737311, -814610, -519587, 527373, 1462240, 1169295, 217896, 279517, 1661268, 2852541, 2768707, 2083743, 1774063, 1582230, 848711, -94677, -546075, -843471, -1825457, -3089198, -3170404, -1737527, -406188, -721597, -2188461, -3087147, -2653822, -1589078, -746547, -227776, 254598, 899392, 1842267, 3027712, 3876870, 3678145, 2583430, 1664194, 1591232, 1763685, 1285695, 378897, 40541, 427270, 459540, -689449, -2413727, -3488679, -3583532, -3333920, -3194273, -2976304, -2549245, -2278030, -2473087, -2921281]
39925b921281l63856k04853J53264J040248J909835J527664j93434j508377r32896
39916a493686O49753J146632J56242o67486k36911M38263L6233r17779q34203
39907a722942N64997J851165J796290O90583l95396q29924n81060J31860Q22638
39898B328211Q36621N7631p17644o74690j35763k11537j222594k084697j617142
39889c441604k1343J424809J865869J495620Q22693J6115q09564j237487r37220
39880h22112j76599L87413L09113l80309j207297j383687l58136J342628K215018
39871g3968J335588l53211r36603K88673K048715K565627J334977o28336j850566
39862C730896j567720k53081P94039O24351m52548j268457j081926k84748Q8362
$$ y = [-2921281, -3285137, -3489990, -3336726, -2296478, -386643, 1141021, 947587, -560790, -1493686, -843933, 302699, 458941, -208545, -445456, -7193, 29040, -888739, -1722942, -1157945, 693220, 2489510, 3180093, 2784697, 1954773, 1373713, 1505573, 2328211, 3164832, 3222463, 2504819, 1830129, 1694366, 1482829, 260235, -1824462, -3441604, -3462947, -2038138, -172269, 1323351, 2146044, 2162159, 1352595, 115108, -822112, -998711, -611298, -302185, -682494, -1889791, -3273478, -3631614, -2288986, -73968, 1261620, 908409, -28194, 260479, 2309194, 4874821, 6209798, 5581462, 3730896, 2163176, 1910095, 2704134, 3328485, 2875937, 1607480, 525554, 240806, 329168]
39853C29168o08980j881488k218902m89727K359828L661385J947457r77166k010057
39844A11518m80440J422570J792829R32235j09111j072268j707420j125162O96854
39835D61605J980690J266310l77979q09015J64383Q50948M11022k09380j52704
39826C585880J04027j82852q60222j279885j096918l82743M26518O36014K1459
39817I71278o24101m42779J62902J10372o12582r25517l84730K84878N24026N53587
39807c82666M32587j40225o81477k9556J691901K584923J441008m57149j114516
39798C344830m20914K64492K98342R7689k05046r57680j864137j900256o38215
39789a980895J087061K009782J500071n4908j462887j601075o15554J08954k54960
$$ y = [329168, -279812, -2161300, -4380202, -4869929, -2510101, 1151284, 3098741, 2121575, 111518, -368922, 1053648, 2846477, 3778712, 3669601, 2597333, 889913, -235249, 461605, 2442295, 3708605, 3330626, 2521611, 2685994, 3536942, 3947964, 3738584, 3585880, 3689907, 3507055, 2646833, 1366948, 270030, -112713, 313805, 949819, 971278, 347177, -95602, 67300, 177672, -434910, -1360427, -1745157, -1460279, -936253, -382666, 49921, -90304, -771781, -801337, 890564, 3475487, 4916495, 4459346, 3344830, 2923916, 3188408, 3486750, 3584439, 3379393, 2421713, 557576, -1342680, -1980895, -893834, 1115948, 2616019, 2561111, 1098224, -502851, -1118405, -1009451, -1264411]
39780a264411p53235o7796J354889J773851N90650q95138j322285p99033k66733
39771a649241k14595m70079o30266l06595N90419J551926J876770J500867R65757
39762C214963N65079J56258j60391q186M00485K40521o60967j368581j225224
39753A153957q78347j104598j334588n07302R75058J485574M81116o85772p61922
39744a176824k81955l81970q11195m35523O52893J040730K33847m46243N8199
39735a548041Q14986M53800m90012l93817P17702J075937l7877j171084r98978
39726a577384j44678K74574M77239J046710J307577L72310r00368q19019N07197
39717E44158J199506L93368o26352n12066L05130N32868k33433j329767j864856
$$ y = [-1264411, -2017646, -2085442, -730553, 1043298, 1633948, 738810, -583475, -1382508, -1649241, -1863836, -2333915, -2964181, -3270776, -2680357, -1128431, 748339, 2249206, 3214963, 3780042, 3936300, 3775909, 3767723, 4168208, 4408729, 3747762, 2379181, 1153957, 275610, -828988, -2163576, -2670878, -1695820, -210246, 270870, -414902, -1176824, -1458779, -1840749, -2651944, -3087467, -2434574, -1393844, -1159997, -1606240, -1548041, -733055, -279255, -769267, -1163084, -445382, 630555, 592678, -578406, -1577384, -1722062, -1447488, -970249, 76461, 1384038, 1756348, 855980, 36961, 544158, 1743664, 2137032, 1510680, 998614, 1303744, 1836612, 1603179, 273412, -1591444]
39708a591444j299499J15098J172638P89278m51544p55159M76992J716693J418182
39699A591235O1833q13882q06144p31787r77425r83265l92705K62414L75457K04803
39689b209466N48013J565522K261835J510029l30711j417405o37586P51620P91328
39680B833179k70403l92123Q23917J183338n88563k335512j378227J342655K383613
39671C601874O18874j398838j182548O24519J738760J237793j2106r45271j241953
39662C041104j145809j082346j243194j250352o01829M41624J017729Q41272M77682
39653D95881K54927j81281q52123r96809l03237L37549J87096m4481O19078J543268
39643A059868J169450n61403j822843j239413M50164J536921J328843M25902l84766
$$ y = [-1591444, -2890943, -2775845, -1603207, -813929, -1265473, -2020632, -1543640, 173053, 1591235, 1653068, 839186, 33042, -698745, -1676170, -2659435, -3052140, -2789726, -2414269, -2209466, -1661453, -95931, 2165904, 3675933, 3345222, 1927817, 1290231, 2041851, 2833179, 2562776, 2170653, 2994570, 4177908, 3589345, 1253833, -124394, 1218261, 3601874, 4220748, 2821910, 1639362, 2263881, 4002641, 5240434, 5228328, 4283057, 3041104, 1895295, 812949, -430245, -1680597, -2282426, -1840802, -823073, 18199, 495881, 750808, 569527, -282596, -1279405, -1582642, -1245093, -1057997, -1102478, -483400, 1059868, 2229318, 1667915, -154928, -1394341, -944177, 592744, 1921587, 2347489, 1962723]
39634A962723q44014j093816j335450j542735j340090m32845O84661R25282o5617
39625c081901j169385r91741L61876J370454J025649M0541k15091M56400Q92884
39616a310314J95323r50885r62701O69140K486637K530745O32338j272243j348692
39607F69348J07543J331530J317381N71507j28399o28982q47932m29722M46231
39598B408505Q32576L58758l5039L47455N50824n12200j807532j294728Q14577
39589A663196J931272P39945r37946r80258J9833J27775p77716j124475l28479
39580C33147N25186O13401L39094J39962k39838q49844j080449o61467k13032
39571a093840k87445n87334n47861l3145Q43483J861990K394297J828166O61815
$$ y = [1962723, 1118709, 24893, -1310557, -2853292, -4193382, -4626227, -3941566, -3016284, -3081901, -4251286, -5243027, -4881151, -3510697, -2485048, -2444507, -2659598, -2203198, -1310314, -1114991, -2065876, -3028577, -2359437, 127200, 2657945, 3290283, 2018040, 669348, 776891, 2108421, 3425802, 3997309, 3868910, 3239928, 2391996, 1962274, 2408505, 3241081, 3599839, 3564800, 3912255, 4463079, 3950879, 2143347, 848619, 1663196, 3594468, 4334413, 3396467, 2416209, 2436042, 2563817, 1786101, 661626, 333147, 858333, 1471734, 1810828, 1950790, 1710952, 861108, -219341, -880808, -1093840, -1381285, -1968619, -2516480, -2549625, -1706142, 155848, 2550145, 4378311, 5040126]
39562E040126K17527P27087P43624o90707k265699k023963j44135J299175J153890
39553D056925L65405J53186L35619J19012l98437m38008J46938N96394K66976
39544E204010o27882j423703j776973j809172j678452j316491o44698J79773R05472
39535b988116J386452J404520N92131q91032j780493p80053J467478K518863J076308
39526B006058j046369j141164P43534J960374J026707n66487r21443l84673l26032
39517A350505n72343R7986J464533J810344N00496j027983j346057p29568j16747
39508A431166L63838Q72478R08450R9855p16852m75377M19201O04924j76655p96661
39498B534367o14207l75805p86162j241330p38751N89549J581932J387254K41442
$$ y = [5040126, 5257653, 5984740, 6728364, 6037657, 3771958, 1747995, 1603860, 2903035, 4056925, 4422330, 4575516, 4911135, 5030147, 4631710, 4193702, 4340640, 4937034, 5204010, 4576128, 3152425, 1375452, -433720, -2112172, -3428663, -4073361, -3893588, -2988116, -1601664, -197144, 394987, -496045, -2276538, -3056591, -1589113, 929750, 2006058, 959689, -181475, 562059, 2522433, 3549140, 2982653, 2061210, 1676537, 1350505, 778162, 876148, 2340681, 4151025, 4651521, 3623538, 2277481, 1547913, 1431166, 1795004, 2667482, 3575932, 3675787, 2958935, 2483558, 2902759, 3507683, 3331028, 2534367, 1920160, 1544355, 758193, -483137, -1221888, -632339, 949593, 2336847, 2578289]
39489B578289q32610q24425L97899J760933J932398Q20696l63065p47554p99362
39480C923199j251843j812571j709037r73670k84084J69341P45724J387638J462859
39471A657556P16977k35842n59568K0907J064999J703215J226107k01992j567686
39462C824673k094560j989299j704509j037210K52831J442018J575231R61993
39454A231168P35223R77265O30486n25859j263552q57629k86227n44559r36311
$$ y = [2578289, 1745679, 921254, 1319153, 3080086, 5012484, 5833180, 5470115, 4722561, 3923199, 2671356, 858785, -850252, -1823922, -2108006, -1938665, -1192941, 194697, 1657556, 2374533, 2138691, 1579123, 1600030, 2665029, 4368244, 5594351, 5392359, 3824673, 1730113, -259186, -1963695, -3000905, -2748074, -1306056, 269175, 1231168, 1966391, 2943656, 3574142, 3048283, 1784731, 927102, 640875, 96316, -839995]
$$ [...]
##END NTUPLES=NMR SPECTRUM
##END=
