##TITLE=31Pdec_DE-99_oil_c_TFA
CDCl3, 24 sc
 30.7.2025
##JCAMPDX= 6.0         $$ Bruker NMR JCAMP-DX V2.0
##DATA TYPE= NMR SPECTRUM
##DATA CLASS= NTUPLES
##ORIGIN= UXNMR, Bruker Analytische Messtechnik GmbH
##OWNER= root
$$ XWIN-NMR		Version 3.5
$$ Wed Jul 30 14:26:16 2025 Russian Standard Time (UT+4h)  she@DPX200
##.OBSERVE FREQUENCY= 81.013821
##.OBSERVE NUCLEUS= ^31P
##.ACQUISITION MODE= SIMULTANEOUS
##.ACQUISITION SCHEME= undefined
##.AVERAGES= 64
##.DIGITISER RES= 17
##SPECTROMETER/DATA SYSTEM= spect
##.PULSE SEQUENCE= zgpg30
##.SOLVENT NAME= CDCl3
##.SHIFT REFERENCE= (INTERNAL, CDCl3, 0, 198.062)
##AUDIT TRAIL= $$ (NUMBER, WHEN, WHO, WHERE, WHAT)
$$ ##TITLE= Audit trail, XWIN-NMR		Version 3.5
$$ ##JCAMPDX= 5.01
$$ ##ORIGIN= Bruker BioSpin GmbH
$$ ##OWNER= she
$$ F:/spectra/data/she/nmr/P31/2/pdata/1/auditp.txt
$$ ##AUDIT TRAIL=  $$ (NUMBER, WHEN, WHO, WHERE, WHAT)
(   1,<2025-07-30 14:25:10.21 +0400>,<she>,<DPX200>,
      <created by zg, POWCHK disabled, PULCHK disabled
       configuration hash MD5:
       00 E9 B6 7A A2 85 ED C7 34 08 36 98 17 FE 4E 26
       data hash MD5: 32K
       32 04 FE BE A6 91 87 F8 AE 95 DF 65 2A CE 5E 34>)
(   2,<2025-07-30 14:25:16.35 +0400>,<she>,<DPX200>,
      <Start of raw data processing
       efp BC_mod = 2 LB = 1.5 FT_mod = 6 PKNL = 1 PHC0 = 1102.528 PHC1 = 868.2987 SI = 64K 
       data hash MD5: 64K
       73 B8 D6 B6 81 0D B0 51 68 99 2E F7 CC 89 2C A5>)
(   3,<2025-07-30 14:25:37.12 +0400>,<she>,<DPX200>,
      <pk PHC0 = 24.65432 PHC1 = 0 
       data hash MD5: 64K
       A3 1C A9 CE 08 AF 40 D7 76 12 AC 28 F7 2E B0 D4>)
(   4,<2025-07-30 14:25:41.96 +0400>,<she>,<DPX200>,
      <abs ABSG = 5 
       data hash MD5: 64K
       C8 8D 80 6B D0 6E 8E 5A 6F A0 82 3F A9 96 A4 FD>)
$$ ##END=
$$ 
$$ hash MD5
$$ 43 DE AF 96 4B 6D 72 A3 DF CD 3E 59 40 BB C7 FA
##$RELAX= 
##$RELAX= 
##$RELAX= 
##$RELAX= 
##$RELAX= 
##$RELAX= 
##$RELAX= 
##$RELAX= 
$$ Bruker specific parameters
$$ --------------------------
##$DU= <F:/spectra>
##$EXPNO= 2
##$NAME= <P31>
##$PROCNO= 1
##$TYPE= <nmr>
##$USER= <she>
##$AMP= (0..31)
100 100 100 100 100 100 100 100 100 100 100 100 100 100 100 100 100 100 
100 100 100 100 100 100 100 100 100 100 100 100 100 100 
##$AQSEQ= 0
##$AQ_mod= 1
##$AUNM= <au_zg>
##$AUTOPOS= <>
##$BF1= 81.014009
##$BF2= 200.13
##$BF3= 200.13
##$BF4= 200.13
##$BF5= 200.13
##$BF6= 200.13
##$BF7= 200.13
##$BF8= 200.13
##$BYTORDA= 1
##$CFDGTYP= 0
##$CFRGTYP= 5
##$CHEMSTR= <none>
##$CNST= (0..31)
1 1 145 1 1 1 1 1 1 1 1 1 1 1 1 1 1 1 1 1 1 1 1 1 1 1 1 1 1 1 1 1 
##$CPDPRG= <waltz16>
##$CPDPRG1= <>
##$CPDPRG2= <waltz16>
##$CPDPRG3= <>
##$CPDPRG4= <mlev>
##$CPDPRG5= <mlev>
##$CPDPRG6= <mlev>
##$CPDPRG7= <mlev>
##$CPDPRG8= <mlev>
##$CPDPRGB= <>
##$CPDPRGT= <>
##$D= (0..31)
0 1 0 0 0 0 0 0 0 0.06 0 0.03 2e-05 3e-06 0 0 0.0002 0 0 0 0 0 0 0 0 0 
0 0 0 0 0 0 
##$DATE= 1753871109
##$DBL= (0..7)
120 120 120 11 120 120 24 19 
##$DBP= (0..7)
150 150 150 150 150 150 150 150 
##$DBP07= 0
##$DBPNAM0= <>
##$DBPNAM1= <>
$$ [...]
##$SUBNAM3= <"">
##$SUBNAM4= <"">
##$SUBNAM5= <"">
##$SUBNAM6= <"">
##$SUBNAM7= <"">
##$SUBNAM8= <"">
##$SUBNAM9= <"">
##$SW= 400.765351723535
##$SWIBOX= (0..15)
0 1 3 0 0 0 0 0 0 0 0 0 0 0 0 0 
##$SW_h= 32467.5324675325
##$TD= 32768
##$TD0= 1
##$TE= 0
##$TE2= 300
##$TE3= 300
##$TEG= 300
##$TL= (0..7)
0 120 53 12 22 120 120 120 
##$TP= (0..7)
150 150 150 150 150 150 150 150 
##$TP07= 0
##$TPNAME0= <>
##$TPNAME1= <>
##$TPNAME2= <>
##$TPNAME3= <>
##$TPNAME4= <>
##$TPNAME5= <>
##$TPNAME6= <>
##$TPNAME7= <>
##$TPOAL= (0..7)
0.5 0.5 0.5 0.5 0.5 0.5 0.5 0.5 
##$TPOFFS= (0..7)
0 0 0 0 0 0 0 0 
##$TUNHIN= 0
##$TUNHOUT= 0
##$TUNXOUT= 0
##$USERA1= <user>
##$USERA2= <user>
##$USERA3= <user>
##$USERA4= <user>
##$USERA5= <user>
##$V9= 5
##$VALIST= <valist>
##$VCLIST= <CCCCCCCCCCCCCCC>
##$VD= 0
##$VDLIST= <DDDDDDDDDDDDDDD>
##$VPLIST= <PPPPPPPPPPPPPPP>
##$VTLIST= <TTTTTTTTTTTTTTT>
##$WBST= 1024
##$WBSW= 4
##$XGAIN= (0..3)
0 0 0 0 
##$XL= 0
##$YL= 0
##$YMAX_a= 13602
##$YMIN_a= -6338
##$ZGOPTNS= <>
##$ZL1= 120
##$ZL2= 120
##$ZL3= 120
##$ZL4= 120
##$ABSF1= 198.0616
##$ABSF2= -202.7028
##$ABSG= 5
##$ABSL= 3
##$ALPHA= 0
##$AQORDER= 0
##$ASSFAC= 0
##$ASSFACI= 0
##$ASSFACX= 0
##$ASSWID= 0
##$AUNMP= <proc_1d>
##$AZFE= 0.1
##$AZFW= 0.5
##$BCFW= 0
##$BC_mod= 2
##$BYTORDP= 0
##$COROFFS= 0
##$CY= -3
##$DATMOD= 1
##$DC= 0
##$DFILT= <>
##$DTYPP= 0
##$F1P= 0
##$F2P= 0
##$FCOR= 1
##$FTSIZE= 65536
##$FT_mod= 6
##$GAMMA= 0
##$GB= 0
##$INTBC= 1
##$INTSCL= 9.790993e-09
##$ISEN= 30
##$LB= 1.5
##$LEV0= 0
##$LPBIN= 0
##$MAXI= 10000
##$MC2= 0
##$MEAN= 0
##$ME_mod= 0
##$MI= 50
##$NCOEF= 0
##$NC_proc= -9
##$NLEV= 6
##$NOISF1= 182.463
##$NOISF2= 159.3651
##$NSP= 0
##$NTH_PI= 0
##$NZP= 0
##$OFFSET= 198.0616
##$PC= 4
##$PHC0= 1127.182
##$PHC1= 868.2987
##$PH_mod= 1
##$PKNL= yes
##$PPARMOD= 0
##$PSCAL= 0
##$PSIGN= 0
##$REVERSE= no
##$SF= 81.0140089999434
##$SI= 65536
##$SIGF1= 159.3651
##$SIGF2= -187.1042
##$SINO= 113.3802
##$SIOLD= 16384
##$SREGLST= <1H.CDCl3>
##$SSB= 0
##$STSI= 65536
##$STSR= 0
##$SW_p= 32467.5324675325
##$SYMM= 0
##$S_DEV= 0
##$TDeff= 32768
##$TDoff= 0
##$TI= <>
##$TILT= no
##$TM1= 0
##$TM2= 0
##$TOPLEV= 0
##$USERP1= <user>
##$USERP2= <user>
##$USERP3= <user>
##$USERP4= <user>
##$USERP5= <user>
##$WDW= 1
##$XDIM= 65536
##$YMAX_p= 561300833
##$YMIN_p= -77689434
$$ End of Bruker specific parameters
$$ ---------------------------------
##NTUPLES= NMR SPECTRUM
##VAR_NAME=  FREQUENCY,     SPECTRUM/REAL,   SPECTRUM/IMAG
##SYMBOL=    X,             R,               I
##VAR_TYPE=  INDEPENDENT,   DEPENDENT,       DEPENDENT
##VAR_FORM=  AFFN,          ASDF,            ASDF
##VAR_DIM=   65536,         65536,           65536
##UNITS=     HZ,            ARBITRARY UNITS, ARBITRARY UNITS
##FACTOR=    0.49542278885378, 1,            1
##FIRST=     16045.7642231865, 0,            0
##LAST=      -16421.768244346, 0,            0
##MIN=       -16421.768244346, -77689434,    0
##MAX=       16045.7642231865, 561300833,    0
$$ Real data points
##PAGE= N=1
##DATA TABLE= (X++(R..R)), XYDATA
$$ [...]
$$ plain form
7369 -219075 -7561571 -10256535 -9015991 -8632413 -10310578 -10879015 -8390212 -4056349 791404
7360 791404 5146426 5911778 15007 -10081904 -17498793 -19163213 -18966628 -20999987 -23698497
7351 -23698497 -23289141 -19621156 -15465947 -12546917 -11280678 -12418276 -15789417 -18561743
7343 -18561743 -17360459 -11566220 -3180656 5043999 9968315 8992809 3145111 -2587105
7335 -2587105 -4598525 -4630770 -5745195 -6470606 -2853696 4770624 11205486 12495716 9034728
7326 9034728 2745117 -4798782 -10837474 -12120695 -8833310 -4814496 -2599336 -1435703
7318 -1435703 -1382537 -4991869 -11886049 -15472036 -9700427 2721259 13166600 17033568
7310 17033568 16556256 14342188 9330746 783660 -7809842 -11764324 -10263821 -6446961
$$ packed form
7369b19075p342496k694964J240544L83578j678165n68437K488803M333863M847753
7360G91404M355022P65352n896771j0096911p416889j664420J96585k033359k698510
7351b3698497M09356L667985M155209K919030J266239j137598l371141k772326
7343a8561743J201284N794239Q385564Q224655M924316r75506n847698n732216
7335b587105k011420l2245j114425p25411L616910P624320O434862J290230l460988
7326I034728o289611p543899o038692j283221L287385M018814K215160J163633
7318a435703N3166l609332o894180l585987N771609J2421686J0445341L866968
7310A7033568m77312k214068n011442q547086q593502l954482J500503L816860
$$ plain form
7302 -6446961 -3980770 -5017749 -9632847 -15107744 -16988722 -13110326 -6122325 -427331
7294 -427331 2659320 4921998 7251466 8209693 6811152 4337351 2293892 299405 -2599569
7285 -2599569 -5767263 -7780950 -8659866 -9479416 -9965772 -8508330 -5209106 -2983340 -3937103
7276 -3937103 -5793680 -4177171 1671252 7681041 10040496 9383092 8648523 8700659 8090225
7267 8090225 5873241 2343092 -2225166 -7040977 -9455907 -6995063 -978016 4558064
7259 4558064 8018087 11492720 16005871 18707160 16662274 10809652 4027214 -2255625
7251 -2255625 -7036347 -7888076 -3702526 2151571 5020179 4659760 4506454 5833394 6174061
7242 6174061 3653988 -518160 -4551771 -8118001 -11110545 -13119107 -15072111 -18729029
$$ packed form
7302f446961K466191j036979m615098n474897j880978L878396O988001N694994
7294d27331L086651K262678K329468R58227j398541k473801k043459j994487k898974
7285b599569l167694k013687q78916q19550m86356J457442L299224K225766r53763
7276c937103j856577J616509N848423O009789K359455o57404p34569N2136o10434
7267H090225k216984l530149m568258m815811k414930K460844O017047N536080
7259D558064L460023L474633M513151K701289k044886n852622o782438o282839
7251b255625m780722q51729M185550N854097K868608l60419j53306J326940L40667
7242F174061k520073m172148m033611l566230k992544k008562j953004l656918
$$ plain form
7234 -18729029 -23244080 -24585666 -19989180 -11409437 -3446063 657177 322639 -2892039
7226 -2892039 -5875269 -5791173 -2724031 718114 3205391 6448494 12190767 19059099 23611115
7217 23611115 23404065 18404278 10783654 3898971 -89068 -2177735 -4719893 -7682876
7209 -7682876 -8753667 -7173918 -4915328 -3793698 -4092720 -6039075 -9304635 -11122843
7201 -11122843 -9200788 -6606525 -8083225 -10625072 -5236927 8654254 18751906 16120497
7193 16120497 8457284 8261858 13661911 12566872 2933189 -4290099 -3344410 -1825468
7185 -1825468 -6224488 -10904819 -9073414 -5626938 -9272160 -17600900 -20422181 -15280060
7177 -15280060 -9659182 -8103238 -6708807 -2591917 -318104 -4092264 -9555980 -9549285 -4863709
$$ packed form
7234a8729029m515051j341586M596486Q579743P963374M103240l34538l214678
7226b892039k983230Q4096L067142L442145K487277L243103N742273O868332M552016
7217B3611115k07050m999787p620624o884683l988039k088667k542158k962983
7209g682876j070791J579749K258590J121630k99022j946355l265560j818208
7201a1122843J922055K594263j476700k541847N388145J3891181J0097652k631409
7193A6120497p663213j95426N400053j095039r633683p223288R45689J518942
7185a825468m399020m680331J831405L446476l645222q328740k821281N142121
7177a5280060N620878J555944J394431M116890K273813l774160n463716O695M685576
$$ plain form
7168 -4863709 -2946389 -6718354 -10689274 -9710741 -6618804 -7546156 -12556414 -15563643 -12895650
7159 -12895650 -7448255 -3348737 -563836 2708272 5368188 4642038 537407 -3962002
7151 -3962002 -6339558 -5853240 -2703791 1470595 3688819 3214978 3521405 7159966 10421666
7142 10421666 7771514 428784 -5016661 -6232458 -7237807 -10253349 -12228832 -11589261
7134 -11589261 -11637519 -13668451 -13061809 -7116772 -1215245 -1247469 -4383810 -4001721 -442744
7125 -442744 202797 -4045853 -9412071 -13414520 -16661518 -17927315 -14414287 -7916007 -4460707
7116 -4460707 -5995263 -7640802 -5033033 378950 5075646 7676643 7372821 3095099
7108 3095099 -2807645 -4427283 544625 6803068 7967069 4183419 -173109 -3358065
$$ packed form
7168d863709J917320l771965l970920R78533L091937r27352n010258l007229K667993
7159a2895650N447395M099518K784901L272108K659916p26150m104631m499409
7151c962002k377556M86318L149449M174386K218224m73841L06427L638561L261700
7142A0421666k650152p342730n445445j215797j005349l015542j975483O39571
7134a1589261m8258k030932O06642N945037N901527l2224l136341L82089L558977
7125d42744O45541m248650n366218m002449l246998j265797L513028O498280L455300
7116d460707j534556j645539K607769N411983M696696K600997l03822m277722
7108C095099n902744j619638M971908O258443J164001l783650m356528l184956
$$ plain form
7100 -3358065 -6490817 -9011857 -8901729 -7264064 -8463910 -14475599 -21585337 -23905339
7092 -23905339 -18977303 -9644374 -1603089 805297 -2270457 -6552978 -7507699 -4193603
7084 -4193603 384051 2069814 -1225993 -7970712 -14185414 -16887478 -16480440 -15049643
7076 -15049643 -13052065 -9590547 -5507288 -3336729 -3577477 -3813600 -2614643 -1411714
7068 -1411714 -986853 617115 4038361 5415511 1079459 -6335736 -10557520 -9720025 -7779634
7059 -7779634 -7931020 -8713664 -7928927 -6983298 -8911841 -13824283 -18463502 -19676563 -17030451
7050 -17030451 -12361897 -7649770 -3452868 504240 3130032 1438507 -6212148 -16616370
7042 -16616370 -23329275 -22518656 -16305798 -10077752 -7578796 -8809003 -11276336 -12452696
$$ packed form
7100c358065l132752k521040J10128J637665j199846o011689p109738k320002
7092b3905339M928036R332929Q041285K408386l075754m282521r54721L314096
7084d193603M577654J685763l295807o744719o214702k702064M07038J430797
7076a5049643J997578L461518M083259K170559k40748k36123J198957J202929
7068a411714M24861J603968L421246J377150m336052p415195m221784Q37495J940391
7059g779634j51386p82644P84737R45629j928543m912442m639219j213061K646112
7050a7030451M668554M712127M196902L957108K625792j691525p650655j0404222
7042a6616370o712905Q10619O212858O228046K498956j230207k467333j176360
$$ plain form
7034 -12452696 -11819984 -11152645 -12234685 -14133846 -13774827 -9766053 -4718438 -2841969 -5506858
7025 -5506858 -9662580 -10515890 -5794290 2126146 8266981 9701094 8026453 6615003
7017 6615003 6062225 4026014 -424426 -4557874 -5424809 -3999583 -3901681 -6533873 -9414406
7008 -9414406 -9575096 -7102690 -4614670 -4225582 -5912848 -8290391 -9879752 -9518566 -6511580
6999 -6511580 -1275691 4272390 7715139 7847527 5096922 331076 -5772241 -11646892
6991 -11646892 -14367673 -12008941 -6460566 -2419419 -3078712 -7679273 -13239871 -17046838
6983 -17046838 -16989249 -11769857 -2984169 4069764 4305481 -1845957 -8408922 -9544542 -4427284
6974 -4427284 3178205 8504666 8769158 4656576 167614 -147184 4789295 11607634 16024859
$$ packed form
7034a2452696O32712O67339j082040j899161L59019M008774N047615J876469k664889
7025e506858m155722q53310M721600P920436O140835J434113j674641j411450
7017F615003n52778k036211m450440m133448q66935J425226R7902k632192k880533
7008i414406j60690K472406K488020L89088j687266k377543j589361L61186L006986
6999f511580N235889N548081L442749J32388k750605m765846o103317n874651
6991a1646892k720781K358732N548375M041147o59293m600561n560598l806967
6983a7046838N7589N219392Q785688P053933K35717o151438o562965j135620N117258
6974d427284P605489N326461K64492m112582m488962l14798M936479O818339M417225
$$ plain form
6965 16024859 16496372 13830805 8666841 996938 -8232740 -16289729 -19470115 -14948267
6957 -14948267 -3643780 8024903 12161912 8021148 4537294 10329157 22363240 29285542
6949 29285542 25777714 17919428 12939738 10008151 5181689 68385 -665386 2555257
6941 2555257 5010563 5282310 5866010 6738257 4899113 1207136 1097639 5918163 9288304
6932 9288304 5908818 -542105 -2880399 -616924 174130 -4375397 -11512951 -15679147
6924 -15679147 -13702508 -6881782 -489553 -359600 -7513481 -16899842 -23163562 -25782417
6916 -25782417 -26200703 -22794377 -13299260 -955894 6965687 7434978 4519832 3307135
6908 3307135 4742348 7438042 10541511 12653565 11134116 5364354 -1136939 -4395720
$$ packed form
6965A6024859M71513k665567n163964p669903r229678q056989l180386M521848
6957a4948267J1304487J1668683M137009m140764l483854N791863J2034083O922302
6949B9285542l507828p858286m979690k931587m826462n113304p33771L220643
6941B555257K455306K71747N83700Q72247j839144l691977j09497M820524L370141
6932I288304l379486o450923k338294K263475P91054m549527p137554m166196
6924a5679147J976639O820726O392229J29953p153881r386361o263720k618855
6916b5782417m18286L406326R495117J2343366P921581M69291k915146j212697
6908C307135J435213K695694L103469K112054j519449n769762o501293l258781
$$ plain form
6900 -4395720 -4769222 -6027740 -10189966 -14879075 -15878156 -11613942 -5020292 -806888 -544205
6891 -544205 -1071516 1484485 7117083 12513655 14769915 12749719 6690476 -510339 -3397900
6882 -3397900 323447 5085342 3449348 -3456665 -7290874 -4780944 -1502487 -924719
6874 -924719 2290514 12220307 21552070 20020680 9509914 1978763 3472941 8434791
6866 8434791 10087103 8248375 4928560 -62635 -5255040 -5538095 928001 7970978
6858 7970978 8261271 1876658 -5924663 -12133166 -16467656 -17386670 -13697331 -9208237 -9866715
6849 -9866715 -15454161 -18922984 -15455076 -8175164 -3094222 -2143513 -3835993 -7566102
6841 -7566102 -13232272 -17916278 -17136251 -10367053 -2770257 102193 -1900148 -4342408
$$ packed form
6900d395720l73502j258518m162226m689109r99081M264214O593650M213404K62683
6891e44205n27311K556001N632598N396572K256260k020196o059243p200815k887561
6882c397900L721347M761895j635994o906013l834209K509930L278457N77768
6874i24719L215233R929793R331763j531390j0510766p531151J494178M961850
6866H434791J652312j838728l319815m991195n192405k83055O466096P042977
6858G970978K90293o384613p801321o208503m334490r19014L689339M489094o58478
6849i866715n587446l468823L467908P279912N080942R50709j692480l730109
6841g566102n666170m684006P80027O769198P596796K872450k002341k442260
$$ plain form
6833 -4342408 -4048630 -2468540 -2972537 -6388495 -10673833 -14227608 -17274296 -19531829 -19063167
6824 -19063167 -15456015 -12266332 -13162211 -16331376 -16322502 -11851873 -7865825 -8085535 -9378305
6815 -9378305 -7008499 -2567656 -1840002 -5972890 -10080715 -11194327 -12421443 -16866264
6807 -16866264 -21683900 -21957630 -18028599 -15072512 -16358873 -20053041 -22213186 -20422103
6799 -20422103 -14945689 -8629422 -5178760 -5480069 -6468660 -5743380 -5584758 -8924760 -12806074
6790 -12806074 -10940184 -3071292 3462647 3345486 -256053 -1673486 -977796 -2203790
6782 -2203790 -6187055 -9635119 -10096723 -8154417 -5292271 -2469766 -142235 2622911
6774 2622911 7724664 14157480 16485553 11001824 2264470 -885261 4173184 11345122
$$ packed form
6833d342408K93778J580090n03997l415958m285338l553775l046688k257533M68662
6824a9063167L607152L189683q95879l169165Q874M470629L986048k19710j292770
6815i378305K369806M440843P27654m132888m107825j113612j227116m444821
6807a6866264m817636k73730L929031K956087j286361l694168k160145J791083
6799b0422103N476414O316267L450662l01309r88591P25280J58622l340002l881314
6790a2806074J865890P868892O533939j17161l601539j417433O95690j225994
6782b203790l983265l448064m61604J942306K862146K822505K327531K765146
6774B622911N101753O432816K328073n483729q737354l149731N058445P171938
$$ plain form
6766 11345122 14297620 13424239 13000919 14875000 17231804 17670307 15642100 12643963 10590538
6757 10590538 9368910 6758445 2108061 -1613023 -2043705 -1687917 -3816763 -5805240
6749 -5805240 -2341779 5062248 8489949 4864831 -65295 -1577601 -2663812 -6502144
6741 -6502144 -9167355 -6461235 -2707018 -4956773 -11938912 -16763266 -18159754 -20420635
6733 -20420635 -23308968 -21326430 -14052156 -8413388 -8008909 -8085138 -4757894 -1694259 -2486551
6724 -2486551 -3007206 1865186 8599031 9527629 4366383 28903 136759 1592308 1696352
6715 1696352 2117058 4157737 5612820 4915457 4061047 4439306 3334568 -1854001 -8339537
6706 -8339537 -10660309 -7438557 -2134950 2008645 4174825 3478025 -1261919 -7622765
$$ packed form
6766A1345122K952498q73381m23320J874081K356804M38503k028207k998137k053425
6757A0590538j221628k610465m650384l721084m30682L55788k128846j988477
6749e805240L463461P404027L427701l625118m930126j512306j086211l838332
6741f502144k665211K706120L754217k249755o982139m824354j396488k260881
6733b0420635k888333J982538P274274N638768M04479p6229L327244L063635p92292
6724b486551n20655M872392O733845R28598n161246m337480J07856J455549J04044
6715A696352M20706K040679J455083o97363q54410L78259j104738n188569o485536
6706h339537k320772L221752N303607M143595K166180o96800m739944o360846
$$ plain form
6698 -7622765 -9485044 -4420166 1234083 -777381 -9393114 -14829329 -11571282 -5841366
6690 -5841366 -6795674 -14124751 -19418833 -17884830 -12936214 -9086176 -6059857 -2162232
6682 -2162232 1166441 1815143 1296445 2974557 7404126 12328079 16174319 18776012 19470245
6673 19470245 17411469 13679790 10573285 8516911 5744154 1506512 -2255822 -3387096
6665 -3387096 -2533235 -2597516 -5278594 -8654575 -8746001 -3877430 3149835 8378950 11479586
6656 11479586 14921242 18507375 18247710 12353569 5112357 1772435 1825121 825232 -2707541
6647 -2707541 -6062513 -7157873 -6456479 -3872739 2306738 12048932 21756959 27065977
6639 27065977 25869168 18727142 8866677 1675557 666633 2963297 2102309 -3342563
$$ packed form
6698g622765j862279N064878N654249k011464q615733n436215L258047N729916
6690e841366r54308p329077n294082J534003M948616L850038L026319L897625
6682b162232L328673O48702n18698J678112M429569M923953L846240K601693O94233
6673A9470245k058776l731679l106505k056374k772757m237642l762334j131274
6665c387096Q53861o4281k681078l375981r1426M868571P027265N229115L100636
6656A1479586L441656L586133k59665n894141p241212l339922N2686r99889l532773
6647b707541l354972j095360P01394K583740O179477R742194R708027N309018
6639B7065977j196809p142026r860465p191120j008924K296664q60988n444872
$$ plain form
6631 -3342563 -7473725 -5545721 -1105681 -973314 -5576477 -9028614 -8194525 -6713275 -8412234
6622 -8412234 -10775817 -8650155 -2729734 72858 -4265333 -11006841 -12839266 -9696870
6614 -9696870 -8082759 -11087656 -14282092 -13231426 -9939768 -8105299 -6457143 -2294702
6606 -2294702 1678113 1028970 -1517955 1244065 8976925 12421390 6525886 -2376330
6598 -2376330 -6423926 -6582206 -7767933 -9306254 -7286602 -3034691 -1895864 -4608663
6590 -4608663 -6027126 -2519460 4080767 10007366 13110037 12971589 11035825 10481060 12957051
6581 12957051 16106265 17189532 17616621 20020831 22253038 19082774 9582203 -1612855
6573 -1612855 -10335901 -15831999 -17700402 -14821492 -8594691 -3298220 -1704484 -3018671
$$ packed form
6631c342563m131162J928004M440040J32367m603163l452137Q34089J481250j698959
6622h412234k363583K125662N920421K802592m338191o741508j832425L142396
6614i696870J614111l004897l194436J050666L291658J834469J648156M162441
6606b294702L972815o49143k546925K762020P732860L444465n895504q902216
6598b376330m047596j58280j185727j538321K019652M251911J138827k712799
6590d608663j418463L507666O600227N926599L102671j38448j935764n54765K475991
6581A2957051L149214J083267M27089K404210K232207l170264r500571j1195058
6573a612855q723046n496098j868403K878910O226801N296471J593736j314187
$$ plain form
6565 -3018671 -5386511 -7178873 -5846039 494135 9691758 17246504 21452045 23237091
6557 23237091 21670636 15016148 6566627 3332471 6955438 11092049 9938534 4541856
6549 4541856 -1203910 -5433745 -6746757 -3411319 2436178 4721460 968346 -4733549
6541 -4733549 -9038484 -13661035 -18749890 -19048664 -12723682 -7726824 -11569896 -19355052
6533 -19355052 -20265138 -12663860 -4356165 -300480 1184414 1365342 -779767 -3338988
6525 -3338988 -2607479 -103221 -816752 -3891759 -3122389 2004395 4229439 18954 -5007022
6516 -5007022 -5786825 -5333402 -7779767 -10640547 -9827402 -7269585 -7614410 -11017996 -14510941
6507 -14510941 -17417756 -20367902 -21413179 -17974314 -11224437 -5001995 -1810726 -2096837
$$ packed form
6565c018671k367840j792362J332834O340174R197623P554746M205541J785046
6557B3237091j566455o654488q449521l234156L622967M136611j153515n396678
6549D541856n745766m229835j313012L335438N847497K285282l753114n701895
6541d733549m304935m622551n088855k98774O324982M996858l843072p785156
6533a9355052r10086P601278Q307695M055685J484894J80928k145109k559221
6525c338988P31509K504258p13531l075007P69370N126784K225044m210485n025976
6516e007022p79803M53423k446365k860780Q13145K557817l44825l403586l492945
6507a4510941k906815k950146j045277L438865O749877O222442L191269k86111
$$ plain form
6499 -2096837 -4729301 -5922083 -1432928 7180444 12580854 11345909 8896166 10213898
6491 10213898 10820078 3652843 -8879509 -17339196 -17604170 -13415310 -8208052 -2377158
6483 -2377158 1632406 -255343 -6632671 -10854464 -10479619 -10315310 -13836333 -17595183 -17170699
6474 -17170699 -13435240 -9594494 -6452773 -3843978 -2788647 -3165201 -2862548 -1786548
6466 -1786548 -2630151 -5184397 -5002431 -1399185 -1273850 -9321706 -18869447 -19456747 -10992586
6457 -10992586 -3291304 -2812125 -6894441 -10854906 -13434545 -13792964 -9986295 -3511557
6449 -3511557 48395 -1561324 -3637659 -1952623 314680 -2379247 -9171954 -14320619
6441 -14320619 -15567763 -15416969 -14764769 -11282870 -5490516 -3032405 -7587791 -14981383
$$ packed form
6499b096837k632464j192782M489155Q613372N400410j234945k449743J317732
6491A0213898O06180p167235j2532352q459687k64974M188860N207258N830894
6483b377158M009564j887749o377328m221793L74845J64309l521023l758850M24484
6474a7170699L735459L840746L141721K608795J055331l76554L02653J076000
6466a786548q43603k554246J81966L603246J25335q047856r547741n87300Q464161
6457a0992586P701282M79179m082316l960465k579639l58419L806669O474738
6449c511557L559952j609719k076335J685036K267303k693927o792707n148665
6441a4320619j247144J50794O52200L481899N792354K458111m555386p393592
$$ plain form
6433 -14981383 -18092621 -15577678 -12060234 -10969685 -11264823 -11205462 -11235398 -11616610 -10540264
6424 -10540264 -7158808 -4367116 -5661340 -10302521 -14351982 -15936424 -16577923 -17219945
6416 -17219945 -16070700 -11745252 -6268954 -3143603 -3719845 -6808897 -10518524 -13047617
6408 -13047617 -13117108 -11543445 -11365119 -14383376 -18348118 -19664723 -18151222 -16652031 -16527304
6399 -16527304 -16627831 -16668491 -17721784 -18194593 -13575528 -3228932 5975068 7204951 2827752
6390 2827752 1030371 4079965 5633431 790484 -6828006 -11010590 -11136419 -9945796
6382 -9945796 -6874854 207643 8004499 9160342 1937782 -6674461 -9827077 -8540283
6374 -8540283 -7593015 -7371680 -4260465 2366707 7834872 7352823 1134497 -6007275 -8725584
$$ packed form
6433a4981383l111238K514943L517444J090549k95138N9361k9936l81212J076346
6424a0540264L381456K791692j294224m641181m049461j584442o41499o42022
6416a7219945J149245M325448N476298L125351n76242l089052l709627k529093
6408a3047617o9491J573663J78326l018257l964742j316605J513501J499191J24727
6399a6527304j00527m0660j053293m72809M619065J0346596R204000J229883m377199
6390B827752j797381L049594J553466m842947p618490m182584j25829J190623
6382i945796L070942P082497P796856J155843p222560q612243l152616J286794
6374h540283R47268K21335L111215O627172N468165m82049o218326p141772k718309
$$ plain form
6365 -8725584 -5052304 2294415 8683014 12418498 15718872 19912009 22006755 18859171
6357 18859171 13121982 11079789 14572018 18726774 18545666 14430597 9740203 5924671
6349 5924671 2507889 -86907 -541680 887696 1766592 -277670 -5067670 -9389782 -9349840
6340 -9349840 -4482023 601905 466213 -4871583 -9752537 -9540359 -5546923 -2506836 -3120646
6331 -3120646 -6172620 -8205286 -5952160 1017212 8952611 13132952 13262576 13107668 13892281
6322 13892281 12012211 5783065 200686 505599 4189505 5008563 2963268 3753711 8577930
6313 8577930 11265227 7251554 -523064 -7340309 -12954409 -18394041 -21098825 -18183420
6305 -18183420 -11735708 -6072305 -1610402 3867120 9301239 11001300 9137821 8434744
$$ packed form
6365h725584L673280P346719O388599L735484L300374M193137K094746l147584
6357A8859171n737189k042193L492229M154756j81108m115069m690394l815532
6349E924671l416782k594796m54773J429376Q78896k044262m790000m322112L9942
6340i349840M867817N083928j35692n337796m880954K12178L993436L040087o13810
6331c120646l051974k032666K253126O969372P935399M180341J29624j54908P84613
6322A3892281j880070o229146n582379L04913L683906Q19058k045295P90443M824219
6313H577930K687297m013673p774618o817245n614100n439632k704784K915405
6305a8183420O447712N663403M461903N477522N434119J700061j863479p03077
$$ plain form
6297 8434744 10995882 12822586 9944478 4734375 2879720 5753716 8880150 7592605
6289 7592605 1878661 -4646305 -8893622 -10662632 -11570709 -12386946 -11819773 -8262140 -2439878
6280 -2439878 2714521 5239065 6230780 7893346 10131883 10252967 6109111 -1179054 -7793337
6271 -7793337 -10216614 -7971358 -4038928 -2442905 -4661809 -8321536 -10070561 -9731073
6263 -9731073 -10500535 -14482184 -19257977 -20521499 -17759970 -15229589 -16292836 -18373407
6255 -18373407 -15582959 -6111586 4940494 10766285 9499544 4731723 646213 -1665234
6247 -1665234 -3367165 -5219167 -6673341 -7013658 -6746465 -7804296 -11951651 -18167162 -21927229
6238 -21927229 -18811678 -9682549 -847681 2517145 2192190 4050101 9663140 13616770
$$ packed form
6297H434744K561138J826704k878108n210103j854655K873996L126434j287545
6289G592605n713944o524966m247317j769010r08077q16237N67173L557633N822262
6280b439878N154399K524544R91715J662566K238537J21084m143856p288165o614283
6271g793337k423277K245256L932430J596023k218904l659727j749025L39488
6263i731073p69462l981649m775793j263522K761529K530381j063247k080571
6255a8373407K790448R471373J1052080N825791j266741m767821m085510k311447
6247a665234j701931j852002j454174l40317K67193j057831m147355o215511l760067
6238b1927229L115551R129129Q834868L364826l24955J857911N613039L953630
$$ plain form
6230 13616770 10568129 2700342 -2535035 -1316575 2659686 3441243 -615498 -6689602
6222 -6689602 -11579290 -13590376 -11548970 -5003344 3830895 10431208 11963398 10288886
6214 10288886 9724408 11969193 14355685 13422420 9357249 6093452 7144042 11948952
6206 11948952 16418381 16518373 11092119 1955630 -7702791 -14989958 -18462412 -18579103 -17187845
6197 -17187845 -16371405 -17390449 -19913540 -21716557 -19933462 -13933657 -6755604 -2203939
6189 -2203939 -407370 2027793 6910202 11474439 11841655 7883767 2899169 -283279
6181 -283279 -798014 1601801 6561167 11684008 13636575 11700232 8606546 6920652 5895129
6172 5895129 2963881 -2407240 -7347233 -8129119 -4114782 873896 2044252 -966876
$$ packed form
6230A3616770l048641p867787n235377J218460L976261P81557m056741o074104
6222f689602m889688k011086K041406O545626Q834239O600313J532190j674512
6214A0288886n64478K244785K386492r33265m065171l263797J050590M804910
6206A1948952M469429R9992n426254r136489r658421p287167l472454j16691J391258
6197a7187845Q16440j019044k523091j803017J783095N999805P178053M551665
6189b203939J796569K435163M882409M564237L67216l957888m984598l182448
6181b83279n14735K399815M959366N122841J952567j936343l093686j685894j025523
6172E895129k931248n371121m939993p81886M014337M988678J170356l011128
$$ plain form
6164 -966876 -3654297 -2791529 -791205 -1198512 -2115674 889111 5902035 5083822 -3763327
6155 -3763327 -11906468 -10499581 -2422165 2369185 450921 -2855691 -3876055 -5564241
6147 -5564241 -10010827 -12532087 -7940565 1070801 7013719 7591717 7884850 12469530 19502691
6138 19502691 24335763 26116482 27911802 31074847 32240993 27039265 15598529 3044569
6130 3044569 -5219813 -7734441 -6688842 -4809944 -3155950 -1108872 2184271 5972821
6122 5972821 7456717 4299693 -2038699 -6911512 -7252515 -4389003 -1322873 790333
6114 790333 1896231 1070363 -1797923 -3696585 -1211973 4784186 10109299 12634119 13559838
6105 13559838 13576376 11644270 8463387 7342942 9760331 13052189 14378074 14103218 13252335
$$ packed form
6164i66876k687421Q62768K000324m07307r17162L004785N012924q18213q847149
6155c763327q143141J406887Q077416M791350j918264l306612j020364j688186
6147e564241m446586k521260M591522R011366N942918N77998K93133M584680P033161
6138A9502691M833072J780719J795320L163045J166146n201728j1440736j2553960
6130C044569q264382k514628J045599J878898J653994K047078L293143L788550
6122E972821J483896l157024o338392m872813l41003K863512L066130K113206
6114G90333J105898q25868k868286j898662K484612N996159N325113K524820R25719
6105A3559838J6538j932106l180883j120445K417389L291858J325885k74856q50883
$$ plain form
6096 13252335 10783373 6342681 3016200 3581178 5715629 4828093 725026 -2509484
6088 -2509484 -3132328 -4168112 -8076802 -12332483 -12518810 -8038581 -2638540 98844 240032
6079 240032 531206 3097397 7833538 13695351 20021561 25193090 25239064 17096292 4057788
6070 4057788 -5438092 -6915059 -5210516 -7697826 -14432673 -19148752 -18691661 -16456924
6062 -16456924 -16156739 -17042584 -17068383 -16792551 -17598907 -18999709 -20321228 -22668387 -26474817
6053 -26474817 -29045553 -27490930 -22819574 -18331045 -15026960 -11650490 -8603342 -8248596
6045 -8248596 -10703735 -12454234 -10719862 -6995763 -4415810 -3275095 -1489639 1370626
6037 1370626 3178184 2634191 1099119 -174873 -2572120 -7666211 -13413304 -15570850
$$ packed form
6096A3252335k468962m440692l326481N64978K134451q87536m103067l234510
6088b509484o22844j035784l908690m255681j86327M480229N400041K737384J41188
6079B40032K91174K566191M736141N861813O326210N171529M5974q142772j3038504
6070D057788r495880j476967J704543k487310o734847m716079M57091K234737
6062a6456924L00185q85845k5799K75832q06356j400802j321519k347159l806430
6053b6474817k570736J554623M671356M488529L304085L376470L047148L54746
6045h248596k455139j750499J734372L724099K579953J140715J785456K860265
6037A370626J807558n43993j535072j273992k397247n094091n747093k157546
$$ plain form
6029 -15570850 -12905153 -8365094 -4521096 -576476 4730212 9813066 11951554 10435879
6021 10435879 5998075 -804203 -8148645 -12102238 -10563218 -6348114 -2810017 1530946
6013 1530946 9079278 15608889 13581513 3844937 -2928343 554337 9294398 13891393
6005 13891393 11932626 6780871 -54568 -8700045 -15739967 -16150631 -10207329 -3394920
5997 -3394920 456345 1693814 1213789 -783085 -2385186 -1202546 1245618 817402 -2655147
5988 -2655147 -4579320 -2909583 -1644570 -4309040 -7680281 -5664123 2546553 11361185
5980 11361185 14997106 12677219 8300406 6484007 8519197 11509783 12070299 10673157
5972 10673157 10702290 13332352 15928505 16299685 15880335 17024277 19107422 19226930 15727574
$$ packed form
6029a5570850K665697M540059L843998L944620N306688N082854K138488j515675
6021A0435879m437804o802278p344442l953593J539020M215104L538097M340963
6013A530946P548332O529611k027376r736576o773280L482680Q740061M596995
6005A3891393j958767n151755o835439q645477p039922m10664N943302O812409
5997c394920L851265J237469m80025j996874j602101J182640K448164m28216l472549
5988b655147j924173J669737J265013k664470l371241K016158Q210676Q814632
5980A1361185L635921k319887m376813j816399K035190K990586N60516j397142
5972A0673157K9133K630062K596153L71180m19350J143942K083145J19508l499356
$$ plain form
5963 15727574 9864966 4955964 4291918 8068424 11688661 9379052 897957 -7250435
5955 -7250435 -8828027 -4475054 96896 839548 -1378750 -2894690 -876387 4466023
5947 4466023 10258686 14167320 17154762 21275881 24888825 23247487 15046584 5291284
5939 5291284 -276907 -1000541 250693 1370290 1174264 -1705573 -6554703 -9285586 -6931627
5930 -6931627 -1901409 1345294 1991716 1764612 225502 -4189024 -9301612 -10108517 -4935212
5921 -4935212 2939172 9894196 14724379 16919527 16142788 13978138 12682961 11683348 8742726
5912 8742726 4899356 4169203 7383308 10413159 10023655 7547857 4956861 1513832 -2876472
5903 -2876472 -4941009 -2583938 696494 336131 -2078991 -742841 5610784 11157144
$$ packed form
5963A5727574n862608m909002o64046L776506L620237k309609q481095q148392
5955g250435j577592M352973M571950P42652k218298j515940K018303N342410
5947D466023N792663L908634K987442M121119L612944j641338q200903r755300
5939E291284n568191p23634J251234J119597j96026k879837m849130k730883K353959
5930f931627N030218L246703O46422k27104j539110m414526n112588q06905N173305
5921d935212P874384O955024M830183K195148p76739k164650j295177r99613k940622
5912H742726l843370p30153L214105L029851l89504k475798k590996l443029m390304
5903b876472k064537K357071L280432l60363k415122J336150O353625N546360
$$ plain form
5895 11157144 10050748 2782654 -5741177 -11625934 -13595870 -11529667 -6571286 -2266115
5887 -2266115 -2450332 -6642491 -9519708 -6923916 -1073234 2559576 2461124 1800886 2315321
5878 2315321 2040670 519626 1413164 6676073 12251986 13787339 12988915 13283128 12772212
5869 12772212 8152013 2888671 3302252 7596733 7785152 3016538 1155246 4506896
5861 4506896 4346602 -4629943 -13606350 -11655969 -1701016 4828127 4688299 4302583 6869098
5852 6869098 7848933 3613459 -3576282 -10439715 -15787477 -17718007 -14353558 -9191446
5844 -9191446 -9576385 -17113827 -24550799 -24958101 -19771159 -14930231 -12902312 -11918968 -10530262
5835 -10530262 -9588616 -10603061 -13770240 -16935696 -16492849 -11174931 -4709920 -2055850
$$ packed form
5895A1157144j106396p268094q523831n884757j969936K066203M958381M305171
5887b266115j84217m192159k877217K595792N850682L632810r8452o60238N14435
5878B315321k74651j521044Q93538N262909N575913J535353p98424K94213n10916
5869A2772212m620199n263342M13581M294481J88419m768614j861292L351650
5861D506896j60294q976545q976407J950381R954953O529143j39828l85716K566515
5852F869098R79835m235474p189741o863433n347762j930530L364449N162112
5844i191446l84939p537442p436972m07302N186942M840928K027919R83344J388706
5835a0530262R41646j014445l167179l165456M42847N317918O465011K654070
$$ plain form
5827 -2055850 -3171893 -3779293 -2292110 -1958925 -5270883 -10286168 -13956238 -15303716 -13700796
5818 -13700796 -8055650 -127165 4907660 3930910 -916252 -6551287 -12788754 -19061047
5810 -19061047 -21261671 -16223566 -6923120 806224 4691985 5363818 1950989 -6216295
5802 -6216295 -14719625 -16960986 -12927420 -9977554 -12821637 -16775325 -13928897 -3408548
5794 -3408548 7610041 11857012 8391311 1819524 -2360244 -1375044 3762567 9422596
5786 9422596 12133944 11164195 8484449 6132357 4280785 2507803 1947890 4211522 8096291
5777 8096291 9725297 7187180 3067361 776874 530866 1276444 4125863 9956170 15158248
5768 15158248 14728766 9551515 5758522 6168403 7363438 6689847 6721086 9836268 13285630
$$ packed form
5827b055850j116043o07400J487183L33185l311958n015285l670070j347478J602920
5818a3700796N645146P928485N034825r76750m847162n635035o237467o272293
5810a9061047k200624N038105R300446P729344L885761O71833l412829q167284
5802f216295q503330k241361M033566K949866k844083l953688K846428J0520349
5794c408548J1018589M246971l465701o571787m179768R85200N137611N660029
5786I422596K711348r69749k679746k352092j851572j772982n59913K263632L884769
5777H096291J629006k538117m119819k290487k46008P45578K849419N830307N202078
5768A5158248m29482n177251l792993M09881J195035o73591L1239L115182L449362
$$ plain form
5759 13285630 13722184 12677501 12918167 12594762 8286275 1793941 -1540804 -524063 708989
5750 708989 -950668 -4334054 -7347046 -9708913 -11508651 -11912353 -10195789 -6543405 -2274024
5741 -2274024 -632564 -5274500 -15096996 -22652018 -21603901 -14274605 -7713206 -4109421
5733 -4109421 -467119 3467819 3827309 48740 -2815173 -1593627 566557 -65036 -2559348
5724 -2559348 -4795188 -7314147 -9887247 -8616104 -1396421 6619720 8058210 2407575
5716 2407575 -3994666 -5868128 -3122687 1901876 7282040 11270126 12093646 8929887
5708 8929887 2318766 -5671375 -11217458 -11106508 -7092169 -5323734 -8848369 -13079616
5700 -13079616 -11811469 -5370356 1045659 5082726 8563338 12190805 14023792 13476470
$$ packed form
5759A3285630M36554j044683K40666l23405m308487o492334l334745J016741J233052
5750G08989j659657l383386l012992k361867j799738m03702J716564L652384M269381
5741b274024J641460m641936r822496p555022J048117P329296O561399L603785
5733d109421L642302L934938L59490l778569k863913J221546K160184o31593k494312
5724b559348k235840k518959k573100J271143P219683Q016141J438490n650635
5716B407575o402241j873462K745441N024563N380164L988086Q23520l163759
5708H929887o611121p990141n546083J10950M014339J768435l524635m231247
5700a3079616J268147O441113O416015M037067L480612L627467J832987n47322
$$ plain form
5692 13476470 12304259 10757488 6798313 451550 -4457337 -4392885 463510 7368601
5684 7368601 12905222 13816678 9661887 5047487 5170726 8422728 7945527 1642944 -4769894
5675 -4769894 -6988581 -8433127 -13103430 -17466974 -15547447 -8599387 -3259047 -2176914
5667 -2176914 -2682355 -3021568 -3177170 -528047 7617094 16519386 16871895 7703129 -492878
5658 -492878 940539 8604638 14383952 16958502 20029860 23654283 24406495 21893408 18752786
5649 18752786 15484338 10950714 6804557 5589092 5227691 1472416 -4425486 -6905360
5641 -6905360 -5376227 -5372942 -8754848 -9916585 -5292943 -184363 -989688 -5612099 -7503887
5632 -7503887 -5718572 -4506000 -4775255 -2499759 4068844 10714164 12114736 7191544
$$ packed form
5692A3476470j172211j546771l959175o346763m908887O4452M856395O905091
5684G368601N536621R11456m154791m614400J23239L252002m77201o302583o412838
5675d769894k218687j444546m670303m363544J919527O948060N340340J082133
5667b176914n05441l39213j55602K649123Q145141Q902292L52509r168766q196007
5658d92878J433417P664099N779314K574550L071358L624423P52212k513087l140622
5649A8752786l268448m533624m146157j215465l61401l755275n897902k479874
5641f905360J529133L285l381906j161737M623642N108580q05325m622411j891788
5632g503887J785315J212572k69255K275496O568603O645320J400572m923192
$$ plain form
5624 7191544 -1109246 -8677794 -12335452 -11384040 -7817356 -3970283 -534712 2086781
5616 2086781 2453644 472450 -947515 -50677 -389338 -6439075 -15798808 -20781495 -18524344
5607 -18524344 -14799908 -15843214 -20352347 -22395161 -19398920 -14024279 -9585038 -6606543
5599 -6606543 -3758048 -122599 4075180 8177948 11750670 14070239 13376348 8355890
5591 8355890 1207542 -2810767 -851470 4236162 8412265 11994048 16892699 20180911
5583 20180911 16232194 5963493 -1560872 528604 8650373 13722330 11781413 6958961
5575 6958961 5583319 9631206 15177522 16112488 10181305 1471503 -4395984 -6616871
5567 -6616871 -8000425 -8599806 -5412161 1040325 5329898 4783154 3829009 7343399 13494194
$$ packed form
5624G191544q300790p568548l657658R51412L566684L847073L435571K621493
5616B086781L66863j981194j419965Q96838l38661o049737r359733m982687K257151
5607a8524344L724436j043306m509133k042814K996241N374641M439241K978495
5599f606543K848495L635449M197779M102768L572722K319569o93891n020458
5591H355890p148348m018309J959297N087632M176103L581783M898651L288212
5583B0180911l948717j0268701p524365K089476Q121769N071957j940917m822452
5575F958961j375642M047887N546316R34966n931183q709802n867487k220887
5567f616871j383554n99381L187645O452486M289573n46744r54145L514390O150795
$$ plain form
5558 13494194 16971785 16246939 13699215 10912393 7634463 3646092 -1573297 -9243050
5550 -9243050 -18363865 -24383524 -23813799 -18320555 -11617171 -4919662 1418998 4933703
5542 4933703 4090396 1930561 2053632 2849060 469018 -4080381 -5959351 -3742568 -745182
5533 -745182 469898 424328 -28212 -606488 -451643 -129169 -3235582 -10991220 -17053801
5524 -17053801 -14345339 -6185067 -2971802 -7312098 -10802266 -7839772 -4019081 -6105083
5516 -6105083 -11062541 -11542062 -6976575 -2250341 1128780 5553796 11020360 14844475
5508 14844475 16948120 19648421 22159446 20553249 14038806 6884672 2871486 1532686
5500 1532686 1268241 2627888 6136794 9309728 8800479 4973368 2293894 4874091 12567069
$$ packed form
5558A3494194L477591p24846k547724k786822l277930l988371n219389p669753
5550i243050r120815o019659N69725N493244O703384O697509O338660L514705
5542D933703q43307k159835J23071P95428k380042m549399j878970K216783K997386
5533g45182J215080m5570m52540n78276J54845L22474l106413p755638o062581
5524a7053801K708462Q160272L213265m340296l490168K962494L820691k086002
5516f105083m957458m79521M565487M726234L379121M425016N466564L824115
5508A4844475K103645K700301K511025j606197o514443p154134m013186j338800
5500A532686k64445J359647L508906L172934n09249l827111k679474K580197P692978
$$ plain form
5491 12567069 21580210 27977057 29844624 26770196 19309907 10311131 5209608 8026736
5483 8026736 16360846 22381398 20129132 10969522 1284021 -4055700 -5299834 -6180227
5475 -6180227 -9666838 -14935289 -18342786 -17719451 -14811230 -12380310 -10492749 -8224117
5467 -8224117 -7512264 -10979871 -15955838 -15710428 -8485131 -763543 1414051 431160 2372811
5458 2372811 7327539 9355532 4900688 -3429649 -11418420 -17357590 -20625429 -19716800
5450 -19716800 -14114394 -6694723 -2092908 -2305102 -4665649 -4929065 -2362599 -454298
5442 -454298 -1529835 -2679017 -198057 3230585 983408 -7007680 -11970407 -7745587
5434 -7745587 540216 4111929 2654013 2275992 4004612 2320366 -4380039 -9329486
$$ packed form
5491A2567069R013141O396847J867567l074428p460289q998776n101523K817128
5483H026736Q334110O020552k252266r159610r685501n339721j244134q80393
5475f180227l486611n268451l407497O23335K908221K430920J887561K268632
5467h224117P11853l467607m975967K45410P225297P721588K177594r82891J941651
5458B372811M954728K027993m454844q330337p988771n939170l267839R08629
5450a9716800N602406P419671M601815k12194k360547k63416K566466J908301
5442d54298j075537j149182K480960L428642k247177p991088m962727M224820
5434g745587Q285803L571713j457916l78021J728620j684246o700405m949447
$$ plain form
5426 -9329486 -6421794 1615438 7772524 9730536 10387575 11937892 13482078 13550620 11634267
5417 11634267 7379748 1022635 -5013999 -7262532 -5036507 -1739099 -1142717 -3135670
5409 -3135670 -4527310 -3778750 -3036875 -4498467 -6392012 -4793934 1027474 7445155 10829409
5400 10829409 10710337 8186493 4130411 329173 -625332 993147 984490 -3152100 -7499357
5391 -7499357 -6164212 731985 7100132 8315401 5037847 -105480 -5612735 -9885183
5383 -9885183 -10352318 -5882324 1522667 8510493 12682384 13157988 10958936 9217718 10834104
5374 10834104 15122158 18347565 17806380 13583455 6582060 -2206986 -9865558 -12306980
5366 -12306980 -8887039 -4070428 -2510584 -4183292 -6268847 -7996702 -10823196 -14525568
$$ packed form
5426i329486K907692Q037232O157086J958012O57039J550317J544186O8542j916353
5417A1634267m254519o357113o036634k248533K226025L297408N96382j992953
5409c135670j391640P48560P41875j461592j893545J598078N821408O417681L384254
5400A0829409j19072k523844m056082l801238r54505J618479q657m136590m347257
5391g499357J335145O896197O368147J215269l277554n143327n507255m272448
5383i885183m67135M469994P404991O987826M171891M75604k199052j741218J616386
5374A0834104M288054L225407n41185m222925p001395q789046p658572k441422
5366a2306980L419941M816611J559844j672708k085555j727855k826494l702372
$$ plain form
5358 -14525568 -16062014 -13208412 -7794351 -4237110 -5276382 -9706880 -14105327 -16186927
5350 -16186927 -16158031 -15290224 -14204323 -12716999 -10247785 -5925760 284912 5674790 5817548
5341 5817548 -537797 -8879555 -13625140 -14594255 -16162889 -20450919 -24583582 -25340931 -23502633
5332 -23502633 -21906159 -21227749 -19766878 -16737868 -14268858 -15722492 -21901632 -28951540
5324 -28951540 -31336510 -28043975 -24274818 -24736345 -26668934 -23055792 -12492252 -1878250
5316 -1878250 1838873 -825271 -4376012 -5322227 -4239229 -2992419 -2665596 -3494492 -5073967
5307 -5073967 -7009608 -9827388 -13775750 -16346193 -13650325 -5866231 1271635 2925557
5299 2925557 1064163 993608 3733741 5693635 5262685 5356464 8466663 13089311 17107571
$$ packed form
5358a4525568j536446K853602N414061L557241j039272m430498m398447k081600
5350a6186927K8896Q67807J085901J487324K469214M322025O210672N389878J42758
5341E817548o355345q341758m745585r69115j568634m288030m132663p57349J838298
5332b3502633J596474O78410J460871L029010K469010j453634o179140p049908
5324b8951540k384970L292535L769157m61527j932589L613142J0563540J0614002
5316a878250L717123k664144l550741r46215J082998J246810L26823q28896j579475
5307e073967j935641k817780l948362k570443K695868P784094P137866J653922
5299B925557j861394p0555K740133J959894m30950R3779L110199M622648M018260
$$ plain form
5290 17107571 21228230 25692551 26286784 18796205 7101876 1281043 5427661 11995539
5282 11995539 12037259 7105634 5195406 7330673 6072897 -1824958 -9253622 -9190291 -5057668
5273 -5057668 -5023355 -10240855 -14997698 -16003148 -15387445 -15659285 -17001554 -18737507 -18885567
5264 -18885567 -13782772 -3308901 5222271 4561041 -2204159 -5656846 -3722021 -3506329
5256 -3506329 -8751697 -13871260 -13303432 -9244820 -6120400 -3890661 -1323226 -243443
5248 -243443 -1828669 -3509025 -3860946 -5742732 -10314866 -13256556 -11985633 -11390800 -16339222
5239 -16339222 -23054352 -24529457 -20626895 -15975235 -11500803 -5759177 -1826679 -4221958
5231 -4221958 -10059770 -11604767 -7696093 -4796288 -5947360 -6505117 -2829610 2034951
$$ packed form
5290A7107571M120659M464321N94233p490579j1694329n820833M146618O567878
5282A1995539M1720m931625j910228K135267j257776p897855p428664O3331M132623
5273e057668L4313n217500m756843j005450O15703k71840j342269j735953j48060
5264a8885567N102795J0473871Q531172o61230o765200l452687J934825K15692
5256c506329n245368n119563N67828M058612L124420K229739K567435J079783
5248b43443j585226j680356l51921j881786m572134k941690J270923N94833m948422
5239a6339222o715130j475105L902562M651660M474432N741626L932498k395279
5231d221958n837812j544997L908674K899805j151072n57757L675507M864561
$$ plain form
5223 2034951 4552385 6554384 11079231 16883902 20855496 22533741 22952536 21659139
5215 21659139 17815872 12327165 6721670 1688982 -1819642 -2242450 208764 2823836
5207 2823836 3651253 3741698 4716307 5731793 4464464 253852 -4736581 -7121970 -5173221
5198 -5173221 -867050 1628700 645284 -1076804 -796086 -76986 -1724727 -4252282 -3685590
5189 -3685590 -236137 1336892 -1676701 -7105271 -12117068 -16020470 -18000499 -16525225
5181 -16525225 -12728981 -10469388 -11024532 -11185653 -8479941 -4732252 -2316633 -500634
5173 -500634 1793331 2937073 1464009 -872056 -2251568 -4342122 -8707772 -11700227
5165 -11700227 -7833392 1858546 9114168 7437038 -871082 -8023528 -9198220 -6121008
$$ packed form
5223B034951K517434K001999M524847N804671L971594J678245M18795j293397
5215B1659139l843267n488707n605495n032688l508624m22808K451214K615072
5207B823836Q27417R0445R74609J015486j267329m210612m990433k385389J948749
5198e173221M306171K495750r83416j722088K80718P19100j647741k527555N66692
5189c685590L449453J573029l013593n428570n011797l903402j980029J475274
5181a6525225L796244K259593n55144j61121K705712L747689K415619J815999
5173e00634K293965J143742j473064k336065j379512k090554m365650k992455
5165a1700227L866835R691938P255622j677130q308120p152446j174692L077212
$$ plain form
5157 -6121008 -3315664 -2769453 -3010863 -2536203 -2355423 -4033780 -6195328 -5093736 759377
5148 759377 7952656 11179699 8349333 2127731 -3199237 -5868788 -7591887 -10532571
5140 -10532571 -14063458 -15713250 -15165346 -15294009 -18328871 -22814806 -25543701 -24611381 -19447867
5131 -19447867 -10653494 -1981780 673310 -4089503 -9927654 -10311582 -7384638 -8374487
5123 -8374487 -14426420 -18764968 -16359785 -10125482 -6052934 -6520456 -10220114 -15136294
5115 -15136294 -19508537 -22010760 -22129443 -19167062 -12062082 -2845508 1917426 -1942382
5107 -1942382 -9040125 -10102605 -4515167 -668245 -3118296 -6778547 -6529034 -5676578 -10345349
5098 -10345349 -20369142 -30193354 -35275261 -34163066 -27807880 -20052528 -15489112 -14183636
$$ packed form
5157f121008K805344N46211k41410M74660J80780j678357k161548J101592N853113
5148G59377P193279L227043k830366o221602n326968k669551j723099k940684
5140a0532571l530887j649792N47904j28663l034862m485935k728895R32320N163514
5131a9447867Q794373Q671714K655090m762813n838151l83928K926944r89849
5123h374487o051933m338548K405183O234303M072548m67522l699658m916180
5115a5136294m372243k502223j18683K962381P104980R216574M762934l859808
5107a942382p097743j062480N587438L846922k450051l660251K49513Q52456m668771
5098a0345349j0023793r824212n081907J112195O355186P755352M563416J305476
$$ plain form
5090 -14183636 -12074995 -8508526 -8270396 -13146769 -17097756 -14440884 -8162183 -5094178
5082 -5094178 -6905103 -10974902 -16189487 -21874852 -24057694 -19284290 -10832618 -5824080
5074 -5824080 -7032170 -11531596 -15709415 -17574100 -16164196 -12889804 -11447723 -12544946
5066 -12544946 -11547544 -5770143 -549153 -2162186 -7768828 -9524527 -6767837 -6131726
5058 -6131726 -9723928 -11304298 -6260872 1262313 4405643 2134416 -1281921 -2151285
5050 -2151285 -348249 1386947 -263537 -5826718 -11512407 -12885646 -9783130 -5534920
5042 -5534920 -2357158 -350254 173852 -942808 -1812439 -869754 -404613 -3266861 -6395995
5033 -6395995 -3019912 7390082 16261822 15661834 7466036 21524 -1832627 -315214
$$ packed form
5090a4183636K108641L566469K38130m876373l950987K656872O278701L068005
5082e094178j810925m069799n214585n685365k182842M773404Q451672N008538
5074e824080j208090m499426m177819j864685J409904L274392J442081j097223
5066a2544946R97402N777401N220990j613033n606642j755699K756690O36111
5058f131726l592202j580370N043426P523185L143330k271227l416337q69364
5050b151285J803036J735196j650484n563181n685689j373239L102516M248210
5042e534920L177762K006904N24106j116660q69631R42685M65141k862248l129134
5033f395995L376083J0409994Q871740n99988q195798p444512j854151J517413
$$ plain form
5025 -315214 453110 -187666 -344161 -180961 -3022240 -10532553 -18601201 -21229996 -18281076
5016 -18281076 -15541959 -16196216 -16441698 -11647928 -2727605 6550365 14646716 20981496
5008 20981496 23151957 19769630 13579921 8098419 3740056 293304 -675472 209279
5000 209279 -1833074 -8734153 -14815515 -14663733 -11577313 -11779153 -14366762 -14479569 -12838971
4991 -12838971 -13748166 -16225728 -15725991 -12666365 -10622203 -8091034 -1508665 5153775
4983 5153775 4370953 -1699283 -2943471 2788723 6625745 3783286 495129 1730685
4975 1730685 2390901 -3357113 -12185323 -16929946 -15306340 -8717043 905177 8542260
4967 8542260 7400474 -1797148 -8838217 -6656838 -519349 492161 -4140115 -8078276
$$ packed form
5025c15214P68324o40776j56495J63200k841279p510313q068648k628795K948920
5016a8281076K739117o54257k45482M793770Q920323R277970Q096351O334780
5008B0981496K170461l382327o189709n481502m358363l446752r68776Q84751
5000B09279k042353o901079o081362J51782L086420k01840k587609j12807J640598
4991a2838971r09195k477562M99737L059626K044162K531169O582369O662440
4983E153775p82822o070236j244188N732194L837022k842459l288157J235556
4975A730685O60216n748014q828210m744623J623606O589297R622220P637083
4967H542260j141786r197622p041069K181379O137489J011510m632276l938161
$$ plain form
4959 -8078276 -7930212 -5860211 -5216681 -7598438 -11879868 -13773983 -9425721 -767660 6619772
4950 6619772 11235978 15598965 18528373 15624182 9102433 7957298 14516482 19574365
4942 19574365 15818833 7769154 2714735 122503 -2895315 -3223855 2619009 10132043
4934 10132043 12507072 10483542 9005279 7936632 3742489 -2511823 -6147174 -6024494
4926 -6024494 -4527326 -1969725 3385256 10629510 16059648 17448090 15859716 13922523
4918 13922523 13261227 12140569 6458328 -3730796 -10829028 -8526223 -1803730 -436080
4910 -436080 -4722495 -7539891 -8524014 -13274157 -18663314 -14113247 -229532 9148273
4902 9148273 7759660 4360651 4647184 2798959 -2451344 -1636403 6623211 9056218 531250
$$ packed form
4959h078276J48064K070001O43530k381757m281430j894115M348262Q658061P387432
4950F619772M616206M362987K929408k904191o521749j145135O559184N057883
4942A9574365l755532q049679n054419k592232l017818l28540N842864P513034
4934A0132043K375029k023530j478263j068647m194143o254312l635351J22680
4926f024494J497168K557601N354981P244254N430138J388442j588374j937193
4918A3922523o61296j120658n682241j0189124p098232K302805O722493J367650
4910d36080m286415k817396r84123m750143n389157M550067J3883715R377805
4902I148273j388613l399009K86533j848225n250303Q14941Q259614K433007q524968
$$ plain form
4893 531250 -5483197 -1214575 675899 -9081648 -18467738 -16710690 -13588631 -17556259
4885 -17556259 -16974655 -4726470 2166177 -7414985 -14369453 -4325174 1359771 -14113834
4877 -14113834 -22653375 1702339 28669876 30730424 68910805 225982965 449435464
4870 449435464 561300833 466656384 272632208 145028894 115734519 102626039 63078712
4863 63078712 33531301 37205594 43404035 29408973 14941102 15892646 15619181 2708649
4855 2708649 -4670945 6810688 20750653 20330076 14107818 14078519 13216688 3723467 -3881152
4846 -3881152 943699 8519796 4988666 -5141380 -8926610 -6155381 -5152634 -6085780
4838 -6085780 -2664476 5003332 10621783 11080722 7776285 2495788 -2337184 -3649132
$$ packed form
4893E31250o014447M268622J890474r757547r386090J757048L122059l967628
4885a7556259N81604J2248185O892647r581162o954468J0044279N684945j5473605
4877a4113834q539541K4355714K6967537K060548L8180381J57072160K23452499
4870D49435464J11865369r4644449j94024176j27603314k9294375j3108480l9547327
4863F3078712k9547411L674293O198441j3995062j4467871R51544k73465j2910532
4855B708649p379594J1481633J3939965m20577o222258k9299q61831r493221p604619
4846c881152M824851P576097l531130j0130046l785230K771229J002747r33146
4838f085780L421304P667808N618451M58939l304437n280497m832972j311948
$$ plain form
4830 -3649132 -2047376 -1614413 -3271663 -4075227 -3764979 -4355298 -2974567 5106102 15192267
4821 15192267 16050147 6754937 -519594 1888941 7948660 10545190 11576045 13757247
4813 13757247 13676288 10198078 9710486 15153449 18776146 14036219 6862557 6620401 12408280
4804 12408280 16567738 16463567 15094925 14309836 14194783 15704383 18469548 19326961 16989942
4795 16989942 14252837 12742536 10643545 8059005 8177327 10489175 10324236 8029064
4787 8029064 9828329 15786058 17013986 10493399 6089684 10939771 16913177 13549215
4779 13549215 4822851 1692421 4811840 6662165 5719529 6128220 6659552 2342227 -4378038
4770 -4378038 -5581185 -726840 2844424 2506713 3341493 7270453 8822118 4608366 -856436
$$ packed form
4830c649132J601756M32963j657250q03564L10248n90319J380731Q080669J0086165
4821A5192267Q57880r295210p274531K408535O059719K596530J030855K181202
4813A3757247q0959l478210m87592N442963L622697m739927p173662k42156N787879
4804A2408280M159458j04171j368642p85089j15053J509600K765165Q57413k337019
4795A6989942k737105j510301k098991k584540J18322K311848j64939k295172
4787H029064J799265N957729J227928o520587m403715M850087N973406l363962
4779A3549215q726364l130430L119419J850325r42636M08691N31332m317325o720265
4770d378038j203147M854345L571264l37711Q34780L928960J551665m213752n464802
$$ plain form
4761 -856436 -2205670 -83849 1925497 2322125 1289109 -689230 -2254578 -2765981 -4839007
4752 -4839007 -11008682 -17602420 -17161059 -8479711 527141 2393311 -1203548 -3162228
4744 -3162228 -798806 1406087 -1350043 -6923726 -7681796 260431 11174068 15987718
4736 15987718 13494112 10728407 11790927 12418216 8518674 3910799 4342095 8546914
4728 8546914 11251857 11296820 10359700 7001528 -405520 -6729945 -4136190 6813578 17040454
4719 17040454 20577317 20089972 20043532 20728102 20921234 20944887 20639586 18701708 16209874
4710 16209874 16788158 20958214 23874082 21299819 15314748 11742111 13573079 18567463
4702 18567463 22035039 20838410 15626694 9766994 5618986 2384779 -1549114 -5445866
$$ packed form
4761h56436j349234K121821K009346L96628j033016j978339j565348n11403k073026
4752d839007o169675o593738M41361Q681348R006852J866170l596859j958680
4744c162228K363422K204893k756130n573683p58070P942227J0913637M813650
4736A5987718k493606k765705J062520O27289l899542m607875M31296M204819
4728H546914K704943M4963r37120l358172p407048o324425K593755J0949768J0226876
4719A7040454L536863m87345m6440O84570J93132K3653l05301j937878k491834
4710A6209874N78284M170056K915868k574263n985071l572637J830968M994384
4702A8567463L467576j196629n211716n859700m148008l234207l933893l896752
$$ plain form
4694 -5445866 -7010538 -5236470 -988667 3698235 5391923 824570 -8622222 -16124010
4686 -16124010 -16234804 -10877642 -5813264 -3443540 -2559303 -2841791 -5067150 -7996089 -9220952
4677 -9220952 -8559771 -7451845 -6115399 -4242958 -2813667 -2263439 -1160898 278762 -1279540
4668 -1279540 -6389770 -9547704 -7011812 -3643299 -5324496 -8587477 -6005090 1189441
4660 1189441 5320850 5344826 7515691 13209364 16474319 14951235 13050228 12055113 7343078
4651 7343078 -1049968 -5217727 -1708147 2214512 473543 -2397898 -709581 1488333
4643 1488333 -2645051 -11060171 -16796738 -18948831 -20953383 -21499776 -16168194 -6513024
4635 -6513024 558320 2069628 1165378 793054 1399488 4060758 9248932 12456763 7733576
$$ packed form
4694e445866j564672J774068M247803M686902J693688m567353r446792p501788
4686a6124010j10794N357162N064378K369724Q84237k82488k225359k928939j224863
4677i220952O61181J107926J336446J872441J429291N50228J102541J439660j558302
4668a279540n110230l157934K535892L368513j681197l262981K582387P194531
4660A189441M131409K3976K170865N693673L264955j523084j901007r95115m712035
4651G343078q393046m167759L509580L922659j740969k871441J688317K197914
4643A488333m133384q415120n736567k152093k004552n46393N331582R655170
4635f513024P071344J511308r04250l72324O06434K661270N188174L207831m723187
$$ plain form
4626 7733576 -3009092 -9941242 -6844820 1573219 6117049 3382522 -2683253 -6681177
4618 -6681177 -6390323 -2810763 1676051 4476537 3350273 -2257052 -9279478 -11901885
4610 -11901885 -7251056 -46744 1812819 -3094859 -8292290 -8788025 -7147577 -7491922
4602 -7491922 -8344815 -6130128 -2079170 84771 1177511 5292905 12220265 16663824
4594 16663824 15395391 10514632 5043633 -147779 -3841683 -3366182 1405324 5792851
4586 5792851 4857037 -932056 -6330264 -6908725 -2880564 2033452 4458963 3985105 2487429
4577 2487429 1634480 1718390 2363850 2908657 2158942 -408034 -2945293 -2803810 -279769
4568 -279769 1509775 1138520 528314 1002795 665809 -2506772 -7580596 -12457394 -16168031
$$ packed form
4626G733576j0742668o932150L096422Q418039M543830k734527o065775l997924
4618f681177K90854L579560M486814K800486j126264n607325p022426k622407
4610a1901885M650829P204312J859563m907678n197431m95735J640448l44345
4602g491922q52893K214687M050958K163941J092740M115394O927360M443559
4594A6663824j268433m880759n470999n191412l693904M75501M771506M387527
4586E792851r35814n789093n398208n78461M028161M914016K425511m73858j497676
4577B487429q52949Q3910O45460N44807p49715k566976k537259J41483K524041
4568b79769J789544l71255o10206M74481l36986l172581n073824m876798l710637
$$ plain form
4559 -16168031 -17725481 -15723358 -11078485 -7010304 -4242253 -30169 5487360 6737549
4551 6737549 869925 -5735874 -4813484 2751640 9019006 9933109 7976310 5268867 718601
4542 718601 -5597126 -10929249 -13789588 -14903519 -13717422 -8553593 -1157784 3222869
4534 3222869 1795090 -2881576 -6731247 -7933572 -6504012 -3249463 204428 2700676
4526 2700676 4846205 7090085 7836745 6119623 4189102 3979461 3354704 241788 -2170288
4517 -2170288 -114416 3138354 1309845 -4554029 -7420482 -5534000 -4218462 -5908569
4509 -5908569 -6929601 -5831386 -6236099 -8751267 -8796144 -6058802 -7150363 -13901099 -17847664
4500 -17847664 -12875027 -5209726 -3059452 -3706876 -166498 5431284 5761767 1621212
$$ packed form
4559a6168031j557450K002123M644873M068181K768051M212084N517529J250189
4551F737549n867624o605799R22390P565124O267366R14103j956799k707443m550266
4542G18601o315727n332123k860339j113931J186097N163829P395809M380653
4534C222869j427779m676666l849671j202325J429560L254549L453891K496248
4526B700676K145529K243880P46660j717122j930521k09641o24757l112916k412076
4517b170288K055872L252770j828509n863874k866453J886482J315538j690107
4509e908569j021032J098215m04713k515168m4877K737342j091561o750736l946565
4500a7847664M972637P665301K150274o47424L540378N597782L30483m140555
$$ plain form
4492 1621212 230113 2014829 -85860 -7793057 -13698576 -12121553 -5843559 -179188
4484 -179188 2638546 1566989 -3662819 -8857866 -7775929 -681136 5516586 7804355
4476 7804355 11018455 18077987 23174357 19845650 10626497 3036861 -352305 -2597656
4468 -2597656 -6078227 -10537531 -15174890 -18213942 -16688618 -11157984 -8075417 -12080061
4460 -12080061 -18041972 -17220852 -10407889 -7595806 -13421637 -20224013 -19086784 -11789178
4452 -11789178 -6548045 -5929153 -5101083 -274954 7069761 14218464 20031551 22628590
4444 22628590 19274419 11208213 4854585 4829083 8071977 8191071 3779846 -1190761 -3995962
4435 -3995962 -5939381 -8492763 -10790302 -12224382 -14045353 -16324217 -16024297 -10698582
$$ packed form
4492A621212j391099J784716k100689p707197n905519J577023O277994N664371
4484a79188K817734j071557n229808n195047J081937P094793O197722K287769
4476G804355L214100P059532N096370l328707r219153p589636l389166k245351
4468b597656l480571m459304m637359l039052J525324N530634L082567m004644
4460a2080061n961911Q21120O812963K812083n825831o802376J137229P297606
4452a1789178N241133O18892Q28070M826129P344715P148703N813087K597039
4444B2628590l354171q066206o353628k5502L242894J19094m411225m970607k805201
4435c995962j943419k553382k297539j434080j820971k278864K99920N325715
$$ plain form
4427 -10698582 -2536614 3650257 5653349 5320630 5569616 7470971 9645423 9422125 5506269
4418 5506269 462176 -902696 2966588 8017862 9509181 7739690 6587282 7689348
4410 7689348 9059893 8993059 8295116 8282587 9107198 10788190 13811754 17653578 19995002
4401 19995002 18277749 11721446 2315494 -5376472 -6816368 -2114293 2786046 2164125
4393 2164125 -2761391 -6116485 -5854519 -5877465 -9012586 -12481885 -12895956 -11910008 -13073799
4384 -13073799 -15500016 -15026523 -10818476 -6826356 -6374194 -8342517 -9316529 -7149798 -1956194
4375 -1956194 4180555 8001949 7816738 6031291 6628764 9432206 9679971 4812825 -1242233
4366 -1242233 -3216331 -1492927 -242289 -109898 2362475 7688964 10937514 8845168
$$ packed form
4427a0698582Q161968O186871K003092l32719K48986J901355K174452k23298l915856
4418E506269n044093j364872L869284N051274J491319j769491j152408J102066
4410G689348J370545o6834o97943j2529Q24611J680992L023564L841824K341424
4401A9995002j717253o556303r405952p691966j439896M702075M900339o21921
4393B164125m925516l355094K61966k2946l135121l469299m14071R85948j163791
4384a3073799k426217M73493M208047L992120M52162j968323r74012K166731N193604
4375a956194O136749L821394j85211j785447N97473K803442K47765m867146o055058
4366a242233j974098J723404J250638J32391K472373N326489L248550k092346
$$ plain form
4358 8845168 5412056 6358719 10481044 11347021 6837395 2018344 1559146 3751567 4453095
4349 4453095 3508510 3807293 5892327 7114780 5637995 2369668 -1050938 -3672667 -4484795
4340 -4484795 -2844206 -510427 -948369 -4940195 -8382356 -6533647 -8286 5461833
4332 5461833 5705373 2868289 2131681 4752214 6730446 4729925 694663 -1352020 -1034917
4323 -1034917 -926617 -1116588 1349606 6885888 11249456 11020546 7847731 4753960 1550525
4314 1550525 -2596848 -5070496 -3140834 237914 -680002 -5967312 -9636088 -8469074
4306 -8469074 -6152987 -6701937 -8458640 -7849469 -5596973 -5333243 -8074387 -11693905 -14775818
4297 -14775818 -17712700 -20273765 -20677723 -17246020 -9468734 1958732 14377956 23157463
$$ packed form
4358H845168l433112R46663M122325Q65977m509626m819051m59198K192421P01528
4349D453095r44585K98783K085034J222453j476785l268327l420606k621729q12128
4340d484795J640589K333779m37942l991826l442161J848709O525361N470119
4332E461833K43540k837084p36608K620533J978232k000521m035262k046683L17103
4323a034917J08300j89971K466194N536282M363568k28910l172815l093771l203435
4314A550525m147373k473648J929662L378748r17916n287310l668776J167014
4306h469074K316087n48950j756703O09171K252496K63730k741144l619518l081913
4297a4775818k936882k561065m03958L431703P777286J1427466J2419224Q779507
$$ plain form
4289 23157463 24777195 20171369 13532151 7981935 4011967 1729526 2030205 4561142
4281 4561142 6510558 5295245 1875682 -82970 1515043 4670307 5421819 2097085
4273 2097085 -2855357 -4996946 -1644405 5990505 13670979 17382981 16716491 15086231
4265 15086231 15523956 16304163 12733504 4141409 -3386002 -3760924 1129132 3458278 -842190
4256 -842190 -7745883 -11180955 -10314255 -8920479 -9450884 -10122114 -7784239 -2503799 1345806
4247 1345806 -699418 -7499173 -12296353 -9966699 -2844155 2965893 5381379 6799290
4239 6799290 7936107 6326305 1677217 -2204891 -2740814 -1636024 -579420 1740063
4231 1740063 5519893 7012586 3625340 -1493544 -3907249 -4035767 -4834871 -6107316 -5689466
$$ packed form
4289B3157463J619732m605826o639218n550216l969968k282441L00679K530937
4281D561142J949416j215313l419563j958652J598013L155264P51512l324734
4273B097085m952442k141589L352541P634910P680474L712002o66490j630260
4265A5086231M37725P80207l570659q592095p527411l74922M890056K329146m300468
4256h42190o903693l435072Q66700J393776n30405o71230K337875N280440L849605
4247A345806k045224o799755m797180K329654P122544N810048K415486J417911
4239F799290J136817j609802m649088l882108n35923J104790J056604K319483
4231A740063L779830J492693l387246n118884k413705j28518p99104j272445M17850
$$ plain form
4222 -5689466 -4209683 -4007318 -4831570 -5067445 -5873008 -9529009 -14657851 -17509275 -17191760
4213 -17191760 -15449501 -12446193 -7525370 -3126581 -2542267 -4046668 -2695273 1770109
4205 1770109 4251946 2340709 -238324 392322 3541438 6666166 8456778 7800627 3709231
4196 3709231 -2541661 -8854399 -15938584 -24862991 -31445669 -29657856 -21511862 -16314401
4188 -16314401 -17833301 -19587398 -16267044 -12146018 -12770848 -14971893 -12093623 -4680766
4180 -4680766 868155 1537117 -21635 -160145 3197862 9900449 15579058 13738270 3811550
4171 3811550 -6528313 -10682656 -10070972 -8128533 -3794172 3563374 9429115 11290342
4163 11290342 14073438 20857873 25312904 22590306 19993078 24954697 29782820 23221439
$$ packed form
4222e689466J479783K02365q24252k35875q05563l656001n128842k851424L17515
4213a7191760J742259L003308M920823M398789N84314j504401J351395M465382
4205A770109K481837j911237k579033O30646L149116L124728J790612o56151m091396
4196C709231o250892o312738p084185q924407o582678J787813Q145994N197461
4188a6314401j518900j754097L320354M121026o24830k201045K878270P412857
4180d680766N548921O68962j558752j38510L358007O702587N678609j840788r926720
4171C811550j0339863m154343O11684J942439M334361P357546N865741J861227
4163A1290342K783096O784435M455031k722598k597228M961619M828123o561381
$$ plain form
4155 23221439 11355135 9348138 15607071 13921633 1389637 -6703063 -3396896 -434481
4147 -434481 -5841510 -12308596 -16624944 -28206875 -45834208 -50054696 -37263945 -36325493
4139 -36325493 -62835327 -77689434 -30852349 61262280 124532788 118851413 82391657
4132 82391657 69700844 81396734 81680127 59326166 36582264 28325489 24956337 16383144
4124 16383144 7384642 3392661 92220 -5366876 -6975313 -1120719 5758957 7754198
4116 7754198 8419539 11999880 13866778 8161094 -684024 -2988781 2375063 7235899
4108 7235899 6216690 2341732 -122541 -1854419 -4601296 -5732756 -1039260 8615036
4100 8615036 17042393 19185376 15503499 9838904 5408800 3866567 5828185 9867510
$$ packed form
4155B3221439j1866304k006997O258933j685438j2531996q092700L306167K962415
4147d34481n407029o467086m316348j1581931j7627333m220488J2790751R38452
4139c6325493k6509834j4854107M6837085R2114629O3270508n681375l6459756
4132H2391657j2690813J1695890K83393k2353961k2743902q256775l369152q573193
4124A6383144q998502l991981l300441n459096j608437N854594O879676J995241
4116G754198O65341L580341J866898n705684q845118k304757N363844M860836
4108G235899j019209l874958k464273j731878k746877j131460M693496R654296
4100H615036Q427357K142983l681877n664595m430104j542233J961618M039325
$$ plain form
4092 9867510 12216315 10292683 6342031 4861786 6094062 5068035 -1530545 -10177966
4084 -10177966 -14459694 -12608911 -8891909 -8454764 -12711004 -18984839 -22713041 -20464170
4076 -20464170 -12688423 -3550672 3068508 6997606 10221280 12954640 13173148 9747759
4068 9747759 4224520 -725028 -3293964 -2831807 536185 5905711 11609928 15543128
4060 15543128 15786294 11793104 5248157 -1256410 -6788379 -12043344 -16422710 -17425555
4052 -17425555 -14406468 -10483389 -7921735 -3517649 7316746 22111616 31382086 28920804
4044 28920804 18979586 10705121 7531767 5239126 -264802 -6798986 -8882818 -4647295
4036 -4647295 2477141 8286487 11691074 13588770 13992770 12104612 8388616 4808143
$$ packed form
4092I867510K348805j923632l950652j480245J232276j026027o598580q647421
4084a0177966m281728J850783L717002M37145m256240o273835l728202K248871
4076b0464170P775747R137751O619180L929098L223674K733360K18508l425389
4068I747759n523239m949548k568936M62157L367992N369526N704217L933200
4060A5543128K43166l993190o544947o504567n531969n254965m379366j002845
4052a7425555L019087L923079K561654M404086J0834395J4794870R270470k461282
4044B8920804r941218q274465l173354k292641n503928o534184k083832M235523
4036d647295P124436N809346L404587J897696M04000j888158l715996l580473
$$ plain form
4028 4808143 3218610 4733104 9854429 17233785 22841608 23102261 19362620 16926722
4020 16926722 18947552 23398401 26641209 27444173 26503017 24628079 22800539 21661009
4012 21661009 19756873 15016777 9152631 7086343 10067376 13247588 12835089 11328057
4004 11328057 11538107 9853981 1869057 -7825067 -8845357 1884335 16246671 24761994
3996 24761994 24887161 18787239 8875096 -1680325 -8357230 -8587075 -3914151 2170928
3988 2170928 6340076 5617371 -607609 -7990589 -10474293 -7100144 -2001946 2690237
3980 2690237 9033848 17160740 22503461 21968034 18365448 15693467 14165227 12918766
3972 12918766 13148841 14621714 13190101 6512082 -844143 -2690307 886078 5336116
$$ packed form
4028D808143j589533J514494N121325P379356N607823K60653l739641k435898
4020A6926722K020830M450849L242808Q02964r41156j874938j827540j139530
4012B1661009j904136m740096n864146k066288K981033L180212m12499j507032
4004A1328057K10050j684126p984924r694124j020290J0729692J4362336Q515323
3996B4761994J25167o099922r912143j0555421o676905k29845M672924O085079
3988B170928M169148p22705o224980p382980k483704L374149N098198M692183
3980B690237O343611Q126892N342721n35427l602586k671981j528240j246461
3972A2918766K30075J472873j431613o678019p356225j846164L576385M450038
$$ plain form
3964 5336116 8817501 12579087 16030453 16669321 14353776 11431332 9107701 7102518
3956 7102518 5729339 4778873 1967031 -3448818 -7280776 -5477558 -1212312 -1407341 -6699399
3947 -6699399 -10587403 -8936458 -4659605 -1693911 339641 3327430 6946242 10124460
3939 10124460 12725561 13929380 12412243 9907850 10972344 17023988 23794630 26742043
3931 26742043 25817311 22893301 18185830 12241749 8358736 9406447 14129880 19479234
3923 19479234 24573752 29405945 31791713 29441244 24023093 19571268 17167153 14369235
3915 14369235 10003249 6515458 6620755 9681874 12674572 13735829 13661093 13947454 14009143
3906 14009143 11314909 4910055 -2310501 -6540398 -7398436 -6829253 -4537350 1308426
$$ packed form
3964E336116L481385L761586L451366O38868k315545k922444k323631k005183
3956G102518j373179r50466k811842n415849l831958J803218M265246j95029n292058
3947f699399l888004J650945M276853K965694K033552K987789L618812L178218
3939A0124460K601101J203819j517137k504393J064494O051644O770642K947413
3931B6742043r24732k924010m707471n944081l883013J047711M723433N349354
3923A9479234N094518M832193K385768k350469n418151m451825k404115k797918
3915A4369235m365986l487791J05297L061119K992698J061257p4736K86361O1689
3906A4009143k694234o404854p220556m229897q58038N69183K291903N845776
$$ plain form
3898 1308426 8280176 9840417 4317471 -627476 2963093 12820705 20016657 20950154
3890 20950154 19940025 20542025 20595629 17400341 12637829 9609661 9299663 11363012 15376330
3881 15376330 18644489 16658781 9461834 4418344 7938721 16342473 20132097 16590143
3873 16590143 12363098 12631953 13848056 10812498 6184871 7180065 14692031 21513625
3865 21513625 21663603 16518462 10384632 4806086 205711 -794054 3592310 9448643
3857 9448643 9712433 1893250 -9489315 -18079166 -20793013 -18243215 -13328292 -9841237
3849 -9841237 -9456298 -9107813 -3895956 6332670 15609609 18217427 14463181 9135848
3841 9135848 6241588 6216383 6316758 2917455 -4429309 -10670322 -9855623 -2930882 2577583
$$ packed form
3898A308426O971750J560241n522946m944947L590569R857612P195952R33497
3890B0950154j010129O02000N3604l195288m762512l028168l09998K063349M013318
3881A5376330L268159j985708p196947n043490L520377Q403752L789624l541954
3873A6590143m227045K68855J216103l035558m627627R95194P511966O821594
3865B1513625J49978n145141o133830n578546m600375r99765M386364N856333
3857I448643K63790p819183j1382565q589851k713847K549798M914923L487055
3849i841237L84939L48485N211857J0228626R276939K607818l754246n327333
3841I135848k894260k5205J00375l399303p346764o241013Q14699O924741N508465
$$ plain form
3832 2577583 2192242 -194343 868251 4564776 6928915 8202534 11608472 16644435
3824 16644435 19142513 17528847 14240007 11081695 7687049 4567527 3066758 1818043
3816 1818043 -2186046 -8055193 -10915021 -8729686 -5196412 -4293856 -5689336 -7045804
3808 -7045804 -7037076 -4490392 1259014 7033365 7140444 861792 -5321277 -5951274 -2945851
3799 -2945851 -418637 2005783 5689084 7225860 3066341 -2741277 -2871436 2270562
3791 2270562 5343406 3863583 3134026 5548124 5210469 -2173492 -10660650 -11709265 -6285612
3782 -6285612 -2650883 -4359142 -7106639 -6896790 -4955257 -3394613 -1379308 1988430
3774 1988430 4830392 5246070 4341442 4331164 5894660 9259384 15026104 21130550 21920476
$$ packed form
3832B577583l85341k386585J062594L696525K364139J273619L405938N035963
3824A6644435K498078j613666l288840l158312l394646l119522j500769j248715
3816A818043m004089n869147k859828K185335L533274R02556j395480j356468
3808g045804Q728K546684N749406N774351J07079o278652o183069o29997L005423
3799b945851K527214K424420L683301J536776m159519n807618j30159N141998
3791B270562L072844j479823p29557K414098l37655p383961q487158j048615N423653
3782f285612L634729j708259k747497K09849J941533J560644K015305L367738
3774A988430K841962M15678r04628j0278J563496L364724N766720O104446P89926
$$ plain form
3765 21920476 14749288 5978077 5011790 11948483 16599013 12012540 3861469 2000257
3757 2000257 6413927 7811952 1261087 -7156207 -8993335 -3778265 2331496 4851315
3749 4851315 4389623 3575955 3757864 4172994 2621234 -1961383 -6439514 -5528753 669394
3740 669394 4042427 -2384469 -14264974 -19875930 -14143497 -3877475 1904240 2119521
3732 2119521 1938790 4945812 10089224 14082876 14297322 10897084 7481898 7266877 7681899
3723 7681899 2626982 -7840065 -14839631 -11876937 -4564825 -3249323 -8649208 -11769696
3715 -11769696 -7109231 1413227 8471507 13916380 18572452 19880181 16305601 11832648
3707 11832648 11408368 14559170 17199852 17169366 14452694 8764039 1189869 -3989266 -3786477
$$ packed form
3765B1920476p171188q771211r66287O936693M650530m586473q151071j861212
3757B000257M413670J398025o550865q417294j837128N215070O109761K519819
3749D851315m61692q13668J81909M15130j551760m582617m478131R10761O198147
3740F69394L373033o426896j1880505n610956N732433J0266022N781715K15281
3732B119521j80731L007022N143412L993652K14446l400238l415186k15021M15022
3723G681899n054917j0467047o999566K962694P312112J315502n399885l120488
3715a1769696M660465Q522458P058280N444873M656072J307729l574580m472953
3707A1832648m24280L150802K640682l0486k716672n688655p574170n179135K02789
$$ plain form
3698 -3786477 -1482779 -2670973 -7319434 -10318041 -9376183 -7589983 -7817660 -8944136 -8683106
3689 -8683106 -6391341 -2434611 1570200 1641512 -4735627 -12645049 -13013574 -4510452 2784663
3680 2784663 -405543 -10543461 -16070001 -11340739 -864531 8262338 12568823 11491234
3672 11491234 6133380 171084 -2053127 -238233 1596377 584020 -1844086 -3307783
3664 -3307783 -4068842 -5371132 -6446741 -5649560 -3504689 -2440343 -3734307 -6281840 -8360939
3655 -8360939 -9240310 -8518641 -4912229 2718002 12447858 18661238 16727985 8914491 3325391
3646 3325391 5138729 10648067 12468678 9217380 6569743 9048457 14615563 18496861
3638 18496861 19058136 17903841 16597673 15681480 15529338 16077786 16499822 16544197 17204278
$$ packed form
3698c786477K303698j188194m648461k998607R41858J786200k27677j126476K61030
3689h683106K291765L956730M004811P1312o377139p909422l68525Q503122P295115
3680B784663l190206j0137918n526540M729262J0476208R126869M306485j077589
3672A1491234n357854n962296k224211J814894J834610j012357k428106j463697
3664c307783p61059j302290j075609P97181K144871J064346j293964k547533k079099
3655h360939q79371P21669L606412P630231R729856O213380j933253p813494n589100
3646C325391J813338N509338J820611l251298k647637K478714N567106L881298
3638A8496861N61275j154295j306168r16193j52142N48448M22036M4375O60081
$$ plain form
3629 17204278 18840441 19947366 19273415 17845458 17099055 16180088 13278899 8988388 6177326
3620 6177326 6675852 9728263 13301448 15139391 13104337 6968207 168431 -2458479
3612 -2458479 445186 5640289 9445896 11175116 11788862 11334692 9418396 6836381 4877311
3603 4877311 3703518 2950951 3132980 4454189 4569319 88415 -8594923 -15871453 -16359415
3594 -16359415 -11223810 -7034226 -7860077 -10220688 -7355989 2254967 12427631 15527275
3586 15527275 9665907 -1046463 -11783479 -20486561 -26474563 -28158704 -23968522 -15011862
3578 -15011862 -5315617 1129315 3273856 3110830 3627804 6912996 13366040 21481117
3570 21481117 28165827 30403608 27772365 23194057 20264966 19677688 19005329 16095745
$$ packed form
3629A7204278J636163J106925o73951j427957p46403r18967k901189m290511k811062
3620F177326M98526L052411L573185J837943k035054o136130o799776k626910
3612b458479K903665N195103L805607J729220O13746m54170j916296k582015j959070
3603D877311j173793p52567J82029J321209J15130m480904q683338p276530m87962
3594a6359415N135605M189584q25851k360611K864699R610956J0172664L099644
3586A5527275n861368j0712370j0737016q703082n988002j684141M190182Q956660
3578a5011862R696245O444932K144541j63026N16974L285192O453044Q115077
3570B1481117O684710K237781k631243m578308k929091n87278o72359k909584
$$ plain form
3562 16095745 11640694 7958626 6421010 7052891 9590006 13290328 16182813 16412596
3554 16412596 14563470 12949658 12130208 9989157 5389755 999930 554097 4241317
3546 4241317 8806980 11688188 12903529 13082822 12219134 10987894 10783760 11152644 9528622
3537 9528622 5448540 2843523 5235900 10014006 10950228 6164545 230760 -2043178
3529 -2043178 -629926 1872785 4025188 5296331 4954682 3658208 3839590 6031503 7178061
3520 7178061 5578486 5016747 9693867 16523973 17490885 9807946 -717502 -7083560
3512 -7083560 -7563670 -3854200 2392220 8669693 11195979 8674658 3976689 -359366
3504 -359366 -5368212 -11655055 -15514993 -13271943 -7460534 -4410596 -6772029 -12111248
$$ packed form
3562A6095745m455051l682068j537616O31881K537115L700322K892485K29783
3554A6412596j849126j613812q19450k141051m599402m389825m45833L687220
3546D241317M565663K881208J215341J79293q63688j231240k04134L68884j624022
3537I528622m080082k605017K392377M778106R36222m785683n933785k273938
3529b043178J413252K502711K152403J271143l41649j296474J81382K191913J146558
3520G178061j599575n61739M677120O830106R66912p682939j0525448o366058
3512g083560m80110L709470O246420O277473K526286k521321m697969m336055
3504c59366n008846o286843l859938K243050N811409L049938k361433n339219
$$ plain form
3496 -12111248 -17580493 -21745567 -22623654 -18591865 -11560066 -5323862 -546617 4735499
3488 4735499 9614638 10086993 5333842 -524040 -4728836 -9301087 -15616072 -20105763
3480 -20105763 -19136726 -14660757 -10757201 -7097110 -290285 9774543 19007207 23649626
3472 23649626 22436871 15552627 5084943 -4530933 -10212859 -13401102 -15971672 -14920053
3464 -14920053 -6531036 5227305 11436221 10364865 9653527 13442221 14683161 6126753
3456 6126753 -6744647 -11875642 -7142180 -2307553 -4389873 -8877319 -7959362 -1139495
3448 -1139495 6318238 10941096 12395505 10235454 4346376 -2241685 -5158442 -3669337
3440 -3669337 -1126865 -291846 -530490 185992 2721590 6636614 10688260 12867262 11449508
$$ packed form
3496a2111248n469245m165074q78087M031789P031799O236204M777245N282116
3488D735499M879139M72355m753151n857882m204796m572251o314985m489691
3480b0105763R69037M475969L903556L660091O806825J0064828R232664M642419
3472B3649626j212755o884244j0467684r615876n681926l188243k570570J051619
3464a4920053Q389017J1758341O208916j071356p11338L788694J240940q556408
3456F126753j2871400n130995M733462M834627k082320m487446R17957O819867
3448a139495P457733M622858J454409k160051n889078o588061k916757J489105
3440c669337K542472Q35019k38644P16482K535598L915024M051646K179002j417754
$$ plain form
3431 11449508 6690753 680506 -4362994 -6699121 -4854430 1126087 8526752 14252569
3423 14252569 18045354 20949032 21107045 15127814 4680061 -2552370 -1280620 5148535
3415 5148535 9893145 11042395 11314679 12198889 13292295 15729284 20613563 24343750 21324340
3406 21324340 12501544 5866284 6326457 9906956 10843784 9701629 10103959 11030461 8054856
3397 8054856 1086038 -4221051 -3366628 2118762 7443432 9734547 9746293 9990020 11478672
3388 11478672 11551448 5890093 -5950107 -18355219 -24875962 -24347705 -19964200 -14476674
3380 -14476674 -9555861 -7879944 -10922766 -14838720 -13334045 -5688540 2029329 4841124
3372 4841124 3945753 2439971 274176 -3648880 -7625976 -8824941 -7021999 -4244176
$$ packed form
3431A1449508m758755o010247n043500k336127J844691N980517P400665N725817
3423A4252569L792785K903678J58013n979231j0447753p232431J271750O429155
3415E148535M744610J149250K72284Q84210J093406K436989M884279L730187l019410
3406B1324340q822796o635260M60173L580499R36828j142155M02330R26502k975605
3397H054856o968818n307089Q54423N485390N324670K291115J1746K43727J488652
3388A1478672P2776n661355j1840200j2405112o520743N28257M383505N487526
3380a4476674M920813J675917l042822l915954J504675P645505P717869K811795
3372D841124q95371j505782k165795l923056l977096j198965J802942K777823
$$ plain form
3364 -4244176 -2393030 -2908647 -6183374 -9160230 -6674009 1554499 8075666 5900047
3356 5900047 -2627868 -9459123 -11220735 -10475713 -7945523 -671782 10441074 17822945
3348 17822945 16099772 9618069 6796076 9741124 13747313 14948706 13448997 9606933
3340 9606933 2786023 -4563077 -6191112 900393 10876060 14314661 8635639 257134
3332 257134 -3694589 -2543750 119676 2189181 3465324 2576338 -2160771 -8883939 -13004288
3323 -13004288 -12718035 -10410021 -7575927 -2185779 6633546 14844440 18000063 17252933
3315 17252933 17195674 19180004 20361676 18368417 13455569 6879842 677691 -1737442
3307 -1737442 1151799 5141920 3764757 -3866304 -12106639 -15971116 -15624522 -13455283
$$ packed form
3364d244176J851146n15617l274727k976856K486221Q228508O521167k175619
3356E900047q527915o831255j761612P45022K530190P273741J1112856P381871
3348A7822945j723173o481703k821993K945048M006189J201393j499709l842064
3340I606933o820910p349100j628035P091505R975667L438601n679022q378505
3332B57134l951723J150839K663426K069505J276143q88986m737109o723168m120349
3323a3004288K86253K308014K834094N390148Q819325Q210894L155623p47130
3315A7252933n7259J984330J181672j993259m912848o575727o202151k415133
3307a737442K889241L990121j377163p631061q240335l864477L46594K169239
$$ plain form
3299 -13455283 -11049789 -10207545 -12569575 -16162569 -15965612 -10140905 -2674692 1894933
3291 1894933 3099637 2362325 242705 -1753577 -565577 4150324 8462938 9716562
3283 9716562 10044892 11259791 10321854 4133111 -4644774 -11165209 -14661639 -16347290 -14396640
3274 -14396640 -7089115 1280367 4136522 1337562 -1659621 -2399979 -3156904 -4805402
3266 -4805402 -5672919 -6694822 -10745148 -15457278 -13495676 -2643830 10110918 17489869
3258 17489869 19705816 20215156 18999782 14673472 9491691 7151119 7298707 6216705
3250 6216705 2130580 -3024521 -6492602 -7271632 -6274540 -5193440 -4813955 -4205915 -2349586
3241 -2349586 13658 1434922 1295289 -1557880 -9025386 -18923795 -23076443 -16388996
$$ packed form
3299a3455283K405494Q42244k362030l592994J96957N824707P466213M569625
3291A894933J204704p37312k119620j996282J188000M715901M312614J253624
3283I716562L28330J214899r37937o188743q777885o520435l496430j685651J950650
3274a4396640P307525Q369482K856155k798960k997183p40358p56925j648498
3266d805402q67517j021903m050326m712130J961602J0851846J2754748P378951
3258A7489869K215947N09340j215374m326310n181781k340572J47588j082002
3250F216705m086125n155101l468081p79030R97092J081100L79485O08040J856329
3241b349586K363244J421264j39633k853169p467506r898409m152648O687447
$$ plain form
3233 -16388996 -5857425 -2925658 -7611381 -9043135 -2442279 4588450 5759009 5511807
3225 5511807 8848032 11189617 6498779 -1869587 -7256578 -10769066 -17055785 -23623049
3217 -23623049 -23969746 -18504536 -13475095 -11182753 -9353167 -7812258 -7474678 -5159004
3209 -5159004 1625370 6840399 2597508 -7660588 -12958241 -11304205 -11304471 -16117319 -17304236
3200 -17304236 -8368993 5582631 16467675 22952170 26495728 25387550 18687081 10563076
3192 10563076 5699177 4658283 6643979 11214735 14489074 10344330 -784915 -10457091
3184 -10457091 -13008059 -11242810 -8361416 -2684997 4674100 5905595 -2277220 -10953319
3176 -10953319 -10719771 -4669415 -1162040 15814 4186954 9505094 9520161 5534360 5457409
$$ packed form
3233a6388996J0531571K931767m685723j431754O600856P030729J170559k47202
3225E511807L336225K341585m690838q368366n386991l512488o286719o567264
3217b3623049l46697N465210N029441K292342J829586J540909L37580K315674
3209e159004O784374N215029m242891j0258096n297653J654036k66m812848j186917
3200a7304236Q935243J3951624J0885044O484495L543558j108178o700469q124005
3192A0563076m863899j040894J985696M570756L274339m144744j1129245r672176
3184a0457091k550968J765249K881394N676419P359097J231495q182815q676099
3176a0953319K33548O050356L507375J177854M171140N318140J5067l985801p6951
$$ plain form
3167 5457409 10980184 15630298 15595326 13454059 10822717 6118819 677085 -1180444 365077
3158 365077 705209 -324307 2492797 9930820 15414060 14720379 11380044 9327168 7322830
3149 7322830 4581213 5047678 10742265 16136951 14889975 8690604 4417855 5064396 7715534
3140 7715534 8533303 6238908 2283525 136946 2539245 7449286 9056089 4760215
3132 4760215 -1371846 -3967782 -2456401 -17504 628724 -1567055 -5984119 -9498729
3124 -9498729 -8617181 -4417951 -2314673 -5078729 -9495265 -11627955 -11108799 -7953260 -333149
3115 -333149 10576492 18317679 18744749 16082630 16155748 17220778 13743448 6416443 1268055
3106 1268055 173077 -538593 -2246618 -2121842 -234470 -1529883 -7647787 -12362851 -9313239
$$ packed form
3167E457409N522775M650114l4972k141267k631342m703898n441734j857529J545521
3158C65077L40132j029516K817104P438023N483240o93681l340335k052876k004338
3149G322830k741617M66465N694587N394686j246976o199371m272749O46541K651138
3140G715534Q17769k294395l955383k146579K402299M910041J606803m295874
3132D760215o132061k595936J511381K438897O46228k195779m417064l514610
3124i498729Q81548M199230K103278k764056m416536k132690N19156L155539P620111
3115c33149J0909641P741187M27070k662119P3118J065030l477330p327005n148388
3106A268055j094978p11670j708025J24776J887372j295413o117904m715064L049612
$$ plain form
3097 -9313239 -677647 5782646 6086457 3057444 1448704 3072174 6289362 8122987
3089 8122987 6784121 3342944 1079738 2745326 8321535 15046424 19297392 19401113
3081 19401113 17500521 17529771 20308413 22539358 22374483 22980243 26723854 28460293 20880504
3072 20880504 6314736 -3520276 -1531975 6869091 12671366 14057054 13897131 12018218
3064 12018218 6648099 427994 -1995513 -1154404 -1353494 -2905547 -2147186 922127 1857157
3055 1857157 -280001 -1043297 1076416 1314085 -2807352 -6276789 -5111479 -3816209 -7182953
3046 -7182953 -9632123 -2017739 13059007 22482873 19874804 12851628 10783711 13438463
3038 13438463 15787580 16980099 18753804 19848620 18195769 15937413 17084792 21905732
$$ packed form
3097i313239Q635592O460293L03811l029013j608740J623470L217188J833625
3089H122987j338866l441177k263206J665588N576209O724889M250968J03721
3081A9401113j900592K9250K778642K230945j64875O05760L743611J736439p579789
3072B0880504j4565768r835012J988301Q401066N802275J385688j59923j878913
3064A2018218n370119o220105k423507Q41109j99090j552053P58361L069313R35030
3055A857157k137158p63296K119713K37669m121437l469437J165310J295270l366744
3046g182953k449170P614384J5076746R423866k608069p023176k067917K654752
3038A3438463K349117J192519J773705J094816j652851k258356J147379M820940
$$ plain form
3030 21905732 27380683 30929552 30348238 23501892 12593746 5279379 5822887 7927678
3022 7927678 2883048 -7269954 -12272997 -8554567 -3281769 -2271848 -2030377 2658480
3014 2658480 9934860 14501029 15386311 15222103 14906302 13391598 10803255 8255848 6001461
3005 6001461 4225171 4014734 5573734 7391285 8711791 10303668 11293120 8622095 2083931
2996 2083931 -3325472 -3144423 990535 4319964 4998744 4369632 3789871 4225202 6682163
2987 6682163 10150514 11476500 9894541 8645120 9150285 7511523 1185784 -4587792
2979 -4587792 -2866182 4879069 10677485 10365252 5850355 -1433916 -12004333 -22842922
2971 -22842922 -27508832 -23940691 -16808386 -10121431 -2619018 7074061 15565040 18433337
$$ packed form
3030B1905732N474951L548869n81314o846346j0908146p314367N43508K104791
3022G927678n044630j0153002n003043L718430N272798J009921K41471M688857
3014B658480P276380M566169Q85282j64208l15801j514704k588343k547407k254387
3005F001461j776290k10437J559000J817551J320506J591877R89452k671025o538164
2996B083931n409403J81049M134958L329429O78780o29112n79761M35331K456961
2987F682163L468351J325986j581959j249421N05165j638762o325739n773576
2979d587792J721610P745251N798416l12233m514897p284271j0570417j0838589
2971b2842922m665910L568141P132305O686955P502413R693079Q490979K868297
$$ plain form
2963 18433337 15681582 10644512 5994841 2932312 1731644 1058940 -995996 -3750539
2955 -3750539 -4307792 -2227307 -675467 -1485268 -2579478 -2254067 -2294126 -4124850 -5531194
2946 -5531194 -4894404 -5628875 -11768799 -20811792 -25699047 -23685978 -19212470 -17405355 -18140460
2937 -18140460 -17976632 -15725455 -14159226 -16513438 -22072565 -25701797 -22596206 -13722740
2929 -13722740 -5244823 -1753039 -1517203 229280 4729037 8490992 8025183 3760442
2921 3760442 -884513 -2888298 -1782638 551514 1766068 1055342 -533072 -1565836
2913 -1565836 -1382506 196457 3234900 7103713 10142684 10443395 6805379 -716145 -10216185
2904 -10216185 -18126242 -21562790 -21038759 -19885704 -20761320 -23556702 -26356531 -27022091 -24277201
$$ packed form
2963A8433337k751755n037070m649671l062529j200668o72704k054936k754543
2955c750539n57253K080485J551840q09801j094210L25411m0059j830724j406344
2946e531194O36790p34471o139924r042993m887255K013069M473508J807115p35105
2937a8140460J63828K251177J566229k354212n559127l629232L105591Q873466
2929a3722740Q477917L491784K35836J746483M499757L761955m65809m264741
2921C760442m644955k003785J105660K334152J214554p10726j588414j032764
2913a565836J83330J578963L038443L868813L038971L00711l638016p521524r500040
2904a0216185p910057l436548N24031J153055q75616k795382k799829o65560K744890
$$ plain form
2895 -24277201 -19226211 -15550527 -15860400 -17947937 -17336624 -13460871 -9887427 -8100651
2887 -8100651 -5510194 -1262418 726361 -2124860 -5867005 -5309145 -1740402 -710115
2879 -710115 -4022766 -8743510 -12834670 -16572110 -18754046 -16933211 -12355108 -9835361
2871 -9835361 -11022643 -11942269 -9292543 -5313926 -3674386 -3829657 -2931778 -1098938 -1081323
2862 -1081323 -3688121 -6748287 -8288808 -8183330 -6895419 -4988014 -3808503 -4298547 -4924126
2853 -4924126 -3151658 442772 1924511 -936117 -5432519 -7487803 -6762387 -5891945 -5677797
2844 -5677797 -3946066 497562 5258134 6924623 4855568 1432339 -321951 1362833
2836 1362833 6062035 10902283 12358280 9635217 5576984 3409695 3792367 5948713
$$ packed form
2895b4277201N050990L675684l09873k087537O11313L875753L573444J786776
2887h100651K590457M247776J988779k851221l742145N57860L568743J030287
2879g10115l312651m720744m091160l737440k181936J820835M578103K519747
2871i835361j187282r19626K649726L978617J639540j55271Q97879J832840J7615
2862a081323k606798l060166j540521J05478J287911J907405J179511m90044o25579
2853d924126J772468L594430J481739k860628m496402k055284P25416Q70442K14148
2844e677797J731731M443628M760572J666489k069055l423229j754290J684784
2836A362833M699202M840248J455997k723063m058233k167289L82672K156346
$$ plain form
2828 5948713 9605006 13697939 15128905 12208532 8570556 9905032 16315360 21251937
2820 21251937 19256744 12065090 5609574 3435091 4923049 7967224 10867628 12234358
2812 12234358 11008292 7019937 1254224 -4168372 -6651993 -5012901 -745584 3693994
2804 3693994 7425511 10398189 10981499 7160335 315657 -4971553 -5599820 -2280191 2695294
2795 2695294 6997116 7606083 2708922 -4589087 -8286150 -6732450 -4143034 -3585040 -3175442
2786 -3175442 -1480078 -1305957 -4135280 -5523581 -1131688 6317602 11346000 13605877
2778 13605877 15654306 15931456 11007910 3286668 -774668 -73775 -27464 -3994622 -9771511
2769 -9771511 -15292820 -21323666 -26816641 -27772460 -23325199 -17720299 -13654210 -8749766
$$ packed form
2828E948713L656293M092933J430966k920373l637976J334476O410328M936577
2820B1251937j995193p191654o455516k174483J487958L044175K900404J366730
2812A2234358j226066l988355n765713n422596k483621J639092M267317M439578
2804C693994L731517K972678N83310l821164o844678n287210o28267L319629M975485
2795B695294M301822O08967m897161p298009l697063J553700K589416N57994M09598
2786c175442J695364J74121k829323j388301M391893P449290N028398K259877
2778A3605877K048429K77150m923546p721242m061336P00893M6311l967158n776889
2769i771511n521309o030846n492975r55819M447261N604900M066089M904444
$$ plain form
2761 -8749766 -1564715 4104668 4945828 3823352 5126983 7669946 7078555 3172510 209778
2752 209778 622213 2549651 3604716 3958242 5048869 6985807 7827688 5257595 -379359
2743 -379359 -5079671 -5218302 -2419273 -1387706 -2706710 -2081246 1872876 4256942 1695516
2734 1695516 -1225667 1578524 8284739 12216894 12039920 12149014 13604421 11915557 5363128
2725 5363128 -902550 -2194847 -782273 -1439318 -4543401 -7730121 -11087564 -15606114
2717 -15606114 -18387804 -15082956 -7133988 -1450759 -1544637 -3419315 -2349837 573689
2709 573689 2167705 3758276 8799631 15532186 17825731 13733499 7823233 3452259
2701 3452259 -1833834 -9894266 -15756304 -12971119 -2653039 7883357 14014206 16484916
$$ packed form
2761h749766P185051N669383Q41160j122476J303631K542963n91391l906045k962732
2752B09778M12435J927438J055065L53526J090627J936938Q41881k570093n636954
2743c79359m700312j38631K799029J031567j319004O25464L954122K384066k561426
2734A695516k921183K804191O706215L932155j76974J09094J455407j688864o552429
2725E363128o265678j292297J412574o57045l104083l186720l357443m518550
2717a5606114k781690L304848P948968N683229r3878j874678J069478K923526
2709E73689J594016J590571N041355O732555K293545m092232n910266m370974
2701C452259n286093q060432n862038K785185J0318080J0536396O130849K470710
$$ plain form
2693 16484916 16400034 13210713 8167469 4666639 3637244 2487377 -171340 -2507012
2685 -2507012 -3127439 -2588477 -36635 6874256 16460633 22127606 20363876 15659682 13738696
2676 13738696 13600041 10845394 5921902 3595185 5511924 8256238 8478103 5809142
2668 5809142 973155 -4786936 -8057729 -5127994 3020221 10435272 12463611 10507773
2660 10507773 9469871 11830354 15178014 15006445 9782833 3415928 1649479 5291587
2652 5291587 8764100 6912074 1262990 -2901369 -3711084 -3317823 -2463325 1015256 7434325
2643 7434325 12826445 13352948 10072531 7513482 8594556 12051387 14062714 11723499
2635 11723499 5460808 -1723520 -7550081 -12186960 -16133176 -18227061 -17817926 -17400173
$$ packed form
2693A6484916q4882l189321n043244l500830j029395j149867k658717k335672
2685b507012o20427N38962K551842O910891R586377N666973j763730m704194j920986
2676A3738696j38655k754647m923492k326717J916739K744314K21865k668961
2668E809142m835987n760091l270793K929735Q148215P415051K028339j955838
2660A0507773j037902K360483L347660j71569n223612o366905j766449L642108
2652E291587L472513j852026n649084m164359q09715L93261Q54498L478581O419069
2643G434325N392120N26503l280417k559049J081074L456831K011327k339215
2635A1723499o262691p184328n826561m636879l946216k093885M09135M17753
$$ plain form
2627 -17400173 -19899060 -23734866 -23994191 -19151230 -13472942 -11160611 -10549610 -6529769
2619 -6529769 2210926 10558057 12192490 6702895 459114 -380684 2946512 3649649 -1468866
2610 -1468866 -7974935 -10799145 -11634530 -15095094 -19830774 -19266935 -11209014 -1228155 4927787
2601 4927787 7396485 8488897 7708196 4276894 1230017 2341331 6378742 8419016
2593 8419016 6470204 3568710 3345473 6254919 10347587 13208779 12601224 7640352 720144
2584 720144 -3221190 -922453 6122771 13590493 18729191 21874700 24078571 24979664 23975356
2575 23975356 22354970 22335311 23787707 23748280 20294625 15571232 13319203 14094921 14677568
2566 14677568 12046653 6457983 733656 -1879072 817578 8522366 17478789 22524404
$$ packed form
2627a7400173k498887l835806k59325M842961N678288K312331O11001M019841
2619f529769Q740695Q347131J634433n489595o243781q39798L327196P03137n118515
2610a468866o506069k824210q35385l460564m735680N63839Q057921R980859O155942
2601D927787K468698J092412p80701l431302l046877J111314M037411K040274
2593H419016j948812k901494k23237K909446M092668K861192o07555m960872o920208
2584G20144l941334K298737P045224P467722N138698L145509K203871R01093j004308
2575B3975356j620386j9659J452396l9427l453655m723393k252029P75718N82647
2566A4677568k630915n588670n724327k612728K696650P704788Q956423N045615
$$ plain form
2558 22524404 21688623 18279474 17125517 18760111 18581910 12609136 3271189 -2306520
2550 -2306520 -255350 5801192 10160386 12612475 17036605 23392937 26250642 22825454
2542 22825454 17727890 16485466 17957935 16988368 11776574 4720703 -1498765 -4591764
2534 -4591764 -2232163 4042124 7015482 1820955 -6061508 -7449473 -2758464 -859334
2526 -859334 -4734287 -7175294 -3038699 2911268 4778559 4569222 6620120 9132525 8038184
2517 8038184 4932919 4333024 6055389 6682115 6053213 5881434 4043010 -2639166 -10650575
2508 -10650575 -11862350 -4200519 5616893 11164571 12713344 13011726 12165308 9819379
2500 9819379 8373675 10261069 14184768 16997533 17744432 17268952 15072892 9473182 941113
$$ packed form
2558B2524404q35781l409149j153957J634594j78201n972774r337947n577709
2550b306520K051170O056542M359194K452089M424130O356332K857705l425188
2542B2825454n097564j242424J472469r69567n211794p055871o219468l092999
2534d591764K359601O274287K973358n194527p882463j387965M691009J899130
2526h59334l874953k441007M136595N949967J867291k09337K050898K512405j094341
2517H038184l105265n99895J722365O26726o28902j71779j838424o682176q011409
2508a0650575j211775P661831R817412N547678J548773K98382q46418k345929
2500I819379j445704J887394L923699K812765P46899m75480k196060n599710q532069
$$ plain form
2491 941113 -6943605 -10928255 -11519336 -11819638 -13117782 -13115961 -9565887 -4348184 -1531300
2482 -1531300 -1553365 -295855 4875962 10713672 11737171 6764778 213613 -1891385 3479765
2473 3479765 13471168 20119307 17171782 7912898 2750472 6583806 12548034 11909953
2465 11909953 5833758 1684408 1093937 -721626 -4797384 -5507995 534667 8888689
2457 8888689 12979341 10638515 3182283 -6858566 -14398729 -13149656 -2562276 9338531
2449 9338531 13523134 8535263 -536818 -8650746 -13324247 -13201823 -8210108 -589157
2441 -589157 6811866 12723436 16435158 16457423 12890309 9797967 11800373 18064578 22308190
2432 22308190 19745544 12428947 6598198 5651084 7190060 7279387 6160902 7694615 13100653
$$ packed form
2491I41113p884718l984650n91081l00302j298144J821L550074N217703K816884
2482a531300k2065J257510N171817N837710J023499m972393o551165k104998N371150
2473C479765R991403O648139k947525r258884n162426L833334N964228o38081
2465A1909953o076195m149350n90471j815563m075758p10611O042662Q354022
2457H888689M090652k340826p456232j0040849p540163J249073J0587380J1900807
2449I338531M184603m987871r072081q113928m673501J22424M991715P620951
2441e89157P401023N911570L711722K2265l567114l092342K002406O264205M243612
2432B2308190k562646p316597n830749r47114J538976Q9327j118485J533713N406038
$$ plain form
2423 13100653 18050108 17880353 13466034 9021308 5828850 1957139 -2763773 -5853550
2415 -5853550 -6165815 -4380701 563974 10317928 21348421 26135978 22827827 18471482
2407 18471482 19209556 22352128 22521555 20475995 19663065 18174433 12004386 4368823 3386557
2398 3386557 9987329 15758719 14872672 11316692 10871285 11894409 9176100 2941930 -1806121
2389 -1806121 -3173408 -4105526 -6116609 -5914152 -131125 9313083 16810184 18906625 16787268
2380 16787268 13317777 9401978 4164174 -2213916 -7521234 -9791748 -9281622 -7286598
2372 -7286598 -4150806 2252 3289911 2939678 -1571472 -7867562 -13512842 -17774381
2364 -17774381 -19879764 -17626442 -9881684 222813 6861920 7077451 3739535 2174877
$$ packed form
2423A3100653M949455j69755m414319m444726l192458l871711m720912l089777
2415e853550l12265J785114M944675R753954J1030493M787557l308151m356345
2407A8471482P38074L142572J69427k045560q12930j488632o170047p635563r82266
2398C386557O600772N771390q86047l555980m45407J023124k718309o234170m748051
2389a806121j367287r32118k011083K02457N783027R444208P497101K096441k119357
2380A6787268l469491l915799n237804o378090n307318k270514N10126J995024
2372g286598L135792M153058L287659l50233m511150o296090n645280m261539
2364a7774381k105383K253322P744758J0104497O639107K15531l337916j564658
$$ [...]
##END NTUPLES=NMR SPECTRUM
##END=
