##TITLE=31Pdec_DE-99_oil_2
 CDCl3, 64 sc
 3.7.2025
##JCAMPDX= 6.0         $$ Bruker NMR JCAMP-DX V2.0
##DATA TYPE= NMR SPECTRUM
##DATA CLASS= NTUPLES
##ORIGIN= UXNMR, Bruker Analytische Messtechnik GmbH
##OWNER= root
$$ XWIN-NMR		Version 3.5
$$ Fri Jul  4 15:22:19 2025 Russian Standard Time (UT+4h)  she@DPX200
##.OBSERVE FREQUENCY= 81.013821
##.OBSERVE NUCLEUS= ^31P
##.ACQUISITION MODE= SIMULTANEOUS
##.ACQUISITION SCHEME= undefined
##.AVERAGES= 64
##.DIGITISER RES= 17
##SPECTROMETER/DATA SYSTEM= spect
##.PULSE SEQUENCE= zgpg30
##.SOLVENT NAME= CDCl3
##.SHIFT REFERENCE= (INTERNAL, CDCl3, 0, 198.062)
##AUDIT TRAIL= $$ (NUMBER, WHEN, WHO, WHERE, WHAT)
$$ ##TITLE= Audit trail, XWIN-NMR		Version 3.5
$$ ##JCAMPDX= 5.01
$$ ##ORIGIN= Bruker BioSpin GmbH
$$ ##OWNER= she
$$ F:/spectra/data/she/nmr/P31/2/pdata/1/auditp.txt
$$ ##AUDIT TRAIL=  $$ (NUMBER, WHEN, WHO, WHERE, WHAT)
(   1,<2025-07-04 15:21:22.17 +0400>,<she>,<DPX200>,
      <created by zg, POWCHK disabled, PULCHK disabled
       configuration hash MD5:
       00 E9 B6 7A A2 85 ED C7 34 08 36 98 17 FE 4E 26
       data hash MD5: 32K
       64 23 21 02 FE A2 A6 20 67 81 3B 2B 4C 28 B0 4F>)
(   2,<2025-07-04 15:21:25.84 +0400>,<she>,<DPX200>,
      <Start of raw data processing
       efp BC_mod = 2 LB = 1.5 FT_mod = 6 PKNL = 1 PHC0 = 1274.104 PHC1 = 351.894 SI = 64K 
       data hash MD5: 64K
       A4 62 A3 6E 7C 4E 83 62 78 10 43 39 DB 1C BB E2>)
(   3,<2025-07-04 15:21:44.90 +0400>,<she>,<DPX200>,
      <pk PHC0 = 23.53987 PHC1 = 0 
       data hash MD5: 64K
       96 0F 79 86 4F D5 5E 0A 01 A1 52 DA 30 1F 79 4F>)
(   4,<2025-07-04 15:21:49.82 +0400>,<she>,<DPX200>,
      <abs ABSG = 5 
       data hash MD5: 64K
       BB 16 5E 53 B1 F9 23 19 CC 85 6E 04 65 7C 6B C9>)
$$ ##END=
$$ 
$$ hash MD5
$$ 8A 7F EC 43 14 37 CE 84 EF 61 C4 E7 54 93 10 8E
##$RELAX= 
##$RELAX= 
##$RELAX= 
##$RELAX= 
##$RELAX= 
##$RELAX= 
##$RELAX= 
##$RELAX= 
$$ Bruker specific parameters
$$ --------------------------
##$DU= <F:/spectra>
##$EXPNO= 2
##$NAME= <P31>
##$PROCNO= 1
##$TYPE= <nmr>
##$USER= <she>
##$AMP= (0..31)
100 100 100 100 100 100 100 100 100 100 100 100 100 100 100 100 100 100 
100 100 100 100 100 100 100 100 100 100 100 100 100 100 
##$AQSEQ= 0
##$AQ_mod= 1
##$AUNM= <au_zg>
##$AUTOPOS= <>
##$BF1= 81.014009
##$BF2= 200.13
##$BF3= 200.13
##$BF4= 200.13
##$BF5= 200.13
##$BF6= 200.13
##$BF7= 200.13
##$BF8= 200.13
##$BYTORDA= 1
##$CFDGTYP= 0
##$CFRGTYP= 5
##$CHEMSTR= <none>
##$CNST= (0..31)
1 1 145 1 1 1 1 1 1 1 1 1 1 1 1 1 1 1 1 1 1 1 1 1 1 1 1 1 1 1 1 1 
##$CPDPRG= <waltz16>
##$CPDPRG1= <>
##$CPDPRG2= <waltz16>
##$CPDPRG3= <>
##$CPDPRG4= <mlev>
##$CPDPRG5= <mlev>
##$CPDPRG6= <mlev>
##$CPDPRG7= <mlev>
##$CPDPRG8= <mlev>
##$CPDPRGB= <>
##$CPDPRGT= <>
##$D= (0..31)
0 1 0 0 0 0 0 0 0 0.06 0 0.03 2e-05 3e-06 0 0 0.0002 0 0 0 0 0 0 0 0 0 
0 0 0 0 0 0 
##$DATE= 1751628081
##$DBL= (0..7)
120 120 120 11 120 120 24 19 
##$DBP= (0..7)
150 150 150 150 150 150 150 150 
##$DBP07= 0
##$DBPNAM0= <>
##$DBPNAM1= <>
$$ [...]
##$SUBNAM3= <"">
##$SUBNAM4= <"">
##$SUBNAM5= <"">
##$SUBNAM6= <"">
##$SUBNAM7= <"">
##$SUBNAM8= <"">
##$SUBNAM9= <"">
##$SW= 400.765351723535
##$SWIBOX= (0..15)
0 1 3 0 0 0 0 0 0 0 0 0 0 0 0 0 
##$SW_h= 32467.5324675325
##$TD= 32768
##$TD0= 1
##$TE= 0
##$TE2= 300
##$TE3= 300
##$TEG= 300
##$TL= (0..7)
0 120 53 12 22 120 120 120 
##$TP= (0..7)
150 150 150 150 150 150 150 150 
##$TP07= 0
##$TPNAME0= <>
##$TPNAME1= <>
##$TPNAME2= <>
##$TPNAME3= <>
##$TPNAME4= <>
##$TPNAME5= <>
##$TPNAME6= <>
##$TPNAME7= <>
##$TPOAL= (0..7)
0.5 0.5 0.5 0.5 0.5 0.5 0.5 0.5 
##$TPOFFS= (0..7)
0 0 0 0 0 0 0 0 
##$TUNHIN= 0
##$TUNHOUT= 0
##$TUNXOUT= 0
##$USERA1= <user>
##$USERA2= <user>
##$USERA3= <user>
##$USERA4= <user>
##$USERA5= <user>
##$V9= 5
##$VALIST= <valist>
##$VCLIST= <CCCCCCCCCCCCCCC>
##$VD= 0
##$VDLIST= <DDDDDDDDDDDDDDD>
##$VPLIST= <PPPPPPPPPPPPPPP>
##$VTLIST= <TTTTTTTTTTTTTTT>
##$WBST= 1024
##$WBSW= 4
##$XGAIN= (0..3)
0 0 0 0 
##$XL= 0
##$YL= 0
##$YMAX_a= 6302
##$YMIN_a= -6270
##$ZGOPTNS= <>
##$ZL1= 120
##$ZL2= 120
##$ZL3= 120
##$ZL4= 120
##$ABSF1= 198.0616
##$ABSF2= -202.7028
##$ABSG= 5
##$ABSL= 3
##$ALPHA= 0
##$AQORDER= 0
##$ASSFAC= 0
##$ASSFACI= 0
##$ASSFACX= 0
##$ASSWID= 0
##$AUNMP= <proc_1d>
##$AZFE= 0.1
##$AZFW= 0.5
##$BCFW= 0
##$BC_mod= 2
##$BYTORDP= 0
##$COROFFS= 0
##$CY= -3
##$DATMOD= 1
##$DC= 0
##$DFILT= <>
##$DTYPP= 0
##$F1P= 0
##$F2P= 0
##$FCOR= 1
##$FTSIZE= 65536
##$FT_mod= 6
##$GAMMA= 0
##$GB= 0
##$INTBC= 1
##$INTSCL= 9.790993e-09
##$ISEN= 30
##$LB= 1.5
##$LEV0= 0
##$LPBIN= 0
##$MAXI= 10000
##$MC2= 0
##$MEAN= 0
##$ME_mod= 0
##$MI= 50
##$NCOEF= 0
##$NC_proc= -8
##$NLEV= 6
##$NOISF1= 182.463
##$NOISF2= 159.3651
##$NSP= 0
##$NTH_PI= 0
##$NZP= 0
##$OFFSET= 198.0616
##$PC= 4
##$PHC0= 1297.644
##$PHC1= 351.894
##$PH_mod= 1
##$PKNL= yes
##$PPARMOD= 0
##$PSCAL= 0
##$PSIGN= 0
##$REVERSE= no
##$SF= 81.0140089999434
##$SI= 65536
##$SIGF1= 159.3651
##$SIGF2= -187.1042
##$SINO= 113.3802
##$SIOLD= 16384
##$SREGLST= <1H.CDCl3>
##$SSB= 0
##$STSI= 65536
##$STSR= 0
##$SW_p= 32467.5324675325
##$SYMM= 0
##$S_DEV= 0
##$TDeff= 32768
##$TDoff= 0
##$TI= <>
##$TILT= no
##$TM1= 0
##$TM2= 0
##$TOPLEV= 0
##$USERP1= <user>
##$USERP2= <user>
##$USERP3= <user>
##$USERP4= <user>
##$USERP5= <user>
##$WDW= 1
##$XDIM= 65536
##$YMAX_p= 243514424
##$YMIN_p= -41249297
$$ End of Bruker specific parameters
$$ ---------------------------------
##NTUPLES= NMR SPECTRUM
##VAR_NAME=  FREQUENCY,     SPECTRUM/REAL,   SPECTRUM/IMAG
##SYMBOL=    X,             R,               I
##VAR_TYPE=  INDEPENDENT,   DEPENDENT,       DEPENDENT
##VAR_FORM=  AFFN,          ASDF,            ASDF
##VAR_DIM=   65536,         65536,           65536
##UNITS=     HZ,            ARBITRARY UNITS, ARBITRARY UNITS
##FACTOR=    0.49542278885378, 1,            1
##FIRST=     16045.7642231865, 0,            0
##LAST=      -16421.768244346, 0,            0
##MIN=       -16421.768244346, -41249297,    0
##MAX=       16045.7642231865, 243514424,    0
$$ Real data points
##PAGE= N=1
##DATA TABLE= (X++(R..R)), XYDATA
$$ [...]
##PAGE= N=2
##DATA TABLE= (X++(I..I)), XYDATA
$$ plain form
7482 7244781 9353487 7822600 3487342 129939 325428 3373470 6792652 8734825
7474 8734825 8978007 8136769 6288093 3003463 -1004215 -3589863 -3916512 -4308575 -7101584
7465 -7101584 -10298290 -9315278 -3415421 2486118 3550446 128137 -4130991 -6853008
7457 -6853008 -7726115 -6677690 -3712815 183110 3665815 6021414 6682812 5073159 2096451
7448 2096451 266041 780829 1797923 1196538 -406236 -1289558 -1797097 -3488729 -6212862
7439 -6212862 -8583278 -10592199 -13039352 -14882414 -14162845 -11608781 -10265115 -10894255 -10607087
7430 -10607087 -7236937 -2590334 136765 93176 -1626067 -4092996 -6287941 -6431929 -4084331
7421 -4084331 -1988611 -3210816 -6575934 -7438887 -3639388 1392570 2811374 315965
$$ packed form
7482G244781K108706j530887m335258l357403J95489L048042L419182J942173
7474H734825K43182q41238j848676l284630m007678k585648l26649l92063k793009
7465g101584l196706R83012N899857N901539J064328l422309m259128k722017
7457f853008q73107J048425K964875L895925L482705K355599O61398j609653k976708
7448B096451j830410N14788J017094o01385j602774q83322n07539j691632k724133
7439f212862k370416k008921k447153j843062P19569K554064J343666o29140K87168
7430a0607087L370150M646603K727099m3589j719243k466929k194945j43988K347598
7421d084331K095720j222205l365118q62953L799499N031958J418804k495409
$$ plain form
7413 315965 -1758377 67396 4399354 6864820 4973536 332695 -3368738 -3638327 -674206
7404 -674206 3332393 6036037 6741771 6702776 7196755 7455051 5576806 1703546 -1148522
7395 -1148522 -344356 3332134 6848010 8047303 6533150 2842777 -1377016 -3390986
7387 -3390986 -2002385 75945 -1186764 -5991062 -10357337 -11305044 -10027550 -8994655
7379 -8994655 -8212810 -6094415 -2510498 946624 3095980 4165789 5035437 6357233 7955590
7370 7955590 8543085 6811741 3351890 494516 -414707 -509941 -1457792 -3219302 -4626774
7361 -4626774 -4920984 -3702847 -778100 2599671 3769521 1775226 -632623 -78341 3163606
7352 3163606 6037434 7165254 7969633 9388802 9978794 8099878 4200864 -47565 -3674303
$$ packed form
7413C15965k074342J825773M331958K465466j891284m640841l701433k69589K964121
7404f74206M006599K703644P05734l8995M93979K58296j878245l873260k852068
7395a148522Q04166L676490L515876J199293j514153l690373m219793k013970
7387c390986J388601K078330j262709m804298m366275r47707J277494J032895
7379h994655P81845K118395L583917L457122K149356J069809Q69648J321796J598357
7370G955590N87495j731344l459851k857374r09223r5234r47851j761510j407472
7361d626774k94210J218137K924747L377771J169850j994295k407849N54282L241947
7352C163606K873828J127820Q04379J419169N89992j878916l899014m248429l626738
$$ plain form
7343 -3674303 -6565925 -8474145 -8629612 -6267615 -1690405 2959163 4885276 3611196
7335 3611196 1874831 2097728 2859044 951612 -3640157 -7404242 -7989109 -6543476 -4867663
7326 -4867663 -3106369 -1505356 -1635950 -3711294 -4816077 -2401639 1806867 3976587
7318 3976587 3338364 2492080 2904110 2984685 1297288 -734850 -753446 1350016 3648215
7309 3648215 4782408 4907718 4250724 2168376 -1609002 -5457447 -6733601 -4593367 -1326994
7300 -1326994 -162056 -1963183 -4867872 -7047943 -8711161 -10915346 -13351006 -14298927
7292 -14298927 -12668221 -9480456 -7133836 -7190832 -8876559 -10005024 -9474580 -8189588 -7165096
7283 -7165096 -5960755 -4233559 -3580725 -5623395 -8947262 -10680135 -10932477 -12399628 -15045495
$$ packed form
7343c674303k891622j908220j55467K361997M577210M649568J926113j274080
7335C611196j736365K22897P61316j907432m591769l764085n84867J445633J675813
7326d867663J761294J601013j30594k075344j104783K414438M208506K169720
7318C976587o38223q46284M12030Q0575j687397k032138j8596K103462K298199
7309C648215J134193J25310o56994k082348l777378l848445j276154K140234L266373
7300a326994J164938j801127k904689k180071j663218k204185k435660r47921
7292a4298927J630706L187765K346620n6996j685727j128465N30444J284992J024492
7283g165096J204341J727196O52834k042670l323867j732873k52342j467151k645867
$$ plain form
7274 -15045495 -15080261 -11094292 -7459873 -8451321 -11893068 -12527081 -9581205 -6617336 -5159170
7265 -5159170 -3341797 -816385 -176456 -2327789 -4454581 -4242266 -2752917 -1393490 663149
7256 663149 3744058 5245816 2825372 -1826268 -5022459 -5519146 -4586704 -2964786 -337863
7247 -337863 2795137 5061155 5984714 6317458 6790217 7496104 7867369 6534941 2523393
7238 2523393 -2405230 -4406223 -2211485 671101 544663 -1515834 -2072645 -1097200 -1733915
7229 -1733915 -4993609 -8432367 -10177765 -10673828 -9983737 -7097592 -3044545 -1072056 -1906403
7220 -1906403 -2017903 1225243 5607919 7827268 8434668 9734751 10859994 8801334 3404018
7211 3404018 -2194038 -5702111 -7142701 -6721143 -4759630 -3646925 -5884030 -9342860
$$ packed form
7274a5045495l4766L985969L634419r91448l441747o34013K945876K963869J458166
7265e159170J817373K525412O39929k151333k126792K12315J489349J359427K056639
7256F63149L080909J501758k420444m651640l196191m96687R32442J621918K626923
7247c37863L133000K266018R23559L32744M72759P05887L71265j332428m011548
7238B523393m928623k000993K194738K882586j26438k060497n56811R75445o36715
7229a733915l259694l438758j745398m96063O90091K886145M053047J972489q34347
7220a906403j11500L243146M382676K219349O07400J300083J125243k058660n397316
7211C404018n598056l508073j440590M21558J961513J112705k237105l458830
$$ plain form
7203 -9342860 -8362173 -1317291 6360349 9069313 7861246 7420338 8918693 9777371 8935593
7194 8935593 8031563 7650241 6478619 4792774 5060593 7711449 9523474 8181174 5860618
7185 5860618 5951041 8092826 8905497 6400835 1454136 -4067247 -8344413 -9496173 -6831305
7176 -6831305 -2207287 1556626 3436245 4041201 3612565 2241206 1331906 2237265 3608321
7167 3608321 2742350 -358670 -3037046 -4270578 -5625478 -7139683 -6041022 -1583779
7159 -1583779 2342495 2431767 851859 1170797 1775259 -1807296 -8963413 -13612877 -12559618
7150 -12559618 -9554814 -9091384 -10177209 -9343228 -6858240 -5944625 -7076184 -7075469 -4289832
7141 -4289832 -1481869 -2091951 -5604712 -8462429 -8635728 -7400545 -6589117 -5876722 -3973915
$$ packed form
7203i342860R80687P044882P677640K708964j208067m40908J498355Q58678q41778
7194H935593r04030l81322j171622j685845K67819K650856J812025j342300k320556
7185E860618R0423K141785Q12671k504662m946699n521383m277166j151760K664868
7176f831305M624018L763913J879619O04956m28636j371359r09300R05359J371056
7167C608321q65971l101020k678376j233532j354900j514205J098661M457243
7159a583779L926274Q9272j579908L18938O04462l582555p156117m649464J053259
7150a2559618L004804M63430j085825Q33981K484988R13615j131559P15K785637
7141d289832K807963o10082l512761k857717j73299J235183Q11428P12395J902807
$$ plain form
7132 -3973915 -1585788 -1318597 -4196064 -7750337 -8785726 -7136664 -5146468 -3959515
7124 -3959515 -2458435 -331309 -10388 -3722927 -9517906 -12289873 -9178738 -2749398
7116 -2749398 1886214 2416124 999235 987005 3185579 5869719 7448750 7716843 6747132
7107 6747132 4358134 1367066 -234583 285065 968085 -146738 -1815761 -1211635 1604968
7098 1604968 3256511 1546313 -1735610 -3372302 -2316898 243663 2734467 3848298
7090 3848298 2837909 680578 -127793 1562753 3758849 3782006 1607870 -828851 -2750119
7081 -2750119 -4831456 -6667786 -6227492 -2529340 2642263 6511051 7873355 7348279 5953419
7072 5953419 4174575 2078362 -153974 -1832650 -2057031 -672568 1393197 3170000
$$ packed form
7132c973915K388127K67191k877467l554273j035389J649062J990196J186953
7124c959515J501080K127126L20921l712539n794979k771967L111135O429340
7116b749398M635612N29910j416889j2230K198574K684140J579031K68093r69711
7107F747132k388998k991068j601649N19648O83020j114823j669023O04126K816603
7098A604968J651543j710198l281923j636692J055404K560561K490804J113831
7090C848298j010389k157331q08371J690546K196096K3157k174136k436721j921268
7081b750119k081337j836330M40294L698152N171603L868788J362304n25076j394860
7072E953419j778844k096213k232336j678676k24381J384463K065765J776803
$$ plain form
7064 3170000 4549990 5616624 5881658 5308145 5380644 7467947 10317175 11062326 9058500
7055 9058500 6862059 6630122 7309138 6673280 4710318 3295007 3379649 4259362 5185146
7046 5185146 5973547 6047363 4526309 1749469 -492941 -870361 66783 746398 214427
7037 214427 -1295082 -2692814 -2676696 -767832 1986341 3936333 4528778 4311791 3429731
7028 3429731 1597959 -163499 214021 2612716 3563440 368406 -4801553 -7317307 -5900315
7019 -5900315 -3380556 -1951192 -838086 637092 946968 -804750 -2463741 -1689787 485319
7010 485319 1504561 1420970 2431208 4944247 6942495 7347578 7556052 9034881 11202980
7001 11202980 12260958 10810619 6573568 963836 -3139011 -3900220 -2818854 -2763280 -3902144
$$ packed form
7064C170000J379990J066634K65034n73513P2499K087303K849228P45151k003826
7055I058500k196441k31937O79016o35858j962962j415311Q4642Q79713R25784
7046E185146P88401P3816j521054k776840k242410l77420R37144O79615n31971
7037B14427j509509j397732J6118J908864K754173J949992N92445k16987q82060
7028C429731j831772j761458L77520K398695R50724l195034n169959k515754J416992
7019e900315K519759J429364J113106J475178L09876j751718j658991P73954K175106
7010D85319J019242q3591J010238K513039J998248M05083K08474J478829K168099
7001A1202980J057978j450339m237051n609732m102847p61209J081366N5574j138864
$$ plain form
6992 -3902144 -3817034 -1682415 423094 1054612 1370862 2165267 1625865 -1749446 -5927458
6983 -5927458 -7410189 -5404953 -2029567 548704 1375792 242626 -2027095 -3550289
6975 -3550289 -3407640 -3011109 -3916473 -5245898 -5073473 -3377620 -1511101 431348 3264755
6966 3264755 6105825 6646993 4282684 876171 -1895364 -4023219 -5623515 -5883753 -4408705
6957 -4408705 -2228139 -646264 42925 351483 977361 2427862 4240638 4686532 2516273
6948 2516273 -1005008 -3149701 -2889929 -1660504 -892027 -322158 832431 2395658 3535112
6939 3535112 3606750 2360698 152442 -1948109 -3111319 -3662161 -4094408 -3697299 -1641607
6930 -1641607 1021319 2349532 2309647 2427971 2603012 863370 -2934552 -5775677 -5442404
$$ packed form
6992c902144Q5110K134619K105509O31518L16250P94405n39402l375311m178012
6983e927458j482731K005236L375386K578271Q27088j133166k269721j523194
6975c550289J42649L96531r05364j329425J72425J695853J866519J942449K833407
6966C264755K841070N41168k364309l406513k771535k127855j600296k60238J475048
6957d408705K180566J581875O89189L08558O25878J450501J812776M45894k170259
6948B516273l521281k144693K59772J229425P68477N69869J154589J563227J139454
6939C535112P1638j246052k208256k100551j163210n50842m32247L97109K055692
6930a641607K662926J328213l9885J18324J75041j739642l797922k841125L33273
$$ plain form
6921 -5442404 -3777088 -3995365 -6049472 -6729091 -3814708 1570745 6597203 9426377 10204143
6912 10204143 10250537 10606954 11253162 11662847 11639379 10999341 8985558 5208181 957691
6903 957691 -1796082 -2729750 -3150619 -3746601 -4005824 -3940037 -4420055 -5322106 -5319391 -4312183
6893 -4312183 -4144749 -5777633 -7454771 -7095450 -5255133 -4322976 -5572014 -8016941 -9590431
6884 -9590431 -8938357 -6780433 -5570961 -6758894 -8699926 -8943849 -8054449 -8510621 -9934629
6875 -9934629 -8934367 -4645881 -824246 -567243 -2249048 -2998798 -2992539 -3333968 -2698693
6866 -2698693 51826 2089199 -250667 -5587935 -8712841 -7316848 -4046581 -1946026
6858 -1946026 -1072899 7091 1951864 4264106 5356744 3296548 -1702410 -6324644
$$ packed form
6921e442404J665316k18277k054107o79619K914383N385453N026458K829174P77766
6912A0204143M6394L56417O46208M09685k3468o40038k013783l777377m250490
6903I57691k753773r33668m20869n95982k59223O5787m80018r02051K715J007208
6893d312183J67434j632884j677138L59321J840317R32157j249038k444927j573490
6884i590431O52074K157924J209472j187933j941032k43923Q89400m56172j424008
6875i934629J000262M288486L821635K57003j681805p49750O259l41429O35275
6866b698693K750519K037373k339866n337268l124906J395993L270267K100555
6858a946026Q73127J079990J944773K312242J092638k060196m998958m622234
$$ plain form
6850 -6324644 -7777718 -7279697 -7486161 -7853590 -5897897 -2099195 330107 401127 303604
6841 303604 1174946 1622294 1116131 1315168 2959450 4559853 5211386 5743599 6071312
6832 6071312 4442799 618014 -2945066 -4323811 -4047162 -2960256 -1131465 152978
6824 152978 -1312670 -4807566 -6382088 -4226307 -1178695 109356 1145732 4142458
6816 4142458 7736858 9261423 8644673 6947144 3699227 -712252 -2582289 703141
6808 703141 5440076 5554550 1101157 -1823545 315497 4536728 6795664 6981412 6562128
6799 6562128 4925390 1008465 -3448786 -5028851 -2344316 2918768 7891545 10277219
6791 10277219 9177990 5649261 2133120 398340 245910 621946 1142020 1648472 1129673
$$ packed form
6850f324644j453074M98021k06464l67429J955693L798702K429302P1020r7523
6841C03604Q71342M47348n06163J99037J644282J600403O51533N32213L27713
6832F071312j628513l824785l563080j378745K76649J086906J828791J284443
6824A52978j465648l494896j574522K155781L047612J288051J036376K996726
6816D142458L594400J524565o16750j697529l247917m411479j870037L285430
6808G03141M736935J14474m453393k924702K139042M221231K258936J85748m19284
6799F562128j636738l916925m457251j580065K684535N263084M972777K385674
6791A0277219j099229l528729l516141j734780j52430L76036N20074N06452n18799
$$ plain form
6782 1129673 -1325054 -4457537 -5265149 -2444015 1411134 2317227 -552170 -4119418 -5405967
6773 -5405967 -4744849 -4139459 -4093844 -3960373 -4296697 -6266920 -8918751 -9746010 -8395173
6764 -8395173 -7238982 -7493146 -7480312 -6091700 -5194010 -6390004 -7670521 -6079858 -2227140
6755 -2227140 683003 1367306 1260138 1371104 1095220 129830 -823446 -1502012 -2216210
6746 -2216210 -2358915 -709790 2442162 5189054 6400042 6779829 7285469 7896986 8244996
6737 8244996 8200873 7589279 6343686 4953953 3827294 2625790 1439889 1871372 5035710
6728 5035710 8863358 9669090 6717383 3258596 2529553 4444780 6700957 7387302 5855174
6719 5855174 2657279 -534853 -2241932 -3018283 -4747812 -7736811 -10013298 -9982869 -8126217
$$ packed form
6782A129673k454727l132483q07612K821134L855149R06093k869397l567248j286549
6773e405967O61118O05390M5615J33471l36324j970223k651831q27259J350837
6764h395173J156191k54164J2834J388612Q97690j195994j280517J590663L852718
6755b227140K910143O84303j07168J10966k75884r65390r53276o78566p14198
6746b216210j42705J649125L151952K746892J210988L79787N05640O11517L48010
6737H244996m4123o11594j245593j389733j126659j201504j185901M31483L164338
6728E035710L827648Q05732k951707l458787p29043J915227K256177O86345j532128
6719E855174l197895l192132j707079p76351j729529k988999k276487L0429J856652
$$ plain form
6710 -8126217 -5448497 -2097622 1437711 3503477 3144767 1636448 865038 1184434 1984449
6701 1984449 3225975 5037525 6708545 7487750 7711921 7972337 7996416 7648630 8095194
6692 8095194 10256290 12727382 13164330 11504998 9815971 8785857 6503628 1596445
6684 1596445 -4206615 -8033380 -9185379 -9007981 -8410438 -7425537 -6815104 -7730464 -9044402
6675 -9044402 -7133807 -131243 8671518 13653913 12856735 9457534 7325800 6952589 6245474
6666 6245474 3576655 -950359 -5870300 -8826194 -7826853 -3429144 980219 2240666
6658 2240666 350491 -2296257 -3705141 -3472058 -2300025 -1599214 -2700900 -5146054 -6484262
6649 -6484262 -5031489 -2083293 -206860 -296196 -1601157 -3367602 -4626708 -3612130 232104
$$ packed form
6710h126217K677720L350875L535333K065766l58710j508319p71410L19396Q00015
6701A984449J241526J811550J671020P79205K24171K60416K4079l47786M46564
6692H095194K161096K471092M36948j659332j689027j030114k282229m907183
6684A596445n803060l826765j151999J77398N97543R84901O10433r15360j313938
6675i044402J910595P002564Q802761M982395p97178l399201k131734l73211p07115
6666F245474k668819m527014m919941k955894R99341M397709M409363J260447
6658B240666j890175k646748j408884K33083J172033P00811j101686k445154j338208
6649f484262J452773K948196J876433q9336j304961j766445j259106J014578L844234
$$ plain form
6640 232104 4402613 5845391 4731024 3402265 2338042 95111 -3093060 -4979102
6632 -4979102 -4936588 -4788554 -5236738 -4505601 -1774134 801836 1098513 -162191 -1103314
6623 -1103314 -1174058 -517396 1099029 3061237 3410305 1358052 -1070658 -1498661 -96746
6614 -96746 1351389 2036667 2332949 2454468 2307286 2042059 1822737 1594101 1413700 1172900
6604 1172900 111086 -2012680 -3596905 -3016093 -1373060 -825968 -551271 2031260 5798581
6595 5798581 6142211 2078157 -1363426 -291652 2732256 3662216 3206586 4102697 5582134
6586 5582134 5148652 3326643 2108967 924200 -1217844 -1765682 1939616 6874287 7506799
6577 7506799 3762599 233589 -1751227 -4946428 -9008321 -9427110 -5449011 -2680021
$$ packed form
6640B32104M170509J442778j114367j328759j064223k242931l188171j886042
6632d979102M2514J48034m48184P31137K731467K575970K96677j260704r41123
6623a103314p0744O56662J616425J962208L49068k052253k428710m28003J401915
6614i6746J448135O85278K96282J21519j47182k65227k19322k28636j80401k40800
6604A172900j061814k123766j584225N80812J643033N47092K74697K582531L767321
6595E798581L43630m064054l441583J071774L023908R29960m55630Q96111J479437
6586E582134m33482j822009j217676j184767k142044n47838L705298M934671O32512
6577G506799l744200l529010j984816l195201m061893m18789L978099K768990
$$ plain form
6569 -2680021 -4646393 -7042684 -4220409 2701968 8198921 9637171 8264047 5291628
6561 5291628 1010957 -3334301 -5993387 -6602226 -5850756 -4346060 -3218703 -4129149 -6930327
6552 -6930327 -9019555 -8720104 -7461388 -6842266 -5717843 -2579962 1050117 2322730 862750
6543 862750 -1553426 -3823093 -5491271 -5136797 -1767387 2564523 4111400 1477893 -3389293
6534 -3389293 -7845571 -10502031 -11158840 -10638133 -10277186 -10106083 -8335721 -4245698 -372617
6525 -372617 394438 -1052473 -1316761 727721 3075024 4133891 4316755 3972067 2489510
6516 2489510 86171 -1836020 -2770277 -3484638 -3922496 -3108699 -1789420 -2433294 -5180318
6507 -5180318 -6304244 -2906881 2598518 5145099 3199393 -41302 -1217232 -288873
$$ packed form
6569b680021j966372k396291K822275O922377N496953J438250j373124k972419
6561E291628m280671m345258k659086o08839P51470J504696J127357r10446k801178
6552f930327k089228K99451J258716O19122J124423L137881L630079J272613j459980
6543H62750k416176k269667j668178L54474L369410M331910J546877k633507m867186
6534c389293m456278k656460o56809N20707L60947J71103J770362M090023L873081
6525c72617P67055j446911k64288K044482K347303J058867J82864l44688j482557
6516B489510k403339j922191r34257p14361m37858Q13797J319279o43874k747024
6507e180318j123926L397363N505399K546581j945706l240695j175930R28359
$$ plain form
6499 -288873 825424 1144542 1154856 1479398 2042134 2286571 1661958 -13283 -2375503
6490 -2375503 -4754889 -6712307 -8225227 -9292039 -9681780 -9451298 -9502325 -10887402 -13256571
6481 -13256571 -14703851 -13896036 -11817524 -10333875 -9451963 -7678929 -5223180 -4652396 -7100623
6472 -7100623 -9692843 -8918408 -5500725 -3366409 -4082721 -5101704 -4181470 -2868341 -3750180
6463 -3750180 -5987654 -5999999 -2172297 3162492 6690734 7439924 6468185 4615295 1974466
6454 1974466 -852689 -2546286 -2673460 -2478031 -3113490 -3746738 -2776990 -775306 -474495
6445 -474495 -3111813 -6328398 -7139101 -5926525 -5592768 -7216234 -8747270 -8332642 -6791262
6436 -6791262 -5721854 -4953821 -3534329 -1940967 -1204639 -549520 1583760 4072068 3446538
$$ packed form
6499b88873J114297L19118J0314L24542N62736K44437o24613j675241k362220
6490b375503k379386j957418j512920j066812l89741K30482n1027j385077k369169
6481a3256571j447280Q07815K078512J483649Q81912J773034K455749N70784k448227
6472g100623k592220P74435L417683K134316p16312j018983R20234J313129q81839
6463c750180k237474j2345L827702N334789L528242P49190r71739j852890k640829
6454A974466k827155j693597j27174J95429o35459o33248R69748K001684L00811
6445d74495k637318l216585q10703J212576L33757j623466j531036M14628J541380
6436f791262J069408P68033J419492J593362P36328O55119K133280K488308o25530
$$ plain form
6427 3446538 -1001313 -4843672 -3614814 1210221 4224444 3343751 1586199 1254965 278152
6418 278152 -3520086 -7778582 -8699798 -6813439 -5733304 -6140843 -5252700 -2383442 -683434
6409 -683434 -1981423 -3756162 -3460233 -2671503 -4193920 -7531367 -10274459 -12059883 -13877472
6400 -13877472 -14730177 -12416846 -7277454 -2301819 390182 848813 -467604 -3115348
6392 -3115348 -5458611 -5678424 -4270943 -3368155 -3524328 -3404921 -2593147 -2141904 -2128588
6383 -2128588 -1326467 148764 412001 -1273380 -3535607 -5452399 -7517086 -9404400 -9666802
6374 -9666802 -8680723 -8813827 -10146235 -9180433 -3984410 2227073 5204958 4846100 3577553
6365 3577553 2154932 415097 -66658 1818088 3259716 619562 -4621752 -7281269
$$ packed form
6427C446538m447851l842359J228858M825035L014223q80693j757552l31234r76813
6418B78152l798238m258496r21216J886359J080135m07539Q88143K869258J700008
6409f83434j297989j774739K95929P88730j522417l337447k743092j785424j817589
6400a3877472q52705K313331N139392M975635K692001M58631j316417k647744
6392c115348k343263k19813J407481R02788j56173J19407Q11774M51243J3316
6383b128588Q02121J475231K63237j685381k262227j916792k064687j887314k62402
6374i666802R86079j33104j332408R65802N196023O211483K977885l58858j268547
6365C577553j422621j739835m81755J884746J441628k640154n241314k659517
$$ plain form
6357 -7281269 -5818455 -3910800 -3994139 -3698907 -718706 2482722 1804051 -2826667 -7605866
6348 -7605866 -9397433 -8025954 -5087523 -2424195 -1241023 -1340001 -1577780 -1654570 -2402729
6339 -2402729 -3734981 -3973852 -2386563 -735053 -707856 -1256864 -363101 1764252 3351042
6330 3351042 3960145 4427057 4528871 3232081 1162220 366002 1251940 1985469 1509758
6321 1509758 1045197 1699766 2555888 2358432 1461138 689376 -405273 -2647654 -5568338
6312 -5568338 -8023726 -9679641 -10644660 -10592967 -9697045 -9396225 -10292196 -10025495 -5731299
6303 -5731299 1312824 5977886 5128502 1211355 -1236179 -1012491 -490125 -1494001 -2985148
6294 -2985148 -2876676 -718528 1860279 2683199 853688 -2355668 -4362987 -3568818 -944088
$$ packed form
6357g281269J462814J907655q3339K95232K980201L201428o78671m630718m779199
6348g605866j791567J371479K938431K663328J183172r8978k37779p6790p48159
6339b402729j332252k38871J587289J651510K7197n49008Q93763K127353J586790
6330C351042O09103M66912J01814j296790k069861p96218Q85938P33529m75711
6321A509758m64561O54569Q56122j97456q97294p71762j094649k242381k920684
6312e568338k455388j655915r65019N1693Q95922L00820q95971K66701M294196
6303e731299P044123M665062q49384l917147k447534K23688N22366j003876j491147
6294b985148J08472K158148K578807Q22920j829511l209356k007319P94169K624730
$$ plain form
6285 -944088 973185 657368 -1061421 -2031684 -820465 2029979 4357076 4251933 2105151
6276 2105151 550418 1761476 5015674 7682252 8442875 8435619 8937832 9134121 7276822
6267 7276822 3555121 480747 7400 1081523 885262 -1622677 -4171126 -3552918 824599
6258 824599 6155950 8753609 6965602 2035432 -2984974 -5125154 -3414826 279936
6250 279936 2713206 2086534 -732802 -3789869 -5999337 -7175007 -7240915 -6532429 -6274691
6241 -6274691 -7508772 -9668948 -11171578 -11275603 -10538416 -9780390 -9670091 -11004273 -13948475
6232 -13948475 -16890036 -17491801 -15396677 -12728581 -11325262 -10523195 -8435436 -4616390
6224 -4616390 -657320 1386373 651400 -1878044 -3865878 -3337245 -474340 2581900 3898748
$$ packed form
6285i44088J917273l15817j718789r70263J211219K850444K327097j05143k146782
6276B105151j554733J211058L254198K666578P60623p256N02213J96289j857299
6267G276822l721701l074374m73347J074123j96261k507939k548449O18208M377517
6258H24599N331351K597659j788007m930170n020406k140180J710328L694762
6250B79936K433270o26672k819336l057067k209468j175670o5908P08486K57738
6241f274691j234081k160176j502630j04025P37187P58026J10299j334182k944202
6232a3948475k941561o01765K095124K668096J403319Q02067K087759L819046
6224d616390L959070K043693p34973k529444j987834N28633K862905L056240J316848
$$ plain form
6215 3898748 3201919 1173677 -1621479 -4575273 -6734192 -7511264 -7259300 -6623275 -5809440
6206 -5809440 -4836147 -3833894 -2743576 -1492923 -741891 -1336556 -2574470 -2471116 -668616
6197 -668616 514611 -502892 -1533813 643157 5109705 6990182 3320720 -3265565
6189 -3265565 -7633311 -7476213 -4550598 -1746308 -326684 213575 754634 1640724 2996003
6180 2996003 5269932 8522574 10958724 9453668 2938084 -5166286 -9435280 -7691910
6172 -7691910 -2830540 709973 1249959 404535 421989 1700390 2547200 1096511 -2382532
6163 -2382532 -5476182 -6511422 -6722850 -8211562 -10322183 -10149893 -6846444 -3123586 -1493976
6154 -1493976 -1141096 -106028 1316518 1693885 1757133 3811088 8018266 11801367 13374530
$$ packed form
6215C898748o96829k028242k795156k953794k158919p77072K51964O36025Q13835
6206e809440R73293J002253J090318J250653P51032n94665j237914J03354J802500
6197f68616J183227j017503j030921K176970M466548J880477l669462o586285
6189c265565m367746J57098K925615K804290J419624N40259N41059Q86090J355279
6180B996003K273929L252642K436150j505056o515584q104370m268994J743370
6172g691910M861370L540513N39986q45424J7454J278401Q46810j450689l479043
6163b382532l093650j035240k11428j488712k110621J72290L303449L722858J629610
6154a493976L52880J035068J422546L77367O3248K053955M207178L783101J573163
$$ plain form
6145 13374530 13591443 13437706 11948961 8366675 4758011 4059489 5892422 6600438 4002403
6136 4002403 323695 -774087 1097911 2922782 2448080 690953 -308405 -738937 -2436725
6127 -2436725 -5438928 -6916608 -4474570 397520 3503587 2573995 -410826 -2070208
6119 -2070208 -1838714 -2076049 -4248858 -6720680 -7214613 -6081867 -5341893 -5100131 -3250817
6110 -3250817 801097 4391218 4943288 3262911 1605545 -10847 -2890006 -5820906
6102 -5820906 -5429904 -1035839 3531857 4293026 1364024 -2343867 -4703168 -5124488 -3649320
6093 -3649320 -1430956 -825882 -2794422 -5097508 -5144477 -3658152 -3103238 -3391879 -2270185
6084 -2270185 269538 1504224 602368 179293 1597590 2056527 -938963 -4843789 -5270234
$$ packed form
6145A3374530K16913j53737j488745l582286l608664o98522J832933P08016k598035
6136D002403l678708j097782J871998J824871m74702j757127r99358m30532j697788
6127b436725l002203j477680K442038M872090L106067r29592k984821j659382
6119b070208K31494k37335k172809k471822m93933J132746P39974K41762J849314
6110c250817M051914L590121N52070j680377j657366j616392k879159k930900
6102e820906L91002M394065M567696P61169k929002l707891k359301m21320J475168
6093c649320K218364O05074j968540k303086m6969J486325N54914k88641J121694
6084b270185K539723J234686r01856m23075J418297M58937k995490l904826m26445
$$ plain form
6075 -5270234 -2299892 144826 463953 863687 2343046 2304538 -962529 -4560034 -4478175
6066 -4478175 -1008402 2015424 2386126 1402268 974454 1253194 1460538 1228411 475110
6057 475110 -802056 -2132868 -2993003 -3895346 -5931391 -8818689 -10540208 -9576736 -6624800
6048 -6624800 -3514937 -1297569 -57138 274831 -128084 -778907 -1481543 -2721081 -4683317
6039 -4683317 -6316558 -6239654 -4378022 -2003043 -357013 190157 -16147 -238599 133538
6030 133538 721849 245681 -1825443 -4314014 -5933132 -7030347 -8304336 -8527438 -5798811
6021 -5798811 -1233558 972453 -1620694 -6414572 -8775817 -7277220 -4553349 -3679169
6013 -3679169 -5139269 -7121812 -7651989 -6419729 -5135765 -5847165 -8454882 -10511156 -10096134
$$ packed form
6075e270234K970342K444718L19127L99734J479359l8508l267067l597505Q1859
6066d478175L469773L023826L70702r83858m27814K78740K07344k32127p53301
6057D75110j277166j330812q60135r02343k036045k887298j721519R63472K951936
6048f624800L109863K217368J240431L31969m02915o50823p02636j239538j962236
6039d683317j633241P6904J861632K374979J646030N47170k06304k22452L72137
6030A33538N88311m76168k071124k488571j619118j097215j273989k23102K728627
6021e798811M565253K206011k593147m793878k361245J498597K723871Q74180
6013c679169j460100j982543n30177J232260J283964p11400k607717k056274M15022
$$ plain form
6004 -10096134 -8087517 -6662190 -6394513 -6153259 -5285115 -4341290 -3758186 -3193479 -2251000
5995 -2251000 -793988 1324603 3704889 4872030 3747906 1469109 123300 -184859
5987 -184859 -1069509 -2710162 -3535512 -3694600 -5857289 -10732003 -14442518 -13217664 -8903435
5978 -8903435 -6443028 -6786125 -6071379 -2178437 1544423 775386 -4062082 -8645805 -9850195
5969 -9850195 -8130650 -5765128 -4468598 -4383460 -4128981 -2028820 1824531 5046888 5307127
5960 5307127 2901562 376514 43708 2420082 6335930 9621264 10346528 8629297 6925943
5951 6925943 7391408 9124544 9159143 6142900 1945706 -455352 307222 3416954 6846379
5942 6846379 8568729 7847923 5927182 4790435 4822599 4318503 1700448 -2408760 -5825904
$$ packed form
6004a0096134K008617J425327K67677K41254Q68144R43825N83104N64707R42479
5995b251000J457012K118591K380286J167141j124124k278797j345809l08159
5987a84859q84650j640653q25350j59088k162689m874714l710515J224854M314229
5978h903435K460407l43097P14746L892942L722860p69037m837468m583723j204390
5969i850195J719545K365522J296530Q5138K54479K100161L853351L222357K60239
5960E307127k405565k525048l32806K376374L915848L285334P25264j717231j703354
5951F925943M65465J733136L4599l016243m197194k401058P62574L109732L429425
5942F846379J722350p20806j920741j136747L2164n04096k618055m109208l417144
$$ plain form
5933 -5825904 -7062953 -6461211 -5367435 -4631670 -3947495 -2610724 -843857 114871 -388319
5924 -388319 -1351535 -1476252 -1076750 -1409541 -2371968 -2437581 -1108987 150886 102716 -513194
5914 -513194 -276720 975491 2393621 3253080 2998262 1355727 -477000 -21320 3496324
5905 3496324 7277149 7912286 5622451 3531791 2992474 2005936 -1138769 -4864493 -6368205
5896 -6368205 -5265602 -3471718 -2148645 -624863 1456261 2555400 1016633 -2188751
5888 -2188751 -3948379 -2623096 -81660 739815 -572583 -2128741 -2917063 -3721330 -4741649
5879 -4741649 -4701144 -3417499 -2993699 -4461550 -5011757 -1268074 5531717 10430742 10747653
5870 10747653 8626002 7274809 7144492 6801678 5607743 4157163 3202991 3169889 3948580
$$ packed form
5933e825904j237049O01742J093776P35765O84175J336771J766867R58728n03190
5924c88319r63216j24717L99502l32791r62427o5613J328594J259873m8170o15910
5914e13194K36474J252211J418130Q59459k54818j642535j832727M55680L517644
5905C496324L780825O35137k289835k090660n39317r86538l144705l725724j503712
5896f368205J102603J793884J323073J523782K081124J099139j538767l205384
5888b188751j759628J325283K541436Q21475j312398j556158p88322q04267j020319
5879d741649M0505J283645M23800j467851n50207L743683O799791M899025L16911
5870A0747653k121651j351193j30317l42814j193935j450580r54172l3102P78691
$$ plain form
5861 3948580 4640871 4403673 3867849 4638133 7068498 9687501 11114086 11288325 10533138
5852 10533138 8817655 6391785 3862088 1370585 -972559 -2015682 -961262 220632
5844 220632 -1452504 -5243688 -6891714 -4821551 -2718951 -3635294 -4867771 -2112856 3866694
5835 3866694 8689958 10579065 10795182 9195201 4389650 -1734092 -4683669 -3689473 -2927558
5826 -2927558 -4749174 -5924744 -3170025 1325614 3331861 2847935 3146982 5162957 6584378
5817 6584378 5895642 3938132 1474299 -1767993 -5090788 -6441968 -5075705 -2845603
5809 -2845603 -1897629 -2342057 -2914069 -2776568 -1952066 -929331 -535469 -1481970 -3523902
5800 -3523902 -5672537 -7446879 -9021691 -9914898 -8884459 -6037420 -3874671 -4689371 -7326373
$$ packed form
5861C948580O92291k37198n35824P70284K430365K619003J426585J74239p55187
5852A0533138j715483k425870k529697k491503k343144j043123J054420J181894
5844B20632j673136l791184j648026K070163K102600r16343j232477K754915N979550
5835C866694M823264J889107K16117j599981m805551o123742k949577R94196P61915
5826b927558j821616j175570K754719M495639K006247m83926K99047K015975J421421
5817F584378o88736j957510k463833l242292l322795j351180J366263K230102
5809b845603R47974m44428n72012J37501Q24502J022735L93862r46501k041932
5800c523902k148635j774342j574812q93207J030439K847039K162749q14700k637002
$$ plain form
5791 -7326373 -8096087 -5140429 -590420 2191544 2360759 1531109 797579 -535098 -3171039
5782 -3171039 -6393400 -9281067 -12084245 -14946580 -16083394 -13302870 -7510742 -2679517
5774 -2679517 -1328371 -1630414 -480004 1828491 2050428 -1337239 -6062790 -8978653 -9235515
5765 -9235515 -7844887 -5701368 -3254064 -1109563 306652 1147043 1311503 -29314 -2988623
5756 -2988623 -5791927 -6537613 -5765254 -5675310 -6859735 -7587280 -6779201 -5895408 -6691536
5747 -6691536 -8351889 -8345643 -5603023 -1611387 1364743 2138057 956495 -900337 -1902122
5738 -1902122 -1555024 -956151 -1343687 -2262657 -2149496 -703265 557905 559495 421305 2062831
5728 2062831 5570156 8788629 9463751 7307087 3993702 1489347 450394 101555 -460068
$$ packed form
5791g326373p69714K955658M550009K781964J69215q29650p33530j332677k635941
5782c171039l222361k887667k803178k862335j136814K780524N792128M831225
5774b679517J351146l02043J150410K308495K21937l387667m725551k915863k56862
5765i235515J390628K143519K447304K144501J416215Q40391J64460j340817k959309
5756b988623k803304p45686P72359Q9944j184425p27545Q08079Q83793p96128
5747f691536j660353O246K742620L991636K976130P73314j181562j856832j001785
5738a902122L47098N98873l87536r18970J13161J446231J261170J590j38190J641526
5728B062831L507325L218473O75122k156664l313385k504355j038953l48839n61623
$$ plain form
5719 -460068 -1041482 -579605 1598480 5023870 8472445 10831818 11783852 12025056 12668577
5710 12668577 13970819 14670462 12964114 8241417 1897129 -3261023 -4582260 -1642185
5702 -1642185 2688085 4290017 1918148 -1528219 -2828815 -2409420 -2935837 -5018453 -6584215
5693 -6584215 -6112208 -4133824 -1550942 1096215 2413964 813823 -2805052 -5405770
5685 -5405770 -5834069 -6173385 -7953166 -9508516 -8846958 -6959155 -6197341 -7008734 -8200044
5676 -8200044 -8956628 -8843895 -7373685 -5276418 -4429390 -4756094 -3387030 854157 4560107
5667 4560107 4322292 1936512 1361344 2405236 1835620 -449767 -1245931 251608 1436315
5658 1436315 1382213 2079986 3532681 2532862 -1626239 -4681396 -3430798 -486583 161149
$$ packed form
5719d60068n81414M61877K178085L425390L448575K359373R52034K41204O43521
5710A2668577J302242O99643j706348m722697o344288n158152j321237K940075
5702a642185M330270J601932k371869l446367j300596M19395n26417k082616j565762
5693f584215M72007J978384K582882K647157J317749j600141l618875k600718
5685e405770m28299l39316j779781j555350O61558J887803P61814q11393j191310
5676h200044p56584J12733J470210K097267Q47028l26704J369064M241187L705950
5667D560107k37815k385780n75168J043892n69616k285387p96164J497539J184707
5658A436315n4102O97773J452695r99819m159101l055157J250598K944215O47732
$$ plain form
5649 161149 -852432 -257272 2304453 4493543 5453078 6136165 6331578 4750082 1946043
5640 1946043 419044 1563419 4378314 7097522 8498145 8004535 6209325 5007044
5632 5007044 5687361 7214096 7682696 6816458 5539663 3923771 1522450 -765916 -1386051
5623 -1386051 -773214 -1335060 -4254907 -7808638 -9510679 -8853734 -7299831 -6304509 -5942930
5614 -5942930 -5181381 -3171702 -245475 2469522 4269774 5188754 5222717 4228180 2744519
5605 2744519 1708539 915147 -899945 -3722007 -5407793 -4304928 -1623733 -29357
5597 -29357 -741293 -2962219 -5117388 -5667266 -3921518 -1257637 -337112 -1855591 -3400303
5588 -3400303 -2968733 -2071357 -3308063 -6108818 -7330752 -5524811 -2396832 -341425 -498793
$$ packed form
5649A61149j013581N95160K561725K189090R59535O83087J95413j581496k804039
5640A946043j526999J144375K814895K719208J400623m93610j795210j202281
5632E007044O80317J526735M68600q66238j276795j615892k401321k288366o20135
5623a386051O12837n61846k919847l553731j702041O56945J553903R95322L61579
5614e942930P61549K009679K926227K714997J800252R18980L3963r94537j483661
5605B744519j035980p93392j815092k822062j685786J102865K681195J594376
5597b9357p11936k220926k155169n49878J745748K663881R20525j518479j544712
5588c400303M31570Q97376j236706k800755j221934J805941L127979K055407j57368
$$ plain form
5579 -498793 -2915717 -6547817 -9124707 -8893597 -6677023 -4775738 -3982652 -3164911 -1537278
5570 -1537278 313771 1636110 2334030 2702068 3455619 5409642 7794251 7893714 4312192
5561 4312192 -255189 -1862823 -364277 950323 434261 -183073 490535 1063254 -101640
5552 -101640 -2120294 -2871416 -1673846 436941 2119244 2740883 2849047 3849663 6261714
5543 6261714 8454175 8401659 6405856 4542816 3863804 4118370 5808707 9855490 14926377
5534 14926377 17691372 16559073 13089776 9149228 4978153 870823 -1698163 -2066434
5526 -2066434 -1756219 -2616459 -4910336 -7845299 -10324804 -10722493 -8052264 -4152765 -2543405
5517 -2543405 -4124059 -6049251 -5702603 -3441073 -440673 3331543 7221076 8555340
$$ packed form
5579d98793k416924l632100k576890K31110K216574J901285P93086Q17741J627633
5570a537278J851049J322339O97920L68038P53551J954023K384609R9463l581522
5561D312192m567381j607634J498546J314600n16062o17334O73608N72719j164894
5552a01640k018654p51122J197570K110787J682303O21639J08164J000616K412051
5543F261714K192461n2516j995803j863040o79012K54566J690337M046783N070887
5534A4926377K764995j132299l469297l940548m171075m107330k568986l68271
5526b066434L10215q60240k293877k934963k479505l97689K670229L899499J609360
5517b543405j580654j925192L46648K261530L000400L772216L889533J334264
$$ plain form
5509 8555340 5638740 442731 -3660853 -5357487 -5055698 -3156952 -724134 14721 -1734036
5500 -1734036 -3589304 -3068901 -1108482 -347237 -1220248 -2107397 -2275831 -2258823 -2105039
5491 -2105039 -1549653 -1358952 -2453815 -4175421 -5124321 -5014293 -4136481 -2109318 952962
5482 952962 3185555 3038099 1607100 745729 -95718 -2663859 -6305661 -8142273 -6548055
5473 -6548055 -2467014 2080553 4860544 3978565 167214 -2421062 -540242 3738846
5465 3738846 5762940 4527826 2829302 1987583 591884 -1386445 -1639422 155543 1047085
5456 1047085 -367525 -1322800 733947 4196502 6275457 7345265 9342700 11566566
5448 11566566 11215985 7567062 3207710 1119065 2030926 4541499 6720716 7584684 7460465
$$ packed form
5509H555340k916600n196009m103584j696634L01789J898746K432818P38855j748757
5500a734036j855268N20403J960419P61245q73011q87149j68434J7008J53784
5491b105039N55386J90701j094863j721606r48900J10028Q77812K027163L062280
5482I52962K232593j47456j430999q61371q41447k568141l641802j836612J594218
5473f548055M081041M547567K779991q81979l811351k588276J880820M279088
5465C738846K024094j235114j698524q41719j395699j978329k52977J794965Q91542
5456A047085j414610r55275K056747L462555K078955J069808J997435K223866
5448A1566566l50581l648923m359352k088645R11861K510573K179217Q63968j24219
$$ plain form
5439 7460465 6769184 4888133 1429213 -1729396 -1823728 980023 3357233 3250522 2336121
5430 2336121 2946719 4786970 6277864 7079965 7419656 6814024 5515760 5372475 6877546
5421 6877546 7160227 3867046 -334945 -653825 2952453 5465634 3802828 704399 336102
5412 336102 2856138 5373891 6418175 7142689 8776090 10651557 10833587 7994796 2969429
5403 2969429 -1206743 -1647955 1243727 3698739 2486990 -1662331 -5366749 -6623231
5395 -6623231 -6291909 -5909044 -5629604 -4875822 -3854292 -3398095 -3710875 -4122440 -4060653 -3691011
5385 -3691011 -3525613 -3786037 -4208236 -4200710 -3247807 -1506723 29948 380366 -346919 -1049776
5375 -1049776 -835072 194080 1280649 1712219 1253754 390822 58512 586407 1137074
$$ packed form
5439G460465o91281j881051l458920l158609r4332K803751K377210j06711r14401
5430B336121O10598J840251J490894Q02101L39691o05632j298264j43285J505071
5421F877546K82681l293181m201991l18880L606278K513181j662806l098429l68297
5412C36102K520036K517753J044284P24514J633401J875467J82030k838791n025367
5403B969429m176172m41212K891682K455012j211749m149321l704418j256482
5395f623231L31322L82865K79440P53782J021530M56197l12780m11565O1787L69642
5385c691011J65398k60424m22199P526R52903J741084J536671L50418p27285p02857
5375a049776K14704J029152J086569M31570m58465q62932l32310N27895N50667
$$ plain form
5366 1137074 914929 519667 906160 1348661 192743 -2306954 -3988841 -4116524 -4309749
5357 -4309749 -5082422 -4176748 -438028 3121316 3143314 1109457 1341241 4858265 8671068
5348 8671068 10504785 10512958 8599154 4282364 -124822 -483821 3396248 6713254 6425518
5339 6425518 5425518 7283457 10225100 10079590 6860818 4208059 3412905 2118785 -1046983
5330 -1046983 -4117968 -4921887 -4025860 -3508985 -4407403 -6078327 -6961210 -5677742 -2332459
5321 -2332459 1348742 4063644 6559231 9966044 13272808 14329325 13002150 11257609
5313 11257609 10055324 8290595 5341655 2631755 1544059 1237778 -183581 -3194276
5305 -3194276 -6601930 -9135391 -10237632 -9633583 -7200869 -3556571 -200846 1452616
$$ packed form
5366A137074k22145l95262L86493M42501j155918k499697j681887j27683j93225
5357d309749p72673R05674L738720L559344K1998k033857K31784L517024L812803
5348H671068J833717Q173j913804m316790m407186l58999L880069L317006k87736
5339F425518j000000J857939K941643j45510l218772k652759p95154j294120l165768
5330a046983l070985q03919Q96027N16875q98418j670924q82883J283468L345283
5321b332459L681201K714902K495587L406813L306764J056517j327175j744541
5313A1257609j202285j764729k948940k709900j087696l06281j421359l010695
5305c194276l407654k533461j102241O04049K432714L644298L355725J653462
$$ plain form
5297 1452616 1230070 84151 -1303245 -3299760 -6110520 -8323391 -8005340 -5382250 -2984248
5288 -2984248 -2501689 -2833956 -2163158 -669161 102428 -380836 -1238237 -1527198 -945660
5279 -945660 119471 454634 -925898 -2662974 -1614512 2964625 7488600 8261054 5966879
5270 5966879 3554992 1459084 -1711761 -5039419 -6004885 -4991419 -4785930 -5233683 -2949491
5261 -2949491 2310978 5517653 3090282 -2005251 -4833161 -4896217 -4607481 -4282616 -2826269
5252 -2826269 -1511585 -2627450 -5094494 -5452994 -3075696 -800515 -303459 -326781 162629
5243 162629 594169 1344882 4088787 8094830 9461943 6309770 2194355 1773323 4885106
5234 4885106 7553583 7538397 6057006 4576551 2727475 -114406 -3167744 -5043699 -5223872
$$ packed form
5297A452616k22546j145919j387396j996515k810760k212871L18051K623090K398002
5288b984248M82559l32267O70798J493997P71589m83264q57401k88961N81538
5279i45660J065131L35163j380532j737076J048462M579137M523975P72454k294175
5270E966879k411887k095908l170845l327658r65466J013466K05489m47753K284192
5261b949491N260469L206675k427371n095533k827910o3056K88736L24865J456347
5252b826269J314684j115865k467044l58500K377298K275181M97056k3322M89410
5243A62629M31540P50713K743905M006043J367113l152173m115415m21032L111783
5234D885106K668477j5186j481391j480455j849076k841881l053338j875955j80173
$$ plain form
5225 -5223872 -4289882 -3294843 -2964321 -2987018 -2363693 -1097274 -993414 -3693854 -8158501
5216 -8158501 -11214956 -10644019 -6978197 -2557310 259737 394882 -1085264 -1533912 547365
5207 547365 3471132 4465610 3596131 3655604 5927543 8303315 8533960 7200502 5937969
5198 5937969 4631390 2541456 892021 1733303 4565995 6401924 5456994 3052875 1493241
5189 1493241 1463238 1925374 1480260 -463801 -3016691 -4317972 -3567598 -2143865 -1544231
5180 -1544231 -916186 1449801 4559478 5210790 2530048 -561305 -1647191 -2248252 -4970537
5171 -4970537 -8912093 -10410185 -7771675 -3071795 777057 2953756 4293066 5316246
5163 5316246 5654316 5004808 3863225 2910383 1834474 -440780 -3719301 -5523331 -3607008
$$ packed form
5225e223872R33990R95039L30522k2697O23325J266419J03860k700440m464647
5216h158501l056455N70937L665822M420887K817047J35145j480146m48648K081277
5207E47365K923767R94478q69479N9473K271939K375772K30645j333458j262533
5198E937969j306579k089934j649435Q41282K832692J835929r44930k404119j559634
5189A493241l0003M62136m45114j944061k552890j301281P50374J423733N99634
5180a544231O28045K365987L109677O51312k680742l091353j085886o01061k722285
5171d970537l941556j498092K638510M699880L848852K176699J339310J023180
5163E316246L38070o49508j141583r52842j075909k275254l278521j804030J916323
$$ plain form
5154 -3607008 703167 3419199 2499027 -84963 -1344359 -490588 1619553 4146396 5913476
5145 5913476 5260461 2235021 -371108 -181494 1560090 1869818 178877 -1471859 -1691522
5136 -1691522 -1028173 -377315 -141141 -761050 -2178251 -2905998 -1474467 1231402 2690182
5127 2690182 1675174 -906330 -3496814 -4567487 -2772517 1260459 4048653 2899134
5119 2899134 -26589 -278707 2618084 5065842 5643657 7085726 10651344 12896569 10842658
5110 10842658 6942279 5538561 6901130 8275282 8875878 10011834 11394810 11152854
5102 11152854 9226891 7385919 5795428 2690429 -2094711 -6109402 -7626900 -7724251
5094 -7724251 -8236069 -9576955 -11188590 -12209035 -11211129 -7448491 -3009654 -1305446 -2343835
$$ packed form
5154c607008M310175K716032r20172k583990j259396Q53771K110141K526843J767080
5145E913476o53015l025440k606129J89614J741584L09728j690941j650736k19663
5136a691522O63349O50858K36174o19909j417201p27747J431531K705869J458780
5127B690182j015008k581504k590484j070673J794970M032976K788194j149519
5119B899134k925723k52118K896791K447758N77815J442069L565618K245225k053911
5110A0842658l900379j403718J362569J374152O00596J135956J382976k41956
5102A1152854j925963j840972j590491l104999m785140m014691j517498r7351
5094g724251n11818j340886j611635j020445R97906L762638M438837J704208j038389
$$ plain form
5085 -2343835 -2085723 1763580 5804405 5396207 1279574 -1450133 -308132 1736479 596240
5076 596240 -4252354 -9802285 -11932904 -7389708 3875199 16827330 23970662 22015090
5068 22015090 15004065 9412921 7418808 6706364 5437088 4552194 5323268 7314914 9602551
5059 9602551 12121804 14761683 16407150 15927961 13422632 9903825 6414869 3785725
5051 3785725 2502871 2505126 3633887 6013703 9017805 10438218 8552010 5014081 3588909
5042 3588909 5478353 7898506 7964011 5879571 3404562 1489724 788191 2198399 5095322
5033 5095322 7041743 7069952 7099953 8119415 7605595 3732217 -227267 425592 5222347
5024 5222347 9610164 11554342 12686966 13364069 11502145 7175896 3875737 3436535 3372517
$$ packed form
5085b343835K58112L849303M040825m08198m116633k729707J142001K044611j140239
5076E96240m848594n549931k130619M543196J1264907J2952131P143332j955572
5068B2015090p011025n591144j994113p12444j269276q84894P71074J991646K287637
5059I602551K519253K639879J645467m79189k505329l518807l488956k629144
5051C785725j282854K255J128761K379816L004102J420413j886208l537929j425172
5042C588909J889444K420153O5505k084440k475009j914838p01533J410208K896923
5033E095322J946421K8209L0001J019462n13820l873378l959484O52859M796755
5024E222347M387817J944178J132624O77103j861924m326249l300159m39202o4018
$$ plain form
5015 3372517 1229984 -1566499 -2384043 -1258145 105504 1046879 1619945 1466464 1000775
5006 1000775 2017313 5202068 8495931 9632013 8865158 7624453 6082915 3905439
4998 3905439 1984707 1434296 1845315 2237701 2741991 3695170 4088019 2748051 434510
4989 434510 -890712 -507242 623778 1451921 1754432 1782525 1830486 1912937 1566305 578014
4979 578014 -66744 912836 3163148 5072290 6126813 7092784 7753862 6885845 5086677
4970 5086677 4885773 6737326 7588054 5312971 2169298 1531492 3203668 4541193 4629340
4961 4629340 4590574 4813620 4664759 4540387 5789949 8554532 11431948 13243267 13705164
4952 13705164 12514833 9194247 4124578 -970734 -3825167 -3145471 61672 3042240
$$ packed form
5015C372517k142533k796483q17544J125898J363649R41375N73066j53481m65689
5006A000775J016538L184755L293863J136082p66855j240705j541538k177476
4998C905439j920732n50411M11019L92386N04290R53179L92849j339968k313541
4989D34510j325222L83470J131020Q28143L02511K8093M7961Q2451l46632r88291
4979E78014o44758R79580K250312J909142J054523R65971O61078q68017j799168
4970E086677k00904J851553Q50728k275083l143673o37806J672176J337525Q8147
4961D629340l8766K23046j48861j24372J249562K764583K877416J811319M61897
4952A3705164j190331l320586n069669n095312k854433O79696L207143K980568
$$ plain form
4944 3042240 4292979 5440956 8357837 11132950 9875135 4645313 236656 6417
4936 6417 1988424 2472727 527089 -2541937 -5343401 -6314446 -4181247 -207962 2466438
4927 2466438 2935839 3159671 3701147 2646107 57291 -833095 1208724 3469176 4558348
4918 4558348 6706202 10295589 11599485 9317183 7682151 9009089 9100482 5026819 1360743
4909 1360743 2552215 4978551 3778576 2185288 5793486 12039512 14235104 12481352
4901 12481352 11579829 11275327 8099067 4438932 5851546 10823400 12834508 11507974
4893 11507974 12259113 15938243 18469019 19832646 23543977 28039300 28612144 26939316
4885 26939316 28462095 31937395 32626562 33343296 39598211 46934040 48240113 50006513
$$ packed form
4944C042240J250739J147977K916881K775113j257815n229822m408657k30239
4936F417J982007M84303j945638l069026k801464r71045K133199L973285K674400
4927B466438M69401K23832N41476j055040k588816q90386K041819K260452J089172
4918D558348K147854L589387J303896k282302j635032J326938R1393m073663l666076
4909A360743J191472K426336j199975j593288L608198O246026K195592j753752
4901A2481352r01523l04502l176260l660135J412614M971854K011108j326534
4893A1507974P51139L679130K530776J363627L711331M495323N72844j672828
4885B6939316J522779L475300O89167P16734O254915P335829J306073J766400
$$ plain form
4877 50006513 62661132 78797954 85947579 98901906 144067468 201829500 203853352
4870 203853352 115592870 -7209855 -78775367 -80715991 -63046366 -62912602 -67278271
4863 -67278271 -56704744 -41819546 -39386338 -43215172 -39641999 -31697094 -29213965 -29673630
4855 -29673630 -25715025 -20652167 -21522025 -25112038 -24014684 -19762401 -18436340 -19206382
4847 -19206382 -17758341 -15820646 -17413744 -20088706 -18932778 -15340959 -13552943 -12383055
4839 -12383055 -8548706 -4700387 -5876723 -10452132 -12289889 -10211341 -8568881 -9795917
4831 -9795917 -12321484 -14513811 -15433770 -13277172 -8023319 -3956578 -4936863 -8928689 -11358439
4822 -11358439 -11534871 -11493192 -11301803 -10310004 -10286690 -12165207 -12307571 -7544383 -1562500
$$ packed form
4877E0006513J2654619J6136822P149625J2954327M5165562N7762032K023852
4870B03853352q8260482j22802725p1565512j940624J7669625J33764m365669
4863f7278271J0573527J4885198K433208l828834L573173P944905K483129m59665
4855b9673630L958605N062858q69858l590013J097354M252283J326061p70042
4847a9206382J448041J937695j593098k674962J155928L591819J788016J169888
4839a2383055L834349L848319j176336m575409j837757K078548J642460j227036
4831i795917k525567k192327r19959K156598N253853M066741r80285l991826k429750
4822a1358439j76432M1679J91389R91799K3314j878517j42364M763188N981883
$$ plain form
4813 -1562500 -356232 -3258885 -4765751 -3895611 -4975811 -9249458 -12245864 -10745272
4805 -10745272 -7092734 -4994039 -5131729 -6281070 -7322266 -7064096 -4920391 -2336550
4797 -2336550 -1021402 86451 3205631 7379754 9026446 6909163 3537323 1443430
4789 1443430 843502 1076615 1663866 1705496 413744 -1840230 -4660982 -8627385 -13029719
4780 -13029719 -14562790 -11591287 -8015470 -8794327 -12771121 -14438511 -12131403 -9485974
4772 -9485974 -8704618 -7705128 -5258203 -4040928 -6224406 -9810420 -11855600 -12362264 -12611870
4763 -12611870 -12174891 -10024833 -6860963 -4309761 -3092626 -3221363 -4436121 -5384387 -4229106
4754 -4229106 -1389903 73347 -1681144 -4447601 -4505294 -1012506 3289581 4951248 2582332
$$ packed form
4813a562500J206268k902653j506866Q70140j080200m273647k996406J500592
4805a0745272L652538K098695j37690j149341j041196K58170K143705K583841
4797b336550J315148J107853L119180M174123J646692k117283l371840k093893
4789A443430n99928K33113N87251M1630j291752k253974k820752l966403m402334
4780a3029719j533071K971503L575817p78857l976794j667390K307108K645429
4772i485974P81356R99490K446925J217275k183478l586014k045180n06664k49606
4763a2611870M36979K150058L163870K551202J217135j28737j214758r48266J155281
4754d229106K839203J463250j754491k766457n7693L492788M302087J661667k368916
$$ plain form
4745 2582332 -2321123 -6473533 -7383739 -5434990 -3034984 -1874290 -1847037 -2223362 -2446615
4736 -2446615 -1924829 -572527 424046 -188145 -1870794 -3102398 -3658790 -4230274 -4192975
4727 -4192975 -2246753 636951 1661820 382891 -178323 2025596 4738130 4386222 890278
4718 890278 -2475813 -3212567 -1785595 68253 1660487 3451581 5579564 7121691 7085320
4709 7085320 5639669 3600293 1030555 -2228504 -4640739 -3818893 -287976 1944932
4701 1944932 431162 -2289592 -2695097 -1478494 -1403393 -1857729 -19070 3206406 3250128
4692 3250128 -1342394 -6423388 -7965760 -6646631 -5012232 -3460014 -1381515 341569
4684 341569 614126 292103 943556 2542567 3840731 3878208 2055402 -1881658 -6779172
$$ packed form
4745B582332m903455m152410r10206J948749K400006J160694K7253l76325k23253
4736b446615N21786J352302R96573o12191j682649j231604n56392n71484L7299
4727d192975J946222K883704J024869j278929n61214K203919K712534l51908l495944
4718H90278l366091p36754J426972J853848J592234J791094K127983J542127l6371
4709G085320j445651k039376k569738l259059k412235Q21846L530917K232908
4701A944932j513770k720754m05505J216603P5101m54336J838659L225476M3722
4692C250128m592522n080994j542372J319129J634399J552218K078499J723084
4684C41569K72557l22023O51453J599011J298164L7477j822806l937060m897514
$$ plain form
4675 -6779172 -10263953 -10981442 -9613867 -7358186 -5000499 -3715867 -4497728 -5985461 -5085115
4666 -5085115 -830358 4354726 8108043 10555798 12219235 12014014 9018709 4267055
4658 4267055 -695897 -5147021 -7947314 -7493797 -4595666 -2887255 -4251664 -6132614
4650 -6132614 -5719750 -4475889 -5577290 -8700092 -10631361 -9954752 -8007860 -5905033 -3702266
4641 -3702266 -2333875 -3503772 -7191342 -11290783 -14002228 -14939982 -13964907 -10867105 -6619777
4632 -6619777 -3425057 -2842178 -4549624 -7041598 -8909400 -9513322 -8916000 -7171887 -3964036
4623 -3964036 168357 2650127 977981 -3452511 -5889102 -3919429 -637080 -428886
4615 -428886 -3401963 -6076071 -6212206 -4678675 -3353551 -3211630 -4058377 -4734904 -4181106
$$ packed form
4675f779172l484781p17489J367575K255681K357687J284632p81861j487733R00346
4666e085115M254757N185084L753317K447755J663437k05221k995305m751654
4658D267055m962952m451124k800293M53517K898131J708411j364409j880950
4650f132614M12864J243861j101401l122802j931269O76609J946892K102827K202767
4641c702266J368391j169897l687570m099441k711445r37754R75075L097802M247328
4632f619777L194720N82879j707446k491974j867802o03922N97322J744113L207851
4623c964036M132393K481770j672146m430492k436591J969673L282349K08194
4615d28886k973077k674108j36135J533531J325124J41921q46747o76527N53798
$$ plain form
4606 -4181106 -3222426 -4055173 -6946270 -9230129 -9012600 -7822960 -7685637 -7759994 -6462464
4597 -6462464 -4952022 -5342130 -6794379 -6645783 -4598086 -2763254 -2197893 -2229597 -2526950
4588 -2526950 -3017369 -2573801 -806397 -280307 -3524648 -8473758 -10601792 -9293933 -8187445
4579 -8187445 -9153327 -10144504 -9669552 -9126600 -9260944 -8216503 -5121361 -2355463 -2130338
4570 -2130338 -3549552 -4953146 -6384518 -7624596 -6567656 -2296341 2249437 3382846
4562 3382846 1070717 -1965349 -4075184 -5353679 -5877540 -5836837 -6639383 -9417458 -12609115
4553 -12609115 -13032594 -9574131 -4485794 -886238 140378 -53684 396236 1586002 1681718
4544 1681718 -355257 -2501543 -1858366 999073 2196115 -216914 -3577744 -4436456 -2835246
$$ packed form
4606d181106R58680q32747k891097k283859K17529J189640J37323p4357J297530
4597f462464J510442l90108j452249J48596K047697J834832N65361l1704k97353
4588b526950m90419M43568J767404N26090l244341m949110k128034J307859J106488
4579h187445r65882r91177M74952N42952j34344J044441L095142K765898K25125
4570b130338j419214j403594j431372j240078J056940M271315M545778J133409
4562C382846k312129l036066k109835j278495n23861M0703q02546k778075l191657
4553a2609115m23479L458463N088337L599556J026616j94062M49920J189766R5716
4544A681718k036975k146286O43177K857439J197042k413029l360830q58712J601210
$$ plain form
4535 -2835246 -999170 197508 1085640 998709 -1027598 -3841432 -4822694 -3057352 -292357
4526 -292357 1217859 580779 -1635680 -3815700 -4152927 -2473051 -941033 -1621596 -3588976
4517 -3588976 -3921035 -1583682 1078843 1103717 -1855636 -5487647 -7318241 -6802182 -5283822
4508 -5283822 -4318067 -4251538 -4520349 -4861009 -5435856 -5906480 -5497299 -4290242 -3437486 -3596332
4498 -3596332 -4039033 -3808075 -2901632 -1859336 -1094455 -1150469 -2677298 -5493532 -8338275
4489 -8338275 -9950184 -9795479 -7844612 -4766170 -2262360 -1719298 -2425917 -2685000 -2560300
4480 -2560300 -3417501 -4805099 -4660760 -3198926 -3348491 -5962505 -7858875 -6656610 -4418710
4471 -4418710 -3893320 -4167284 -3338538 -2784236 -4722614 -7469061 -7461449 -4841237 -2790948
$$ packed form
4535b835246J836076J196678Q88132q6931k026307k813834r81262J765342K764995
4526b92357J510216o37080k216459k180020l37227J679876J532018o80563j967380
4517c588976l32059K337353K662525K4874k959353l632011j830594N16059J518360
4508e283822R65755O6529k68811l40660n74847m70624M09181J207057Q52756j58846
4498c596332m42701K30958R06443J042296P64881n6014j526829k816234k844743
4489h338275j611909J54705J950867L078442K503810N43062p06619k59083J24700
4480b560300q57201j387598J44339J461834j49565k614014j896370J202265K237900
4471d418710N25390k73964Q28746N54302j938378k746447P612K620212K050289
$$ plain form
4462 -2790948 -2173576 -1256219 -357171 -2016318 -6022673 -8734296 -8486324 -7679834 -8148207
4453 -8148207 -8362185 -7095609 -6238258 -7525168 -9390588 -9626467 -8836697 -8813289 -9455449
4444 -9455449 -9654046 -9609881 -10132459 -11026523 -11912309 -13020404 -13507292 -11060542 -5448764
4435 -5448764 -558055 -142818 -2939200 -4802134 -4493344 -4182706 -4941445 -5354287 -4967704
4426 -4967704 -5746989 -8671230 -11322954 -10822577 -7873266 -6051498 -7440984 -10345469 -11573726
4417 -11573726 -10151590 -8049015 -7339728 -7615058 -7072697 -5485895 -4428932 -4508971 -4359818
4408 -4359818 -3189559 -2361971 -2992981 -3722269 -2871312 -1439165 -1489920 -2353550 -1177055
4399 -1177055 2659665 6076851 5845830 1869743 -3502442 -7738367 -9182756 -7591518
$$ packed form
4462b790948O17372R17357Q99048j659147m006355k711623K47972Q06490m68373
4453h148207k13978J266576Q57351j286910j865420k35879P89770K3408o42160
4444i455449j98597M4165n22578q94064q85786j108095m86888K446750N611778
4435e448764M890709M15237k796382j862934L08790L10638p58739m12842L86583
4426d967704p79285k924241k651724N00377K949311J821768j389486k904485j228257
4417a1573726J422136K102575P09287k75330N42361J586802J056963q0039J49153
4408d359818J170259Q27588o31010p29288Q50957J432147n0755q63630J176495
4399a177055L836720L417186k31021l976087n372185m235925j444389J591238
$$ plain form
4391 -7591518 -4661682 -3052796 -4091300 -6926254 -9939617 -12028129 -12614176 -11798686 -10740123
4382 -10740123 -10581579 -10778250 -9792947 -7504677 -5271561 -3454050 -988516 1922969 2984710
4373 2984710 987709 -2162612 -4181193 -5295352 -6499585 -6808728 -4956982 -2615239
4365 -2615239 -2765226 -5108695 -6022820 -3437794 814447 4071032 5718746 6088657 5006261
4356 5006261 3049887 2222713 3395788 4509698 3296305 655823 -794102 -742625 -1431938
4347 -1431938 -4054150 -7103894 -8722272 -8895441 -8638124 -8322074 -7597000 -6214570 -4522699
4338 -4522699 -3616562 -4664411 -7098961 -8117601 -5805950 -2462076 -2351433 -5762956 -8126133
4329 -8126133 -6346466 -3152994 -2759305 -4620456 -4931642 -2981164 -2050420 -3935490 -6195208
$$ packed form
4391g591518K929836J608886j038504k834954l013363k088512n86047Q15490J058563
4382a0740123J58544j96671R85303K288270K233116J817511K465534K911485J061741
4373B984710j997001l150321k018581j114159j204233l09143J851746K341743
4365b615239j49987k343469r14125K585026M252241L256585J647714L69911j082396
4356E006261j956374q27174J173075J113910j213393k640482j449925N1477o89313
4347a431938k622212l049744j618378j73169K57317L16050P25074J382430J691871
4338d522699R06137j047849k434550j018640K311651L343874J10643l411523k363177
4329h126133J779667L193472L93689j861151l11186J950478R30744j885070k259718
$$ plain form
4320 -6195208 -5896856 -3215941 81412 3325871 6441463 8679388 9668182 10340558 11204656
4311 11204656 10947437 8332801 4309096 651493 -2234074 -4348189 -4333600 -1283476 2332670
4302 2332670 2452954 -1466954 -5456551 -5854459 -3176404 -333073 1114254 1539121 1429066
4293 1429066 646777 -873221 -2759909 -4391749 -4977817 -3984604 -2062209 -1013702 -2147514
4284 -2147514 -4915622 -7554810 -8610517 -7459953 -4075038 827413 5612524 8489351
4276 8489351 8705637 6955869 4847817 3973644 4882328 6569768 7396214 6804235 5650180
4267 5650180 4623674 3174083 657603 -2135291 -3492634 -2486731 500634 4435208
4259 4435208 7904319 9222404 7595112 4322418 1821390 1157896 1273305 740303 -617693
$$ packed form
4320f195208K98352K680915L297353L244459L115592K237925R88794O72376Q64098
4311A1204656k57219k614636m023705l657603k885567k114115J4589L050124L616146
4302B332670J20284l919908l989597l97908K678055K843331J447327M24867j10055
4293A429066p82289j519998j886688j631840n86068R93213J922395J048507j133812
4284b147514k768108k639188j055707J150564L384915M902451M785111K876827
4276H489351K16286j749768k108052q74173R08684J687440Q26446n91979j154055
4267E650180j026506j449591k516480k792894j357343J005903K987365L934574
4259D435208L469111J318085j627292l272694k501028o63494J15409n33002j357996
$$ plain form
4250 -617693 -2051364 -2837528 -2526594 -1237542 -252879 -1224238 -3813779 -5040553 -2366365
4241 -2366365 2947810 6914109 7131976 4734219 2094165 285157 -613118 -372904 878474
4232 878474 2071989 2532374 3102121 4399611 4750218 2036036 -2560140 -5193801 -4397084
4223 -4397084 -2898964 -2929506 -2310567 1917576 7661476 9438031 5888783 1915528 1977888
4214 1977888 4356988 4339482 801409 -3257880 -5387417 -5744369 -4904614 -2789072 -377883
4205 -377883 246364 -1114822 -1856430 -254020 1647920 856951 -2040251 -3605690 -2495320
4196 -2495320 -1220311 -2325052 -4800047 -5651398 -3845115 -1111626 730616 1723048 2777194
4187 2777194 3902898 4252605 3530776 2593669 2559504 3804613 6012798 8639624 10680501
$$ packed form
4250f17693j433671p86164L10934J289052R84663r71359k589541j226774K674188
4241b366365N314175L966299K17867k397757k640054j809008q98275K40214J251378
4232H78474J193515M60385N69747J297490L50607k714182m596176k633661P96717
4223d397084J498120l0542O18939M228143N743900J776555l549248l973255O2360
4214A977888K379100j7506l538073m059289k129537l56952Q39755K115542K411189
4205c77883O24247j361186p41608J602410J901940p90969k897202j565439J110370
4196b495320J275009j104741k474995q51351J806283K733489J842242R92432J054146
4187B777194J125704L49707p21829r37107l4165J245109K208185K626826K040877
$$ plain form
4178 10680501 10376341 6518097 737144 -2612099 -434764 5332185 9347229 8571114
4170 8571114 5032603 2435263 1693540 1200899 179859 -377256 256742 1561037 2945837
4161 2945837 4234404 4887724 4634506 5098707 8459509 13626860 16222540 13971271 9858356
4152 9858356 7915792 8251556 9067298 11075940 15490260 19323556 18894088 18574377 28972938
4143 28972938 52179221 73890113 76493053 58187406 33759565 17414816 10587535
4136 10587535 6996750 3121947 -124787 -2057260 -3534962 -4489230 -3660347 -1112761
4128 -1112761 1049298 847856 -1765966 -5114458 -6927972 -5840789 -2895945 -1130598
4120 -1130598 -2493967 -5433110 -6571090 -4532595 -1140779 877595 347051 -1888081
$$ packed form
4178A0680501l04160l858244n780953l349243K177335N766949M015044p76115
4170H571114l538511k597340p41723m92641j021040n57115O33998J304295J384800
4161B945837J288567O53320k53218M64201L360802N167351K595680k251269m112915
4152I858356j942564L35764Q15742K008642M414320L833296m29468l19711J0398561
4143B8972938K3206283K1710892K602940j8305647k4427841j6344749o827281
4136A0587535l590785l874803l246734j932473j477702r54268Q28883K547586
4128a112761K162059k01442k613822l348492j813514J087183K944844J765347
4120a130598j363369k939143j137980K038495L391816K018374n30544k235132
$$ plain form
4112 -1888081 -3759534 -3354730 -770385 1200340 -624953 -6280282 -12105496 -14168000
4104 -14168000 -11777889 -7437629 -4026438 -2617963 -2688899 -3559740 -4962769 -6227392 -5801453
4095 -5801453 -2672852 1742859 4254277 2917948 -1386708 -6614078 -11386527 -14451039
4087 -14451039 -14063958 -9743799 -3662495 1557922 5636172 9257441 10944576 8366600
4079 8366600 2806043 -938509 -237281 2494356 4000657 4493084 5549320 6179580 4267435
4070 4267435 734061 -1124181 -354980 523651 -456689 -2196797 -2958154 -3009469 -3354621
4061 -3354621 -3494702 -2300685 -267677 860266 545341 100987 578064 1048816 -245282
4052 -245282 -3338805 -5857994 -5250602 -1467164 3035576 5876971 6632491 6028584 4489110
$$ packed form
4112a888081j871453M04804K584345J970725j825293n655329n825214k062504
4104a4168000K390111M340260L411191J408475p0936q70841j403029j264623M25939
4095e801453L128601M415711K511418j336329m304656n227370m772449l064512
4087a4451039L87081M320159O081304N220417M078250L621269J687135k577976
4079H366600n560557l744552P01228K731637J506301M92427J056236O30260j912145
4070D267435l533374j858242P69201Q78631r80340j740108p61357n1315l45152
4061c354621j40081J194017K033008J127943l14925m44354M77077M70752j294098
4052b45282l093523k519189O07392L783438M502740K841395P55520o03907j539474
$$ plain form
4043 4489110 2539301 1713337 3184986 5437354 5117995 1045404 -3960504 -6346762 -5962110
4034 -5962110 -5615040 -7087177 -9141383 -9623407 -8222725 -6463277 -5695199 -5898404 -6256206
4025 -6256206 -6247022 -5978807 -5719205 -5379920 -4645918 -3693909 -3543153 -5144463 -7874967 -9495206
4015 -9495206 -8392755 -5770713 -4636974 -6211507 -8233908 -7655810 -4273925 -475866
4007 -475866 2135342 4173390 6370714 7810185 7139753 4348190 519812 -2993351 -4400764
3998 -4400764 -2178412 2475345 5319361 3389110 -1101620 -3254418 -1245738 2622592
3990 2622592 5900901 8029712 8496121 6498944 3549730 3117446 5706058 7017346 3512581
3981 3512581 -2339702 -5139624 -3254006 434686 3138738 4278966 3754621 1614764
$$ packed form
4043D489110j949809q25964J471649K252368l19359m072591n005908k386258L84652
4034e962110L47070j472137k054206m82024J400682J759448P68078k03205l57802
4025f256206R184K68215K59602L39285P34002R52009J50756j601310k730504j620239
4015i495206J102451K622042J133739j574533k022401N78098L381885L798059
4007d75866K611208K038048K197324J439471o70432k791563l828378l513163j407413
3998d400764K222352M653757K844016j930251m490730k152798K008680L868330
3990B622592L278309K128811M66409j997177k949214m32284K588612J311288l504765
3981C512581n852283k799922J885618L688692K704052J140228n24345k139857
$$ plain form
3973 1614764 -408491 -186114 1461953 1542599 -411205 -1447229 -55109 1201340 -229767
3964 -229767 -2888529 -3835867 -3062144 -2567137 -2544546 -1546304 251521 902126 -190342
3955 -190342 -1445800 -1569556 -695458 976308 3296677 4566396 2419840 -2602405 -6573995
3946 -6573995 -6669365 -4261502 -2129345 -688727 793557 1068708 -1720325 -5957761 -7101981
3937 -7101981 -3160428 2761536 6506475 7458577 7640376 7966211 7586289 6252025 5114040
3928 5114040 4839550 4471544 2853423 316605 -1678285 -2110401 -1197410 11946 512022
3919 512022 64380 -679074 -878826 -389390 200370 284903 -338924 -1638843 -3340094 -4601198
3909 -4601198 -4265413 -1881439 1698177 4950601 6774094 6957357 5978124 4550011 3110072
$$ packed form
3973A614764k023255K22377J648067Q0646j953804j036024J392120J256449j431107
3964b29767k658762r47338P73723M95007K2591R98242J797825O50605j092468
3955a90342j255458j23756Q74098J671766K320369J269719k146556n022245l971590
3946f573995r5370K407863K132157J440618J482284K75151k789033m237436j144220
3937g101981L941553N921964L744939R52102J81799L25835l79922j334264j137985
3928E114040k74490l68006j618121k536818j994890m32116R12991J209356N00076
3919E12022m47642p43454j99752M89436N89760Q4533o23827j299919j701251j261104
3909d601198L35785K383974L579616L252424J823493J83263r79233j428113j439939
$$ plain form
3900 3110072 1670555 473285 610310 3114398 7132986 9981979 9837195 7699704 5730646
3891 5730646 4291066 2093600 -923677 -2768063 -2218875 -985957 -1594391 -3868626 -5160822
3882 -5160822 -4014152 -1996868 -1243191 -1430187 -515100 1974658 3914630 3388403 1478866
3873 1478866 1106799 3343033 6117249 6992433 6093796 5251016 5003578 4083148 1886822
3864 1886822 -279733 -1254313 -1901417 -3621381 -5977945 -7437735 -7840652 -8245218 -8597632
3855 -8597632 -7818557 -6526988 -7104812 -9747661 -10834008 -7518225 -2302314 -198061 -2140061
3846 -2140061 -4241225 -3497351 -1044198 1003986 2782982 4900177 5865976 3773146 -790794
3837 -790794 -5588531 -9292601 -11112837 -9202771 -2438069 6394985 11996404 11883669 8540590
$$ packed form
3900C110072j439517j197270J37025K504088M018588K848993j44784k137491j969058
3891E730646j439580k197466l017277j844386N49188J232918o08434k274235j292196
3882e160822J146670K017284P53677j86996R15087K489758J939972n26227j909537
3873A478866l72067K236234K774216Q75184q98637q42780k47438r20430k196326
3864A886822k166555r74580o47104j719964k356564j459790m02917m04566l52414
3855h597632P79075J291569n77824k642849j086347L315783N215911K104253j942000
3846b140061k101164P43874K453153K048184J778996K117195R65799k092830m563940
3837g90794m797737l704070j820236J910066O764702Q833054N601419j12735l343079
$$ plain form
3828 8540590 5900071 5528432 6680466 8049175 8437195 7229920 5245726 4068867 4026292
3819 4026292 4117469 4226739 5471798 7618218 8397042 6907155 5684674 7295885 10394578
3810 10394578 11542711 9878148 7391412 5184360 2331534 -1261982 -3471650 -2529437
3802 -2529437 612807 3495542 4741116 4858945 5298633 6969509 8946404 8839869 5544913
3793 5544913 1198356 -1204383 -1702624 -2572628 -3715131 -2024042 3402740 8510423 9151584
3784 9151584 6344955 3730530 1730505 -1836401 -6192551 -7292365 -4053707 -802830
3776 -802830 -1243825 -3183698 -2298882 1165243 3170901 2221425 982411 1508029 2601759
3767 2601759 3033395 4020312 6456629 8304152 7402803 5127699 4424567 5318251 5296322
$$ packed form
3828H540590k640519l71639J152034J368709L88020j207275j984194j176859m2575
3819D026292R1177J09270J245059K146420P78824j489887j222481J611211L098693
3810A0394578J148133j664563k486736k207052k852826l593516k209668R42213
3802b529437L142244K882735J245574J17829M39688J670876J976895j06535l294956
3793E544913m346557k402739m98241q70004j142503J691089N426782N107683O41161
3784I151584k806629k614425k000025l566906m356150j099814L238658L250877
3776h02830m40995j939873Q84816L464125K005658r49476j239014N25618J093730
3767B601759M31636R86917K436317J847523r01349k275104p03132Q93684k1929
$$ plain form
3758 5296322 3553466 1710032 182363 -2957436 -8361716 -13203207 -14248637 -11509437
3750 -11509437 -7483070 -4161904 -1996312 -453454 1662475 5245860 9089777 10266364
3742 10266364 7439462 2590276 -1517081 -4012362 -4976447 -3955901 -1385494 327549
3734 327549 -445883 -2094820 -2444575 -2422959 -4167392 -6694283 -6896436 -4370247 -1846392
3725 -1846392 -881887 -447497 72431 -17641 -77410 1834252 5172044 6500653 4319445
3716 4319445 1196958 -443559 -1463212 -2971474 -3363060 -1116198 1992378 3397248
3708 3397248 3491146 4021933 4491798 3172091 496971 -1400977 -1739453 -1323383 -697308
3699 -697308 -257677 -985437 -2683861 -2794180 370760 4444414 5925869 5075441 4682977
$$ packed form
3758E296322j742856j843434j527669l139799n404280m841491j045430K739200
3750a1509437M026367L321166K165592J542858K115929L583385L843917J176587
3742A0266364k826902m849186m107357k495281r64085J020546K570407J713043
3734C27549p73432j648937l49755K1616j744433k526891k02153K526189K523855
3725a846392R64505M34390N19928r0072n9769J911662L337792J328609k181208
3716D319445l122487j640517j019653j508262l91586K246862L108576J404870
3708C397248R3898N30787M69865j319707k675120j897948l38476M16070O26075
3699f97308M39631p27760j698424j10319L164940M073654J481455q50428l92464
$$ plain form
3690 4682977 5073962 4211926 2312452 2152429 4290951 5863318 5176637 4023101 4088776
3681 4088776 4271804 3217387 1705985 795791 160820 -2999 1912250 5726882 7825246
3672 7825246 5476891 1137189 -421332 1678765 3727948 2545596 -1075223 -4159691
3664 -4159691 -4942652 -4007272 -3170488 -3675013 -5040736 -5655872 -4545421 -2060970 1116092
3655 1116092 4572111 7524733 8917593 8769788 8287223 8125209 7818959 7299561 7149807
3646 7149807 6620226 3600448 -1926638 -6358384 -6343278 -2664070 1619143 5217170 8408169
3637 8408169 10283788 9296425 6045321 2700156 -199281 -3750288 -7576481 -9529309
3629 -9529309 -8915246 -7340014 -5618248 -2551145 1948719 5072741 4529181 2078963 1485028
$$ packed form
3690D682977L90985q62036j899474j60023K138522J572367o86681j153536O5675
3681D088776J83028j054417j511402r10194o34971j63819J915249L814632K098364
3672G825246k348355m339702j558521K100097K049183j182352l620819l084468
3664d159691p82961R35380Q36784n04525j365723o15136J110451K484451L177062
3655A116092L456019K952622J392860j47805m82565j62014l06250n19398j49754
3646G149807n29581l019778n527086m431746J5106L679208M283213L598027L190999
3637H408169J875619r87363l251104l345165k899437l551007l826193j952828
3629i529309O14063J575232J721766L067103M499864L124022n43560k450218n93935
$$ plain form
3620 1485028 3823637 6732002 7788701 6871311 5287749 4161267 4028560 4911141 6150398
3611 6150398 6618534 5542588 3174064 745666 -236220 858212 2923710 3789435 2429462
3602 2429462 478340 842455 4406095 8549312 9631314 6953103 3475828 2205444
3594 2205444 2809206 2968122 2309879 2808796 4961529 6089304 4101379 942488 -205927
3585 -205927 173289 -1039859 -4145971 -5766036 -4151675 -1899604 -1581118 -1694654 271878
3576 271878 3042604 3404705 1736080 1748377 4492091 6364544 4543904 1283983 364023
3567 364023 1437980 1006470 -1961061 -4645824 -4878612 -4087951 -4484263 -5558151 -5327873
3558 -5327873 -3678154 -2297421 -1970599 -2051949 -2370040 -3433521 -4504882 -3782714 -1406173
$$ packed form
3620A485028K338609K908365J056699r17390j583562j126482j32707Q82581J239257
3611F150398M68136j075946k368524k428398r81886J094432K065498Q65725j359973
3602B429462j951122L64115L563640M143217J082002k678211l477275j270384
3594B205444O03762J58916o58243M98917K152733J127775j987925l158891j148415
3585b05927L79216j213148l106112j620065J614361K252071L18486j13536J966532
3576B71878K770726L62101j668625J2297K743714J872453j820640l259921r19960
3567C64023J073957m31510k967531k684763k32788P90661l96312j073888K30278
3558e327873J649719J380733L26822q1350l18091j063481j071361P22168K376541
$$ plain form
3549 -1406173 -163778 -1780589 -4331911 -5166594 -4709027 -4890679 -5102261 -3000877 859654
3540 859654 2751453 1221645 -215506 2151444 6936885 9516142 7795909 3692984
3532 3692984 -298319 -3389751 -5396078 -5802964 -4762693 -3461178 -2714190 -2276951 -1945322
3523 -1945322 -2003093 -1946666 -219725 3573267 7187427 7872957 5485591 2228824 -224892
3514 -224892 -1835976 -2602981 -1803708 363259 1859790 897372 -1777214 -3919011 -4586097
3505 -4586097 -4587931 -4515914 -3994711 -3044602 -2420713 -1847290 415250 4824366 8589433 8351552
3495 8351552 4406600 464426 -787802 -141076 439831 741010 1785244 3572191 4760482
3486 4760482 4289587 2367776 8667 -1695343 -1950405 -599002 1685107 3712354 4427081
$$ packed form
3549a406173J242395j616811k551322q34683M57567j81652k11582K101384L860531
3540H59654J891799j529808j437151K366950M785441K579257j720233m102925
3532C692984l991303l091432k006327m06886J040271J301515P46988M37239L31629
3523a945322n7771N6427J726941L792992L614160O85530k387366l256767k453716
3514b24892j611084p67005P99273K166967J496531r62418k674586k141797o67086
3505d586097j834P2017N21203R50109O23889N73423K262540M409116L765067k37881
3495H351552l944952l942174j252228O46726N80907L01179J044234J786947J188291
3486D760482m70895j921811k359109j704010k55062J351403K284109K027247P14727
$$ plain form
3477 4427081 3580182 2220934 2244178 4493135 7174072 7214790 3663160 -1260903 -5007966
3468 -5007966 -7234238 -8418871 -7498216 -3252578 2290325 4501729 1359393 -3630656
3460 -3630656 -5244432 -2465721 854775 943827 -1818865 -4223150 -4458706 -3798522 -4156902
3451 -4156902 -5176356 -4749733 -2139893 715131 1656318 1098292 1102124 2043249 1894071
3442 1894071 -564538 -3195865 -2555941 1934194 7095372 9309964 7763039 4232951
3434 4232951 793225 -1488474 -2294577 -1768824 -692009 -127022 -348835 -451967 552422
3425 552422 2457838 4129179 4967425 5588213 6831139 8448791 9176447 8107212 5790455
3416 5790455 3862477 3573070 4633581 5479069 4651471 1934032 -1700791 -4909974 -6688582
$$ packed form
3477D427081q46899j359248K3244K248957K680937M0718l551630m924063l747063
3468e007966k226272j184633R20655M245638N542903K211404l142336m990049
3460c630656j613776K778711L320496Q9052k762692k404285k35556O60184l58380
3451d156902j019454M26623K609840K855024R41187n58026L832R41125j49178
3442A894071k458609k631327O39924M490135N161178K214592j546925l530088
3434D232951l439726k281699q06103N25753J076815N64987k21813j03132J004389
3425E52422J905416J671341Q38246O20788J242926J617652P27656j069235k316757
3416E790455j927978k89407J060511Q45488q27598k717439l634823l209183j778608
$$ plain form
3407 -6688582 -6836028 -6270108 -6533676 -8192891 -9793588 -9319692 -6857189 -4729927 -4399666
3398 -4399666 -4361545 -2353058 1111416 3187864 2686397 1728725 2575881 4367254 4591685
3389 4591685 2907934 1509685 1696800 2048322 838698 -1290717 -2500728 -2624430 -3093857
3380 -3093857 -4253283 -4580317 -3096272 -1109202 -654560 -2152157 -4458483 -6362545 -7029900
3371 -7029900 -5783959 -2827948 136398 1303830 767703 159092 494173 1477188 2656749
3362 2656749 3780640 3951539 2109935 -1060998 -3121569 -2526691 -181235 2206406 3988094
3353 3988094 5079671 5138623 4401445 3984180 3993034 2652153 -1019456 -4852769 -5904102
3344 -5904102 -4381839 -3029984 -3182260 -3862204 -4540573 -5938703 -7523175 -6942745 -3384329
$$ packed form
3407f688582j47446N65920k63568j659215j600697M73896K462503K127262L30261
3398d399666L8121K008487L464474K076448n01467r57672Q47156J791373K24431
3389D591685j683751j398249J87115L51522j209624k129415j210011j23702m69427
3380c093857j159426l27034J484045J987070M54642j497597k306326j904062o67355
3371g029900J245941K956011K964346J167432n36127o08611L35081R83015J179561
3362B656749J123891J70899j841604l170933k060571N94878K345456K387641J781688
3353C988094J091577N8952p37178m17265Q854j340881l671609l833313j051333
3344e904102J522263J351855j52276o79944o78369j398130j584472N80430L558416
$$ plain form
3335 -3384329 499051 1605889 -16589 -1866573 -1944016 274505 4385343 8802458 10840504
3326 10840504 8889764 4313993 65459 -2110806 -2151149 -364605 2694709 5523027
3318 5523027 6503555 5480345 3452559 1123026 -1037300 -1948507 -922816 742068 984912
3309 984912 -247415 -1287011 -1763293 -3034845 -5071295 -5374131 -2447570 1527345 3218324
3300 3218324 2033742 -108953 -1671589 -2351452 -2071937 -1186042 -1149705 -2985800 -5291346
3291 -5291346 -5620448 -3742868 -1732367 -924812 -766581 -709745 -972227 -998744 371858
3282 371858 2298570 2068273 -618392 -2006120 713200 4839735 5638414 2936339 674687
3273 674687 460010 -423359 -3848728 -7441173 -8195420 -6665994 -5315179 -4870650 -4732572
$$ packed form
3335c384329L883380J106838j622478j849984p7443K218521M110838M417115K038046
3326A0840504j950740m575771m248534k176265m0343J786544L059314K828318
3318E523027R80528j023210k027786k329533k160326r11207J025691J664884K42844
3309I84912j232327j039596m76282j271552k036450l02836K926561L974915J690979
3300C218324j184582k142695j562636o79863K79515Q85895L6337j836095k305546
3291e291346l29102J877580K010501Q07555J58231N6836k62482k6517J370602
3282C71858J926712k30297k686665j387728K719320M126535P98679k702075k261652
3273F74687k14677q83369l425369l592445p54247J529426J350815M44529J38078
$$ plain form
3264 -4732572 -5192051 -6454014 -6640061 -3756958 761659 3237000 2463126 707264 -148395
3255 -148395 -745354 -1829335 -2364510 -1495948 -273387 313478 1360654 4176029 7538137
3246 7538137 8839688 7405398 4973414 3263303 2633198 2890617 3817758 4684920 4418825
3237 4418825 2586552 -333094 -3424676 -5521190 -5635136 -4225020 -3288098 -3856747 -4169727
3228 -4169727 -2128552 1025391 1846811 -491568 -3092550 -3750658 -3909870 -5732511 -8386288
3219 -8386288 -9380225 -8264887 -6868097 -6566762 -7114228 -7579236 -6823404 -3740970 1159415
3210 1159415 4972159 5159215 2754795 844892 262252 -797065 -3030412 -4917370 -6015067
3201 -6015067 -8146377 -11541907 -12650618 -8537277 -1532415 3550505 5529780 6774982
$$ packed form
3264d732572m59479j261963j86047K883103M518617K475341p73874j755862q55659
3255a48395n96959j083981n35175Q68562J222561N86865J047176K815375L362108
3246G538137J301551j434290k431984j710111o30105K57419R27141Q67162k66095
3237D418825j832273k919646l091582k096514j13946J410116R36922n68649l12980
3228d169727K041175L153943Q21420k338379k600982o58108j59212j822641k653777
3219h386288r93937J115338J396790L01335n47466m65008P55832L082434M900385
3210A159415L812744J87056k404420j909903n82640j059317k233347j886958j097697
3201f015067k131310l395530j108711M113341P004862N082920J979275J245202
$$ plain form
3193 6774982 7671826 5309951 -1166872 -7410438 -8568644 -5198794 -2000174 -1733129 -2858750
3184 -2858750 -2872962 -1532975 -70417 1086423 2559743 4671445 6797424 7890587 7153963
3175 7153963 4478847 800569 -2116911 -2978479 -2333685 -2144893 -3514926 -5268372 -5521459
3166 -5521459 -4312456 -3381879 -3118815 -1418092 3083285 7869639 8808396 5359230 1419290
3157 1419290 527449 2158822 3646338 3890692 3642318 3519518 3654999 4555820 6455933
3148 6455933 8097645 7757706 5398097 2513899 178727 -1280990 -1080652 1525911 5346652
3139 5346652 7819639 8108147 7902931 8405765 8329693 6104064 2499178 -488516 -2174825
3130 -2174825 -2928456 -2290310 679883 5392455 9693405 11910114 11785800 9703346 6519256
$$ packed form
3193F774982Q96844k361875o476823o243566j158206L369850L198620K67045j125621
3184b858750j4212J339987J462558J156840J473320K111702K125979J093163p36624
3175G153963k675116l678278k917480q61568O44794J88792j370033j753446k53087
3166e521459J209003R30577K63064J700723M501377M786354R38757l449166l939940
3157A419290q91841J631373J487516K44354k48374j22800J35481R00821J900113
3148F455933J641712l39939k359609k884198k335172j459717K00338K606563L820741
3139E346652K472987K88508k05216N02834p6072k225629l604886k987694j686309
3130b174825p53631O38146K970193M712572M300950K216709j24314k082454l184090
$$ plain form
3121 6519256 4068487 3962715 5282832 5041066 1938926 -1496511 -1702997 1723720 5754631
3112 5754631 7345615 5998687 3238276 847040 -206209 -211978 -597604 -2559133 -5316502
3103 -5316502 -6509359 -4978105 -2357631 -952648 -773882 -115899 1391899 2310167 2182957
3094 2182957 2537560 3994690 4571321 2850206 1030691 2006285 4463135 4233527 409218
3085 409218 -3351747 -4259665 -3625862 -3233584 -1991142 1227779 4219411 4162193 1835069
3076 1835069 -22447 -983702 -2231921 -3040438 -1977874 -916352 -3409746 -8721586 -11678154
3067 -11678154 -9553310 -5286922 -2459873 -847032 1083416 2876242 3892299 5226519
3059 5226519 6889502 6016576 1391413 -2756815 -1638558 2987089 4807501 1197846
$$ packed form
3121F519256k450769j05772J320117k41766l102140l435437k06486L426717M030911
3112E754631J590984j346928k760411k391236j053249n769l85626j961529k757369
3103e316502j192857J531254K620474J404983J78766O57983J507798R18268j27210
3094B182957L54603J457130N76631j721115j819515R75594K456850k29608l824309
3085D09218l760965r07918O33803L92278J242442L218921K991632n7218k327124
3076A835069j857516r61255j248219q08517J062564J061522k493394n311840k956568
3067a1678154K124844M266388K827049J612841J930448J792826J016057J334220
3059E226519J662983q72926m625163m148228J118257M625647J820412l609655
$$ plain form
3051 1197846 -4596786 -8947802 -11163302 -11248031 -8928929 -6089429 -6043791 -8489879 -8727070
3042 -8727070 -4202610 1266798 2555455 -50067 -2316408 -2311477 -1629365 -1299668 -99059
3033 -99059 2677087 5521450 6727439 6303538 5078603 3292633 961985 -1223445 -2188822
3024 -2188822 -1451860 353950 1737690 1452557 -90774 -820003 845196 4036546 6408856
3015 6408856 6886838 6514985 6542860 6696739 5880236 3935831 1909271 575970 -640056
3006 -640056 -2692998 -5017088 -5576978 -3486813 -737307 71422 -649198 46960 3280689
2997 3280689 6500196 7002927 5393720 3812729 2199155 -1343910 -6988884 -12141444
2989 -12141444 -14056066 -11986469 -6898251 -739854 3913708 5232102 3789835 1862626
$$ packed form
3051A197846n794632m351016k215500q4729K319102K839500M5638k446088k37191
3042h727070M524460N469408J288657k605522k266341M931O82112L29697J200609
3033i9059K776146K844363J205989m23901j224935j785970k330648k185430r65377
3024b188822P36962J805810J383740k85133j543331p29229J665199L191350K372310
3015F408856M77982l71853K7875J53879q16503j944405k026560j333301j216026
3006f40056k052942k324090n59890K090165K749506Q08729p20620O96158L233729
2997C280689L219507N02731j609207j580991j613574l543065n644974n152560
2989a2141444j914622K069597N088218O158397M653562J318394j442267j927209
$$ plain form
2981 1862626 869747 488865 127145 -253440 -993170 -2839877 -5524046 -7381867 -7101894
2972 -7101894 -5113864 -2926861 -1849961 -2392300 -3878433 -4590481 -3443021 -1560940 -936397
2963 -936397 -1613335 -1855677 -1134935 -830407 -1412724 -1196401 902819 3297588 3899491
2954 3899491 2827981 1553114 827303 926710 2424426 5031846 7039336 7648340 8478925
2945 8478925 10886123 13272787 13341331 11620434 10078526 8450303 5159627 1195168 -529425
2936 -529425 242300 661226 -562193 -1549270 -1357555 -2126243 -5203527 -8224867 -8564856
2927 -8564856 -7282192 -6902979 -7216219 -6250887 -4091838 -2637886 -2209117 -1226187 964766
2918 964766 3463908 5899276 8707663 11264748 12100741 11248842 10096444 8581963 5077982
$$ packed form
2981A862626r92879l80882l61720l80585p39730j846707k684169j857821K79973
2972g101894J988030K187003J076900n42339j486133p12048J147460J882081O24543
2963i36397o76938k42342P20742L04528n82317K16323K099220K394769O01903
2954C899491j071510j274867p25811R9407J497716K607420K007490O09004Q30585
2945H478925K407198K386664O8544j720897j541908j628223l290676l964459j724593
2936e29425P71725M18926j223419r87077J91715p68688l077284l021340l39989
2927h564856J282664L79213l13240R65332K159049J453952M28769R82930K190953
2918I64766K499142K435368K808387K557085Q35993q51899j152398j514481l503981
$$ plain form
2909 5077982 -180894 -4202229 -5211290 -5230837 -6850602 -9425169 -10771546 -11009764 -11857888
2900 -11857888 -12977886 -12155417 -9210921 -6803191 -6482481 -6465308 -4748711 -2357027 -1530562
2891 -1530562 -2049345 -1592542 711231 3061914 3430875 1741625 -708695 -2878174 -4562376
2882 -4562376 -5976937 -7034290 -6857609 -4502334 -740403 1695548 896400 -1753048 -3354786
2873 -3354786 -3193926 -2703171 -2150383 -193329 2642772 3082761 -448403 -4862195 -6300602
2864 -6300602 -5267267 -5246350 -7528634 -10360870 -12405438 -13735955 -13473901 -9913826 -4029742
2855 -4029742 -17668 -737450 -4516411 -7788706 -9126431 -9288470 -8989499 -8409683 -7916811
2846 -7916811 -7803203 -7967534 -8701782 -10659679 -13105428 -13646989 -11137162 -7604224 -5706395
$$ packed form
2909E077982n258876m021335j009061j9547j619765k574567j346377k38218q48124
2900a1857888j119998Q22469K944496K407730L20710J7173J716597K391684Q26465
2891a530562n18783M56803K303773K350683L68961j689250k450320k169479j684202
2882d562376j414561j057353J76681K355275L761931K435951p99148k649448j601738
2873c354786J60860M90755N52788J957054K836101M39989l531164m413792j438407
2864f300602J033335K0917k282284k832236k044568j330517K62054L560075N884084
2855d029742M012074p19782l778961l272295j337725j62039K98971N79816M92872
2846g916811J13608j64331p34248j957897k445749n41561K509827L532938J897829
$$ plain form
2837 -5706395 -5387472 -4876803 -4011922 -4255137 -5689705 -6304826 -4815869 -2587050 -1964447
2828 -1964447 -3532352 -5487923 -5335919 -2304503 1469872 2652135 316168 -2794924
2820 -2794924 -3569521 -2318756 -1880652 -3521464 -5490697 -5624759 -3767774 -1324210 284095
2811 284095 441305 -233962 -105636 1750893 4039105 4729819 4032981 4260900 6352468
2802 6352468 8188523 7234187 3602210 -476675 -3273867 -4641860 -5079607 -4702860 -3216375
2793 -3216375 -771883 1127548 312112 -3455924 -7128986 -7194613 -3719191 42571 1849277
2784 1849277 2087771 1186236 -1458236 -4663546 -4673162 153652 5907336 7386353 4499627
2775 4499627 1334575 -260867 -2542006 -7144417 -12026468 -14392041 -13929690 -11587338
$$ packed form
2837e706395L18923N10669Q64881k43215j434568o15121J488957K228819O22603
2828a964447j567905j955571J52004L031416L774375J182263k335967l111092
2820b794924p74597J250765M38104j640812j969233j34062J856985K443564J608305
2811B84095J57210o75267J28326J856529K288212O90714o96838K27919K091568
2802F352468J836055r54336l631977m078885k797192j367993m37747L76747J486485
2793c216375K444492J899431q15436l768036l673062o5627L475422L761762J806706
2784A849277K38494r01535k644472l205310r616M826814N753684J479017k886726
2775D499627l165052j595442k281139m602411m882051k365573M62351K342352
$$ plain form
2767 -11587338 -7514254 -2270370 1773920 2756230 2108582 2722973 4853946 6158238 5707698
2758 5707698 5436700 6778478 8021829 6650493 3071368 261295 232258 2367092 4964996
2749 4964996 6839289 7330588 6442570 5565918 6516249 8853909 9613962 7222247 4419697
2740 4419697 4997040 8124783 8706112 4013746 -2595007 -6090417 -5723580 -4321832 -3292274
2731 -3292274 -1537031 932061 1648535 -785910 -4185907 -5519874 -4622518 -3461577 -2969925
2722 -2969925 -2623374 -2362022 -2683338 -3039613 -2359879 -1352994 -2030225 -4307568 -5415020
2713 -5415020 -3909676 -2007258 -2042793 -2730977 -1685816 -40314 -877007 -3539914 -3664380
2704 -3664380 81890 3067389 780789 -4944777 -8570587 -7807536 -5046736 -3163655
$$ packed form
2767a1587338M073084N243884M044290R82310o47648O14391K130973J304292m50540
2758E707698k70998J341778J243351j371336l579125k810073k9037K134834K597904
2749D964996J874293M91299q88018q76652R50331K337660P60053k391715k802550
2740D419697N77343L127743N81329m692366o608753l495410L66837J401748J029558
2731c292274J755243K469092P16474k434445l399997j333967Q97356J160941M91652
2722b969925L46551K61352l21316l56275O79734J006885o77231k277343j107452
2713e415020J505344J902418l5535o88184J045161J645502q36693k662907j24466
2704c664380L746270K985499k286600n725566l625810P63051K760800J883081
$$ plain form
2696 -3163655 -2947568 -4104122 -5861111 -6537984 -5029278 -2925765 -2892132 -4735100 -5428152
2687 -5428152 -3454315 -708196 703139 1207970 2099100 3113719 3180551 2140962 435510
2678 435510 -1635206 -3200974 -2753178 -95468 2798440 4097006 4143788 4024934 3435683
2669 3435683 1482466 -1454457 -4183239 -6078541 -6545948 -4305773 718880 5471627
2661 5471627 6036544 2091101 -2507718 -3875199 -1683829 1433782 2842225 1983979 352987
2652 352987 -318914 -81968 -577807 -2548610 -4546397 -4944668 -4097460 -3187578 -1986517
2643 -1986517 425829 3338541 4805097 4253674 2958665 1934567 1105899 705789 1656596
2634 1656596 3922905 5891554 6130612 4852850 3260856 2394233 2875907 4649761 6391650
$$ packed form
2696c163655K16087j156554j756989o76873J508706K103513L3633j842968o93052
2687e428152J973837K746119J411335N04831Q91130J014619O6832j039589j705452
2678D35510k070716j565768M47796K657710K893908J298566M6782j18854n89251
2669C435683j953217k936923k728782j895302m67407K240175N024653M752747
2661E471627N64917l945443m598819j367481K191370L117611J408443q58246j630992
2652C52987o71901K36946m95839j970803j997787l98271Q47208R09882J201061
2643a986517K412346K912712J466556n51423j295009j024098q28668m00110R50807
2634A656596K266309J968649K39058j277762j591994q66623M81674J773854J741889
$$ plain form
2625 6391650 6033141 2586043 -2736284 -7292394 -8786045 -6882103 -3744884 -2369432
2617 -2369432 -3525284 -5079845 -5310294 -5624041 -8112951 -11464580 -12123385 -9497142 -7112489
2608 -7112489 -7700548 -9632166 -9718343 -7601220 -5460964 -4494675 -3602417 -1374791 1861157
2599 1861157 4204161 4036951 1744595 -578473 -1469271 -1601928 -2226623 -3045357 -3181042
2590 -3181042 -3423920 -5159226 -7240319 -6629162 -2774341 1115439 2177799 1074916 -57536
2581 -57536 -643469 -1166023 -1547261 -1688296 -2130959 -2774771 -2441461 -969675 -6111 -408032
2571 -408032 -896982 -837457 -1899293 -4682952 -6188719 -3894739 -470754 -537369 -3700538
2562 -3700538 -4932569 -1884223 2170704 3558971 2808796 2415393 2846621 2854423 1920992
$$ packed form
2625F391650l58509l447098n322327m556110j493651J903942L137219J375452
2617b369432j155852j554561k30449l13747k488910l351629o58805K626243K384653
2608g112489n88059j931618q6177K117123K140256R66289Q92258K227626L235948
2599A861157K343004j67210k292356k323068q90798j32657o24695q18734j35685
2590c181042k42878j735306k081093O11157L854821L889780J062360j102883j132452
2581e7536n85933n22554l81238j41035m42663o43812L33310J471786R63564m01921
2571d08032m88950N9525j061836k783659j505767K293980L423985o6615l163169
2562c700538j232031L048346M054927J388267p50175l93403M31228P802r33431
$$ plain form
2553 1920992 520806 -756313 -798218 2078702 8010540 14069370 16469506 14235390 9735147
2544 9735147 5805603 3324343 1618765 253805 -336030 163216 1062451 1385209 1235418
2535 1235418 1612638 2775498 3829765 4370204 5301311 7054316 8059869 6411760 2519640
2526 2519640 -1127781 -2451446 -1110967 1826345 4258257 3952862 796168 -2353737
2518 -2353737 -2721013 -1060332 -299313 -1270268 -2037230 -1396650 -551528 -583338 -383429 1599676
2508 1599676 4800980 6886763 6142479 3037602 -202054 -1673799 -1897168 -3140033 -5884302
2499 -5884302 -7323094 -5076572 -1044832 948124 307226 -643418 -1429170 -4007817 -8297664
2490 -8297664 -11125798 -10833234 -9282743 -7768283 -4650366 749817 5407321 6569689
$$ packed form
2553A920992j400186j277119m1905K876920N931838O058830K400136k234116m500243
2544I735147l929544k481260j705578j364960n89835M99246Q99235L22758j49791
2535A235418L77220J162860J054267N40439R31107J753005J005553j648109l892120
2526B519640l647421j323665J340479K937312K431912l05395l156694l149905
2518b353737l67276J660681P61019r70955p66962O40580Q45122l1810J99909J983105
2508A599676L201304K085783p44284l104877l239656j471745k23369j242865k744269
2499e884302j438792K246522M031740J992956o40898r50644p85752k578647m289847
2490h297664k828134K92564J550491J514460L117917N400183M657504J162368
$$ plain form
2482 6569689 5560494 4714555 3364891 231936 -2822548 -3399974 -2930731 -4247036 -6304068
2473 -6304068 -5796387 -3110632 -1912172 -2890918 -2631048 551737 3979061 5044024 4290806
2464 4290806 2514872 -1258774 -6559783 -9685689 -8212728 -4950045 -4395496 -6893174
2456 -6893174 -9034510 -8475113 -5614612 -1619467 2204388 3529203 602548 -4684308
2448 -4684308 -7723472 -6283959 -3097756 -2236089 -4067388 -5264200 -3444066 -232079
2440 -232079 1116213 251228 149794 2554853 4887323 3693961 117999 -1073044 1691403
2431 1691403 4052134 1643623 -3625417 -5954911 -3100157 1428538 3306755 1834253
2423 1834253 -981610 -3330634 -4362753 -3747071 -2106656 -1199014 -2302708 -4514475 -5531114
$$ packed form
2482F569689j009195q45939j349664l132955l054484n77426M69243j316305k057032
2473f304068N07681K685755J198460r78746K59870L182785L427324J064963p53218
2464D290806j775934l773646n301009l125906J472961L262683N54549k497678
2456f893174k141336N59397K860501L995145L823855J324815k926655n286856
2448d684308l039164J439513L186203Q61667j831299j196812J820134L211987
2440b32079J348292q64985j01434K405059K332470j193362l575962j191043K764447
2431A691403K360731k408511n269040k329494K854754M528695J878217j472502
2423A834253k815863k349024j032119O15682J640415R07642j103694k211767j016639
$$ plain form
2414 -5531114 -4207050 -1739530 -140039 -27180 -430075 -580638 -1001987 -2219718 -3160524
2405 -3160524 -2256773 -140905 437221 -1782601 -4434731 -4328412 -1418680 1542688 2624531
2396 2624531 2203257 1138178 -504475 -2392825 -3178468 -1747041 1530510 5263800 8077903
2387 8077903 9001541 7721783 4801717 1030477 -3369600 -8012845 -11188871 -11040669 -8086248
2378 -8086248 -4908661 -2933803 -1338552 217529 68693 -2690749 -5878539 -6860190 -6193835
2369 -6193835 -6285437 -7322056 -7146034 -4869009 -2068772 -222068 724893 835899 -466656
2360 -466656 -2767395 -4426463 -4925631 -5563127 -6797576 -6905890 -4774775 -2242137 -1755385
2351 -1755385 -3032801 -4088715 -4533229 -5530105 -6950960 -6982046 -4900697 -2422670 -1709977
$$ packed form
2414e531114J324064K467520J599491J12859m02895j50563m21349j217731r40806
2405c160524R03751K115868N78126k219822k652130J06319K909732K961368J081843
2396B624531m21274j065079j642653j888350p85643J431427L277551L733290K814103
2387H077903R23638j279758k920066l771240m400077m643245l176026J48202K954421
2378h086248L177587J974858J595251J556081j48836k759442l187790r81651O66355
2369f193835r1602j036619J76022K277025K800237J846704R46961J11006j302555
2360d66656k300739j659068m99168o37496j234449j08314K131115K532638M86752
2351a755385j277416j055914m44514r96876j420855l1086K081349K478027P12693
$$ plain form
2342 -1709977 -3239805 -5874146 -7781217 -7085906 -3053851 2731680 7400466 9551296
2334 9551296 10158980 10509345 10512376 9808866 9372776 10630189 13261463 15008756 14002935
2325 14002935 10830295 7934443 6957520 6952576 5707352 2810548 425648 375314 1527505
2316 1527505 1477322 74060 -738099 -467115 -1072389 -3593889 -5927536 -5543185 -2937138
2307 -2937138 -598681 426938 1030079 1727827 1958869 1746746 2227191 3921243 5772852
2298 5772852 6626788 6835310 7757821 10163264 13531774 16487962 17576324 16028471 12308095
2289 12308095 8020512 5156214 5044215 7403140 10250086 11475296 11011706 10754680 11689338
2280 11689338 12012865 9355866 4278812 -28404 -1448598 -803532 127440 812371 1593647
$$ packed form
2342a709977j529828k634341j907071O95311M032055N785531M668786K150830
2334I551296O07684L50365L031p03510m36090J257413K631274J747293j005821
2325A4002935l172640k895852r76923m944j245224k896804k384900n0334J152191
2316A527505n0183j403262q12159K70984o05274k521500k333647L84351K606047
2307b937138K338457J025619O03141O97748K31042k12123M80445J694052J851609
2298E772852Q53936K08522R22511K405443L368510K956188J088362j547853l720376
2289A2308095m287583k864298j11999K358925K846946J225210m63590k57026R34658
2280A1689338L23527k656999n077054m307216j420194O45066R30972O84931P81276
$$ plain form
2271 1593647 2595348 3959469 6033148 8310564 9215146 8126098 6765727 7156947 8738359
2262 8738359 9016904 6864812 3615812 791997 -1612496 -3910661 -5184528 -4214798 -1341015
2253 -1341015 1703471 3602813 4262292 3995521 2930914 1500744 662585 875204 1107117
$$ packed form
2271A593647J001701J364121K073679K277416R04582j089048j360371L91220J581412
2262H738359K78545k152092l249000k823815k404493k298165j273867R69730K873783
2253a341015L044486J899342O59479k66771j064607j430170q38159K12619K31913
$$ [...]
##END NTUPLES=NMR SPECTRUM
##END=
