##TITLE=31Pdec_DE-97rm_3h
 , 64 sc
 23.6.2025
##JCAMPDX= 6.0         $$ Bruker NMR JCAMP-DX V2.0
##DATA TYPE= NMR SPECTRUM
##DATA CLASS= NTUPLES
##ORIGIN= UXNMR, Bruker Analytische Messtechnik GmbH
##OWNER= root
$$ XWIN-NMR		Version 3.5
$$ Mon Jun 23 14:21:11 2025 Russian Standard Time (UT+4h)  she@DPX200
##.OBSERVE FREQUENCY= 81.013821
##.OBSERVE NUCLEUS= ^31P
##.ACQUISITION MODE= SIMULTANEOUS
##.ACQUISITION SCHEME= undefined
##.AVERAGES= 64
##.DIGITISER RES= 17
##SPECTROMETER/DATA SYSTEM= spect
##.PULSE SEQUENCE= zgpg30
##.SOLVENT NAME= CDCl3
##.SHIFT REFERENCE= (INTERNAL, CDCl3, 0, 198.062)
##AUDIT TRAIL= $$ (NUMBER, WHEN, WHO, WHERE, WHAT)
$$ ##TITLE= Audit trail, XWIN-NMR		Version 3.5
$$ ##JCAMPDX= 5.01
$$ ##ORIGIN= Bruker BioSpin GmbH
$$ ##OWNER= she
$$ F:/spectra/data/she/nmr/P31/2/pdata/1/auditp.txt
$$ ##AUDIT TRAIL=  $$ (NUMBER, WHEN, WHO, WHERE, WHAT)
(   1,<2025-06-23 14:19:59.32 +0400>,<she>,<DPX200>,
      <created by zg, POWCHK disabled, PULCHK disabled
       configuration hash MD5:
       00 E9 B6 7A A2 85 ED C7 34 08 36 98 17 FE 4E 26
       data hash MD5: 32K
       87 56 C5 8A 5F 68 D8 E6 9C 26 B6 BC D7 D3 3E 35>)
(   2,<2025-06-23 14:20:01.92 +0400>,<she>,<DPX200>,
      <Start of raw data processing
       efp BC_mod = 2 LB = 1.5 FT_mod = 6 PKNL = 1 PHC0 = 1691.422 PHC1 = -736.3068 SI = 64K 
       data hash MD5: 64K
       37 A6 FF 1D FC A0 C3 C5 3F 13 1C BF 9B DB CF F4>)
(   3,<2025-06-23 14:20:30.43 +0400>,<she>,<DPX200>,
      <pk PHC0 = -29.6071 PHC1 = 0 
       data hash MD5: 64K
       60 A3 DD 5E 9D D5 26 62 6E 4A 33 97 84 FF 53 BA>)
(   4,<2025-06-23 14:20:35.90 +0400>,<she>,<DPX200>,
      <abs ABSG = 5 
       data hash MD5: 64K
       49 25 D8 0C A9 FD 4B 18 2E B1 91 F8 3D A7 3C F9>)
$$ ##END=
$$ 
$$ hash MD5
$$ EE 30 C2 DD 6D B9 B0 87 85 FF 75 5D 6A 10 F2 4C
##$RELAX= 
##$RELAX= 
##$RELAX= 
##$RELAX= 
##$RELAX= 
##$RELAX= 
##$RELAX= 
##$RELAX= 
$$ Bruker specific parameters
$$ --------------------------
##$DU= <F:/spectra>
##$EXPNO= 2
##$NAME= <P31>
##$PROCNO= 1
##$TYPE= <nmr>
##$USER= <she>
##$AMP= (0..31)
100 100 100 100 100 100 100 100 100 100 100 100 100 100 100 100 100 100 
100 100 100 100 100 100 100 100 100 100 100 100 100 100 
##$AQSEQ= 0
##$AQ_mod= 1
##$AUNM= <au_zg>
##$AUTOPOS= <>
##$BF1= 81.014009
##$BF2= 200.13
##$BF3= 200.13
##$BF4= 200.13
##$BF5= 200.13
##$BF6= 200.13
##$BF7= 200.13
##$BF8= 200.13
##$BYTORDA= 1
##$CFDGTYP= 0
##$CFRGTYP= 5
##$CHEMSTR= <none>
##$CNST= (0..31)
1 1 145 1 1 1 1 1 1 1 1 1 1 1 1 1 1 1 1 1 1 1 1 1 1 1 1 1 1 1 1 1 
##$CPDPRG= <waltz16>
##$CPDPRG1= <>
##$CPDPRG2= <waltz16>
##$CPDPRG3= <>
##$CPDPRG4= <mlev>
##$CPDPRG5= <mlev>
##$CPDPRG6= <mlev>
##$CPDPRG7= <mlev>
##$CPDPRG8= <mlev>
##$CPDPRGB= <>
##$CPDPRGT= <>
##$D= (0..31)
0 1 0 0 0 0 0 0 0 0.06 0 0.03 2e-05 3e-06 0 0 0.0002 0 0 0 0 0 0 0 0 0 
0 0 0 0 0 0 
##$DATE= 1750673998
##$DBL= (0..7)
120 120 120 11 120 120 24 19 
##$DBP= (0..7)
150 150 150 150 150 150 150 150 
##$DBP07= 0
##$DBPNAM0= <>
##$DBPNAM1= <>
##$DBPNAM2= <>
$$ [...]
##$SUBNAM4= <"">
##$SUBNAM5= <"">
##$SUBNAM6= <"">
##$SUBNAM7= <"">
##$SUBNAM8= <"">
##$SUBNAM9= <"">
##$SW= 400.765351723535
##$SWIBOX= (0..15)
0 1 3 0 0 0 0 0 0 0 0 0 0 0 0 0 
##$SW_h= 32467.5324675325
##$TD= 32768
##$TD0= 1
##$TE= 0
##$TE2= 300
##$TE3= 300
##$TEG= 300
##$TL= (0..7)
0 120 53 12 22 120 120 120 
##$TP= (0..7)
150 150 150 150 150 150 150 150 
##$TP07= 0
##$TPNAME0= <>
##$TPNAME1= <>
##$TPNAME2= <>
##$TPNAME3= <>
##$TPNAME4= <>
##$TPNAME5= <>
##$TPNAME6= <>
##$TPNAME7= <>
##$TPOAL= (0..7)
0.5 0.5 0.5 0.5 0.5 0.5 0.5 0.5 
##$TPOFFS= (0..7)
0 0 0 0 0 0 0 0 
##$TUNHIN= 0
##$TUNHOUT= 0
##$TUNXOUT= 0
##$USERA1= <user>
##$USERA2= <user>
##$USERA3= <user>
##$USERA4= <user>
##$USERA5= <user>
##$V9= 5
##$VALIST= <valist>
##$VCLIST= <CCCCCCCCCCCCCCC>
##$VD= 0
##$VDLIST= <DDDDDDDDDDDDDDD>
##$VPLIST= <PPPPPPPPPPPPPPP>
##$VTLIST= <TTTTTTTTTTTTTTT>
##$WBST= 1024
##$WBSW= 4
##$XGAIN= (0..3)
0 0 0 0 
##$XL= 0
##$YL= 0
##$YMAX_a= 51464
##$YMIN_a= -60551
##$ZGOPTNS= <>
##$ZL1= 120
##$ZL2= 120
##$ZL3= 120
##$ZL4= 120
##$ABSF1= 198.0616
##$ABSF2= -202.7028
##$ABSG= 5
##$ABSL= 3
##$ALPHA= 0
##$AQORDER= 0
##$ASSFAC= 0
##$ASSFACI= 0
##$ASSFACX= 0
##$ASSWID= 0
##$AUNMP= <proc_1d>
##$AZFE= 0.1
##$AZFW= 0.5
##$BCFW= 0
##$BC_mod= 2
##$BYTORDP= 0
##$COROFFS= 0
##$CY= -3
##$DATMOD= 1
##$DC= 0
##$DFILT= <>
##$DTYPP= 0
##$F1P= 0
##$F2P= 0
##$FCOR= 1
##$FTSIZE= 65536
##$FT_mod= 6
##$GAMMA= 0
##$GB= 0
##$INTBC= 1
##$INTSCL= 9.790993e-09
##$ISEN= 30
##$LB= 1.5
##$LEV0= 0
##$LPBIN= 0
##$MAXI= 10000
##$MC2= 0
##$MEAN= 0
##$ME_mod= 0
##$MI= 50
##$NCOEF= 0
##$NC_proc= -8
##$NLEV= 6
##$NOISF1= 182.463
##$NOISF2= 159.3651
##$NSP= 0
##$NTH_PI= 0
##$NZP= 0
##$OFFSET= 198.0616
##$PC= 4
##$PHC0= 1661.815
##$PHC1= -736.3068
##$PH_mod= 1
##$PKNL= yes
##$PPARMOD= 0
##$PSCAL= 0
##$PSIGN= 0
##$REVERSE= no
##$SF= 81.0140089999434
##$SI= 65536
##$SIGF1= 159.3651
##$SIGF2= -187.1042
##$SINO= 113.3802
##$SIOLD= 16384
##$SREGLST= <1H.CDCl3>
##$SSB= 0
##$STSI= 65536
##$STSR= 0
##$SW_p= 32467.5324675325
##$SYMM= 0
##$S_DEV= 0
##$TDeff= 32768
##$TDoff= 0
##$TI= <>
##$TILT= no
##$TM1= 0
##$TM2= 0
##$TOPLEV= 0
##$USERP1= <user>
##$USERP2= <user>
##$USERP3= <user>
##$USERP4= <user>
##$USERP5= <user>
##$WDW= 1
##$XDIM= 65536
##$YMAX_p= 419217961
##$YMIN_p= -356046481
$$ End of Bruker specific parameters
$$ ---------------------------------
##NTUPLES= NMR SPECTRUM
##VAR_NAME=  FREQUENCY,     SPECTRUM/REAL,   SPECTRUM/IMAG
##SYMBOL=    X,             R,               I
##VAR_TYPE=  INDEPENDENT,   DEPENDENT,       DEPENDENT
##VAR_FORM=  AFFN,          ASDF,            ASDF
##VAR_DIM=   65536,         65536,           65536
##UNITS=     HZ,            ARBITRARY UNITS, ARBITRARY UNITS
##FACTOR=    0.49542278885378, 1,            1
##FIRST=     16045.7642231865, 0,            0
##LAST=      -16421.768244346, 0,            0
##MIN=       -16421.768244346, -356046481,   0
##MAX=       16045.7642231865, 419217961,    0
$$ Real data points
##PAGE= N=1
##DATA TABLE= (X++(R..R)), XYDATA
$$ [...]
47865 -3253120 -2067233 -2084198 -3683648 -5349637 -5425945 -3771227 -1664607 -686156 -1565848
47856 -1565848 -3482883 -4687612 -4459009 -4068385 -4973754 -6544554 -6770194 -4967450 -2491208
47847 -2491208 -898176 -840520 -2715745 -6490527 -10155969 -10111789 -4661160 3481380 9301016
47838 9301016 9937224 6594244 2608886 335096 -314343 -803297 -1673946 -1718285 131145
47829 131145 2839517 4485868 4944657 5477642 5745714 3710541 -674743 -4191306 -4425100
47820 -4425100 -3016387 -2763593 -3307634 -2335416 156133 1712734 998520 -1180049 -4059250
47811 -4059250 -7284117 -9126154 -7402872 -2872420 939713 2120492 2067233 2086039 1330362
47802 1330362 -410618 -973473 740124 2183525 993652 -643547 1059068 5481383
47794 5481383 8371133 8200615 7736339 8606350 8187578 3954573 -1855256 -4629711 -3082560
47785 -3082560 -235008 649115 -891824 -3360993 -5406332 -6547520 -6796278 -6280825 -5211294
47776 -5211294 -4080911 -3620847 -4011621 -4182935 -2790008 -237405 1218489 113483 -2264072
47767 -2264072 -3544039 -3390122 -3774491 -6181093 -9531155 -11201641 -9578176 -5442059
47759 -5442059 -1254120 800147 361229 -1312283 -2941273 -4165806 -4825851 -4270044 -2286288
47750 -2286288 -132376 616667 172079 296373 1822909 3629307 4497043 4716961 4962334
47741 4962334 4647794 2786090 -17915 -1899095 -2140371 -2018740 -2849848 -4197109 -4691999
47732 -4691999 -3938068 -2789223 -2078951 -1885676 -2083271 -3007768 -5270580 -8987040 -13133853
47723 -13133853 -15660048 -14789484 -10867821 -6662167 -4908809 -5392758 -5343763 -3144656 -655702
47714 -655702 -874335 -3969881 -7058731 -7804296 -6688507 -5250746 -3676679 -1483541 375247
47705 375247 -42355 -2992150 -6197445 -7196966 -5671548 -3037507 -659759 797364 926479
47696 926479 -446635 -2788731 -4950354 -5924168 -5412964 -3880654 -2365439 -2026910 -3320424
47687 -3320424 -5404151 -6618832 -5921754 -4036507 -2989688 -3986811 -5621916 -4998667 -1349642
47678 -1349642 2237887 2117297 -1205790 -3503802 -2311190 88466 314533 -1462692
47670 -1462692 -2655593 -2723482 -3674902 -6214554 -8127267 -7541688 -5921238 -6304226 -9373977
47661 -9373977 -12424576 -12069795 -7592266 -1851653 1139308 -50826 -3186386 -5366349
47653 -5366349 -6111156 -6320322 -5515750 -2627489 991915 2401791 1347406 661989 1463529
47644 1463529 1228843 -1561017 -4108290 -3411951 -996017 -132496 -533310 123797 837939
47635 837939 -1798522 -7465264 -11558582 -11766903 -11006721 -11959845 -12376617 -8674687 -1802116
47626 -1802116 3561539 4621316 2955374 1863861 2830520 4364358 3558259 -646984
47618 -646984 -5512707 -7092065 -5054176 -3009922 -3295961 -3772090 -1385884 3207696 6793638
47609 6793638 7781756 6849631 4608711 1341593 -1370937 -1324328 1648507 5303675 7358887
47600 7358887 6990548 4404859 648006 -2200464 -2312294 -51722 2218174 2318684 -207752
47591 -207752 -4008652 -6576056 -6063762 -3615381 -2620252 -4138237 -4640602 -660915 5604846
47582 5604846 8427369 5763552 1197567 -1311518 -1395819 -532464 368441 417410 -1420252
47573 -1420252 -4477537 -6623323 -7458651 -8806469 -10898471 -11102868 -8327030 -5613243
47565 -5613243 -5556828 -5727576 -2140162 4514481 9908485 12316561 13853701 15671298 15929832
47556 15929832 13528988 10523745 9158598 8874459 7977815 6478463 5482434 4951150 3739454
47547 3739454 1330248 -1574303 -3773526 -4210915 -2506421 528555 3448606 5595416
47539 5595416 7206160 7932624 6615327 3299798 147442 -908120 -409002 94275 766510
47530 766510 2774436 5258503 5403768 2270888 -1319852 -2108725 -473551 317400 -1664078
47521 -1664078 -5079515 -7546806 -8272206 -7948347 -7181685 -5962012 -4261300 -2482785 -1418817
47512 -1418817 -1840984 -3531045 -4582476 -2764399 1676788 5609840 6552606 5684961 5779635
47503 5779635 6953914 6787800 4599142 2946716 3896212 6067570 6985374 6551460 6230546
47494 6230546 6182255 5485049 4384218 3959498 3869265 2654023 248271 -2000109 -3984548
47485 -3984548 -7149314 -11437094 -14208813 -13564687 -10989365 -9120237 -8257343 -6861204
47477 -6861204 -4559967 -2674288 -1963564 -1501705 -61105 2367303 4532007 4750721 2145468
47468 2145468 -2003771 -4526341 -3317696 -89779 1115295 -1461418 -5257361 -6474642
47460 -6474642 -4176877 -531883 2126378 3215663 3150387 2034958 -203561 -2893092
47452 -2893092 -4576172 -4139320 -1920400 348159 766534 -1326011 -4868051 -7891557
47444 -7891557 -9027121 -8508242 -7769631 -7928214 -8660879 -8746486 -7628089 -5998029 -4666549
47435 -4666549 -3371310 -1299347 1375741 3154215 2692468 373780 -1789438 -1790129 671778
47426 671778 3805601 5150597 3855730 1629493 1001710 2560187 4441648 4749166 3780173
47417 3780173 3306448 4211737 5707675 6698764 7039965 7303733 7961553 8956227 9519660
47408 9519660 8368847 4873871 286938 -3065441 -4380154 -5417385 -8186103 -12201403
47400 -12201403 -15000965 -15042957 -13133344 -11197701 -10649960 -11873284 -14132279 -15696050
47392 -15696050 -15019023 -12291195 -9221741 -7090033 -5720294 -4439640 -2951407 -886423
47384 -886423 2267047 5905245 7913929 6630122 2781971 -1223124 -3395248 -3029522
47376 -3029522 -530218 2524762 3933398 2763958 233456 -2241788 -4894271 -8122941
47368 -8122941 -10415208 -10110179 -8571866 -8707876 -10224492 -9517290 -5276492 -1081612 -509829
47359 -509829 -2394074 -3575725 -4076082 -6006770 -8635235 -8617768 -5378987 -2694979 -3767935
47350 -3767935 -7436893 -10537866 -11535803 -10235838 -6300706 -501259 4011263 4292132
47342 4292132 1057367 -2326546 -3878168 -4250535 -4382118 -4000477 -2711009 -894558 870143
47333 870143 1950947 1113069 -2531532 -7571088 -10917759 -11169964 -9928206 -8898402 -7293753
47324 -7293753 -3675137 756678 2782473 1072471 -2013242 -2960624 -723957 2335758
47316 2335758 2681052 -1088058 -6672591 -10036063 -9266500 -6013479 -2820070 -179876
47308 -179876 2683900 5187524 5445611 2869099 -883268 -3750583 -4801354 -3897218 -1396813
47299 -1396813 1335896 2524510 1858868 872735 952214 1897412 2835833 3422200 3544337
47290 3544337 2919937 1707718 635101 -70537 -965568 -2122151 -2682412 -2292635 -1857771
47281 -1857771 -2211969 -3169766 -4396385 -5702612 -5848909 -3099712 1754434 5024643 4611462
47272 4611462 2885481 2829473 3383044 1810722 -928867 -1327349 592334 684351 -3033859
47263 -3033859 -7407127 -9003710 -8538520 -8309099 -8065684 -6087185 -2411953 1605205 5577453
47254 5577453 9477334 11736442 10354218 5566023 -321198 -5346142 -8796132 -10480949
47246 -10480949 -10690015 -10295603 -9555269 -7590943 -4350907 -1855305 -1650763 -2224993 -1282301
47237 -1282301 421282 427200 -732354 351054 4485351 7676236 5966376 159934 -5922724
47228 -5922724 -9885784 -11518683 -10808059 -7726072 -3506025 -87834 1809264 2851700
47220 2851700 3571945 3890478 3879683 3635784 2382106 -911145 -5534307 -8699208 -7993811
47211 -7993811 -3882445 610634 2521998 1189206 -1673346 -3749026 -4035536 -3259671
47203 -3259671 -2717149 -3082766 -4360984 -6346878 -8557535 -10035171 -9937737 -8377029 -6231367
47194 -6231367 -4194945 -2532273 -1698266 -2402752 -4651918 -7201168 -8432664 -7591280 -4972435
47185 -4972435 -1416403 1771151 2759957 181623 -5199822 -10260196 -11788408 -9331013
47177 -9331013 -5623946 -4057389 -5740563 -8998219 -11438985 -12200000 -12176981 -12422464 -12740802
47168 -12740802 -12029073 -9876062 -7554054 -7149360 -9510710 -13085530 -15092881 -14111606
47160 -14111606 -11346088 -9032777 -7905900 -7010132 -5931917 -5809638 -7184284 -8049146
47152 -8049146 -5957657 -1824313 531039 -715453 -2923528 -2750474 -661491 396316
47144 396316 -274778 -406885 1219015 2687051 1942750 -96536 -1048451 -508804 -183618
47135 -183618 -925756 -1290256 444329 3705880 5860107 4945947 1687314 -1541618 -3409140
47126 -3409140 -4436710 -5062308 -4315112 -1540336 1700933 3308763 3683550 4948515 7174910
47117 7174910 7773904 5298028 1562833 -1179857 -3123800 -5440286 -7741092 -8876187
47109 -8876187 -8912265 -8488708 -7377267 -5455941 -3891988 -3480186 -3198877 -2659929 -4371898
47100 -4371898 -10286205 -17036621 -18615836 -14143162 -9247634 -8660067 -10922400 -12135576
47092 -12135576 -11550058 -10644419 -9190789 -5772488 -1164595 1934235 2325145 1052027
47084 1052027 -1019120 -3855425 -6325102 -6197808 -3168104 -54090 368575 -1424206
47076 -1424206 -2870796 -2743310 -1967895 -1540066 -1262289 -837517 -864322 -1840207 -2939620
47067 -2939620 -2971040 -2421110 -3327878 -6572676 -10135063 -10944499 -8166290 -3864515 -566953
47058 -566953 982060 1616814 2278793 3292636 4522411 5541966 5803792 5234459 4752384
47049 4752384 5643142 7948943 9781150 9077227 6238268 3982387 3741846 3284613 -328106
47040 -328106 -5979780 -9197112 -8055330 -5690151 -5455111 -6129718 -4477369 -702767 1875120
47031 1875120 1749801 584115 -171870 -851548 -1421692 -833215 603133 948315 -126129
47022 -126129 -383424 1390298 3359288 3817914 3917364 5055189 5690018 3472746 -796294
47013 -796294 -4016748 -4820438 -4366387 -3715901 -2864829 -2234157 -2798495 -4349937 -5416120
47004 -5416120 -5363922 -5172414 -5680759 -6264100 -5798793 -4201078 -2637798 -2578367 -4558287
46995 -4558287 -7480984 -9424070 -9505438 -8453426 -7067697 -5192400 -2967276 -1850467
46987 -1850467 -2990116 -5356210 -6929621 -7189372 -7028732 -6736453 -5642319 -3601270 -1464103
46978 -1464103 -92672 119928 -875308 -2309457 -2537567 -775253 1516926 2266734 1281705
46969 1281705 -318842 -2498641 -6177724 -10870343 -14408903 -15340565 -14112487 -11773525
46961 -11773525 -9089144 -7128031 -7014518 -8488207 -9951706 -10412626 -10360778 -10572002 -11221020
46952 -11221020 -12331272 -13907387 -15474500 -16604267 -17821782 -19671017 -21028964 -20009154
46944 -20009154 -16694513 -13346583 -11614382 -11062362 -10668341 -10073761 -8973238 -7003926
46936 -7003926 -4822723 -3709065 -3525294 -2625614 -381048 1738622 2231474 1316444 165907
46927 165907 -205330 905108 3149059 4471441 3257769 1136819 933646 1608547 -1142264
46918 -1142264 -7929879 -13153417 -12029341 -6983039 -3873580 -4469713 -6240842 -7404011
46910 -7404011 -8003193 -7406177 -5221278 -4169137 -7532668 -13407548 -15749759 -12227765
46902 -12227765 -7218245 -5441754 -6148330 -5827504 -3726389 -1885038 -1671719 -3023192
46894 -3023192 -5818372 -9461529 -11984275 -11952607 -10691745 -10322561 -10009457 -6797817 -539785
46885 -539785 4575854 4750971 1120140 -2030141 -2463364 -1615528 -1563275 -2423959 -3199170
46876 -3199170 -3509817 -3399757 -2487430 -632403 1106273 1453982 548301 -674004 -2386436
46867 -2386436 -5472135 -9071112 -10444515 -8179170 -4009115 -380023 2337982 4781909
46859 4781909 6106240 4687814 887539 -2820005 -4618236 -4885643 -4935962 -5538230 -6811752
46850 -6811752 -8356879 -9230150 -8807411 -7841806 -7651138 -8098417 -7521156 -5127247 -2524968
46841 -2524968 -2174494 -4690664 -8026438 -9134341 -6535983 -1729577 1966230 2365107
46833 2365107 156814 -2396598 -3858923 -4281699 -4400526 -5097625 -6822815 -8393491 -7291259
46824 -7291259 -2782156 1970289 2940696 169690 -2347800 -1655930 1374508 4286375
46816 4286375 5534543 4144319 -381045 -6245494 -9598610 -8543083 -5492613 -3885031
46808 -3885031 -3999552 -3855060 -2788628 -1770995 -1106226 -405114 -506248 -2817637 -6411290
46799 -6411290 -8058829 -6002350 -2036870 889743 1607666 487292 -2044714 -5324394
46791 -5324394 -7827864 -8262593 -6918042 -4926624 -2749035 -548553 564575 -534876
46783 -534876 -2656490 -2718572 465709 4040917 4120102 322603 -4067938 -6123709 -5872532
46774 -5872532 -4860951 -4052391 -4110459 -6107831 -10084402 -13573524 -13560625 -10175456 -6953783
46765 -6953783 -6831825 -8935494 -10029899 -8351995 -5172711 -2994029 -3062577 -4686382 -6325831
46756 -6325831 -6877035 -6055721 -4208113 -2270523 -1494440 -2266928 -3273718 -2968782 -1925144
46747 -1925144 -2073105 -3116213 -2002248 2403698 6347828 5634836 1418230 -1944970
46739 -1944970 -3745716 -7068708 -11815492 -12810908 -7425423 -879782 -13315 -4349028
46731 -4349028 -7545872 -6288491 -3388977 -2241484 -2300534 -1287978 1015289 2955695
46723 2955695 3503975 3244775 3482749 4819240 6166228 5489710 2365376 -842555 -1610122
46714 -1610122 -372552 543950 309783 -223019 -1186054 -3861575 -7957976 -11281152 -12757672
46705 -12757672 -13405057 -13591346 -12065046 -9125467 -8057041 -10976801 -15014291 -15298565
46697 -15298565 -10913563 -5588472 -3028459 -3785994 -6460712 -9520571 -11328233 -10401012
46689 -10401012 -7041779 -3840476 -3352521 -5351584 -6954126 -5561081 -1559709 1877019
46681 1877019 1728089 -1974081 -6055315 -6921327 -3493593 1945571 5328202 3832590
46673 3832590 -1511167 -6251857 -6555252 -2937534 780098 1795757 153832 -3288477
46665 -3288477 -8154553 -13048057 -15290121 -13932328 -11284018 -9660859 -8298902 -5582016
46657 -5582016 -2637002 -1863681 -2917316 -3313038 -2708170 -3368979 -6016041 -8278721 -8290480
46648 -8290480 -7175839 -6626292 -6304766 -5287784 -4202311 -4107488 -4578515 -4525275 -3848901
46639 -3848901 -2951268 -1811493 -952721 -1966194 -5233507 -8194699 -8004544 -5363547 -3662435
46630 -3662435 -4556184 -6401229 -7183499 -6974744 -6759105 -6402443 -5015653 -2707143 -977289
46621 -977289 -1267427 -3394489 -5616105 -6430004 -6080139 -5645525 -4931813 -2763804 276623
46612 276623 1404646 -657967 -3238531 -3095270 -1018358 -486675 -2418108 -4210179 -4138008
46603 -4138008 -3737574 -4783004 -6322860 -6277208 -4391878 -2199893 -1134397 -1672103 -3301194
46594 -3301194 -4577052 -4332991 -3440311 -4035029 -6400118 -8230490 -7840593 -6385501 -5779113
46585 -5779113 -6133709 -6656726 -7391411 -8304812 -8068797 -5708662 -2439449 -89919 1267737
46576 1267737 2366264 2649163 1299878 -555424 -970904 84595 1215739 2062397 2886291
46567 2886291 2406628 -1038581 -6210145 -9659279 -10050951 -9206100 -8426871 -6624539 -3173713
46558 -3173713 -108171 147894 -2339801 -5523463 -7349846 -6549120 -3211156 528401
46550 528401 1966715 731537 -1375994 -3681094 -7293975 -11627625 -13181118 -9821318
46542 -9821318 -4153728 -448781 221229 -124214 285195 1803655 4129563 6142015 6156230
46533 6156230 4168902 2444252 2022071 526577 -4001784 -8891056 -9757306 -6527675
46525 -6527675 -3074578 -1500689 -521927 488273 -234961 -3526131 -7450757 -10080645
46517 -10080645 -11431738 -11463093 -8923341 -3900153 792105 2697340 2468671 1917361 1134209
46508 1134209 -488149 -1860648 -1098727 1851149 5218068 7467442 7932507 6165017
46500 6165017 2375284 -1804281 -4492131 -5409990 -5490415 -5034491 -3628161 -1773942 -1118688
46491 -1118688 -2502399 -4624177 -5271073 -3622640 -1040349 379718 -82304 -1295873
46483 -1295873 -2037717 -2691729 -4373339 -6683356 -7785632 -7192159 -7078486 -9615682 -13671234
46474 -13671234 -15455096 -12539198 -6614765 -2137777 -2303221 -6026322 -8824060 -7192415
46466 -7192415 -2229097 1609519 1243043 -2408699 -6361034 -8616622 -8813595 -7386168
46458 -7386168 -5266322 -3565686 -2556378 -1558759 -386830 140233 -91085 501126 3207205
46449 3207205 6934102 9409108 9801656 8926701 7538951 5819098 4097115 2727657
46441 2727657 1446702 -144222 -1817012 -3249038 -4545145 -5251539 -3993397 -640310
46433 -640310 2243029 2134260 -32858 -1468808 -1941464 -3791931 -7490469 -10191166 -9697449
46424 -9697449 -7347431 -5625644 -5032406 -4778166 -4616450 -4255779 -2650331 163867 1885483
46415 1885483 654572 -2142233 -3864183 -4376702 -5304388 -6206661 -4633749 -476511 2657606
46406 2657606 1913853 -1037148 -2524240 -1728391 -910799 -1537397 -2466268 -2282510 -1603445
46397 -1603445 -2045859 -3846473 -5553660 -5807460 -4749575 -3759873 -4194010 -6207806 -8428026
46388 -8428026 -8940356 -7039720 -3942580 -1431907 -13426 1050631 2109576 2473734
46380 2473734 1654979 360449 -441159 -906671 -1986998 -3928610 -5768674 -6233541 -4647881
46371 -4647881 -1210907 2888928 5714104 5871712 4034982 2635030 3405373 5278075
46363 5278075 5166537 1172927 -4930668 -8714231 -7082216 -1427724 3532635 4241919
46355 4241919 1298636 -2013695 -3350788 -2884188 -1937058 -1094699 193683 2527205 5109587
46346 5109587 5571763 2063062 -4198985 -9517583 -11505487 -11182965 -10513280 -9497750 -7472568
46337 -7472568 -5818085 -6648481 -9347903 -11267207 -11851273 -13010508 -14835567 -14337824 -10159554
46328 -10159554 -5645843 -4784349 -7143010 -9333382 -9779159 -9305059 -8357858 -6728773 -5399377
46319 -5399377 -5705358 -6811307 -6640647 -5178915 -4154544 -3522459 -1441641 1692545 2575499
46310 2575499 -99665 -2949801 -2296342 918100 2973694 2462671 970366 -228116
46302 -228116 -1459649 -2943365 -4062044 -4448543 -4123307 -2676963 -28091 2133741 1601269
46293 1601269 -1383446 -4202497 -5318850 -5821480 -6780478 -7007361 -5039720 -2115760 -1197642
46284 -1197642 -3231847 -5926573 -6558629 -4948311 -3142697 -2872878 -4161705 -6345498
46276 -6345498 -9464941 -13626963 -17137751 -16769740 -11089744 -2845267 3403747 5829454
46268 5829454 6074120 5661344 3872026 26074 -4225807 -6688447 -7401607 -7713842 -7544189
46259 -7544189 -5822753 -3233026 -2016040 -2679168 -3170075 -2189555 -1261751 -2110346 -3681366
46250 -3681366 -3733642 -2412408 -2060413 -3579968 -4946700 -4020762 -1561696 -468038 -2516532
46241 -2516532 -6599888 -10073170 -11303979 -10709248 -9535781 -8085970 -5512446 -1262108
46233 -1262108 3739742 7526449 8504675 6489373 2746374 -943506 -3643042 -5691777
46225 -5691777 -7530973 -8622318 -8411359 -7823074 -8205146 -8851250 -7601501 -4499534 -2692690
46216 -2692690 -4422663 -8115418 -11098679 -13068083 -14423524 -13242100 -7652648 -402462
46208 -402462 3030825 1356530 -1090844 -775152 676699 152098 -2172198 -4194834 -5584977
46199 -5584977 -7363668 -9365815 -10564396 -10755629 -9959825 -7593053 -4287621 -2828538
46191 -2828538 -4683760 -7100870 -6646794 -4434322 -4433808 -7315660 -9710527 -9602209 -8737012
46182 -8737012 -9006381 -9917768 -10790143 -12228490 -13880874 -13653401 -11018154 -8569330 -8288231
46173 -8288231 -8524427 -6856107 -3987055 -2517296 -3438757 -5986965 -9356183 -12234174
46165 -12234174 -12131674 -7889341 -2051766 1558173 1928408 640630 -1164677 -3227031
46157 -3227031 -4779327 -5498818 -6921314 -9999523 -12167199 -10275121 -5935773 -4062988
46149 -4062988 -5947972 -7842185 -7164093 -5786393 -5452030 -4244285 -665597 2178956
46141 2178956 377735 -4737223 -8016008 -6989854 -3820941 -1391548 -348329 40665
46133 40665 382152 658976 -84369 -2850684 -6213773 -6419239 -2264294 1803751 757557
46124 757557 -3888881 -5922118 -3218439 -485869 -2237327 -6914136 -9961017 -9645587
46116 -9645587 -7472750 -5221031 -4026807 -4556137 -5675619 -4479311 -51984 4075165
46108 4075165 3754777 -400073 -3993915 -4583325 -3815256 -4022103 -5336793 -6694806 -7508150
46099 -7508150 -7516207 -6594799 -5410885 -4872093 -4411467 -2359792 1254397 3803464 3013926
46090 3013926 -401314 -4195086 -7539975 -11038212 -14456236 -16166669 -15044721 -11863012
46082 -11863012 -8567512 -6858635 -7426343 -9557990 -11127800 -9919583 -5890230 -1870210
46074 -1870210 -1201674 -4485595 -9073027 -11836212 -11923127 -10592167 -9112693 -7737340 -6520324
46065 -6520324 -6053209 -6914853 -8946727 -11404440 -13284241 -13258835 -10235721 -4879419 2591
46056 2591 1785020 749554 -413633 97045 1294400 1038109 -1364505 -4801660 -7888884
46047 -7888884 -9920926 -10531109 -9471710 -7227213 -5224575 -4558535 -4485739 -3035857 324884
46038 324884 3270547 2887714 -703327 -4094798 -4366149 -2241734 -882785 -2238553 -5317646
46029 -5317646 -7538229 -7038131 -4084990 -956108 -45780 -1378715 -2466354 -1439600
46021 -1439600 287519 -291330 -3749563 -7362373 -8465051 -7386134 -6474492 -7114244 -8398003
46012 -8398003 -8399639 -6425905 -4126220 -4089741 -6857514 -9839184 -10145200 -8041519 -6250567
46003 -6250567 -6109700 -6259105 -5432680 -4493036 -4515637 -4475836 -2662277 277274 1402132
45994 1402132 -1281163 -6559371 -11038322 -11894806 -8910264 -4584414 -2327281 -3987503
45986 -3987503 -8687626 -13662468 -15992678 -14246176 -9684396 -5775343 -5045094 -6082956
45978 -6082956 -5241383 -1885988 48764 -2780311 -8178623 -10917829 -9170436 -5865637
45970 -5865637 -4026838 -3703840 -4181019 -6327347 -10686656 -14910640 -15639986 -12703809 -9465659
45961 -9465659 -8636593 -9361408 -9341793 -8545983 -9074966 -11527497 -13385667 -12136765 -8893062
45952 -8893062 -7157279 -8131370 -9101626 -7297533 -3921369 -2812408 -5607884 -9718926
45944 -9718926 -11343179 -9486697 -6505643 -5231212 -6187906 -7606229 -7615638 -5861775 -3109304
45935 -3109304 -346367 984481 -953318 -6172933 -10960820 -10538173 -4495103 2281617
45927 2281617 5213843 4781429 4291777 4900755 5150529 4038203 1750028 -1955975 -7170919
45918 -7170919 -11722725 -12575246 -9942002 -7463490 -7443134 -8265084 -7560038 -5522132 -3598635
45909 -3598635 -2139991 -1324895 -2490966 -6077351 -9551422 -10042333 -8361763 -7816926 -9336676
45900 -9336676 -10528271 -9912566 -9338714 -10923928 -13726957 -15249918 -14889864 -13978711 -13113180
45891 -13113180 -11451570 -8771790 -6576196 -6379461 -7754223 -8847692 -8504105 -7311120
45883 -7311120 -6621328 -6949342 -7536180 -7447157 -6859392 -6900684 -8162902 -9883648 -10949777
45874 -10949777 -11160349 -10827141 -9685647 -7407599 -5020150 -4244651 -4957826 -4901636 -3009658
45865 -3009658 -1629020 -3678073 -8309913 -11351837 -10106833 -6190837 -3343293 -3576500
45857 -3576500 -5649114 -6400576 -3741480 676354 2326854 -1143572 -6385889 -7998629
45849 -7998629 -5221768 -2174736 -1484898 -1327429 98620 1004355 -596671 -3025421 -3564412
45840 -3564412 -2623880 -2127338 -1854213 -918298 -1009785 -4014314 -7643108 -7953536 -5664695
45831 -5664695 -5185558 -7229843 -7588000 -4605695 -2790966 -6124568 -11782975 -14140300
45823 -14140300 -12353152 -10318134 -10687059 -12278523 -12721725 -11003302 -7707697 -4668667
45815 -4668667 -3989366 -5897222 -8112752 -8480409 -7230998 -5490099 -3088916 247709
45807 247709 2760070 2044522 -1743084 -5793387 -7468895 -6029087 -2437424 917687
45799 917687 1168175 -2316062 -6457172 -7535814 -5576586 -4013506 -5113284 -7446491
45791 -7446491 -8071953 -5749815 -1710091 1536290 1899235 -682626 -4037953 -5946573
45783 -5946573 -6532973 -7640002 -9951526 -11886835 -11655936 -9534886 -7576407 -7417415 -8705993
45774 -8705993 -9661657 -9052761 -7249794 -5012186 -1971742 2418643 6805505 8737767
45766 8737767 7971532 7052495 7723547 8617849 7759905 5569539 3806718 3122536 3359934
45757 3359934 4693587 6467299 6388881 3258307 -605523 -2032937 -1083663 25996 1003815
45748 1003815 3394080 6864058 8870419 8387995 7083532 6095503 4240572 421139
45740 421139 -4278253 -7885191 -9313985 -8350723 -5698638 -3503904 -3767823 -5468334 -5262913
45731 -5262913 -2048761 1049569 503124 -3297840 -6788689 -7147311 -4423195 -809804
45723 -809804 1203571 745763 -647527 -836236 120299 119981 -1756949 -3757425 -4004706
45714 -4004706 -3131714 -3119912 -4296024 -4687223 -2308353 2343124 6038958 5334515 -94811
45705 -94811 -6878748 -11230120 -12111279 -10468672 -6913343 -2245443 853502 -271841 -4454088
45696 -4454088 -7410396 -6797774 -4402887 -2991540 -3426092 -5418604 -8438022 -10806866
45688 -10806866 -10404144 -7701562 -6054942 -7611195 -10707268 -12424166 -11845741 -9843169
45680 -9843169 -7814675 -7711657 -10824835 -15037909 -15756156 -11440038 -5964307 -3523534
45672 -3523534 -3550424 -3077870 -1857122 -1974305 -3767590 -5328646 -5642870 -5737749 -6802667
45663 -6802667 -8825837 -10765298 -11028700 -8768095 -5600932 -4359063 -4995275 -4087815 -250481
45654 -250481 2601226 174654 -6195172 -11631992 -13949388 -14359687 -13660701 -11768406 -10101594
45645 -10101594 -10307970 -10939746 -9278194 -6312372 -5890103 -8631180 -10694177 -9403141
45637 -9403141 -6348743 -3819105 -1829213 -252213 -472359 -2755530 -4579804 -3700454
45629 -3700454 -960814 1479442 2718043 2576244 751967 -1849518 -3001910 -2109131
45621 -2109131 -1420111 -2655220 -4356089 -4473699 -3764758 -4406568 -6618148 -8850182 -10279015
45612 -10279015 -11032436 -10790792 -9206506 -7185400 -6011629 -5706875 -5796852 -6950462 -9935387
45603 -9935387 -13352978 -14491794 -12695107 -10256099 -9462294 -9943554 -9552388 -7090137 -3519474
45594 -3519474 -731746 468900 963350 1868199 2925346 3036661 2194883 1730421 2307715
45585 2307715 2759018 1542148 -1444069 -4988965 -7610063 -7963322 -5366783 -894741
45577 -894741 2809504 3751106 2145065 -711790 -4140067 -7751927 -10358344 -10570422 -8323798
45568 -8323798 -4973295 -2033778 -278463 417794 881305 1768627 2489690 1762972 -355550
45559 -355550 -2175994 -2915475 -4187314 -7491179 -11258781 -12390814 -10436743 -8284143
45551 -8284143 -8401249 -10113965 -11355659 -11706148 -12403009 -13946439 -15029352 -14133002 -11504159
45542 -11504159 -9028748 -8264815 -9012555 -9976907 -10463479 -10904966 -11751714 -12428745 -11778454
45533 -11778454 -9401532 -6340403 -4377009 -4568589 -6446159 -8804533 -11091194 -13305978
45525 -13305978 -14501264 -12791283 -7978035 -3139631 -1844960 -4031999 -6270376 -6116934
45517 -6116934 -4567944 -3899466 -4706879 -5808314 -5872770 -4409214 -2009403 -80829 467811
45508 467811 477878 1535085 3679746 5321214 5471534 4652524 3511947 2190782 1238719
45499 1238719 1263075 1330905 -131803 -2283280 -2179686 784959 3321723 2790908 899857
45490 899857 705124 2044205 2590704 1866058 1306685 1251168 592323 -1004165 -2812048
45481 -2812048 -4491372 -5733028 -5199873 -2236924 957350 1562917 317377 691097 3747725
45472 3747725 6661104 7006564 5843974 5366003 5801397 6232985 6716580 7753030 8660924
45463 8660924 8126156 6015202 3573201 2055169 1846937 2644353 3862289 4887958 5229281
45454 5229281 4580528 3075503 1655682 1589766 3046617 4672050 5262150 5267776 5844309
45445 5844309 7087347 8151246 8363728 7191245 4152099 268598 -1490919 661493
45437 661493 4452169 6137871 5554093 5911907 8600904 11275187 11951013 12052945 13679722
45428 13679722 16120838 17187725 16541847 15756856 16059007 17650650 20428761 23837963
45420 23837963 26728513 28821662 31675998 36695526 42641938 46704940 47992025 48643707
45412 48643707 51347459 56750149 63441092 69572236 74242852 77961125 82003366 86915984
45404 86915984 91636461 94610351 95832072 97166092 100290393 104681138 108077920 108844399
45396 108844399 107474372 105792710 105282706 106563848 109783884 114352111 118308807 119268375
45388 119268375 116697725 112546763 109139600 107213736 106355789 106023621 105222473 102563779
45380 102563779 98194675 94706388 94390381 96210031 97213523 96412893 95332905 94985469
45372 94985469 94411818 92518355 89601922 86575936 83981700 81975786 80116657 77289527
45364 77289527 73192490 69535233 68034410 67590624 65621921 62062386 59496219 59008236
45356 59008236 58649868 56977568 55499799 56024922 57606258 57881133 56028779 52914609
45348 52914609 49520335 46571353 44704150 43893707 43555885 43806771 45412855 48012126
45340 48012126 49936084 50400302 50194638 49618030 47719091 44395017 41126175 38652482
45332 38652482 36151648 33775570 33403807 35351410 36960109 36358430 35036687 34588111
45324 34588111 33738108 31348545 29563405 30476190 32066949 31482825 30400850 32456609
45316 32456609 36455983 37177940 32948878 27679258 24621898 22555264 19636517 17053295
45308 17053295 16605638 17569574 18147502 17919211 17203725 16032207 15215435 16316119 18984619
45299 18984619 20333336 18632463 15745974 14162128 13512704 12165565 10638232 10832417
45291 10832417 12696024 14117801 13999532 13437562 13707839 14708077 15790327 16927947
45283 16927947 18475657 20358387 21864329 22083201 20641027 18185029 15884242 14303511
45275 14303511 13202565 12558894 13002554 14723793 16631161 17373746 16873116 16172701 15989983
45266 15989983 16087724 16024800 15834275 15646138 15108770 13846816 12513401 12574629 14363044
45257 14363044 15951966 15240256 13052075 12558096 15121889 18407743 19654217 19163361
45249 19163361 18912060 19158948 18690563 17587250 17219166 17624070 17214814 15393587 13468936
45240 13468936 12520475 12030800 11040259 9207901 6640579 4299256 4443980 8458299 13944624
45231 13944624 16424238 14734282 12359311 12239316 12739821 10780020 7029641 5342170
45223 5342170 7750708 12331060 15982896 17489187 17418473 16383728 14391426 11654803
45215 11654803 9322624 8781109 10064561 11500633 11424103 9818503 7894723 6886367
45207 6886367 7781933 10794770 13961995 14149814 11496485 10832483 15475947 21286575 21272097
45198 21272097 15407558 10815995 11843345 15457447 17939129 20118558 22743325 22368341
45190 22368341 17010266 11682719 12278252 16584733 17551687 13951715 11431681 13265197
45182 13265197 16417927 17960492 19581198 23164797 26421657 26233948 23433280 21179231
45174 21179231 20486957 20027669 19160544 18874580 20172106 22919575 25969682 27770094 27488903
45165 27488903 25909574 24467182 23445416 22247038 21123530 20833517 20625527 18780328
45157 18780328 15679332 14152735 15826154 18974250 20960084 20998722 19497710 16649745
45149 16649745 13238209 11271860 12044234 14476958 16701017 18309777 19823867 21015347
45141 21015347 21267791 20874659 20564185 20162305 18857610 16477010 13722874 11590163 11036441
45132 11036441 12364278 14292868 14706682 13212066 11897495 12533231 14097243 14332801
45124 14332801 12795423 10945424 10030549 10374715 12061471 14666680 16789918 17555453
45116 17555453 18279434 20863082 24625882 26683094 25826541 24160610 24081320 25229914 25552932
45107 25552932 24074378 21240342 17546902 13653066 11516070 13377926 18857634 24376359
45099 24376359 26657092 26254409 26636640 30129004 35773928 40914415 43485659 42524294
45091 42524294 38089166 31919930 27207587 26193895 28180187 30844694 32966919 34556070
45083 34556070 34877111 32467122 27641073 23263573 21872354 22868619 23419434 21601300
45075 21601300 18123788 15516920 15955990 19165620 22165572 21964307 18862121 16084526
45067 16084526 15757051 16603201 16487831 15795747 16659942 19611183 22791019 24410356 24472410
45058 24472410 23800340 22692899 21268734 20304376 20718437 22263298 23446571 23193413 22272961
45049 22272961 22325988 23338351 23063002 19743348 14552520 10075114 7145267 5075310
45041 5075310 4517184 7278768 12586033 16382022 16217499 14652089 15424679 17986482 18805370
45032 18805370 17054689 15483007 15443151 14479964 10372793 5137601 2856433 4651878
45024 4651878 7630778 8391410 6275127 3379704 2479744 5041382 10482740 16863218
45016 16863218 22159952 24828440 23680872 18474493 11224006 5914536 5409605 8402403
45008 8402403 10415885 8470771 4264133 2027476 3590811 6623657 7866544 6768317
45000 6768317 5027176 3728166 2703028 2265747 3384725 5566674 6457318 4734867
44992 4734867 2103014 1143742 2155923 3342955 3291349 2006348 224819 -970877 -396666
44983 -396666 2117677 5237844 7662998 9436814 10839483 11271788 10749856 11061400 13114005
44974 13114005 14257040 11290878 5784899 3022914 5119570 8481305 9343249 8604115
44966 8604115 9013711 10335498 10426601 9537205 10189149 13110043 16049133 16876183 15712060
44957 15712060 13700679 11703520 10779997 12035677 14904186 16960366 16634418 15119654
44949 15119654 14408932 14352359 13268278 11082380 9936874 11106595 12859654 12582479 10056239
44940 10056239 7182563 5100489 3464659 2564275 3898186 7543203 10749533 10927747
44932 10927747 8971980 7778908 8210326 8590763 7897139 7198653 7609574 8847067 10505496
44923 10505496 12908796 15633397 16707717 14668287 10557376 6787862 4669827 3862596
44915 3862596 3517441 3082272 2565949 2748242 4564632 7677687 10321879 11185731 10780121
44906 10780121 10366143 10302487 10170164 9887852 10013225 11355622 14471379 18665984 21376912
44897 21376912 20027455 15175477 10395913 8174749 7433601 6180764 4795000 4895218
44889 4895218 6461423 8313555 10416371 13276139 15625666 15254907 12184012 8841291
44881 8841291 6939663 6175837 6090661 6900756 7954219 7670212 6105582 5666831 7889824
44872 7889824 10975967 12009524 10595118 8872873 8607531 9570873 10462292 10393193 9600979
44863 9600979 9304628 10520986 12566073 13388270 12125874 10648347 11370530 13749694 14300971
44854 14300971 10642731 4643349 575178 382743 1888135 2103361 1180180 1682590 4444995
44845 4444995 7227387 8116827 8259878 9610714 11447563 11399659 9304349 7639939 7955373
44836 7955373 8953246 8756614 7458797 6585053 7047983 8204508 8321016 6142051 2934090
44827 2934090 2264146 5913290 10487065 10615078 5699064 732308 -309245 1066831
44819 1066831 1446990 603118 552210 1692755 2759927 3439536 4473123 5972404 7815759
44810 7815759 10803833 15137675 18614791 18839368 16637518 14785301 13923683 12582718
44802 12582718 10977816 11430075 14299492 16532302 15674599 13037333 11403558 11523292
44794 11523292 12420648 13498527 14576953 14984629 14262403 13077021 12191906 11215208 9478921
44785 9478921 7514192 6617326 7471179 9946211 13469368 16661923 17426750 14648953 9569643
44776 9569643 4744055 2043878 2118276 4759352 8631400 11307423 10961008 8071748 4815929
44767 4815929 3034289 3204525 4652003 6048074 6495468 6893308 9136768 12854380 14354837
44758 14354837 10896336 5182655 3025361 6441535 11514809 13731048 13043631 12305139
44750 12305139 12715956 12974760 12009470 10493570 9676582 9973726 10644087 9983313 6327396
44741 6327396 162447 -5018396 -5497480 -1276042 3963171 7135345 8688290 10707179
44733 10707179 13586216 15930427 16820039 16479108 15022377 12336255 9505402 8632428
44725 8632428 10220326 11914610 11129913 8212894 5648130 4571360 3683668 1785599
44717 1785599 -140091 -145786 2353158 6276651 10207459 13170435 14562507 14264502 12852920
44708 12852920 11194128 9839282 9039780 9032034 9926470 11603866 14017140 17114180 20062515
44699 20062515 21261527 19980510 17552593 16017454 15874429 16117211 16111429 16088388 15808232
44690 15808232 14342381 11840482 10233117 11182511 14159454 17475377 20432784 23272829
44682 23272829 25541709 26063323 24783832 23428995 23571700 24593427 24328917 21750730
44674 21750730 18532059 17526292 19607266 22408975 22785237 20478128 18547066 19788690
44666 19788690 23513658 26585372 26981223 25279968 23083748 21439536 21017779 22383063
44658 22383063 25095587 27268084 27071424 24619736 21796492 20258552 19977222 19667021
44650 19667021 18350935 16508393 15737653 17080629 19648230 21306257 20919620 19497949
44642 19497949 18789068 19120164 19153438 17692556 15277568 13715234 13953081 14598764 13205457
44633 13205457 9502991 6581653 7588598 11584146 14469288 14317372 13667896 15365859
44625 15365859 18199086 18820507 16563823 13609951 11040971 7843029 4165503 2510458
44617 2510458 4233438 7100278 8171542 7660771 8074504 10369309 12652516 12448103 9210040
44608 9210040 4843060 2249872 2699381 4241690 3782106 1097341 -854969 -375822 455254
44599 455254 -572004 -1841682 -475485 2559512 3447301 1386309 -39380 1920504
44591 1920504 5649741 8172186 9068070 9564410 9829854 9526273 9833813 12440052 16656520
44582 16656520 19474972 18989038 16636922 15454387 16632557 18366216 18113648 15570501
44574 15570501 12830290 11640598 11569770 11542995 11902217 13300824 14368726 12762570 8631151
44565 8631151 4889852 3484660 3301238 2551355 1376253 967165 1639068 2976990 4665707
44556 4665707 6146590 6645828 6461113 6953355 8415878 9451848 9463859 10063772 12619259
44547 12619259 15945699 18020858 18664323 18976896 19476363 20379871 22242964 24425945 24362692
44538 24362692 20609338 15589946 13133900 14142704 16630039 18804815 19723826 18111612
44530 18111612 13557745 8435340 5869390 5994758 6593838 6842359 7673648 8989669 9712983
44521 9712983 10487752 13031587 16564324 18156940 17111139 15721442 15064128 13526036
44513 13526036 10559813 8277558 7610228 6262411 2772434 -203189 775327 5340098
44505 5340098 10261707 13265393 14156159 14033208 15054858 18976706 24282983 26928048
44497 26928048 25519935 23223794 22730058 22450681 20339038 18278261 18933498 20696388
44489 20696388 19998546 17068721 15192938 15345430 15749642 16066451 17702334 20070959 20725823
44480 20725823 19591327 19222868 20335019 20844580 20081900 20067341 21378296 21560902 19516938
44471 19516938 18100654 20071533 24241283 27964754 30923694 33812050 35403756 33996989
44463 33996989 30603784 27908855 26586806 24969765 22108168 19115756 17373364 17004809
44455 17004809 17480763 18654191 20723563 23526082 26047298 26889441 25830230 24742239
44447 24742239 25872742 29069613 31898338 32716644 32251160 31864203 32064200 33464543 37215785
44438 37215785 42964813 47855854 49325690 48032391 46593050 46355790 46946030 48071468
44430 48071468 49830917 51610225 52596437 53584921 56730414 62937928 70387710 76041491
44422 76041491 78093225 76933995 74430079 72505809 72019328 72762482 74442995 77203080
44414 77203080 80838321 83964998 84706775 82464385 78891583 76863191 77963063 80736324
44406 80736324 82071638 80833510 79153470 79100944 79453740 77958714 75761642 76209626 79078488
44397 79078488 79857704 76414109 72785801 73478911 76796241 77547132 74608049 71642884
44389 71642884 70996311 71120602 70505825 70157066 70615367 69808341 66238871 62133128 60844788
44380 60844788 62292866 63272239 61673891 58268496 54498999 50700973 47170257 45207481
44372 45207481 45649080 47213036 47916548 47993608 49714305 53735341 57318069 57631026 55513854
44363 55513854 53747701 52354948 48685399 42596760 38206486 38599736 41445267 42505214
44355 42505214 41496645 41265794 42446474 42696429 41081729 39539438 39155371 38222839 35538292
44346 35538292 33022928 33091719 35238321 37156616 37828458 37542984 35985222 32576469 28440135
44337 28440135 26106103 26882381 29548596 31767020 32062045 30625035 29024836 28925367 30212690
44328 30212690 30632526 28348350 24738481 23290407 25312931 28084726 28302733 26432402
44320 26432402 26049067 29012747 33054790 34951191 34642133 34551284 35495888 35439156 32806081
44311 32806081 29202746 27543077 28541863 30428717 31470113 31403720 30779501 30300348 30750391
44302 30750391 32291489 33700122 33426448 31616642 30053517 29827536 30055959 29282612 27231496
44293 27231496 24674653 22349224 20622960 19640143 19085230 18095000 16118776 13981347
44285 13981347 13598985 16099277 20134804 22700533 22397882 21545034 23750799 29197394
44277 29197394 33900734 34497530 32204303 30566895 30651295 30569603 28999182 26776677 25040939
44268 25040939 23961008 23618596 24235133 25085306 24973871 24289675 24796773 26755737 28079451
44259 28079451 27218831 25098033 23058429 20670777 17272066 14364601 14439228 17768892
44251 17768892 21847858 23865964 22735298 19126566 14856456 12278710 13037496 16680255
44243 16680255 20771293 22828998 22371657 21078327 20783352 21434082 21687206 21582200 23164335
44234 23164335 27282207 31093781 30892121 26899065 22966731 21553478 21358058 20289268
44226 20289268 18336761 16624161 15779851 16250629 18182735 19971177 19132668 15923645
44218 15923645 13876002 15174623 17731985 18691666 18466941 18832183 19206737 18114067 16961099
44209 16961099 18796940 23645840 28160879 30006106 29953622 29487179 28865638 28031248 27265801
44200 27265801 26374344 24951089 23721915 23855180 24744748 24338376 21978109 19136474 17073850
44191 17073850 15655403 14850169 15350799 16938075 18022721 17716891 16861271 16218349 15188017
44182 15188017 13268314 11445703 11115922 12623719 15512084 18983600 21445800 21079731
44174 21079731 17979879 14613261 13105891 13097699 13221156 13387670 14166660 14979856 14788898
44165 14788898 14118156 14497747 15789792 15825376 13398190 10281533 9156473 10330607 11872728
44156 11872728 12768533 14286874 17419909 20281075 19784209 15673596 11181767 9327852
44148 9327852 10146828 12247552 15278757 19249925 22704017 23762188 22758023 22048496
44140 22048496 22992744 24386489 24157995 21777308 18879620 17919128 19732979 21992224
44132 21992224 21131109 16716430 12597178 12371917 15186444 17877396 19591862 21422557
44124 21422557 22697552 21403610 18277058 16774120 18131748 19737240 19638936 19597233 21858616
44115 21858616 25395795 27339215 26314836 22791260 17997089 14070255 13386019 15940079
44107 15940079 18882987 20010820 19916500 19403330 17323251 13291162 10285269 11412498
44099 11412498 15315691 17784067 17246923 15913399 15866041 16791354 17782143 18996966 20786518
44090 20786518 22666702 23745138 23400819 21671779 19763829 19639844 22032252 25306448
44082 25306448 27189078 26966908 25197923 22391743 19168775 16621308 15219676 14435281
44074 14435281 14527645 17027899 21886128 26050227 27054932 26254242 26007206 25555837 22919018
44065 22919018 19299642 17731341 18203651 18151423 17383692 18285396 20966082 22559699 22110419
44056 22110419 21878733 22579068 21645855 18085900 14877515 14102774 13640170 11649686 10473152
44047 10473152 12216110 13863266 11698397 8287879 9472577 15119250 18438821 15465731
44039 15465731 10513112 10127478 15079338 20869259 23841924 24145398 23845814 24502423 26415769
44030 26415769 28697714 29895328 29317867 27772405 26584722 26087903 25438440 23740709
44022 23740709 21080987 18593378 17629518 18635190 20656061 22038706 21761548 20228168
44014 20228168 18934653 19241455 21066422 22807605 23103687 22686919 23671718 26724245 29875084
44005 29875084 30770689 29275522 26981300 24817738 22313023 19092411 16175550 15494911
43997 15494911 18249591 23449825 28008942 29010952 26356497 22659267 20424559 20307255
43989 20307255 22177790 25951073 30283514 32427483 31408145 29940078 30796574 32396223
43981 32396223 31052472 27232213 26003660 30271722 36660504 39968495 39318966 37496230
43973 37496230 35859983 32952504 28017236 23419009 22544529 26215185 31736237 35175956
43965 35175956 34662707 31912487 30439751 32010462 35194596 37555567 38360878 38433501 38256280
43956 38256280 37531170 36239022 34800280 33202789 31245685 29898052 31100547 35350909
43948 35350909 40245366 42485597 41268532 38961144 38272818 39360819 40206419 39478649
43940 39478649 38069052 37405684 37173983 35917418 33594592 31983917 32141888 32978250 33282963
43931 33282963 33691540 35044769 35933283 34122443 30127836 27096405 26821133 28030589
43923 28030589 29318614 31467830 35327287 39263003 40969093 40887012 41577152 43902492
43915 43902492 45793125 45042373 41820508 38107667 35883254 36103774 38194897 40152680
43907 40152680 40233344 38900541 38093206 38429504 38572369 37859902 37905251 40331119 44066410
43898 44066410 46443526 46437426 45333861 44305276 42774670 39786452 36214199 34641201
43890 34641201 36664415 40543983 42329923 39993432 35915396 34206554 35923096 38444797
43882 38444797 39469083 39511122 39803053 39945138 39094085 37649549 36023866 33413526 29817073
43873 29817073 27599695 28441758 30121622 29524712 27947935 29587563 34658616 37982890
43865 37982890 35684982 29997586 25737492 24854037 26378940 29145891 32146851 34141163
43857 34141163 35234021 37238151 40429810 41855772 39349751 35403754 33987966 34901485
43849 34901485 34778589 32960923 32476057 34786721 37132816 36472758 33485348 31078147
43841 31078147 30695858 31543994 32328447 32700527 33611420 36450674 40975326 44509922 44810768
43832 44810768 43332766 43436584 45451748 46254765 44245349 41769639 41368900 42423013
43824 42423013 43238535 43831566 44411077 43455453 40063317 36512318 35671087 37150013 38668281
43815 38668281 39850941 41607956 42962190 42219684 40894790 42603493 47570310 51712215
43807 51712215 52054379 49894381 47661615 46018955 45545441 47818559 52402241 55548336
43799 55548336 54662178 51903833 50653540 50501457 48892152 46011550 44421079 44806999
43791 44806999 45664605 46648908 48617235 50559026 50358695 49011376 50108664 54006941
43783 54006941 56386002 54497994 51320778 51004511 53311186 55571502 57346833 59341042
43775 59341042 59716394 56007621 50112207 47120159 48689031 51102998 50784221 48633910
43767 48633910 47683883 49139404 52321016 56415476 60624928 64047879 66678273 69290459
43759 69290459 71686011 72853634 73566269 76345359 81320769 84578766 82957001 78566658
43751 78566658 75891165 75952026 76421645 76407417 77444145 79715778 80802771 79208080 76474876
43742 76474876 74706507 74288196 75168236 78040649 82637574 86724021 88523705 88713403
43734 88713403 88589771 87982531 86769520 86668084 89034951 92130749 93322039 93222717 94699169
43725 94699169 98126735 100927110 102169198 104164641 108172275 111711756 112343532 111567439
43717 111567439 112279776 114348027 115846112 117287141 120917890 126104741 129204512 128941092
43709 128941092 128734194 132061754 137994626 143340626 147315729 151634982 156874394 161119231
43701 161119231 162458494 161553494 161453241 165189605 173080143 182129871 188993442 193772185
43693 193772185 199417029 206955491 213659317 217471405 220798459 227129392 235605239 242383132
43685 242383132 246495189 250548759 255646634 259617241 261316488 262991647 266558803 270805627
43677 270805627 274790748 281263526 293353489 309268733 323397372 332144242 336299270
43670 336299270 338341145 340116735 343096974 348241214 354778690 360832181 365892060 371250741
43662 371250741 377427681 382647048 384982917 385222003 386398434 390443317 396015185 400133528
43654 400133528 401712427 402557320 404358837 405880357 404849653 402049215 400907934 402435631
43646 402435631 403248021 400199231 394609012 389594918 385125308 378698919 369934284 361413156
43638 361413156 355044564 350038185 344555555 337359322 327986389 317279642 307428486 299396932
43630 299396932 290914740 279645361 267791816 260129792 257249971 254466031 248515587 241687578
43622 241687578 237350674 234673846 230519610 224062222 216508253 208205738 199445838 192923915
43614 192923915 191618594 194052412 194775233 190494859 183509658 177972236 174507822 170095071
43606 170095071 162548968 153701455 147844626 147509107 151108726 154627596 155096405 152116651
43598 152116651 146877626 141143377 137089935 136258978 137704960 138382243 136389992 132935575
43590 132935575 130249242 128666186 126957166 124607939 122303120 120624414 119598212 119314196
43582 119314196 119877098 120838711 121527436 121780856 121649060 120673596 118242603 114530166 110584569
43573 110584569 107738954 107153219 109146822 112359637 114280043 113346791 110087345 106004293
43565 106004293 102554314 101690462 105361845 112527270 117970995 116774312 110025891 103988442
43557 103988442 103173938 106085326 108540668 109310439 110593097 113609218 116020288 114917587
43549 114917587 111318091 109696450 112527590 117018610 118829904 117812805 117602165 119873976
43541 119873976 121974468 121056179 117817488 114578952 112075404 110314343 110601439 113928298
43533 113928298 118422467 121052282 121424890 121787460 123833256 127624785 133041570 139742891
43525 139742891 145699879 148144262 146555834 143173235 140395531 139122703 139494823 141467270
43517 141467270 144424675 147650954 151277351 155593484 159760346 162581471 164049792 164627735
43509 164627735 163822404 161539307 160128873 162454046 167966710 173132284 175887027 177422710
43501 177422710 179564327 182906451 187751503 194230414 200934047 205872584 209315330 213239345
43493 213239345 217619381 220194960 220681069 222135294 226864205 233753156 240911573 247993840
43485 247993840 254385853 258344664 260185259 263372197 269781792 276494060 280213896 282437415
43477 282437415 286790766 293179057 298400832 301354469 303717502 305977769 306703395 306126820
43469 306126820 307025095 310988724 316361559 320950287 324742207 328851998 333375211 337483026
43461 337483026 340823737 344062898 348310814 353967954 359795099 363811371 365879508 368444354
43453 368444354 373483512 379718434 384513440 387714674 391551449 397106219 403011508 407751539
43445 407751539 411375653 414541376 417297532 419137272 419217961 416730111 412339019 408864962
43437 408864962 408730545 410665323 410673572 406640722 400563758 395908429 394105488 393985303 393318542
43428 393318542 390286245 384309728 376006053 366203032 355537548 345617574 339328391 338014334
43420 338014334 338609905 335546822 326063585 312596812 299933293 291123743 285998527 282252639
43412 282252639 277674274 272044302 266706707 261997705 256480977 249787515 244238871 241367910
43404 241367910 238523873 232110313 223154780 216029769 212058213 208345801 203255685 198915889
43396 198915889 197107117 196466624 195518297 195081311 195619631 195264902 192740830 189525254 186858372
43387 186858372 183367261 178216453 173925832 173037650 174272521 175131947 176074650 178420405
43379 178420405 179955426 177013504 170303458 164622549 162697371 162741869 162231278 160665820
43371 160665820 158107481 154303216 150340581 148478500 149160586 150290611 150228532 149391750
43363 149391750 148358479 146905863 145812922 146931213 149923481 151261241 148456451 143602080
43355 143602080 140696026 140668001 140998052 139413722 136075637 132448610 129560013 127391158
43347 127391158 125045468 121608297 117396245 113985199 112573927 112879954 113898532 114739782
43339 114739782 114313742 111671567 107760286 105577659 107089624 110788796 113671869 114790336
43331 114790336 115250438 115513713 114866331 113461122 112719644 113120352 113252266 111804186 109191191
43322 109191191 106615887 104915937 105050259 108059074 113144642 117116138 117593732 115992120
43314 115992120 115343379 115637251 113803792 108746355 103848943 102870794 105042461 106278905
43306 106278905 104338898 100645425 97351217 94889259 92879702 91479754 90817517 90517303
43298 90517303 90866448 93180723 97647076 101775049 102632566 100224143 97235814 95737228
43290 95737228 95590149 95868768 96029157 95382755 93277128 90679536 89931846 91551393 92594592
43281 92594592 90110515 85548024 83544685 86216382 90764035 93522237 94352996 95390512
43273 95390512 97013942 97638246 97104207 97511409 99862440 102138277 102178470 100699314 99568964
43264 99568964 98550859 96263557 93543762 92868131 94326175 95207736 94551179 95150828 99091707
43255 99091707 103713444 104871572 102919002 102384137 105858921 110838937 113206286 111933545
43247 111933545 109561462 109309421 112342732 116980226 120216964 120669410 119875319 119871204 120148703
43238 120148703 118687056 115710432 114208928 116156373 120092834 123267725 124426636 123539169
43230 123539169 120760947 117388166 116309163 119211521 123857735 126103566 124591493 121943219
43222 121943219 121355104 123484729 126820601 129645097 131089220 131344825 131511014 132581819
43214 132581819 134155557 134746993 133728561 132333353 132288538 133952108 136216412 137772298
43206 137772298 137989088 136997595 135565335 134674612 134550345 134141749 132258475 129384475 127622666
43197 127622666 128291869 130147882 130897575 130263703 130348371 132573962 135484545 136690331 136200103
43188 136200103 136203451 137622122 138665296 137604860 135535332 134867185 135740587 135690210 133192685
43179 133192685 130261660 130621168 135682516 142868218 147756476 147683641 143670054 139306554
43171 139306554 137598412 138492970 139540759 139100763 138341313 139426415 142298694 144687977
43163 144687977 145460348 146278941 148935945 152526380 154994045 156409196 158374045 160583672
43155 160583672 160700904 158082819 154961289 152963971 151248647 149713976 151058608 156675889
43147 156675889 162708570 164027809 161244353 160021644 163530771 169126339 172895631 174003747
43139 174003747 173471160 171849526 169836843 168830005 169238451 170068632 171199048 173883360
43131 173883360 177968672 181136149 182226386 182655458 183001148 181298087 177088027 174134965
43123 174134965 175857192 180372425 183531648 184860308 186626845 188613203 188263132 185499224
43115 185499224 183187582 182677520 182562868 182038399 181809097 181329882 179010643 176035327 176172723
43106 176172723 180260857 184139079 183804138 179910757 175694576 173233056 173322198 176092507
43098 176092507 179655115 180715328 178778840 177534676 179939510 184162644 186649410 186901666
43090 186901666 186564143 185899397 184366522 183245061 184399859 187173658 189347558 190579864
43082 190579864 192200888 194126372 194800129 194195017 194392200 196856499 200958763 205265016
43074 205265016 208758684 211070881 213001585 216238552 220999770 224904420 226113568 226446614
43066 226446614 228862405 232827932 235266519 235641023 236737266 240198163 244544094 248349361
43058 248349361 252388906 257521659 262958970 267757086 271904376 275180471 277221183 279303906
43050 279303906 283344052 288268543 290476386 289366411 289317359 294066912 301834740 308394088
43042 308394088 312410639 314923337 315878435 314708747 312932801 312651241 313171727 312314550
43034 312314550 310532095 310420304 312149143 312611130 309734117 304895977 300210149 295832210
43026 295832210 291016239 285778749 280315951 274395960 268372442 263279188 258851179 252894641
43018 252894641 243906141 233275595 223761254 216699251 211737566 208258226 205621920 202643977
43010 202643977 198373302 193318620 188708026 184509279 179369098 172884654 166878767 163505324
43002 163505324 162478003 161113963 157249491 151320623 145104642 139231474 133149985 127316306
42994 127316306 123678497 123004506 122870460 119912418 113981895 108820666 108209210 112040466
42986 112040466 116442891 117444826 114460861 110386621 108256994 108028157 107315233 105075133
42978 105075133 102907429 101996889 100733443 97282083 92992054 90409047 88574861 83800050
42970 83800050 75739600 69203071 67917629 69238848 67943719 63472771 59916034 59456731
42962 59456731 59666431 58237007 56985608 58698171 62046185 62810170 59724639 56149085
42954 56149085 55218984 55901883 55597919 54723423 55955708 59510405 62141065 61596883 59624276
42945 59624276 58966154 59205872 57775882 54192364 50992332 50391271 51727445 52675120 51931116
42936 51931116 50342814 49963850 51966950 55101525 56755127 56009627 54538031 53619608
42928 53619608 52012327 48724982 46194995 47509300 51173784 52324777 49451099 46207578
42920 46207578 45444234 45181568 42711606 39464617 38687855 40435217 42109953 42657468 43123126
42911 43123126 43859690 44175952 44483580 46097239 48807518 50913552 51772665 52222455 52346995
42902 52346995 50966776 47840123 44583766 42805582 42663894 43576177 45006833 46297793
42894 46297793 46986715 47469500 48213282 48470012 47162101 44829901 43077855 42271858 41608000
42885 41608000 41257761 42161445 43538689 43181648 40957851 39523685 40446178 42077545 42806556
42876 42806556 43958654 47206776 51082401 52895435 52995081 54172359 57098610 59054325
42868 59054325 57638455 53662135 49676662 47244831 46451837 46821037 47691805 48334063 48480434
42859 48480434 48529032 48891854 49416458 49716165 49920983 50850783 53138351 55886092 56645889
42850 56645889 53882492 49594333 47948521 50378710 53443935 53013979 49324998 45863791
42842 45863791 44276240 43268262 42389491 43399285 46461687 48049977 45382438 41136680
42834 41136680 40565201 44522088 48449317 48617797 46548016 46080074 48370420 51593489
42826 51593489 54053141 55539470 56411241 57288306 59329077 63032841 66803554 68343240
42818 68343240 67594184 66667229 66557350 65734829 62852994 59312731 57849964 59480155 62895361
42809 62895361 66104574 67710426 67330000 65766646 64243960 62891381 60929460 58871772
42801 58871772 58836363 61313025 63343731 62099013 59096148 58391119 61305406 65520819
42793 65520819 68873646 71108694 71973955 70890821 69256348 69939850 73145863 75517685
42785 75517685 74952011 73759116 75137734 78832686 82463494 85050507 86760231 87037859
42777 87037859 85825386 85161182 86524505 87715173 85748924 82308288 82653858 88636780
42769 88636780 95996345 99650653 99033065 96943980 95533810 95235819 96041189 97869435
42761 97869435 100268709 102907917 105869834 108843908 110856858 111454371 111343692 111369490 111885255
42752 111885255 113723567 118442821 126320132 134864921 140747231 143192556 144687847 148340514
42744 148340514 154895586 162023368 166187799 165745406 162783339 161521918 164349637 169735832
42736 169735832 174466130 177367337 180000914 183991547 188824536 192756881 195191890 197249149
42728 197249149 199966864 202780751 204422796 204832609 205118028 205652246 205580926 204879358 205544813
42719 205544813 209276873 214688530 218520624 219509694 219506611 220659962 223093303 225833324
42711 225833324 228428519 230581767 231321719 230000283 227865510 227536146 230581486 235922485
42703 235922485 240750071 243052701 243362002 243939064 246209974 249497075 252542241 255292480
42695 255292480 258094410 259954056 259455786 257415402 256792261 259379094 264012108 268651685
42687 268651685 272726766 276518452 279679506 281745667 283153617 284311748 284269945 281805631
42679 281805631 277711512 274719180 274804284 277223599 279416647 279388848 277013448 273280986
42671 273280986 268715790 263028854 256417640 250279167 245595894 241165083 234966543 227267396
42663 227267396 220667554 216617536 213631308 209869416 205806397 202769224 199976744 194989686
42655 194989686 186974760 178141876 171669800 168752500 167544726 164654984 158148977 149548026
42647 149548026 142435405 138879953 137907820 137412054 136080433 133020615 127402544 119811305
42639 119811305 112505864 106842234 101701621 95984853 91140474 89018291 88395192 86403512
42631 86403512 83018287 81271956 82586870 84392331 83392130 79364735 74606528 70988641
42623 70988641 68778054 67576225 67332949 68436733 70913949 73363396 73298625 69531137
42615 69531137 63828221 59047206 55989657 53447257 50877849 49061525 48049541 46649424
42607 46649424 44724893 44165902 46396791 50204631 53145152 54090906 53386708 51431259
42599 51431259 48330519 44590212 41283189 39515746 39759232 41202158 41861433 40213817
42591 40213817 36760356 33146940 30050656 27223097 25150938 24528646 23993280 21026615
42583 21026615 16096168 13298183 15080994 18505601 19071640 16582880 14531378 14794768
42575 14794768 15957050 16572973 17136849 18284635 19433710 20084685 20645959 21113669 20520113
42566 20520113 18571581 16379576 14595294 12235685 8684685 5730353 5884460 9053611
42558 9053611 12457009 14029405 14683196 16669250 20485632 24098763 24931647 22131747
42550 22131747 17067844 12119611 8980058 7591989 6461743 4374678 2055732 1619683
42542 1619683 3866981 6753787 7608727 6546592 6224293 8063564 10482883 11738764
42534 11738764 12659372 14629260 16099819 13903793 8205020 3540099 3668431 7151412
42526 7151412 9617298 9123807 7327763 6053040 5102445 3935343 3465511 4765723 7016256
42517 7016256 8232300 7676612 6283766 4818235 2982817 755967 -562250 425719
42509 425719 3385471 6340565 7491460 6736900 5684876 6151311 8026289 8713489 5864078
42500 5864078 927003 -1618682 517734 4622901 6829900 7078709 7936780 9839746
42492 9839746 10717382 9993470 9484299 9728303 8788111 6054741 4117696 4818728 6144614
42483 6144614 5536097 3962149 3747826 4242323 3149994 1047976 786302 2548990 3163289
42474 3163289 1056348 -1207490 -600064 2560146 5803056 7570329 7751903 6776522 5555378
42465 5555378 5200848 5687307 5690494 4502981 3128635 2905014 4101549 6212347 8215190
42456 8215190 8228820 4887118 -120955 -2967874 -2383567 -1293022 -2100747 -2709805 64416
42447 64416 4992805 7944146 8122919 8903144 12006491 14569433 13648554 10747884 9563603
42438 9563603 11128916 13560112 15334522 16357297 16427324 15123016 13328934 12819270 13816898
42429 13816898 14577229 13952873 12863869 12450886 12181384 10935466 8922017 7211893 6070200
42420 6070200 5051233 4206359 3802797 3253735 1970140 1173775 2976070 7194273 10907156
42411 10907156 12079839 11903604 12190393 12138268 9888349 6318511 4565387 5596096 6705015
42402 6705015 5398601 2864944 2058837 3506503 4720996 3464474 289721 -2175069
42394 -2175069 -1578344 2445647 7920943 11602031 11241884 7528226 3640017 2447379
42386 2447379 4037478 6048483 6241803 4460670 2242629 1200735 2116909 4863477
42378 4863477 8146727 9521393 7049180 1612715 -3284813 -4789450 -3226777 -919076
42370 -919076 564925 1129118 1152695 1220321 2336181 4927109 7788272 9278402 9366759
42361 9366759 9248802 9296835 8990973 8665885 9380820 10819406 11263989 10232482 9336216
42352 9336216 9832457 11154005 12659772 14732493 16819596 16560492 13020384 9199721
42344 9199721 8673283 10471920 10031057 5373333 -74934 -1808435 250953 2035471
42336 2035471 662950 -1830369 -903157 4598419 10372056 11676702 9294294 8099537
42328 8099537 10079368 12207241 12212746 12470705 15272757 17654519 15458436 10624398 9217167
42319 9217167 12546010 15450707 14325944 11843254 11517681 11996588 10137668 6628249
42311 6628249 4735620 5354901 6880226 8828786 12173882 16560687 20219113 22572476
42303 22572476 24383021 25424912 24593054 22449924 21106418 21101580 20763018 19268736 17913594
42294 17913594 17329478 15840975 12224214 8214021 6342102 6650784 7491981 8401274 9895363
42285 9895363 11188254 10846674 9901431 11656722 17191902 22938250 24384382 21163329
42277 21163329 16971809 15188247 16185964 18607547 21376997 23812846 25031865 24362702
42269 24362702 22161933 19771239 18678151 19506235 21309093 22081182 20845861 19185030
42261 19185030 19595717 22236814 24752756 25768336 26706377 28855782 30446737 28984387
42253 28984387 25555739 24051054 26022320 28893288 29977989 29846726 30340672 31401046
42245 31401046 32057107 33219273 36764114 41863015 44621109 42472842 37614299 34719787
42237 34719787 35678282 37811199 37518000 34613412 32037805 31736699 32440324 32135526 31204375
42228 31204375 31513121 33263903 34812856 35438729 36092004 36957370 36492043 34037670 31573979
42219 31573979 31352508 33103245 35080279 36667934 38244932 39436594 39447181 38669396 38202139
42210 38202139 37996919 37053962 35279444 33606491 32347705 30990087 29799061 30159000
42202 30159000 32727386 36061397 37509893 35313912 30281357 25761107 24922766 27122903
42194 27122903 28128295 25244544 20850032 19001284 20078388 21540881 22710363 24995412
42186 24995412 27600443 27287155 23530184 20079142 19555984 19925521 18648201 17082194
42178 17082194 17610401 18967824 18152315 15433753 13806983 14328614 15452372 16539391
42170 16539391 18586564 21300250 22530089 21209918 18461085 15541630 13190006 13074539
42162 13074539 16789347 22588984 26083526 25492701 23566774 22898722 22293237 20101594
42154 20101594 18489582 20884887 26341700 29880294 28501806 24257751 20999195 20317302
42146 20317302 21313193 22348122 21887276 19071335 14855198 11852351 11812126 13539629 14371366
42137 14371366 13697649 13927853 17311734 22452282 25151911 22999709 18155889 14772652
42129 14772652 14357289 14982407 14783229 14420288 15409855 17580693 19542421 20745322 21576070
42120 21576070 21927383 21304038 20317823 20436759 21669197 21782579 18822115 13717352 9405940
42111 9405940 7703321 8002102 9025848 10779996 14104315 18886902 23694918 27215070
42103 27215070 29233266 29879957 28786941 25852147 22349731 20175896 19945637 20646238
42095 20646238 21160218 21217804 20792700 19694049 18189203 17052946 16465937 15764740 14829148
42086 14829148 14689550 15937699 17458675 17752103 16798446 15637318 14838403 14504778 15049216
42077 15049216 16571594 17963791 18124134 17777595 18576384 20557377 22128550 22588896 22782539
42068 22782539 22772585 20833287 16039657 10503476 7376699 7109996 7059174 4811804 949427
42059 949427 -1740060 -1287967 1481383 3885331 4168174 3153380 2943471 4330661 6110648
42050 6110648 6835555 6445844 5925027 5951476 6307808 6413203 6247659 6680736 8509675
42041 8509675 11033435 12374032 11815617 10900417 11173942 11863052 11404119 10348736 10397294
42032 10397294 10922113 9347993 5546536 2964603 3982909 6628135 7768337 7464261
42024 7464261 7833661 9158212 9659674 8262057 5333543 1456868 -2278689 -3448201
42016 -3448201 -374401 4913428 8034287 6914945 3444287 568782 -311883 975094
42008 975094 4032687 7528705 9922698 11270754 12886477 14817209 15392579 13977688
42000 13977688 12467842 12951508 15124559 17056270 17590243 17157323 16981307 18035361 20017149
41991 20017149 21120318 19844952 17129166 15312546 14880283 14060594 12052541 10413331
41983 10413331 10136213 9524028 6769128 3065380 1206764 2173552 4837080 7986338
41975 7986338 10801144 12232960 11956277 11480072 12562761 14901466 16880111 17933254
41967 17933254 18445439 18040357 16147701 14000461 13868213 16113496 18808622 20369781
41959 20369781 20828165 20528581 19601770 18972608 19822549 21498983 21821353 20041716 17708441
41950 17708441 16089392 14739698 13284372 12395625 11961237 10553842 8165342 7246422
41942 7246422 9130431 11451021 11408812 9800624 9060378 8828182 6945166 4237386 4508581
41933 4508581 9078259 14472210 16827562 16127769 14691548 13719081 13096871 12797665 12458080
41924 12458080 10895524 8085932 6557467 8545391 12380150 14177998 13146124 12726673
41916 12726673 15677663 20164574 22214615 20603973 17576747 15571855 15170058 16145641
41908 16145641 18559475 21858135 24030544 23033657 19092022 14911430 13397406 15315549
41900 15315549 19048408 22215107 23353118 22323302 19654144 16010665 12366488 10095773
41892 10095773 10112456 11787785 13278715 13264465 12022241 10565756 9292242 8075876 7236462
41883 7236462 7406917 8353634 8845665 8157545 7069955 6787185 7237158 7027713 4920974
41874 4920974 993185 -3280328 -5575173 -3959725 1182879 6440235 7927094 5309158
41866 5309158 2393277 2853918 6167969 8908553 9267964 8451432 7753128 6619474 4654548
41857 4654548 3488646 4638137 6732430 7259954 6542982 7273484 9745573 10331639 6239596
41848 6239596 -209294 -4076888 -3430487 -540064 1723524 2543587 2376498 1539085 172346
41839 172346 -1485261 -3090747 -3794772 -2314996 1318486 4524017 4428661 1363551 -1681154
41830 -1681154 -3185754 -4521263 -6632426 -7676575 -5531024 -946190 3559850 6691159
41822 6691159 8516374 8784781 7252249 5209300 4687946 6101309 8081089 9487250
41814 9487250 10189829 10113080 9079787 7581308 6220993 4403700 1152565 -2636837 -4430683
41805 -4430683 -3034317 66987 2834754 4786479 6409005 7805072 8721831 8918978
41797 8918978 7925709 5506298 2875131 2115262 3565635 5029175 4561850 2904698 2057582
41788 2057582 2552202 3456868 4171233 4777118 5290015 5991988 7923632 11505127 15038335
41779 15038335 16168775 14747067 12769949 11480313 10081794 7673205 4987914 3370809
41771 3370809 2908201 2475471 1411622 622502 1824030 5513315 9812612 12075338 11835887
41762 11835887 10995109 10489949 8546750 3967517 -414707 -434003 3658468 7071028 6469483
41753 6469483 3412854 1116528 566403 1142715 2511756 4075446 4703665 4915546 7146214
41744 7146214 11576901 13970465 10806908 4862070 1888558 2658909 2553518 -797349
41736 -797349 -3902976 -3013162 371474 2058001 594269 -2476880 -5758268 -8481355
41728 -8481355 -9142720 -6742794 -3121557 -1486806 -2414525 -3390615 -2572729 -912319 133399
41719 133399 996266 2698015 4478577 4573998 3104093 2526950 4536333 7440474 7755157
41710 7755157 4319325 -278427 -2925739 -3636471 -4700726 -6750327 -7670347 -5973687
41702 -5973687 -3329245 -2168092 -1983601 -73218 4273843 8212698 8452564 4702485
41694 4702485 -519462 -4581587 -6623515 -7366781 -7759256 -7891307 -7289055 -6305689 -6569214
41685 -6569214 -9218937 -12973696 -14991619 -13838451 -10892082 -8694799 -8581433 -9984386
41677 -9984386 -11328182 -11408781 -10424631 -9679234 -9847254 -9985843 -9142580 -8352313 -9451889
41668 -9451889 -12037665 -13516377 -12625992 -10923561 -9813715 -8161484 -4686323 -1167898
41660 -1167898 -757623 -3604304 -6519632 -7125376 -6238673 -5638189 -5513087 -5330500 -5655848
41651 -5655848 -7314436 -9395206 -9900812 -8597096 -7832747 -9767837 -13537709 -16034457
41643 -16034457 -15216070 -11848701 -8084449 -5319293 -3835959 -3562726 -4135067 -4611058 -4251914
41634 -4251914 -3618211 -3984378 -5611928 -7546658 -9217236 -11070026 -13191566 -14435950
41626 -14435950 -13697989 -11313566 -8615205 -6844746 -6879889 -8848853 -11263384 -11777864 -9887124
41617 -9887124 -7729856 -7030570 -6593465 -4552345 -1879780 -1309866 -3370149 -5936880 -7569558
41608 -7569558 -8798067 -9920860 -10139742 -9622212 -10021565 -11863009 -13517240 -13849399 -13647551
41599 -13647551 -13096821 -10422346 -5305184 -1424385 -2496853 -7019821 -10113519 -9948956
41591 -9948956 -9058602 -9307320 -9126371 -6900511 -4114662 -3177576 -4133776 -5546478 -7118323
41582 -7118323 -9219487 -10765447 -9982527 -7250116 -5176873 -5361057 -6557461 -6710802 -5578248
41573 -5578248 -4358655 -3510285 -2186869 164960 2575274 3369188 1869090 -1054264
41565 -1054264 -3908150 -5658812 -5989330 -5108748 -3748000 -3034281 -3681421 -5109750 -5833342
41556 -5833342 -5117016 -4062082 -4650761 -7656631 -11679660 -14236633 -13655458 -10060500 -5036315
41547 -5036315 -666454 1441376 912276 -1232486 -3349137 -4345030 -4116435 -3068816 -1767419
41538 -1767419 -1101941 -1859477 -3399468 -3464685 -503765 4056724 7100051 7316581 5934882
41529 5934882 3784039 -273968 -6598084 -12162453 -13126153 -9665745 -6064537 -5590632
41521 -5590632 -6999665 -6810850 -3633422 725809 3414862 2745576 -984518 -5688399
41513 -5688399 -8766355 -9149971 -8104741 -7454069 -7218991 -5776142 -2414608 991987 1389526
41504 1389526 -2399057 -8140949 -11796881 -10874867 -6442030 -1934886 -110753 -1227657
41496 -1227657 -3778398 -6249812 -8031500 -9344043 -10822660 -12793419 -14472112 -14209024
41488 -14209024 -11141632 -6519787 -2856378 -1673043 -2388557 -3374843 -3643075 -3332020 -2972105
41479 -2972105 -2786711 -2779406 -3103593 -3891839 -4719625 -4750974 -3786752 -2804730 -2848503 -3498127
41469 -3498127 -3151987 -1008048 1805220 3356211 2752703 664641 -1500098 -2649897
41461 -2649897 -2705807 -2620362 -3337044 -4400294 -4010889 -933452 3839926 7618281 8056296
41452 8056296 4756195 -454780 -4546631 -5426529 -3877743 -2983838 -4902976 -8454160
41444 -8454160 -10491992 -9351711 -6240877 -3501877 -2379778 -2578193 -3270448 -4092781 -5198380
41435 -5198380 -6442012 -6888947 -5873566 -4547301 -5149990 -8038884 -10615820 -10433706 -8422379
41426 -8422379 -7414048 -8145572 -8800225 -8423509 -8433008 -9853062 -10993322 -9499828 -5749430
41417 -5749430 -2603959 -1941656 -2581733 -2023011 201824 1493880 -897239 -5910729 -8862033
41408 -8862033 -6688700 -1932636 387495 -856307 -2276506 -1630222 -800464 -1887795
41400 -1887795 -3476692 -3239154 -1967562 -2064672 -3467785 -4099413 -3481464 -2838190 -2057597
41391 -2057597 244481 3460899 4919357 3865432 2737276 3276109 3833528 2108944
41383 2108944 -1483006 -4955354 -7630322 -9971758 -11698127 -11998452 -11060319 -9839372
41375 -9839372 -8694161 -7459780 -6424397 -6069980 -6176358 -6139290 -5809967 -5229864 -4086869
41366 -4086869 -2293960 -540918 557297 1168602 1211330 -458356 -4426864 -8827943 -10597854
41357 -10597854 -8699465 -5193897 -3216074 -4432312 -7806974 -10045275 -8211353 -3201675
41349 -3201675 252093 -1411243 -6405148 -10240111 -11601852 -12928594 -15403337 -16633649
41341 -16633649 -14449369 -10368538 -7411368 -6189353 -5144720 -3654729 -2951130 -4098936
41333 -4098936 -6283732 -7292701 -5498857 -1804340 504461 -1038439 -4958188 -7424943
41325 -7424943 -7110609 -6324252 -6644219 -6211985 -3308074 -70060 431650 -809002 -285609
41316 -285609 2081792 2337641 -1684317 -7279861 -10777548 -11679452 -11424784 -10628882 -9606689
41307 -9606689 -9624969 -11235134 -12569247 -11430008 -8166888 -4603900 -1263440 1980478
41299 1980478 3458146 1084007 -3660755 -6227485 -4639740 -2097281 -2280275 -4205656
41291 -4205656 -4103634 -1011419 2303854 3634253 3792706 4213912 4445675 3392558 1492826
41282 1492826 38034 -810332 -1828245 -3111250 -4150664 -5232282 -7122692 -9173587
41274 -9173587 -9301000 -6554245 -2565685 342906 1536179 1684758 1008446 -708291 -2786286
41265 -2786286 -3870705 -3723770 -3631145 -4506408 -5485227 -5146467 -3523459 -1875402 -524158
41256 -524158 1928822 6398787 10899865 11710899 7447321 955448 -3690377 -5099169
41248 -5099169 -4168292 -958001 5232880 12397439 15588105 12219656 5660093 1222049
41240 1222049 8185 -720387 -2301518 -3146480 -2253306 -859270 120773 1283924 2229133
41231 2229133 810717 -3206594 -6199898 -4850363 -662495 1998790 1146678 -1813762
41223 -1813762 -5135525 -8082363 -9723125 -9136032 -7214503 -6222077 -7012654 -8212342 -8466373
41214 -8466373 -8002049 -7556085 -7077605 -6050270 -4275898 -2145085 -728074 -1146612 -2880339
41205 -2880339 -3456959 -1383186 1278232 1232018 -1620222 -4408845 -5696016 -6760332 -8083333
41196 -8083333 -7750245 -4831903 -1705985 -1027703 -2327019 -3404810 -3233690 -1671838 1581233
41187 1581233 5336117 6133226 2164330 -3181964 -4821285 -2411636 -243778 -1023427
41179 -1023427 -3061097 -4069061 -4539358 -5970075 -8018402 -8929596 -7397700 -3149539
41171 -3149539 2822887 7906287 9412833 7436658 4831671 3708474 3496786 3060638
41163 3060638 2739493 3148253 3775471 4196472 5104618 6664915 7383795 6302537 4912678
41154 4912678 4999255 5780002 5252303 3421976 1966079 1317203 383998 -1062113 -1930170
41145 -1930170 -1868371 -1885874 -2668172 -3850918 -5074882 -6225371 -6614595 -5525460 -3522796
41136 -3522796 -1526989 1183520 5769436 10486608 11305494 7056064 1694465 -191496
41128 -191496 1519324 3433325 3148305 962549 -1763050 -3860496 -4377000 -3082968 -1020976
41119 -1020976 509559 1391357 2327398 3423657 4021179 3741497 3100484 3284048 5362293
41110 5362293 8855457 11025577 9220405 4626151 1871743 3597601 7155380 8403856
41102 8403856 6983414 5418704 4502101 2770729 10322 -1998539 -2486428 -2586650 -2767351
41093 -2767351 -2175242 -1263723 -2150110 -4953007 -6322776 -3459105 2314404 7613898 10718229
41084 10718229 11494144 9697737 5872284 2551040 1869858 2678387 2426628 1329959 2053553
41075 2053553 5361871 8698989 9619641 8411641 6551967 4635879 3031617 2791250
41067 2791250 4101896 4804228 2419957 -2364867 -5822097 -5385055 -2669086 -1314627
41059 -1314627 -2440371 -3757395 -3414624 -2852855 -4221600 -6225439 -5254409 -756622 3275898
41050 3275898 3335423 568466 -1714065 -2499838 -2762551 -2540317 -1306854 -198198 -710368
41041 -710368 -1609261 -298604 2746506 4193306 3000039 1994357 3145279 4540578
41033 4540578 4026934 2956089 3577736 4804952 3748891 440346 -1999530 -1731019 -236754
41024 -236754 286671 -448979 -1419781 -1996627 -2170424 -1825466 -597814 1457579 3218135
41015 3218135 2994022 379341 -2696411 -3995724 -3940783 -4754005 -6369842 -5719168 -1457139
41006 -1457139 3048002 3832938 1686996 605310 2072984 3907450 4196391 3218328 1347379
40997 1347379 -1896109 -5868010 -8278518 -7658289 -4645415 -391192 4316777 7900584
40989 7900584 8338791 5783940 2998028 2141249 2690187 3167637 2952473 1628757 -1065070
40980 -1065070 -3396385 -2302997 2167529 5395062 3690869 -544198 -2054421 145460
40972 145460 2088381 824986 -2133736 -3756750 -3145390 -1240871 1065930 3179939
40964 3179939 4252422 3454996 505100 -4119717 -8850958 -11296692 -10143739 -6864369
40956 -6864369 -4386191 -3979750 -4483543 -4418285 -3483833 -2001571 -479359 23374 -1219211
40947 -1219211 -2776675 -1760524 2706195 8037810 11208306 11977617 11893279 11304607 9268173
40938 9268173 6061979 3838915 4074063 5465173 5375495 3105019 905988 1436293 4715140
40929 4715140 8354487 10693704 12495160 14850202 16690520 16137553 13837741 12738234
40921 12738234 13964957 14840833 12289052 6921746 2251695 602951 1279091 2339537
40913 2339537 2591118 1690067 -305479 -2706689 -4173929 -3695748 -1619074 505178 1142132
40904 1142132 -63548 -2122929 -3582577 -3578248 -2139407 204148 2821336 5212422 7269562
40895 7269562 9200084 10890990 11742759 11654178 11513000 11655415 10517542 6639609 1867288
40886 1867288 209279 2730634 5887275 6438259 5810668 7178487 9920230 10359067 7572417
40877 7572417 4913902 4932625 5927702 5364195 4222613 5243228 8090850 9171547 6361716
40868 6361716 1743174 -943510 29943 3850488 8663175 12350510 12939013 9983376
40860 9983376 5512370 2427941 1855631 2919166 4845692 7739547 10934671 12409596
40852 12409596 11199862 9145830 8481569 8465709 6516578 2493396 -509317 -267838 1755402
40843 1755402 2867925 2697494 2709601 3398240 3760667 3021414 1360354 -777235 -2839748
40834 -2839748 -3913670 -3475589 -2237515 -1336260 -1010627 -876369 -799091 -366841 1662847
40825 1662847 5738140 9837157 11263738 9994997 8468776 8102780 8042198 7623931 7793156
40816 7793156 9000450 9581975 7870170 4882284 3392662 4723765 7443006 8973043
40808 8973043 7927188 5259392 3503008 4392423 7029550 9000965 9194679 8361988 6921203
40799 6921203 4076007 10913 -2736631 -1784357 1926728 4815821 4162347 137072
40791 137072 -4901395 -8100597 -7787861 -4689526 -1258824 929074 2550886 4634812
40783 4634812 6366148 6230923 4713295 4109978 5548900 7518364 7721974 5528221 2273241
40774 2273241 -308017 -1743968 -3098808 -5354632 -7463702 -6885196 -2620384 3234458
40766 3234458 7823752 10444674 12028817 12882136 12768066 12556880 13552078 15015950 14301153
40757 14301153 10041363 3798240 -1908148 -5771014 -7350606 -6126169 -2129487 3194189
40749 3194189 7726172 10055555 9921276 8020016 5790545 4685934 5098501 6315838
40741 6315838 7594367 8657369 9162833 8641197 7226374 5628802 4239642 3197080
40733 3197080 3312649 5411886 8278320 8970303 6372035 3048095 2005780 2699466 2266058
40724 2266058 205813 -578130 2031801 6145586 8133889 6861287 4133666 1696978
40716 1696978 -310508 -1868409 -2032278 -506069 1067907 994690 12964 74304 832226
40707 832226 -508038 -5155109 -10436605 -12785503 -11590488 -8722132 -5639833 -2793982
40699 -2793982 -820127 -110029 376620 1871372 3679471 4292367 4278238 5673990 8385071
40690 8385071 9719272 8188960 5478514 3648472 2482899 841366 -1200509 -2926156
40682 -2926156 -4141764 -4508115 -3242964 -811061 571042 -447779 -2521862 -3667870
40674 -3667870 -3722502 -3439452 -2846420 -2238335 -3152822 -6185025 -9117709 -9505541 -8090925
40665 -8090925 -7366486 -7722910 -7560041 -6498005 -5700711 -5206519 -3577755 -410920 3008916
40656 3008916 5667715 7379397 7491661 5360071 2276396 737067 1581454 3736465
40648 3736465 6332157 8505790 7773672 2416126 -4151556 -5594932 -749446 4419751
40640 4419751 5043089 3564987 4620916 7394590 7635357 5012600 3362184 4264933 5106701
40631 5106701 3996852 2567314 2734725 3979748 5226744 6576442 7536191 6049378
40623 6049378 1433490 -3428261 -5036656 -3515894 -2123184 -3150678 -5920908 -8487802
40615 -8487802 -9721172 -9457891 -7745746 -4712258 -1093138 1455150 1125402 -2309998
40607 -2309998 -6644053 -8970791 -8556144 -7322501 -7302389 -8453811 -9337729 -9014981 -7598730
40598 -7598730 -5620583 -3572933 -1656303 442021 2883619 4399210 2718992 -2691687
40590 -2691687 -9025274 -12518489 -12244893 -10538885 -9879945 -10490345 -11026171 -10410852 -8432301
40581 -8432301 -5336325 -1653069 1637567 3224833 2202346 -840071 -3500649 -3261815
40573 -3261815 -140523 3072257 3982648 3106973 2053313 352171 -3573490 -8534102
40565 -8534102 -10464958 -7214821 -1320280 3233776 5032573 4571934 1921148 -2361649
40557 -2361649 -5600725 -5501791 -3661798 -3482060 -4841571 -4312585 -1129499 871394 -1018337
40548 -1018337 -4089957 -4329694 -2192246 -970631 -1257063 -926347 72294 -999492 -4967837
40539 -4967837 -8884564 -10372531 -10984257 -13144413 -15849896 -15932931 -12516992 -7886364 -4416937
40530 -4416937 -2736943 -2725453 -4083423 -5353884 -4356023 -950584 1727903 267961 -5137146
40521 -5137146 -10880448 -13733544 -13331076 -11079556 -8199983 -5507718 -3780146 -3083079
40513 -3083079 -2513779 -1910317 -3093171 -7620724 -13582246 -16777386 -15557642 -12473609
40505 -12473609 -10305722 -8699533 -6326604 -4254427 -4551121 -6696114 -8178275 -8249131
40497 -8249131 -8396679 -9118397 -9025824 -7761743 -7147690 -8192874 -9153047 -8122884 -5851187
40488 -5851187 -4320434 -3867112 -3439401 -2769494 -2613688 -3360573 -4706075 -6208092 -7124561
40479 -7124561 -6482537 -4542338 -3398503 -4625038 -6869709 -7358375 -5452575 -3079810
40471 -3079810 -1724660 -738922 927887 2822538 3734905 3520184 3235688 3631986 4070685
40462 4070685 3152866 399782 -2960716 -5332102 -6696481 -8333624 -10552977 -12100875
40454 -12100875 -12431731 -12853191 -13885818 -12969097 -7266040 1695819 8667666 10264385
40446 10264385 7864908 4646333 2100884 428031 -80318 -60782 -1847735 -6782284
40438 -6782284 -12433730 -14807939 -13233312 -10934586 -10493967 -10967963 -10492722 -9661834 -10309419
40429 -10309419 -12077856 -12575612 -10832193 -8421860 -6706205 -5080333 -3054567 -2097496
40421 -2097496 -3499806 -5807592 -6772657 -7031482 -9017989 -12329067 -13426941 -11031176
40413 -11031176 -8721451 -9881733 -12330848 -11157988 -5991896 -2177913 -4177343 -10166851
40405 -10166851 -14390041 -13572965 -9877552 -8045339 -10442122 -14916944 -17188804 -14986501
40397 -14986501 -9600754 -3949460 -304567 253609 -1897304 -4351751 -4228888 -1723145
40389 -1723145 -485480 -2775914 -5931654 -5925246 -2888546 -200331 723124 1143486 1028362
40380 1028362 -1426214 -5483304 -7053861 -4176187 -248114 529491 -1469044 -2878426
40372 -2878426 -2223353 -463574 1801029 4577213 6542463 5802197 2880679 746694
40364 746694 1252006 3109320 3960738 3153599 1759008 746023 -14208 -1191451 -3017883
40355 -3017883 -5050277 -6821888 -8438075 -10227851 -12028408 -13267609 -13505756 -12363905
40347 -12363905 -9446005 -5320456 -2072227 -1478971 -2913947 -4535322 -6055770 -8235128
40339 -8235128 -10044362 -9394329 -7222907 -7528033 -11773408 -16264709 -17193620 -15505231 -14164132
40330 -14164132 -13265436 -11241098 -8782374 -7554673 -6303393 -2468295 2810604 5493028
40322 5493028 4589856 3192426 2818920 909455 -4259347 -9712927 -11327564 -8799245
40314 -8799245 -4847815 -1641738 -315185 -1999902 -6430062 -10605868 -11584043 -10205673
40306 -10205673 -9818225 -11583684 -13267119 -12778293 -10791797 -9150229 -8291865 -7344775 -5841548
40297 -5841548 -4215490 -2852911 -1512447 88022 1521462 1938818 1192747 312720 457950
40288 457950 1568080 2590305 3017490 3516459 4744776 6126144 6382620 5149353 3617018
40279 3617018 3400494 4886818 6948110 8413007 9399961 10525544 11092278 9407970 5348732
40270 5348732 1220103 -926107 -1608949 -2276028 -2654257 -1720416 -443491 -1074062 -3738579
40261 -3738579 -6031965 -6332975 -5390798 -4097239 -1918659 1343574 4025564 4197320 1690250
40252 1690250 -2295217 -6367298 -9033848 -9140425 -7258117 -5406539 -4563888 -3811180 -2671691
40243 -2671691 -2433830 -3821108 -5077825 -4125261 -1354958 1337971 3008919 3451263 1988005
40234 1988005 -1238106 -3723702 -2808077 924284 4481663 6270913 6961311 7012737 5907411
40225 5907411 4001747 2636384 1731447 -473575 -4255317 -7004781 -6492845 -4080758
40217 -4080758 -2936676 -3846356 -4535401 -3045976 -269965 1458868 1345512 672904 571174
40208 571174 506504 -288604 -965752 -264637 906332 303684 -1934675 -2955259 -1769171
40199 -1769171 -1538790 -5041782 -10027389 -12073267 -10520434 -8198608 -6399496 -4171699
40191 -4171699 -2318441 -3546735 -7519322 -9842255 -8016423 -5114641 -5241590 -8184667
40183 -8184667 -11125278 -13101373 -14728533 -15397809 -14012551 -11430260 -9305225 -7364804
40175 -7364804 -4511025 -1755858 -1148982 -2283038 -2803083 -2282954 -2769239 -5275098 -8384623
40166 -8384623 -10729398 -12374786 -13320204 -13114746 -12505358 -12907917 -13524289 -11666638 -6956669
40157 -6956669 -2431530 -126019 1513229 3904491 5073066 2999790 -277125 -1465723
40149 -1465723 -1163042 -2276260 -4458317 -4572780 -2571979 -2213927 -4807099 -6679584 -5125221
40140 -5125221 -3027483 -4375699 -8161875 -10568405 -11130972 -12290858 -13719123 -11892671
40132 -11892671 -6139305 -1013016 -713486 -4080097 -7266268 -8973725 -10445344 -11920136
40124 -11920136 -12002904 -10054786 -6937896 -3599394 -721583 691292 463502 674218 3478513
40115 3478513 7283644 7754931 3627384 -981998 -1763608 431718 1804063 1521307 2149334
40106 2149334 4483941 5415062 2315319 -2812728 -5605966 -4587067 -2279247 -1629902
40098 -1629902 -3049549 -4983678 -5903239 -5245093 -3413535 -1486268 -373791 109263 838714
40089 838714 1842271 1952360 532887 -1213687 -1600567 -664321 120850 201966 624765
40080 624765 1846607 2179266 -344868 -5212181 -9960659 -13279173 -15935125 -18182392
40072 -18182392 -18095368 -14194606 -8821886 -6593709 -9005182 -12351958 -12153674 -8378528
40064 -8378528 -4723208 -3514768 -3458156 -2684378 -1915864 -3089339 -5853266 -7280991 -5294751
40055 -5294751 -1220604 1705313 1905130 896688 1067453 2447636 2497190 -374055 -3813137
40046 -3813137 -3639344 708291 4554193 3204311 -2376489 -7010349 -7824931 -6962407 -7534219
40037 -7534219 -9428798 -10629388 -10819491 -11366799 -12397741 -12208950 -10004594 -7524219 -6965876
40028 -6965876 -8185923 -8990103 -7897067 -5715914 -4262967 -4245060 -4950896 -5595254 -6022194
40019 -6022194 -5987117 -4907036 -3163841 -2730643 -5084113 -8865253 -11147102 -10959555 -9890823
40010 -9890823 -9066316 -7649450 -5213440 -3482626 -3999057 -5555065 -5904644 -4994830 -4483743
40001 -4483743 -4814182 -4932231 -4513467 -4264709 -4077219 -3071285 -1739678 -1912931 -3955579
39992 -3955579 -5865300 -5959859 -4839792 -3905625 -3511218 -3403793 -3337831 -2295322 1029923
39983 1029923 5471214 6899515 2796940 -3575470 -5979363 -2174704 3701657 5855062
39975 5855062 2346958 -4277348 -10077014 -12516033 -11476488 -8961226 -7657444 -8843255
39967 -8843255 -11341173 -12715828 -11574441 -8634877 -5696715 -3928868 -3323490 -3424051
39959 -3424051 -3895819 -4283211 -3978822 -2963844 -1984618 -1361060 -301825 1660922 3242385
39950 3242385 2753267 416504 -2231464 -4892734 -8439426 -12249637 -14008072 -12992973
39942 -12992973 -11402186 -11213889 -11712098 -11536087 -11136995 -11250156 -10715857 -8237138 -5064398
39933 -5064398 -3466025 -3480394 -3728221 -4635144 -7864424 -12657125 -15646987 -14851950 -11500148
39924 -11500148 -7422743 -3023829 1369412 4367592 4969995 3753701 1948727 676601
39916 676601 1186666 3809161 6377020 6104302 3644142 2546533 3660897 3263418 -1210036
39907 -1210036 -6560195 -7953679 -5433938 -2862230 -1870860 -696227 1508774 3021063
39899 3021063 2714813 1789685 1495815 1637635 2078475 3259831 4282890 2946901 -850370
39890 -850370 -3808586 -3049066 224343 2427996 1629924 -1655703 -6321701 -11214108 -14460450
39881 -14460450 -14359514 -11273110 -7528199 -5249900 -4797961 -4960091 -4075868 -1526124 1244418
39872 1244418 1911223 124371 -1911563 -2655884 -3584621 -6657790 -10750135 -12949252 -12549800
39863 -12549800 -10979855 -8228473 -2898840 3463886 5779685 1407091 -5832102 -10102446
39855 -10102446 -10091426 -8489919 -6792586 -4174410 -899748 834076 137057 -1226189
39847 -1226189 -1570252 -1117152 -394746 807594 1864114 1060572 -1647871 -3802648 -4062874
39838 -4062874 -4448526 -6637999 -8053130 -4989303 1234215 4864901 2857427 -1596671
39830 -1596671 -3641187 -2234227 421025 2668121 4337922 5013749 3711440 453472
39822 453472 -3205649 -5576425 -6123183 -5380163 -4226211 -3349723 -3020154 -3180546 -3685236
39813 -3685236 -4261636 -4418877 -3961356 -3574735 -4158846 -5433554 -6066143 -5513746 -4818790
39804 -4818790 -5059689 -5997175 -7027861 -8437141 -10456466 -11859611 -11205966 -9378165 -9142428
39795 -9142428 -11489833 -13577602 -11402203 -4331455 3565149 6836071 3528100 -2869472
39787 -2869472 -6622332 -5497648 -2968585 -3759069 -7706889 -9984843 -7820603 -4626543
39779 -4626543 -5499535 -10139455 -13112289 -11060145 -6821338 -5228900 -6950349 -8395753
39771 -8395753 -6574491 -2012988 2801842 6058683 7412068 7389520 6520374 4612899 1109658
39762 1109658 -3297805 -6262153 -6373475 -5507320 -6624326 -9479205 -10937934 -9846736
39754 -9846736 -8667607 -8992903 -8487209 -4976440 -1319889 -2469662 -8317782 -13019131
39746 -13019131 -11986508 -6876316 -2800768 -2759824 -5766731 -8687530 -8922957 -6590659
39738 -6590659 -4748315 -6254401 -10099930 -12372027 -11135840 -8496999 -7318516 -8016948
39730 -8016948 -9550501 -11408389 -13108029 -13461921 -12004846 -9871791 -7983917 -5868922
39722 -5868922 -3568238 -2828794 -4538489 -6667085 -6930940 -6074929 -6203255 -7205958 -7481993
39713 -7481993 -7111068 -7335251 -7526220 -5795392 -2551388 -480145 -676155 -1491067 -1618056
39704 -1618056 -1634996 -1909067 -1700290 -1279826 -2328557 -4944523 -6574035 -5400242 -2802533
39695 -2802533 -982220 -67790 737328 824825 -1050280 -4731390 -8966086 -12866332 -15870792
39686 -15870792 -17338005 -17380931 -17028836 -16511498 -14727839 -11572083 -9130072 -8904071 -9380992
39677 -9380992 -8405173 -6714097 -6750410 -8747473 -10493445 -10779002 -10736362 -11435905 -12095178
39668 -12095178 -11389779 -9343042 -7344852 -6902745 -8384942 -10444229 -11013700 -9440942
39660 -9440942 -7050373 -5124215 -3530776 -2222718 -2425769 -4602712 -6649171 -6343218
39652 -6343218 -4568673 -3708896 -3736060 -2735994 -881310 -775844 -3587137 -7621846 -11089530
39643 -11089530 -13432737 -13477962 -9660508 -3510489 139295 -1465558 -5631227 -8099938
39635 -8099938 -8067343 -7178123 -5754122 -3011932 182106 1686044 796119 -1607183 -5005805
39626 -5005805 -9033181 -11825297 -11237624 -7988033 -5371398 -5310304 -6583292 -7570756 -8768883
39617 -8768883 -11249182 -13933069 -14112177 -10566320 -5176904 -1255008 -707664 -2981577
39609 -2981577 -6392030 -9827147 -12791606 -14418713 -13692062 -10933483 -8050262 -6732575
39601 -6732575 -7135961 -8659403 -10854985 -12867986 -13284831 -11837324 -10399009 -10897776 -12727833
39592 -12727833 -13435823 -11580074 -7877034 -3981978 -1145553 373983 1397011 2651028
39584 2651028 2838685 -745571 -8271891 -15403498 -17291907 -13745897 -8573157 -4819151
39576 -4819151 -3011245 -3191678 -5534929 -8786071 -10840109 -11417249 -11939758 -12543098 -11674443
39567 -11674443 -8960632 -5835073 -2897483 439180 3050124 2276524 -1507545 -3761435
39559 -3761435 -1389329 3184165 5734671 5363161 3394793 -68845 -5028947 -8966546
39551 -8966546 -9184373 -6952576 -6069664 -7865303 -10476985 -12260684 -12763556 -10982191 -6247732
39542 -6247732 -885028 1431085 450888 -598823 -199593 -486295 -3088705 -6370550 -8492181
39533 -8492181 -10349886 -13270368 -15940999 -16016872 -13456428 -10238184 -7690882 -5759405
39525 -5759405 -4161095 -2882531 -2098492 -2441252 -4378335 -6530606 -6058448 -2121896 2206923
39516 2206923 3159319 740850 -1530836 -952701 1724398 3912786 4224484 3438053 2826971
39507 2826971 1974465 -1012509 -6451062 -11157955 -11467506 -8074252 -5571519 -6483360 -8077422
39498 -8077422 -6499154 -2042287 1585833 1774193 -1105355 -5082237 -7912461 -7980281 -5753354
39489 -5753354 -3643407 -2984696 -2313144 -250604 1583018 1058566 -422118 393256 3415562
39480 3415562 5079123 3623151 1243100 51934 -1115864 -4155422 -8062540 -9837182
39472 -9837182 -8084647 -4478670 -2174497 -3134832 -6183055 -7798879 -6166085 -4051717
39464 -4051717 -5528394 -9953460 -12143668 -9333984 -4837965 -3020554 -3506644 -3050539
39456 -3050539 -950476 694642 911416 670392 147814 -1649088 -4174216 -5125298 -3951694
39447 -3951694 -3297421 -5467516 -8971897 -10207530 -7908585 -4614913 -3795527 -6257629
39439 -6257629 -9551025 -10724586 -9489790 -8217264 -8602920 -9281158 -7895556 -4960729
39431 -4960729 -3853156 -6541795 -10832066 -12813852 -11131576 -7878093 -5916674 -6337776
39423 -6337776 -8220029 -9870784 -10191151 -9487936 -9173057 -10343005 -12549090 -14144848 -13827299
39414 -13827299 -11737704 -9253757 -7896818 -8119925 -8723905 -7671647 -4109949 309115
39406 309115 2650591 1513124 -1727556 -4679695 -6391973 -7532798 -8630521 -9223096
39398 -9223096 -9004634 -8907122 -10221042 -12825705 -14873934 -14353678 -10885161 -6226455 -3152143
39389 -3152143 -3327550 -5766999 -7691865 -7422907 -6048163 -5546477 -5772409 -4653781 -1519918
39380 -1519918 1281372 1107828 -1551687 -3709508 -3628454 -2547283 -2419155 -3327133 -4192282
39371 -4192282 -5106784 -7177983 -9934246 -10754757 -8124334 -4212471 -2452905 -3287662 -4489722
39362 -4489722 -5405210 -7948862 -12528922 -16030981 -15997026 -14378972 -14325086 -15220822 -14446193
39353 -14446193 -12599613 -12533025 -13528545 -11393207 -5484003 -870609 -1131921 -3225654 -2823437
39344 -2823437 -1062446 -1646822 -3937203 -4110322 -2004112 -1537814 -4084337 -6177205 -5022514
39335 -5022514 -2249328 -433844 575751 1568716 1165134 -1928310 -5635528 -6441399 -3928918
39326 -3928918 -1111120 -563517 -2115661 -4323306 -6536391 -8927267 -11268504 -12304174
39318 -12304174 -10621593 -6503326 -2536774 -1214835 -1840174 -1298325 1536670 3800793
39310 3800793 2205030 -2729430 -7461396 -9436883 -8706102 -6397830 -3640225 -1905350
39302 -1905350 -2465255 -4820751 -6882747 -7435227 -7643187 -9432037 -12804622 -15434562 -15000802
39293 -15000802 -11680582 -8126724 -6939207 -8436239 -11117328 -13646674 -15401652 -15569821
39285 -15569821 -13512004 -10430151 -8861631 -9458868 -9821069 -7882744 -4980925 -3750972
39277 -3750972 -4241827 -4380410 -3433471 -2442727 -1651928 -350322 598517 -896689 -4452972
39268 -4452972 -6792247 -6440876 -6019998 -7736540 -9223853 -6963898 -2052283 1129961
39260 1129961 1267125 1294295 2909283 3653280 1049142 -3295114 -6014724 -6491306 -6608841
39251 -6608841 -7183132 -7096329 -5681984 -3938450 -3120929 -3383534 -3899527 -3493846 -1571961
39242 -1571961 620106 474914 -2709944 -5692534 -4624165 -116868 3474394 4002912
39234 4002912 3935246 5782970 7980580 7426781 4003499 -42875 -3813942 -8045413 -12441730
39225 -12441730 -15545224 -17107084 -18008811 -17765100 -14741591 -9304258 -4164017 -812264
39217 -812264 1802665 3963020 3422372 -936435 -5997928 -7709269 -6024854 -3810990
39209 -3810990 -1955180 1178619 5652273 8641389 8086902 5103932 1712037 -1484745
39201 -1484745 -3996868 -4163871 -1398912 1767188 2338807 804944 65729 790402 512094
39192 512094 -2152164 -4906065 -4828170 -2263741 47568 545129 -260536 -1625282 -3225034
39183 -3225034 -4224448 -3755306 -2577814 -2399215 -3089265 -2550439 -266656 1003173 -1323955
39174 -1323955 -5959780 -9313501 -9751125 -8534116 -7443990 -7440350 -8925253 -11123518 -11657387
39165 -11657387 -9054429 -5372275 -3822958 -4081196 -3128800 -971525 -1540196 -6285404
39157 -6285404 -10712505 -10236883 -6490062 -4140034 -3680696 -1802362 2087645 4437448
39149 4437448 3103950 226429 -1722974 -3199566 -4972811 -5294340 -2473226 1479840
39141 1479840 2588378 -333908 -4753392 -7837903 -8916543 -8589562 -7188439 -4852198
39133 -4852198 -2278480 -652163 -764728 -2202460 -3541981 -3800944 -3658112 -4492268 -6129219
39124 -6129219 -6639608 -4887876 -2173347 -478832 -108594 -257258 -1070677 -3471543 -7089696
39115 -7089696 -9901704 -10283035 -8387161 -5270754 -1752060 1433827 3419735 3958331
39107 3958331 3729804 3132734 1365249 -2239654 -6196157 -7457180 -4579217 441653
39099 441653 4198016 5274431 4779502 3794506 1747122 -1883096 -5324378 -5715631 -2784406
39090 -2784406 101858 -406381 -3650770 -5878900 -4961813 -2777487 -2341268 -3864666 -5102170
39081 -5102170 -5058714 -5422075 -7736842 -10830244 -12464142 -12454533 -12225719 -11731955 -9233306
39072 -9233306 -4766195 -1608780 -2623893 -6426939 -8973110 -8263341 -5828291 -4056469
39064 -4056469 -3905632 -5253660 -7689971 -10288138 -11700385 -11070284 -8335141 -3863673
39056 -3863673 1105033 3981632 2673934 -1500761 -4382633 -3479948 -730427 260230
39048 260230 -1403495 -3610298 -4462590 -4146198 -3749609 -3687655 -3739085 -3791060 -3987131 -4425125
39038 -4425125 -5027745 -5675678 -6347495 -7003516 -7304683 -6786211 -5607594 -4655519 -4271883
39029 -4271883 -3430863 -1278053 927783 993403 -1084619 -3023543 -3753150 -4932503 -7747898
39020 -7747898 -10118904 -9177962 -5518632 -2845863 -3659597 -6902396 -9691097 -9957183 -7577498
$$ [...]
##END NTUPLES=NMR SPECTRUM
##END=
