##TITLE=31Pdec_DE-97m2_TFA
CDCl3, 64 sc
 21.8.2025
##JCAMPDX= 6.0         $$ Bruker NMR JCAMP-DX V2.0
##DATA TYPE= NMR SPECTRUM
##DATA CLASS= NTUPLES
##ORIGIN= UXNMR, Bruker Analytische Messtechnik GmbH
##OWNER= root
$$ XWIN-NMR		Version 3.5
$$ Thu Aug 21 14:25:18 2025 Russian Standard Time (UT+4h)  she@DPX200
##.OBSERVE FREQUENCY= 81.013821
##.OBSERVE NUCLEUS= ^31P
##.ACQUISITION MODE= SIMULTANEOUS
##.ACQUISITION SCHEME= undefined
##.AVERAGES= 64
##.DIGITISER RES= 17
##SPECTROMETER/DATA SYSTEM= spect
##.PULSE SEQUENCE= zgpg30
##.SOLVENT NAME= CDCl3
##.SHIFT REFERENCE= (INTERNAL, CDCl3, 0, 198.062)
##AUDIT TRAIL= $$ (NUMBER, WHEN, WHO, WHERE, WHAT)
$$ ##TITLE= Audit trail, XWIN-NMR		Version 3.5
$$ ##JCAMPDX= 5.01
$$ ##ORIGIN= Bruker BioSpin GmbH
$$ ##OWNER= she
$$ F:/spectra/data/she/nmr/P31/2/pdata/1/auditp.txt
$$ ##AUDIT TRAIL=  $$ (NUMBER, WHEN, WHO, WHERE, WHAT)
(   1,<2025-08-21 14:24:25.18 +0400>,<she>,<DPX200>,
      <created by zg, POWCHK disabled, PULCHK disabled
       configuration hash MD5:
       00 E9 B6 7A A2 85 ED C7 34 08 36 98 17 FE 4E 26
       data hash MD5: 32K
       86 FF 1D 56 CE 0D 7C 28 F1 E5 B5 C0 8B 8F 20 CF>)
(   2,<2025-08-21 14:24:27.50 +0400>,<she>,<DPX200>,
      <Start of raw data processing
       efp BC_mod = 2 LB = 1.5 FT_mod = 6 PKNL = 1 PHC0 = 1577.967 PHC1 = -437.5005 SI = 64K 
       data hash MD5: 64K
       40 D4 45 69 41 B1 53 E8 4B 3B 48 C5 66 50 A7 02>)
(   3,<2025-08-21 14:24:43.04 +0400>,<she>,<DPX200>,
      <pk PHC0 = 9.126936 PHC1 = 0 
       data hash MD5: 64K
       DC A9 D8 1B A9 BA DC 71 26 14 33 E4 87 5F AA 8B>)
(   4,<2025-08-21 14:24:47.87 +0400>,<she>,<DPX200>,
      <abs ABSG = 5 
       data hash MD5: 64K
       23 49 4F 7A BB 9F 18 A4 E1 BC 6C 5B AC B9 2C DB>)
$$ ##END=
$$ 
$$ hash MD5
$$ 17 72 EA BB A2 66 49 E6 F0 74 9A 17 CA C0 BA 61
##$RELAX= 
##$RELAX= 
##$RELAX= 
##$RELAX= 
##$RELAX= 
##$RELAX= 
##$RELAX= 
##$RELAX= 
$$ Bruker specific parameters
$$ --------------------------
##$DU= <F:/spectra>
##$EXPNO= 2
##$NAME= <P31>
##$PROCNO= 1
##$TYPE= <nmr>
##$USER= <she>
##$AMP= (0..31)
100 100 100 100 100 100 100 100 100 100 100 100 100 100 100 100 100 100 
100 100 100 100 100 100 100 100 100 100 100 100 100 100 
##$AQSEQ= 0
##$AQ_mod= 1
##$AUNM= <au_zg>
##$AUTOPOS= <>
##$BF1= 81.014009
##$BF2= 200.13
##$BF3= 200.13
##$BF4= 200.13
##$BF5= 200.13
##$BF6= 200.13
##$BF7= 200.13
##$BF8= 200.13
##$BYTORDA= 1
##$CFDGTYP= 0
##$CFRGTYP= 5
##$CHEMSTR= <none>
##$CNST= (0..31)
1 1 145 1 1 1 1 1 1 1 1 1 1 1 1 1 1 1 1 1 1 1 1 1 1 1 1 1 1 1 1 1 
##$CPDPRG= <waltz16>
##$CPDPRG1= <>
##$CPDPRG2= <waltz16>
##$CPDPRG3= <>
##$CPDPRG4= <mlev>
##$CPDPRG5= <mlev>
##$CPDPRG6= <mlev>
##$CPDPRG7= <mlev>
##$CPDPRG8= <mlev>
##$CPDPRGB= <>
##$CPDPRGT= <>
##$D= (0..31)
0 1 0 0 0 0 0 0 0 0.06 0 0.03 2e-05 3e-06 0 0 0.0002 0 0 0 0 0 0 0 0 0 
0 0 0 0 0 0 
##$DATE= 1755771864
##$DBL= (0..7)
120 120 120 11 120 120 24 19 
##$DBP= (0..7)
150 150 150 150 150 150 150 150 
##$DBP07= 0
##$DBPNAM0= <>
##$DBPNAM1= <>
$$ [...]
##$SUBNAM3= <"">
##$SUBNAM4= <"">
##$SUBNAM5= <"">
##$SUBNAM6= <"">
##$SUBNAM7= <"">
##$SUBNAM8= <"">
##$SUBNAM9= <"">
##$SW= 400.765351723535
##$SWIBOX= (0..15)
0 1 3 0 0 0 0 0 0 0 0 0 0 0 0 0 
##$SW_h= 32467.5324675325
##$TD= 32768
##$TD0= 1
##$TE= 0
##$TE2= 300
##$TE3= 300
##$TEG= 300
##$TL= (0..7)
0 120 53 12 22 120 120 120 
##$TP= (0..7)
150 150 150 150 150 150 150 150 
##$TP07= 0
##$TPNAME0= <>
##$TPNAME1= <>
##$TPNAME2= <>
##$TPNAME3= <>
##$TPNAME4= <>
##$TPNAME5= <>
##$TPNAME6= <>
##$TPNAME7= <>
##$TPOAL= (0..7)
0.5 0.5 0.5 0.5 0.5 0.5 0.5 0.5 
##$TPOFFS= (0..7)
0 0 0 0 0 0 0 0 
##$TUNHIN= 0
##$TUNHOUT= 0
##$TUNXOUT= 0
##$USERA1= <user>
##$USERA2= <user>
##$USERA3= <user>
##$USERA4= <user>
##$USERA5= <user>
##$V9= 5
##$VALIST= <valist>
##$VCLIST= <CCCCCCCCCCCCCCC>
##$VD= 0
##$VDLIST= <DDDDDDDDDDDDDDD>
##$VPLIST= <PPPPPPPPPPPPPPP>
##$VTLIST= <TTTTTTTTTTTTTTT>
##$WBST= 1024
##$WBSW= 4
##$XGAIN= (0..3)
0 0 0 0 
##$XL= 0
##$YL= 0
##$YMAX_a= 15473
##$YMIN_a= -7378
##$ZGOPTNS= <>
##$ZL1= 120
##$ZL2= 120
##$ZL3= 120
##$ZL4= 120
##$ABSF1= 198.0616
##$ABSF2= -202.7028
##$ABSG= 5
##$ABSL= 3
##$ALPHA= 0
##$AQORDER= 0
##$ASSFAC= 0
##$ASSFACI= 0
##$ASSFACX= 0
##$ASSWID= 0
##$AUNMP= <proc_1d>
##$AZFE= 0.1
##$AZFW= 0.5
##$BCFW= 0
##$BC_mod= 2
##$BYTORDP= 0
##$COROFFS= 0
##$CY= -3
##$DATMOD= 1
##$DC= 0
##$DFILT= <>
##$DTYPP= 0
##$F1P= 0
##$F2P= 0
##$FCOR= 1
##$FTSIZE= 65536
##$FT_mod= 6
##$GAMMA= 0
##$GB= 0
##$INTBC= 1
##$INTSCL= 9.790993e-09
##$ISEN= 30
##$LB= 1.5
##$LEV0= 0
##$LPBIN= 0
##$MAXI= 10000
##$MC2= 0
##$MEAN= 0
##$ME_mod= 0
##$MI= 50
##$NCOEF= 0
##$NC_proc= -8
##$NLEV= 6
##$NOISF1= 182.463
##$NOISF2= 159.3651
##$NSP= 0
##$NTH_PI= 0
##$NZP= 0
##$OFFSET= 198.0616
##$PC= 4
##$PHC0= 1587.094
##$PHC1= -437.5005
##$PH_mod= 1
##$PKNL= yes
##$PPARMOD= 0
##$PSCAL= 0
##$PSIGN= 0
##$REVERSE= no
##$SF= 81.0140089999434
##$SI= 65536
##$SIGF1= 159.3651
##$SIGF2= -187.1042
##$SINO= 113.3802
##$SIOLD= 16384
##$SREGLST= <1H.CDCl3>
##$SSB= 0
##$STSI= 65536
##$STSR= 0
##$SW_p= 32467.5324675325
##$SYMM= 0
##$S_DEV= 0
##$TDeff= 32768
##$TDoff= 0
##$TI= <>
##$TILT= no
##$TM1= 0
##$TM2= 0
##$TOPLEV= 0
##$USERP1= <user>
##$USERP2= <user>
##$USERP3= <user>
##$USERP4= <user>
##$USERP5= <user>
##$WDW= 1
##$XDIM= 65536
##$YMAX_p= 265962504
##$YMIN_p= -146175669
$$ End of Bruker specific parameters
$$ ---------------------------------
##NTUPLES= NMR SPECTRUM
##VAR_NAME=  FREQUENCY,     SPECTRUM/REAL,   SPECTRUM/IMAG
##SYMBOL=    X,             R,               I
##VAR_TYPE=  INDEPENDENT,   DEPENDENT,       DEPENDENT
##VAR_FORM=  AFFN,          ASDF,            ASDF
##VAR_DIM=   65536,         65536,           65536
##UNITS=     HZ,            ARBITRARY UNITS, ARBITRARY UNITS
##FACTOR=    0.49542278885378, 1,            1
##FIRST=     16045.7642231865, 0,            0
##LAST=      -16421.768244346, 0,            0
##MIN=       -16421.768244346, -146175669,   0
##MAX=       16045.7642231865, 265962504,    0
$$ Real data points
##PAGE= N=1
##DATA TABLE= (X++(R..R)), XYDATA
$$ [...]
6744F172490L81905k178600l808910l583142k134106l59219J101382J587907R37169
6735a883124J95646O02472J683876J542886m48784k347122j959120K84422J969804
6726c59044J838114R19919M79985L11000k22871o46668p8790J108201J521568
6717D871414N42950r63795j722939j239309o9826O06750J2795j166730j341178
6708d69868k42831L69739o07232j311638P11076M324159N490342K576549j376401
6699I463895k759868j739816r25165j340190j842301j738945j747471k186664
6691d816525j948963q4177K458881L545080K219673j43451j358234q95241k06560
6682a229517m25268p65931j28309P00455J47542j303358j468470J50275J470456
$$ plain form
6744 6172490 6554395 4375795 566885 -3016257 -5150363 -5509582 -4408200 -2820293 -1883124
6735 -1883124 -1687478 -1085006 598870 2141756 1692972 -654150 -2613270 -2328848 -359044
6726 -359044 1479070 2398989 2878974 3189974 2967103 2320435 2241645 3349846 4871414
6717 4871414 5414364 4450569 2727630 1488321 1418495 2025245 2038040 871310 -469868
6708 -469868 -712699 -342960 -950192 -2261830 -1550754 2773405 8263747 10840296 9463895
6699 9463895 6704027 4964211 4039046 2698856 856555 -882390 -2629861 -4816525
6691 -4816525 -6765488 -6849665 -4390784 -845704 1373969 1230518 -127716 -1022957 -1229517
6682 -1229517 -1654785 -2420716 -2549025 -1848570 -1701028 -3004386 -4472856 -4322581 -2852125
6673b852125J030231N8512J79669Q14322M05778j034600k155327k180921j348192
6664g082653j96866N97894N73120M17911J319838K620900J935269j126530l418762
6655d359879k434395q2957L54183n63646L36787L175368M379730K178892o61603
6646B322480r47045P18615J562571O77311m69593o18039j76790k57189j149815
6637A662506j955098j726604r68284j215178k514261k560682R4862L086836K902678
6628c193225J056j661346m47676Q49633q0354j223399L07766L307691M004761
6619A864907J416686j692633k812493k114689r21388q4730j89576j218875j512847
6610g265638P75627M339087N099081J488935k693837l019500m20997O34077q59520
$$ plain form
6673 -2852125 -1821894 -1763382 -1583713 -769391 -363613 -1398213 -3553540 -5734461 -7082653
6664 -7082653 -7279519 -6681625 -6108505 -5690594 -4370756 -1749856 185413 -941117 -4359879
6655 -4359879 -6794274 -6877231 -6523048 -7086694 -6749907 -3574539 805191 2984083 2322480
6646 2322480 1375435 2094050 3656621 4333932 3864339 3246300 3069510 2812321 1662506
6637 1662506 -292592 -2019196 -2987480 -4202658 -6716919 -9277601 -9182739 -6095903 -3193225
6628 -3193225 -3192169 -4853515 -5301191 -4451558 -4531912 -5755311 -5447545 -2139854 1864907
6619 1864907 3281593 1588960 -1223533 -3338222 -4259610 -4344340 -4533916 -5752791 -7265638
6610 -7265638 -6490011 -2150924 2948157 4437092 1743255 -1276245 -1697242 -1063165 -1922685
6601a922685j252391J223365K889635K43696m057207m736127j607088O72314o012
6592h552500p10536Q82270K819918K806075J986082K118883K123597O13706o97085
6583C390410K96146J891949R17606j983350l270548k030100p36490p18411p12553
6574b955341k32622n89778j672327j212242J383197L500631L129660J532256O04635
6565C488069J51146n19133p05135J2382K77849q49767k012942j815379j219730
6556c192640j594483k045557j153834m3466q96623l007251l119654M5662L821897
6547a1185949M825630K676091j49397j162202j1780J595029J718927J50031j423240
6538b966860j299697M72138K353924K862004J633922m80191k043976k175563j285222
$$ plain form
6601 -1922685 -3175076 -1951711 937924 1181620 -2875587 -7611714 -9218802 -8546488 -8552500
6592 -8552500 -9263036 -8380766 -5560848 -2754773 -768691 1350192 3473789 4087495 3390410
6583 3390410 3686556 5578505 6496111 4512761 1242213 -787887 -1524377 -2242788 -2955341
6574 -2955341 -3187963 -3777741 -5450068 -6662310 -5279113 -1778482 1351178 2883434 3488069
6565 3488069 3639215 3120082 2414947 2427329 2705178 1855411 -157531 -1972910 -3192640
6556 -3192640 -4787123 -6832680 -7986514 -8029980 -8926603 -11933854 -15053508 -15007846 -11185949
6547 -11185949 -6360319 -3684228 -3833625 -4995827 -5007607 -3412578 -1693651 -1543620 -2966860
6538 -2966860 -4266557 -3794419 -1440495 1421509 3055431 2575240 531264 -1644299 -2929521
6529b929521l71389K09227O31132O53863r7644j089410j368968j006176p41809
6520f110695m50380L74683Q38427m38885k423765k180759R05336L753603L594344
6511b138091J266112p44919j546843j694451j611115j603778j894187j586291
6503a1553563N14483L153880L237242N17404j226062L82192K758755K799239J750263
6494B333833K225546L157666J970483k86855o45895K97603n14369k728246k894166
6485B915600p25855O2224j902059l307265j804857L73718N87384k91530n54819
6476d647459p71147j489635r67603J683645L691954K364701l57253n97011J627816
6467E38008K856335J670552J48849j10427p1173o84137j042165l17423N45500
$$ plain form
6529 -2929521 -3300910 -3091683 -2460551 -1806688 -1904332 -2993742 -4362710 -5368886 -6110695
6520 -6110695 -6561075 -6186392 -5347965 -5786850 -8210615 -10391374 -9486038 -5732435 -2138091
6511 -2138091 -871979 -1616898 -3163741 -4858192 -6469307 -8073085 -9967272 -11553563
6503 -11553563 -11039080 -7885200 -4647958 -4130554 -5356616 -4974424 -2215669 583570 2333833
6494 2333833 4559379 7717045 9687528 9400673 8754778 9052381 8538012 5809766 2915600
6485 2915600 2189745 2251969 349910 -2957355 -4762212 -4388494 -3801110 -4092640 -4647459
6476 -4647459 -5418606 -6908241 -7875844 -6192199 -2500245 -135544 -492797 -1089808 538008
6467 538008 3394343 5064895 5213744 5103317 5032144 4348007 3305842 2988419 3533919
6458C533919M34600j34038j94343j97525j173774k546702k370568p0795K200218
6449e19008J900739n68181k004229l28860K549573K931145N9840k772270k290712
6440a041963Q29623L095384K513669N03377m44946J49266O55763j86308j552385
6431D521480j652242j68978J164236O89918j066518k100090j537002p33982j428319
6422b311497l227483l596396p27959L760405N852498L537644n00331j925463j26010
6413G35408J402768L33033j317057p42993J139985J239874j002062l209756l761677
6404e182477l164822j964703q8880J441180R34134r70548j233699J366344M077737
6395d785734L809177J223781n44341p5938J170729J237156k44965k074677k637725
$$ plain form
6458 3533919 3968519 3834481 3640138 3442613 2268839 -277863 -2648431 -2719226 -519008
6449 -519008 1381731 813550 -1190679 -1519539 1030034 3961179 4021019 1248749 -1041963
6440 -1041963 -212340 2883044 5396713 5900090 5455144 5604410 6260173 6073865 4521480
6431 4521480 2869238 2700260 3864496 4554414 3487896 1387806 -149196 -883178 -2311497
6422 -2311497 -5538980 -9135376 -9863335 -6102930 -250432 3287212 2786881 861418 735408
6413 735408 2138176 2471209 1154152 411159 1551144 2791018 1788956 -1420800 -5182477
6404 -5182477 -8347299 -10312002 -10400882 -8959702 -8025568 -8996116 -10229815 -8863471 -4785734
6395 -4785734 -976557 247224 -297117 -373055 797674 2034830 1789865 -284812 -2922537
6386b922537j255158J099344K751216L057925K419213P67649k246508n132577
6378a461433m790573m72820M045743M427521J165935j199049j23233K017437J829995
6369E439523l41525j484720p36879n67801k591418m545974l437856k55486J307351
6360g214785M54268K34049K098165L157058J096114j454960r18342J347836J400041
6351A99444o71955j286601J39202M49828j063343j047137J689259L286248R03337
6342B598282k444786k431637M17950K506759K496720J456372j50776k133156k821938
6333e06210j001609J463636J784672P9937j359365j437519n69051R35365K379296
6324A769152K147613J74171q35424O51584J960107L92090j862287j195154J016103
$$ plain form
6386 -2922537 -4177695 -3078351 -327135 2730790 5150003 5917652 3671144 -1461433
6378 -1461433 -6252006 -6724826 -2679083 1748438 2914373 1715324 1592091 3609528 5439523
6369 5439523 5097998 3613278 2876399 2308598 -282820 -4828794 -8266650 -8522136 -7214785
6360 -7214785 -6760517 -6526468 -4428303 -1271245 -175131 -1630091 -2548433 -1200597 199444
6351 199444 -472511 -1759112 -1619910 -1170082 -2233425 -3280562 -1591303 1694945 2598282
6342 2598282 153496 -2278141 -1860191 646568 3143288 4599660 4448884 2315728 -506210
6333 -506210 -1507819 -44183 1740489 1820426 461061 -976458 -1545509 -610144 1769152
6324 1769152 3916765 4090936 3255512 3907096 5867203 6259293 4397006 3201852 4217955
6315D217955N68290k188358k823486n47549M95557j269312j860621J417246N200507
6306C210229N273879K475241K7287j580981l381293m372944l132078j167456r69472
6297c617588j893033j382987N17141J220349m4863r55802L62979K770933L737133
6288G14262K101982j104658l554354l366739r22389J247185J102358q74110k845941
6279g502404l683717k912005j47192L662409N707245M241809J240098j00310K86658
6270G92591J46376n38796O53427L683496M647148J230438l336600m463434k319161
6261D95485p94023j670691l092851l311506k578738j044745J863331M858038M758663
6252e17037J016816k355153j906713L69100L34493j841096k352781j00608J902124
$$ plain form
6315 4217955 4786245 2597887 -225599 -773148 -277591 -1546903 -3407524 -1990278 3210229
6306 3210229 8484108 10959349 10986636 9405655 6024362 1651418 -1480660 -2648116 -3617588
6297 -3617588 -5510621 -6893608 -6376467 -5156118 -5200981 -6156783 -5793804 -3022871 714262
6288 714262 2816244 1711586 -1842768 -5209507 -6131896 -4884711 -3782353 -4656463 -7502404
6279 -7502404 -11186121 -14098126 -14245318 -10582909 -4875664 -633855 606243 505933 792591
6270 792591 938967 400171 1053598 4737094 9384242 10614680 7278080 2814646 495485
6261 495485 -298538 -1969229 -5062080 -8373586 -10952324 -11997069 -10133738 -5275700 -517037
6252 -517037 499779 -1855374 -3762087 -3392987 -3058494 -4899590 -7252371 -7352979 -5450855
6243e450855J859501J726802K930015L363936J092439j959345k820678j691244
6235i49429n97810K7746M54741n67489l503221n110613k072430L182101M761818
6226d374586J595296j082246L21495K674421J416943k484840m204908j788485
6218g926910K016438M008576L916950L247705K617147J255476j284574l729322
6210D121486m087601k158607n5170M97048K54025O27815J075925K67548j216733
6201f74264j772509j562519j734835j588551K79264K474149K205252K03245P0828
6192b099940K117823K403582o27319l243453k522180q50994j157018j793210j88577
6183g961286J899937J380982n45287m76016J392608K177357J535037J408107J740980
$$ plain form
6243 -5450855 -3591354 -1864552 1065463 4429399 5521838 3562493 741815 -949429
6235 -949429 -1547239 -1519493 -1064752 -1632241 -5135462 -10246075 -12318505 -9136404 -4374586
6226 -4374586 -2779290 -3861536 -3540041 -865620 551323 -1933517 -6138425 -7926910
6218 -7926910 -5910472 -1901896 2015054 5262759 7879906 9135382 7850808 4121486
6210 4121486 33885 -2124722 -2179892 -1682844 -1428819 -801004 274921 542469 -674264
6201 -674264 -2446773 -4009292 -5744127 -7332678 -7053414 -4579265 -2374013 -2170768 -2099940
6192 -2099940 17883 2421465 1794146 -1449307 -3971487 -4822481 -5979499 -7772709 -7961286
6183 -7961286 -6061349 -4680367 -5225654 -5701670 -4309062 -2131705 -596668 811439 2552419
6174B552419J045442K51235J202854K081955m22686m557336m766749l10098L022830
6165I9866J608085r31203j29212K539033K995721J116221j79870j28190n12278
6156F478173k074994l734723m630613m451206k564970Q32344L449428L081850
6148c614711O64262q16600j39097J185122J526440J031915P54453J094464J427559
6139C113807Q11217q80000k458645k625030j596266n59771K70898J433026K168611
6130c22153R74758j333320j903403l32408J87617j844803l015145j71404L890944
6121c869317M066609N87986j543854j29958J905734K030494J260994N98504j167985
6112C739207l806001l792120N36562M921716M145371p33051m007783l239377j491135
$$ plain form
6174 2552419 3597861 3849096 5051950 7133905 6711219 2153883 -2612866 -2922964 99866
6165 99866 1707951 776748 647536 3186569 6182290 7298511 7118641 6990451 6478173
6156 6478173 4403179 668456 -3962157 -8413363 -10978333 -10145989 -6696561 -3614711
6148 -3614711 -2950449 -3767049 -3906146 -2721024 -1194584 -162669 591784 1686248 3113807
6139 3113807 3925024 3045024 586379 -2038651 -3634917 -4194688 -3923790 -2490764 -322153
6130 -322153 652605 -680715 -2584118 -2916526 -2728909 -4573712 -7588857 -7760261 -3869317
6121 -3869317 197292 785278 -758576 -888534 1017200 3047694 4308688 4907192 3739207
6112 3739207 -66794 -3858914 -3322352 1599364 5744735 5011684 1003901 -2235476 -3726611
6103c726611j569827k027936m35042K355200L520553K234832J79671j091735j453543
6094b014438j181656k65507R88755J738872J445477M56742m34172p25426n24477
6085e15830l93957p23827j021163k32767J747738L361603K962649Q51395j121920
6076D913921j775886j410124n91061M45160R46718j22389k091008k317435N80000
6067a422104M232548N031815K622430L4424n65776k66976j011810k586959l232287
6058B835305k238280o82844L8760m46062j391332j598782m50020J252336J794768
6049h86151L94038j748571k715881j964331o42141L1317J20003N37435J649554
6040e224728K770601L167574L149306L497372L831187K567547p63830l990275
$$ plain form
6103 -3726611 -5296438 -7324374 -7759416 -5404216 -1883663 351169 530840 -560895 -2014438
6094 -2014438 -3196094 -3461601 -2472846 -733974 711503 1168245 734073 8647 -515830
6085 -515830 -909787 -1633614 -2654777 -2887544 -1139806 2221797 5184446 6035841 4913921
6076 4913921 3138035 1727911 1136850 1582010 2528728 2406339 315331 -2002104 -1422104
6067 -1422104 2810444 7842259 10464689 10499113 9933337 9666361 8654551 6067592 2835305
6058 2835305 597025 -85819 -47059 -493121 -1884453 -3483235 -3933255 -2680919 -886151
6049 -886151 -492113 -2240684 -4956565 -6920896 -7563037 -7531720 -7411717 -6874282 -5224728
6040 -5224728 -2454127 713447 3862753 7360125 11191312 13758859 12995029 9004754
6032I004754m347666j813427Q32899J263726k53153j979743k596311j660041L79022
6023a169940J944508J384572q85861k383801j584630J60668P86673M11067N41626
6014g95118J260456J156057q5923r15477k43312R18984R71541j09251j092535
6005A065422j417920j700463k273959k198771m39218K304225L850778K925226
5997B115320N85464j271321k133008k688141k969599k054109L06210K871598L992984
5988a244602K841813r8532k776678k560914O96655L166205J173664l285155m383662
5979f471206m70533L472543L117132O92737N61742K270412K246137J08581j512402
5970D015143k215709l931058o083380n518630j806203J805045L547184M908078
$$ plain form
6032 9004754 4657088 2843661 3676560 4940286 4687133 2707390 111079 -1548962 -1169940
6023 -1169940 774568 2159140 1273279 -1110522 -2695152 -2534484 -1747811 -1336744 -795118
6014 -795118 465338 1621395 1535472 619995 376683 1295667 2267208 2157957 1065422
6005 1065422 -352498 -2052961 -4326920 -6525691 -6964909 -4660684 -809906 2115320
5997 2115320 2700784 1429463 -703545 -3391686 -6361285 -8415394 -8109184 -5237586 -1244602
5988 -1244602 1597211 1498679 -1277999 -3838913 -3142258 23947 1197611 -2087544 -6471206
5979 -6471206 -6941739 -3469196 -352064 340673 902415 3172827 5418964 5527545 4015143
5970 4015143 1799434 -2131624 -8215004 -13733634 -15539837 -13734792 -10187608 -5279530
5962e279530O197579N032261J205359j399741m82733J034681R8092j502720r00576
5953D002672M73645l69828k410643k378128k94579J236758J842000K828079K945700
5944G875676j82837m668506n567790k113117J092380J192203O56174K014274L545615
5935C844072K815832P72062n45408j254449j789551p83826K072943L670038J427786
5926A0229499k416812l902691k947394k284851k357336j292972Q44927J856414
5918b271216J337876J098254J513438J070919j53546l42416Q7257j574412n006881
5909d240727n665165j463071K997817K389862j802703l658527j057864K584946
5901i915432M085209L788811K777824O92102k201847l769030k817885j177498
$$ plain form
5962 -5279530 918049 5950310 7155669 5755928 5273195 6307876 6405968 4903248 4002672
5953 4002672 4476317 4106489 1695846 -682282 -976861 259897 2101897 4929976 7875676
5944 7875676 7692839 3024333 -2543457 -4656574 -3564194 -2371991 -1715817 298457 3844072
5935 3844072 6659904 7431966 6886558 5632109 3842558 3058732 5131675 8801713 10229499
5926 10229499 7812687 3909996 962602 -1322249 -3679585 -4972557 -4127630 -2271216
5918 -2271216 -933340 164914 1678352 2749271 2595725 2253309 2340566 766154 -4240727
5909 -4240727 -9905892 -11368963 -8371146 -5981284 -7783987 -11442514 -12500378 -9915432
5901 -9915432 -5830223 -2041412 736412 1428514 -773333 -4542363 -7360248 -8537746
5893h537746j103946k055636j815641K50695K764414M404576M794151L804421
5885B505288J564673q87402k183530j954865q83672K71240R85557R08517M48941
5876G74747P01303J605911J164640j680020m279132l052130J172565L679635K315294
5867B402813J08824K6181N70065p43607k557446k066613j66339R3071r51019k09673
5857c493743K221573K636023N1700j788915n35449J117637M82001n73760L81788
5848D98855J387334m63176l192875k518407J050229K586949K5648l319529l914260
5839g859232j837424J194345M043901N393578L988230R26022q83892n40117M517
5830D429928m89575r73388q45617j132989j815425j176894P20465J195967n59169
$$ plain form
5893 -8537746 -9641692 -11697328 -13512969 -13262274 -10497860 -6093284 -1299133 2505288
5885 2505288 4069961 3182559 999029 -955836 -1839508 -1568268 -582711 325806 774747
5876 774747 1476050 3081961 4246601 2566581 -1712551 -4764681 -3592116 87519 2402813
5867 2402813 2511637 2537818 3107883 2364276 -193170 -2259783 -2426122 -2333051 -3284070 -3493743
5857 -3493743 -1272170 1363853 1415553 -373362 -908811 208826 690827 117067 498855
5848 498855 1886189 1423013 -1769862 -4288269 -3238040 -651091 -625443 -3944972 -7859232
5839 -7859232 -9696656 -8502311 -4458410 935168 4923398 5849420 4965528 4425411 4429928
5830 4429928 3940353 2966965 2121348 988359 -827066 -2003960 -1283495 -87528 -646697
5821f46697j469112N53444K900285K391506K63008m02561J51750m24432j959438
5812A357753k314816j421463r04747m94685J287082L311401K766040O6168j088175
5803B564558O56439K206456Q20782k076255l452922k563372p03504R35424J697208
5794H4814J298272M17787J85672L84013m08742k337302l551646k620596j86665
5785f734393K273206L831012L933181K528481P30289k57587r30036k343913l485278
5776d55038k403788R926O03024j009549j406046J298883M374042M622021K592220
5767H225695M93925j204796k602590k534499q13084Q4307j367045k617374q30746
5758c166207K220387K733619P32845o12120l72776m22003j207502j141804j72157
$$ plain form
5821 -646697 -2115809 -1562365 1337920 3729426 3992434 3589873 3741623 3317191 1357753
5812 1357753 -957063 -2378526 -3283273 -3777958 -2490876 820525 3586565 3652733 2564558
5803 2564558 3220997 5427453 6248235 4171980 719058 -1844314 -2547818 -1612394 84814
5794 84814 1383086 1800873 1986545 2370558 1961816 -375486 -3927132 -6547728 -6734393
5785 -6734393 -4461187 -630175 3303006 5831487 6561776 6304189 5374153 3030240 -455038
5776 -455038 -2858826 -2848900 -2245876 -3255425 -4661471 -3362588 1011454 5633475 8225695
5767 8225695 8719620 7514824 4912234 2377735 1564651 1648958 281913 -2335461 -3166207
5758 -3166207 -945820 1787799 2520644 1908524 1535748 1113745 -93757 -1235561 -1407718
5749a407718J1954m40868L27561J773742J122603j433584k032068O19071K458655
5740I99348J89410l424742l812020j405049j94986j035880o21901K847683O502944
5731D4807O455555K511399j990125l954982l226745j957373j909086k597141k274959
5722h898650m45856J500355K221374J805593Q03968p46259k407671k714037q73333
5713i754516J611104K419451J200815k64754m63562L50621J000164Q52562L31682
5704b716433M24184J588984K922514K872672J137733q09048j629881j768886k333574
5695c11735l041074k500454l04857K285274L809966L908939L099862K066892J362223
5686A0375036J146152Q94752k25776k362356m487955n125005l674070j103033
$$ plain form
5749 -1407718 -1395764 -1836632 -1509071 264671 1387274 -46310 -2078378 -1459307 999348
5740 999348 1188758 -2235984 -6048004 -7453053 -7648039 -8683919 -9305820 -6458137 44807
5731 44807 6500362 9011761 7021636 3066654 -160091 -2117464 -4026550 -6623691 -8898650
5722 -8898650 -9344506 -7844151 -5622777 -3817184 -3013216 -3759475 -6167146 -8881183 -9754516
5713 -9754516 -8143412 -5723961 -4523146 -4787900 -5251462 -4900841 -3900677 -3048115 -2716433
5704 -2716433 -2292249 -703265 2219249 5091921 6229654 5420606 3790725 2021839 -311735
5695 -311735 -3352809 -5853263 -6158120 -3872846 -62880 3846059 6945921 9012813 10375036
5686 10375036 11521188 12415940 12190164 9827808 5339853 214848 -3459222 -4562255
5678d562255Q25170J286156J235410K111952L874874N008655M438629K586506
5670A6805097M16281j541499k865195l074173k503427k395753l244589l829883
5662b233141k850123q39453N64296P40503M61515N58083J152535J853799J897701
5653A305715O37812j224312j705433j02823J355752K45283k200420k284085R39120
5644c033391M102741M133386K137912J006000R65545n6345k522168m338303l952178
5635a556801k223143n99119O94907J673383J497291q1018j335263m72647J659528
5626g42882K656366K077364J761173K397666K185004M28k294338k564185j704125
5617C772471j928326l000734k878172j430993n34608n24857K78469J949053K139311
$$ plain form
5678 -4562255 -3737085 -2450929 -1215519 896433 4771307 9779962 14218591 16805097
5670 16805097 17221378 15679879 12814684 9740511 7237084 4841331 1596742 -2233141
5662 -2233141 -5083264 -5922717 -5358421 -4617918 -4156403 -3598320 -2445785 -591986 1305715
5653 1305715 1943527 719215 -986218 -1089041 266711 511994 -1688426 -3972511 -3033391
5644 -3033391 1069350 5202736 7340648 8346648 9312193 9255848 6733680 2395377 -1556801
5635 -1556801 -3779944 -4379063 -3684156 -2010773 -513482 -594500 -1929763 -2402410 -742882
5626 -742882 1913484 3990848 5752021 8149687 10334691 10335119 8040781 5476596 3772471
5617 3772471 1844145 -1156589 -4034761 -5465754 -6000362 -6525219 -6246750 -4297697 -2158386
5608b158386K68408o02577J655713M338995L461012m77533l277532k672467l95494
5599A40139Q84306J92451j865442l548625k632269J061024M059375K694085j822507
5590h37463m320251k018728K444529M794759L554088J10239l153899l816684q64660
5581d108070L418864M853550J959334k354364m553891m067726k187971L18632
5573f721642K867818M204290L715687K280335N58747j816717m087559l750712
5565b749753j48212L442884L752147J699924J22969n98089j427040j173518J626710
5556D548022M343625K530350l166068o875313n401273k100409j087377j475118
5548h683561k21352K259790K874704Q09867j439451j650013k18465J077088J155723
$$ plain form
5608 -2158386 -1889978 -2492555 -836842 3502153 6963165 6485632 3208100 535633 140139
5599 140139 1024445 1216896 -648546 -4197171 -6829440 -5768416 -1709041 985044 -837463
5590 -837463 -5157714 -7176442 -4731913 62846 3616934 3727173 573274 -3243410 -4108070
5581 -4108070 -689206 4164344 6123678 3769314 -784577 -4852303 -7040274 -6721642
5573 -6721642 -3853824 350466 4066153 6346488 6905235 5088518 1000959 -2749753
5565 -2749753 -2897965 544919 4297066 5996990 6119959 5521870 4094830 2921312 4548022
5556 4548022 8891647 11421997 8255929 1380616 -4020657 -6121066 -7208443 -8683561
5548 -8683561 -8904913 -6645123 -3770419 -2960552 -4400003 -6050016 -6268481 -5191393 -4035670
5539d035670M10384K10824J405524K995299L076358J398102j98600l46576K25931
5530E141576K29459n29689j683211k816558k744848l12356L045300L813611R79087
5521E122371k176708k625829j422786p39217L2086J815308K152786j316490n234102
5512d392581l851829K130819N616653L143631n39691l38875J766622J064362j957626
5503B641485k936237q29768J151912J203284J021360J795440J972504L54869j530030
5494D844819j876314j325626j499475k270624k198781p75265J229257L000945
5486h71064L946758L286241Q50984j861503k800969j690570j21939P53919J239174
5477B731031J423401K89536k208158l665165j961314J224951K076074j74684k251606
$$ plain form
5539 -4035670 -3625286 -3414462 -2008938 986361 4062719 5460821 5262221 4915645 5141576
5530 5141576 5371035 4841346 3158135 341577 -2403271 -2715627 329673 4143284 5122371
5521 5122371 2945663 319834 -1102952 -1842169 -1810083 5225 2158011 841521 -4392581
5512 -4392581 -8244410 -6113591 -496938 2646693 2107002 1768127 3534749 4599111 2641485
5503 2641485 -294752 -1124520 27392 1230676 2252036 4047476 6019980 6374849 4844819
5494 4844819 2968505 1642879 143404 -2127220 -4326001 -5101266 -3872009 -871064
5486 -871064 3075694 6361935 7212919 5351416 2550447 859877 737938 1491857 2731031
5477 2731031 4154432 4443968 2235810 -1429355 -3390669 -2165718 -89644 -264328 -2515934
5468b515934j660797J41741P94158O86484J315790K012924J169438n28545j026984
5459C88275k46599M09547J106607K745135L550844O53295m319801n564456r11007
5450b188160M419503M509565J74954l305269l376842j659342j1980R89369L68221
5441g9981k720736o383886o838510k838008K549938N243678M001062Q51314j050741
5432g265870O3845L050933M770240L333398J26325k110889k384361j571725m85495
5423b473599O38833J438931J744578K020430K223417J190941j342142l349223
5415B092166l080450j830956j817779k390498j161633J792101L916866M097726
5407A617543L488182K447329J5621k966233l573888r90279J743466J702865l83227
$$ plain form
5468 -2515934 -4176731 -4034990 -3240832 -2554348 -1238558 774366 1943804 1415259 388275
5459 388275 141676 551223 1657830 4402965 7953809 8607104 4287303 -1277153 -2188160
5450 -2188160 2231343 6740908 6915862 3610593 233751 -1425591 -1437571 -448202 -79981
5441 -79981 -2800717 -9184603 -16023113 -18861121 -16311183 -11067505 -7066443 -6215129 -7265870
5432 -7265870 -7202025 -4151092 619148 3952546 4078871 1967982 -416379 -1988104 -2473599
5423 -2473599 -1834766 -395835 1348743 3369173 5592590 6783531 5441389 2092166
5415 2092166 -988284 -2819240 -4637019 -7027517 -8189150 -6397049 -2480183 1617543
5407 1617543 5105725 7553054 7568675 4602442 1028554 38275 1781741 3484606 3101379
5398C101379j956913j981760j051934J28300J009170J218051J156803J322618
5390B945714Q65949j267316l702943l762969j582210k570L29456J953310N129182
5381I05603N689583J441953l095409k670165P97185J340225j722125l270426j065674
5372a649250Q38410q83717l297670j958011K073244L832110J550717j539326k314832
5363c348325j427453q55894k75750J994668N377117O656710L797387j217355m326106
5354F374999l559298n34690J651514J231382j050427k714733j909745L29900R28274
5345G47176j275901l569518k836005J65373K062337J505041K6131j106431j933693
5336f215490j874475l2354K133642J729158j132492l003554k206661q26428k91391
$$ plain form
5398 3101379 1144466 -837294 -1889228 -1760928 -751758 466293 1623096 2945714
5390 2945714 3811663 2544347 -1158596 -4921565 -6503775 -6506345 -6176889 -4223579 905603
5381 905603 6595186 8037139 4941730 2271565 3068750 4408975 2686850 -583576 -1649250
5372 -1649250 -810840 -1694557 -4992227 -6950238 -4876994 -1044884 505833 -1033493 -3348325
5363 -3348325 -4775778 -5631672 -5907422 -3912754 1464363 8121073 11918460 10701105 6374999
5354 6374999 2815701 2281011 3932525 5163907 4113480 1398747 -510998 -181098 747176
5345 747176 -528725 -4098243 -6934248 -6768875 -4706538 -3201497 -3175366 -4281797 -6215490
5336 -6215490 -8089965 -8122319 -5988677 -4259519 -5392011 -8395565 -10602226 -11428654 -11720045
5327a1720045J131463M175810N718248L354116j84167q35392Q46565J244649n92914
5318C138333k450809k906295k328560q88007J211998K328270J168447q33577j614480
5309c174680j700938k392299k294428N83997M349115M976343K204140l08364p14516
5300A528370q75798k038155k534113j066037Q80860J387292N47897n27337j238828
5291c935849j298135o70705l8334J26617N63929J613710J603065p65457l480781
5282f281940l620200j749380o53769n99714L40410J942166K132626J380561K132044
5273d977196L658815K461318j308462k959139m77831K253849J750205j34081l66210
5264i8732K88238k18764j095998n59521P60984J325530J394452J591091R48642
$$ plain form
5327 -11720045 -10588582 -6412772 -694524 2659592 2475425 1640033 2486598 3731247 3138333
5318 3138333 687524 -2218771 -4547331 -5435338 -4223340 -1895070 -726623 -1560200 -3174680
5309 -3174680 -4875618 -7267917 -9562345 -8978348 -4629233 347110 2551250 2242886 1528370
5300 1528370 652572 -1385583 -3919696 -4985733 -4104873 -2717581 -2169684 -2697021 -3935849
5291 -3935849 -5233984 -5904689 -5943023 -5816406 -5252477 -3638767 -2035702 -2801159 -6281940
5282 -6281940 -9902140 -11651520 -12305289 -12905003 -12564593 -10622427 -8489801 -7109240 -4977196
5273 -4977196 -1318381 1142937 -165525 -3124664 -3602495 -1348646 401559 267478 -98732
5264 -98732 189506 -29258 -1125256 -1684777 -923793 401737 1796189 3387280 4335922
5255D335922j068291k647711k136186o15586N8206q0473j01102J82077R14002
5246a159142K238804K706546O46435k070394j620849J265854J374860k360462
5238A021652m029393p5615M338301L326855n92674j588361k89201j157739l294443
5229b340618j967331K146050L257144J6320k553621j528709K18678K56115L01227
5220b194745J537190J705198m39491k241590j392353N73144J327005J071070Q40506
5211G85934N20551K74377R89907J813544L68469l002460m444988j900925J810792
5202b784799L164210K291876J135347P8887j114749j376132K6470J552405J355824
5193D329339q4596j104231j406056j878183k811967l481991k842636m22145K402585
$$ plain form
5255 4335922 3267631 619920 -1516266 -2131852 -2073646 -2154119 -2255221 -2073144 -1159142
5246 -1159142 1079662 3786208 4432643 2362249 741400 2007254 3382114 1021652
5238 1021652 -3007741 -3083356 1254945 4581800 3989126 2400765 2111564 953825 -2340618
5229 -2340618 -4307949 -2161899 1095245 1111565 -1442056 -2970765 -2752087 -2495972 -2194745
5220 -2194745 -657555 1047643 608152 -1633438 -3025791 -2452647 -1125642 -54572 785934
5211 785934 1306485 1580862 2570769 4384313 4752782 1750322 -2694666 -4595591 -2784799
5202 -2784799 379411 2671287 3806634 3885521 2770772 1394640 1421110 2973515 4329339
5193 4329339 4244743 3140512 1734456 -143727 -2955694 -6437685 -9280321 -9702466 -7299881
5184g299881K683650l22738k516912L11677N398933N463565p11242n543746l241010
5175e777704K039092L002496k6899r76223J811085L683625J686685j272566j614966
5166B554625r9517L99676q37986k412947l221558l047520j861862M7163J724301
5157f755625K155749J108764p25281k137433k183115j012255L42321J234455J793523
5148f178897J838052O61985j391272k522332j727857j60518R14963J955914L380581
5139c229381L734689J913917k04880j17182J343184J488138N14806J033212K774526
5130I251029K016695k206681n290699l295101J008387K011521o49813k103906
5122G41432Q9478K545603J510315j785831l524756k697100j297839m36749O47564
$$ plain form
5184 -7299881 -4616231 -4938969 -7455881 -7144204 -1745271 3718294 3007052 -2536694 -5777704
5175 -5777704 -3738612 -736116 -763015 -1739238 71847 3755472 5442157 4169591 2554625
5166 2554625 2455108 2854784 2016798 -396149 -3617707 -6665227 -8527089 -8479926 -6755625
5157 -6755625 -4599876 -3491112 -4216393 -6353826 -8536941 -9549196 -9206875 -7972420 -6178897
5148 -6178897 -4340845 -3678860 -5070132 -7592464 -9320321 -9480839 -8565876 -6609962 -3229381
5139 -3229381 505308 2419225 2214345 2097163 3440347 4928485 5443291 6476503 9251029
5130 9251029 11267724 9061043 3770344 475243 1483630 3495151 2845338 741432
5122 741432 830910 3376513 4886828 3100997 -423759 -3120859 -4418698 -4855447 -4207883
5113d207883J827847J345320j120018k919534j696608J246787K704753J823387
5105i95949O28719O55142J141321R28282K53558k67509r32281j906070j989512
5096b484299j43173K188038K133098q49524l855576m077417k142885m83776N23819
5087i191695K371118M479855L579008j270766n591052m499808N01634L278716
5079f342990J223884k166649l326811k894597k121117N98502N919692R522375
5071D12289O751486j61809m273202k991689m85080n78776j710843p16125J906255
5062a847494L077036J488045j262321k768698j777335R21104K852713K308143
5054B991193O49537M49973J301800J45981l464749n541797l052752J445376L237138
$$ plain form
5113 -4207883 -2380036 -1034716 -2154734 -5074268 -6770876 -5524089 -2819336 -995949
5105 -995949 -367230 287912 1429233 2357515 2611073 2343564 1411283 -494787 -2484299
5096 -2484299 -2627472 -439434 1693664 844140 -3011436 -7088853 -9231738 -9715514 -9191695
5087 -9191695 -6820577 -2340722 1238286 -32480 -5623532 -10123340 -9621706 -6342990
5079 -6342990 -5119106 -7285755 -10612566 -13507163 -15628280 -15029778 -9110086 412289
5071 412289 7163775 7001966 2728764 -262925 -748005 -1326781 -3037624 -3753749 -1847494
5062 -1847494 1229542 2717587 1455266 -1313432 -3090767 -2169663 683050 2991193
5054 2991193 3640730 4090703 5392503 5538484 2073735 -3468062 -6520814 -5075438 -1838300
5045a838300J730158L26002R76420J968315J226976p97870k383541k863527k648032
5036d303399k040256j106420k00553K78582N23258J023954J580609J289257q0632
5027c035600j319102j205748k75666K7871k80817R4051R93293M23080k041250
5018f619888l623017j931002J506211L354609K721187J137021l11535j345230
5010e111644j160881N37494K027634J728914R68367J824645L278515K772014P14423
5001G579481k77966j35368j303009l895390m908272k884974K19685K393046L334743
4992A21976K607345j45171k705920k084896N74878J116713r80934j840388j04198
4983c440595O82630j419081l092168j449886J314354K123593J642567J515412
$$ plain form
5045 -1838300 -108142 217860 1194280 3162595 4389571 3591701 1208160 -1655367 -4303399
5036 -4303399 -6343655 -7450075 -7650628 -7372046 -6848788 -5824834 -4244225 -2954968 -3035600
5027 -3035600 -4354702 -5560450 -5836116 -5808245 -6089062 -5995011 -5001718 -4578638 -6619888
5018 -6619888 -10242905 -12173907 -10667696 -7313087 -4591900 -3454879 -3766414 -5111644
5010 -5111644 -6272525 -5735031 -3707397 -1978483 -1010116 814529 4093044 6865058 7579481
5001 7579481 7301515 7166147 5863138 1967748 -2940524 -5825498 -5605813 -3212767 121976
4992 121976 2729321 2584150 -121770 -2206666 -1631788 -515075 -1496009 -3336397 -3440595
4983 -3440595 -2757965 -4177046 -7269214 -8719100 -7404746 -5281153 -3638586 -2123174
4975b123174J027057j97189j26792J634472J718930j473689m132659k907398m17965
4966f998407m17556j326020K31519K775393K572172L89565j37505Q86007L81011
4957a643821j452635j307775J061364K018838q7040k496022k352391k82566J131670
4948e410378M05669j530135k005879M03585K944642J314933l599673n427863j158089
4939a4063188L933598L825288J57569j548306n77797n00969k368602l768517l206003
4930a8116927j043784K263083N089544M266010k15765l056699n89834L369607
4922h034765L395209N98454n51146Q4627o082j8528J721708K442001q23114m495311
4912e686947l444250p7636m88945l816503l953488l38140J596085K0596j391107
$$ plain form
4975 -2123174 -1096117 -1293306 -1420098 214374 1933304 459615 -3673044 -6580442 -6998407
4966 -6998407 -7415963 -8741983 -8510464 -5735071 -3162899 -2773334 -2910839 -2024832 -1643821
4957 -1643821 -3096456 -4404231 -3342867 -1324029 -1411069 -3907091 -6259482 -6542048 -5410378
4948 -5410378 -5004709 -6534844 -8540723 -8137138 -5192496 -3877563 -7477236 -12905099 -14063188
4939 -14063188 -10129590 -6304302 -6146733 -7695039 -8272836 -8773805 -11142407 -14910924 -18116927
4930 -18116927 -19160711 -16897628 -11808084 -7542074 -7757839 -10814538 -11404372 -8034765
4922 -8034765 -4639556 -4041102 -4592248 -4507621 -4513703 -4532231 -2810523 -368522 -1191636 -5686947
4912 -5686947 -9131197 -9208833 -9697778 -13514281 -17467769 -17805909 -16209824 -16189228 -17580335
4903a7580335p46532L63414J693185L776586L983110K81866l301779k474342o63354
4894a4668181k826969n455333k742975J672598P04497k767742j393611K061993
4886b5415723Q4306m023587k274023P67073m310515j1164561o907357J800138
4878e1444249j949306j2478613j0019813k177097j5809688l8018424j4278479
4871a46175669O6317766J28997702J01602167J4067686m1732538l2191733o087239
4864H4798142n988080j6022024r974414J620796q62234q922319n841160J695116
4856D0503823j021904q462276o718187N88894R26909l577803k204737K993920
4848B3028639J536790n351777o793962j157198K612375O16918k270656k949613
$$ plain form
4903 -17580335 -18326867 -17963453 -16270268 -12493682 -8510572 -8228706 -11530485 -14004827 -14668181
4894 -14668181 -17495150 -22950483 -25693458 -24020860 -23316363 -26084105 -27477716 -25415723
4886 -25415723 -25331417 -29355004 -31629027 -30861954 -35172469 -46337030 -53244387 -51444249
4878 -51444249 -53393555 -65872168 -75891981 -78069078 -93878766 -131897190 -146175669
4871 -146175669 -79857903 49139799 150741966 164809652 123077114 90885381 84798142
4864 84798142 78810062 62788038 52813624 54434420 53572186 44649867 38808707 40503823
4856 40503823 39481919 31019643 24301456 24890350 25817259 22239456 20034719 23028639
4848 23028639 24565429 19213652 12419690 11262492 13874867 14491785 12221129 9271516
4840I271516l050288k596426l55938J096131q87216k644824L72499M839101M491179
4831A0535734O97553n06124Q89278O2470k855473l092979j95049J532693Q61231
4822G929334M94735P96166k93160j741864o35742J715549J451296o90842m84680
4813H540792J978978K271359n56388k618492k140840j588726j982664r75094J932260
4804D861185L464760J748407p89529j433615p05135m74126j266281k363632k500840
4795E41194m80187K866416M219157J763340j668493k363298j019320p95207j798520
4786A265082j734058p02429o86784j062724N34374L120547K977789l30233l043937
4777C37627k849410j220574M14625K482313M245237L265514m10623l084453k272536
$$ plain form
4840 9271516 6221228 3624802 3268864 4364995 3477779 832955 1205454 6044555 10535734
4831 10535734 11233287 10727163 11616441 11678911 8823438 5730459 5535410 7068103 7929334
4822 7929334 8424069 9220235 8927075 7185211 6549469 8265018 9716314 9025472 8540792
4813 8540792 10519770 12791129 12234741 9616249 7475409 5886683 3904019 2928925 4861185
4804 4861185 8325945 10074352 9284823 7851208 7146073 6671947 5405666 3042034 541194
4795 541194 61007 2927423 7146580 8909920 7241427 4878129 3858809 3063602 1265082
4786 1265082 -468976 -1171405 -1858189 -2920913 -2386539 734008 3711797 3381564 337627
4777 337627 -2511783 -3732357 -3317732 -835419 3409818 6675332 6264709 3180256 907720
4768I07720J40375J260094J061134J135856J680594J589301M00970j083241j613391
4759E479412p03538N13570L65617p20060k91138K053466L024682N62931k121338
4750H163604j103714J768884J618598j513780k758699l15338K094408J582232
4742I536195n1262m68868m14040j024915j234339k39756L72387p84442k528749
4733C162211l132807k583995j474460R6257J327166Q90567m82785j48298K452892
4724A06748M569522M227977K727197J538508k21748l121662n068557m195518j797703
4715a235236M3904J480331K959077K742939k37834k929099j511678K622890M187600
4706H122894J344982j951960j876101K55445P21495j102487k401964j236801R84302
$$ plain form
4768 907720 1048095 2308189 3369323 4505179 6185773 7775074 8176044 7092803 5479412
4759 5479412 4775874 5289444 5655061 4935001 4643863 6697329 9722011 10284942 8163604
4750 8163604 7059890 8828774 10447372 8933592 6174893 5859555 7953963 9536195
4742 9536195 9484933 9016065 8602025 7577110 6342771 6103015 6475402 5690960 3162211
4733 3162211 29404 -2554591 -4029051 -3932794 -2605628 -1715061 -2197846 -2346144 106748
4724 106748 4676270 8904247 11631444 13169952 12948204 9826542 4757985 562467 -1235236
4715 -1235236 -1191332 288999 3248076 5991015 5753181 2824082 1312404 3935294 8122894
4706 8122894 9467876 7515916 5639815 5895260 6616755 5514268 3112304 1875503 2859805
4697B859805J697483N25291n11277K11582J817273K029935r5476l124551m660197
4688G49868l251679O35325M538555N233315J598164l438146n281252k686080R07814
4679i94116J837163M85579l23691J96764K98429p04600j003914O11822K358113
4670B761549J924003L4265o70099J99935K44706j667877l335940k627720p91183
4661c928361j82504l81599N45715J974853J452850n98547p79841J647463K795635
4652B545664l811l611642l412732L5233K158285Q95374j369320j977876r86474
4643e727299K47158R11107O14633o29727j682171r77346J501830L883449M292417
4634B434051K542086K08455n33115J108983L158073K575663r09042m076729m237512
$$ plain form
4697 2859805 4557288 5082579 4571302 4782884 6600157 8630092 8534616 5410065 749868
4688 749868 -2501811 -1866486 2672069 7905384 9503548 6065402 784150 -1901930 -994116
4679 -994116 843047 1328626 1004935 1201699 1500128 795528 -208386 403436 2761549
4670 2761549 4685552 4719817 4049718 4249653 4494359 2826482 -509458 -3137178 -3928361
4661 -3928361 -4110865 -4492464 -3946749 -1971896 -519046 -1117593 -1897434 -249971 2545664
4652 2545664 2541853 -1069789 -4482521 -4447288 -2289003 -1393629 -2762949 -4740825 -5727299
4643 -5727299 -5480141 -4569034 -3954401 -4584128 -6266299 -7243645 -5741815 -1858366 2434051
4634 2434051 4976137 5184592 4651477 5760460 8918533 11494196 10585154 6508425 2270913
4625B270913k222037j55979J546277L006990K879999K63016k855403l747101k387584
4616a400909m54447J455331K964168K283378j101046l853565k844397k81817l69977
4607c603281k190950j279994K248817L273653K09211k149299n13161J815394J041641
4598a147969q07416R6939K707647L084689P28645j447230k038549k062160j831776
4589b717180o42530P12548M36362j086749j447016L1195J227263O42872l86737
4580c229972q8798R09626P66959n27845j044311K79551K177647K792523J703390
4571C738770l91508k772796m364624l618431o74201J364919k2864k551203j843342
4562a1135280J690893L047716O82124p64636J629618L763566J506409j807196
$$ plain form
4625 2270913 48876 -107103 1439174 4446164 7326163 7589179 4733776 986675 -1400909
4616 -1400909 -1855356 -400025 2564143 4847521 3746475 -107090 -2951487 -3233304 -3603281
4607 -3603281 -5794231 -7074225 -4825408 -1551755 -1342544 -3491843 -4005004 -2189610 -1147969
4598 -1147969 -1955385 -1858446 849201 3933890 4662535 3215305 1176756 -885404 -2717180
4589 -2717180 -3359710 -2647162 -2210800 -3297549 -4744565 -4713370 -3486107 -2843235 -3229972
4580 -3229972 -3318770 -2409144 -1642185 -2170030 -3214341 -2934790 -757143 2035380 3738770
4571 3738770 3347262 574466 -3790158 -7408589 -8082790 -6717871 -6740735 -9291938 -11135280
4562 -11135280 -9444387 -6396671 -5714547 -6479183 -4849565 -1085999 420410 -1386786
4554a386786r17914J999718Q27317l710235m688882k16099L670337K615747m41826
4545b248623j403251o43973Q7023J053132K021965J033327j669392k685553p23332
4536e178677J328765J493522J296155J387112k08937l024552k900341R04272K826400
4527b076281o96206n079235m335894N45130M705749O583405O887537M571272l92621
4518A0712856l609195j645796J813791J014706l022184m631355k524389n32337
4510b423903n51467p42554k50351k43789m34731N75199J792492J234330J66517
4501h78257J190523K853265J385738k490382l898450j250926J834992K729772
4493A476275K816436L172224K121795r36403l229514k355866M31018K276792J903217
$$ plain form
4554 -1386786 -2304700 -304982 522335 -3187900 -7876782 -8092881 -4422544 -1806797 -2248623
4545 -2248623 -3651874 -4295847 -4208824 -3155692 -1133727 -100400 -1769792 -4455345 -5178677
4536 -5178677 -3849912 -2356390 -1060235 326877 117940 -2906612 -5806953 -4902681 -2076281
4527 -2076281 -2772487 -7851722 -12187616 -11642486 -6936737 -353332 6534205 11105477 10712856
4518 10712856 7103661 5457865 7271656 8286362 5264178 632823 -1891566 -2423903
4510 -2423903 -2975370 -3717924 -3968275 -4212064 -4646795 -4071596 -2279104 -1044774 -878257
4501 -878257 312266 3165531 4551269 2060887 -1837563 -3088489 -1253497 1476275
4493 1476275 4292711 7464935 9586730 8650327 5420813 3064947 3495965 5772757 7675974
4484G675974q3853k029942k150299n46263K44779j145153k217770n19474J675944
4475I03943Q08452j543640r54651K111302K810201J29207j642378n49703J49174
4466B221907j478451k609636j324305j47567q32186p34499J920481L737023J373970
4457B126737k540769l069887R5550L242040M007294K724889M05907j507691j286615
4448D197455M31430K71319k939085n427296l791316m07993K69842j440157j698134
4439a0533935K58911J493052R37642J056666L207653N048778M004677Q55867j473208
4430D856103j239996P67305K240765J593011q7906n2424K085283K810866o28108
4421A2344899n279908n416382k78728M424929L720562p82024l895059l434562
$$ plain form
4484 7675974 7592121 5562179 3411880 2865617 3110396 1965243 -252527 -772001 903943
4475 903943 1712395 168755 -785896 1325406 4135607 4264814 2622436 2072733 2221907
4466 2221907 743456 -1866180 -3190485 -3338052 -4170238 -4904737 -2984256 752767 2126737
4457 2126737 -414032 -3483919 -3388369 -146329 3860965 6585854 6991761 5484070 4197455
4448 4197455 4628885 4900204 1961119 -3466177 -7257493 -7665486 -7395644 -8835801 -10533935
4439 -10533935 -10275024 -8781972 -7844330 -6787664 -3580011 1468767 5473444 6329311 4856103
4430 4856103 3616107 4383412 6624177 8217188 8129282 8076858 10162141 12973007 12344899
4421 12344899 7064991 1648609 1369881 5794810 9515372 8733348 4838289 1403727
4413A403727j482540l80740j01040L51509R79818J137414P70834L68437N7075
4404C104494n07571j392241k073964k075313j645366j522896j941643k008793
4396a0063293n02183K325202M182438L064489J79638r83095P44380K315317P98706
4387B061599k121194k602870l91901J302908J200724J241774K084286J627776
4379D403102n27612j424520J52530J034949q06182k029828P52625M726461M681027
4370A0962552P22615k644778l415975l207654k770967j368146j1080n77582j881746
4361d192761r36870K036010L909657L541545K267962K36659l117318n465757l544130
4352e265003J247359M113033L776979L108914K973312J233317j638239k093272
$$ plain form
4413 1403727 -78813 -459553 -560593 -209084 770734 1908148 2678982 3047419 3104494
4404 3104494 2596923 1204682 -869282 -2944595 -4589961 -6112857 -8054500 -10063293
4396 -10063293 -10565476 -8240274 -4057836 -993347 -813709 -1796804 -1052424 1262893 2061599
4387 2061599 -59595 -2662465 -3054366 -1751458 -550734 691040 2775326 4403102
4379 4403102 3875490 2450970 2603500 3638449 2832267 802439 1555064 6281525 10962552
4370 10962552 11685167 9040389 5624414 2416760 -354207 -1722353 -1733433 -2311015 -4192761
4361 -4192761 -5129631 -3093621 816036 4357581 6625543 6862202 3744884 -1720873 -5265003
4352 -5265003 -4017644 95389 3872368 6981282 9954594 11187911 9549672 7456400
4344G456400J00929R66879o52826j229096M30029O73881j869949l067830n60007
4335B248410J876943J227126N08413K395578L253549o32480n529747n394892j187652
4326a234752J326234P30654O56636K567467L664226K003675p92548k365757k119351
4317D436484r20112l68861j564545l067760j896764J854282M023135K112906r67085
4308C641680j524307l54076k24066r91565q03834J83237O72476P09780M00455
4299A709780j405251m312896n099091k248822J200725K361224K559865L367933
4291a866533K650745j026525l924341k264783J361151K083128L34262k58315J49472
4282b761739j110703l003796k175793O36542J562312K32166j03837J434148K435226
$$ plain form
4344 7456400 7557329 8524208 7871382 6642286 7072315 7746196 5876247 2808417 2248410
4335 2248410 4125353 5352479 5860892 8256470 11510019 10877539 5347792 -47100 -1234752
4326 -1234752 91482 822136 1478772 4046239 7710465 9714140 8921592 6555835 4436484
4317 4436484 3516372 3147511 1582966 -1484794 -3381558 -1527276 2495859 4608765 3641680
4308 3641680 2117373 1763297 1539231 547666 -256168 -72931 599545 1309325 1709780
4299 1709780 304529 -4008367 -9107458 -11356280 -10155555 -7794331 -5234466 -1866533
4291 -1866533 784212 -242313 -4166654 -6431437 -5070286 -2987158 -2652896 -2911211 -2761739
4282 -2761739 -3872442 -6876238 -9052031 -8415489 -6853177 -6621011 -6724848 -5290700 -2855474
4273b855474J816578O05276j183798l795868m832672j933338K517252M058613
4265e603431K516449J110791O81811k07062r86464k90522P4098k005129l726428
4256h435887j115005L550229M652606K266800J196182K081215J273194q83598
4248D585736j16658K817863J915676l502594o336874k700177K220615K732351
4240A615938K28127j464358k053381k189858n47129K517090L336567O58133j640190
4231D60939q36996M55127k14092n12037J706577L394039R61408l560751n511318
4222c657104m100452j981155n85459M72144J002462L43091j134806k460271k899569
4213a5001119j683860J150372L348981K488944k88980j487135j96239J424069
$$ plain form
4273 -2855474 -1038896 -433620 -1617418 -5413286 -10245958 -12179296 -9662044 -5603431
4265 -5603431 -3086982 -1976191 -1294380 -1501442 -2487906 -2778428 -2704330 -4709459 -8435887
4256 -8435887 -9550892 -6000663 -1348057 918743 2114925 4196140 5469334 4585736
4248 4585736 4469078 7286941 9202617 5700023 -636851 -3337028 -1116413 1615938
4240 1615938 1844065 379707 -1673674 -3863532 -4410661 -1893571 1442996 2101129 460939
4231 460939 -376057 79070 -135022 -647059 1059518 4453557 5414965 1854214 -3657104
4222 -3657104 -7757556 -9738711 -10324170 -9852026 -8849564 -8506473 -9641279 -12101550 -15001119
4213 -15001119 -16684979 -15534607 -12185626 -9696682 -9985662 -11472797 -11669036 -10244967
4205a0244967K260471K910776K652871L86075j597470N5684L558137L657800q5940
4196C553437k585306j518943j65026p57757j318276p85462j138106k457396j811017
4187h983852J001364K385779J328803R11051J990931J665912n38522j577489j347063
4178c163086l143837o249755n680431j060157K093033J678610J424993K453596
4170a1647034J406522j255999p28746K407046K139143j385617j421595K256357
4162h229923K278436j986684k942130k79956k164622p431253m794421N029878
4154b0520675O887044j875552m840289L297867N685941m106646p632271J528121
4146b1576460K27187j5824263k658039O6020609J30853662J06553119K366689
$$ plain form
4205 -10244967 -7984496 -5073720 -2420849 -2034774 -3632244 -3576560 -18423 3639377 3553437
4196 3553437 968131 -550812 -715838 -1473595 -2791871 -3577333 -4715439 -7172835 -8983852
4187 -8983852 -7982488 -5596709 -4267906 -3356855 -1365924 299988 -238534 -1816023 -3163086
4178 -3163086 -6306923 -12556678 -18237109 -19297266 -17204233 -15525623 -14100630 -11647034
4170 -11647034 -10240512 -11496511 -12225257 -9818211 -7679068 -9064685 -10486280 -8229923
4162 -8229923 -5951487 -7938171 -10880301 -11160257 -13324879 -20756132 -25550553 -20520675
4154 -20520675 -13633631 -15509183 -20349472 -17051605 -11365664 -15472310 -23104581 -21576460
4146 -21576460 -21349273 -37173536 -39831575 26189034 157042696 263595815 265962504
4139B65962504p9660552p5068585k6772855n106506j4990505j8933077p927317
4132C7503107j952086m597710j972648M536333J138654q985713r807898j529069
4124A4332970J369407k555487j604800M304540L130856n341394p791367j170948
4116D673777K598095j451019l923729L29726L667463R72840j779132r018J677037
4107F756040j34170j127382J432236L055367P26223j742413j348186o07416j020173
4098E990126J31374L145456L813781J052795p99111J9528r0989k314275k628968
4089H319717J90135J380257j495251m068327k662852J94501J351367K005666L474450
4080H689663L652973J315250j071265j887408k793912m091287l042985M72034
$$ plain form
4139 265962504 186301952 111233367 84460512 79354006 64363501 45430424 37503107
4132 37503107 35551021 30953311 28980663 33516996 34655650 25669937 15862039 14332970
4124 14332970 15702377 13146890 11542090 15846630 18977486 13636092 5844725 4673777
4116 4673777 7271872 5820853 1897124 2226850 5894313 6867153 5088021 5079003 6756040
4107 6756040 6621870 5494488 6926724 9982091 10708314 8965901 7617715 7010299 5990126
4098 5990126 6121500 9266956 13080737 14133532 13334421 13353949 13262960 10948685 8319717
4089 8319717 8509852 9890109 8394858 4326531 1663679 1858180 3209547 5215213 8689663
4080 8689663 12342636 13657886 12586621 10699213 7905301 3814014 771029 1243063
4072A243063K226000N56803o12564J063806K010907m25717k465563k71668K926256
4063F251323J821612k259097l426254n0887L656950M039372J772847n17891j271687
4054A0016288m78946Q07095J267186M73244r93378k435161l011214j592863J321543
4045E373794K506800j98150l799300l574594p8807J691421Q2999j312795k66932
4036D24436R48359O50176O79665J869466J626379r22134k031809P96218M147485
4027H188241L848355J255959J50789K91276j287110m402702n649838l501092J5203
4018a090919K414205K901712J801032m9939j579342k434397l041284l128074j660772
4009e867778J071162L163725L624655L136736J816703j025805m096160m338104
$$ plain form
4072 1243063 3469063 4025866 3413302 4477108 6488015 6062298 3596735 3325067 6251323
4063 6251323 8072935 5813838 2387584 2336697 5993647 10033019 11805866 11287975 10016288
4054 10016288 9537342 10344437 11611623 12084867 11091489 8656328 5645114 4052251 5373794
4045 5373794 7880594 7682444 3883144 308550 229743 1921164 2004163 691368 424436
4036 424436 1372795 2022971 2702636 4572102 6198481 5276347 3244538 4040756 8188241
4027 8188241 12036596 13292555 13443344 13734620 12447510 8044808 2394970 -1106122 -1090919
4018 -1090919 1323286 4224998 6026030 5976091 4396749 1962352 -1078932 -4207006 -5867778
4009 -5867778 -4796616 -1632891 1991764 5128500 6945203 5919398 1823238 -2514866
4001b514866j385924J344187J591947J015251J292312J135023m11380j289064
3993G77486j0969J332738Q27166L51775J933348L479520K172614m33252j031745
3984I398681j76311o96858k117034j552866N87789O96221k083208m386747l898521
3975d228854k273576j594433j146038N80313K940118L974473L056030J497636
3967B805669R47747J586483J830462K80462j965793k290039l57399J032321J29699
3958C999612r95643L5724J786030J343592p10569j122309Q47051K434429J746224
3949I364141J13096o28308p14277j205942j927904j889422q90217J38354J52763
3940B512284q08547j438208o66638O17725N00568r83433j463869K70715K170738
$$ plain form
4001 -2514866 -3900790 -2556603 -964656 50595 1342907 2477930 2066550 777486
3993 777486 766517 2099255 2926421 3278196 5211544 8691064 10863678 10430426 9398681
3984 9398681 9222370 8525512 6408478 4855612 5443401 6139622 4056414 -330333 -4228854
3975 -4228854 -6502430 -8096863 -9242901 -8662588 -5722470 -1747997 1308033 2805669
3967 2805669 3753416 5339899 7170361 7450823 5485030 3194991 2837592 3869913 3999612
3958 3999612 3003969 3039693 4825723 6169315 5458746 4336437 5183488 7617917 9364141
3949 9364141 9477237 8848929 8134652 6928710 5000806 3111384 2221167 2359521 2512284
3940 2512284 1703737 265529 -401109 216616 717184 -266249 -1730118 -1459403 711335
3931G11335J817219r0941r35256K39091K083058L066206K726820J483221L11876
3922A1412629j76653r08265l086576n269104m189220K05057L326130J751442k009073
3913A056367l145197p87959K163932L463074K765355K92657k530243k649339J081177
3904A709824N145943N255340J733022j913321m049658n061629m283771j074636
3896b538886K173861K422393O29860p2549J87144r83098k749423j893161J067454
3887a756405K164902Q09841O29027K477028K550466n86097k901439j677864k7879
3878A681580j039228k234601k50730K872590K928960L07350j203049m66333N42209
3869C138748R89472J720728K278456J174731j048818k162170j586699q22546p58301
$$ plain form
3931 711335 2528554 2437613 1502357 1741448 3824506 6890712 9617532 11100753 11412629
3922 11412629 11235976 10327711 7241135 1972031 -2217189 -2012132 1313998 3065440 1056367
3913 1056367 -2088830 -2876789 -712857 2750217 5515572 5808229 3277986 628647 1709824
3904 1709824 6855767 12111107 13844129 11930808 7881150 2819521 -1464250 -2538886
3896 -2538886 -365025 2057368 2687228 2614679 2801823 1818725 -930698 -2823859 -1756405
3887 -1756405 408497 1218338 1847365 4324393 6874859 6288762 3387323 1709459 1681580
3878 1681580 642352 -1592249 -1842979 1029611 3958571 4265921 3062872 2596539 3138748
3869 3138748 4128220 5848948 8127404 9302135 8253317 6091147 4504448 3681902 2923601
3860B923601r02836r90064j081146l79875J791961M006094L889743J318277j441849
3851I133906k775972l066518k935421k075585m32564Q74555O52121r44752k458870
3842d029100k348194l56687J942831K386542N25545j706648k104986n25366J280132
3833d935931J624641L40123j189422j275680K19831J499503J244126Q45562K439468
3824H12221N038497N202173K056387j104577j476352m10855n67099j646025j408840
3815F495530M69700J950313J365375j033540l554645m033146j602612J458122
3807A515097J477538j629628l374234p09633L293250L617005K00007k741435k955505
3798a307538j956453j164413r9388J222459J451780L53106m98357k22823L76833
$$ plain form
3860 2923601 2020765 1030701 -50445 -430320 1361641 5367735 9257478 10575755 9133906
3851 9133906 6357934 3291416 355995 -1719590 -2152154 -1277599 -625478 -1570230 -4029100
3842 -4029100 -6377294 -6733981 -4791150 -2404608 -1879063 -3585711 -5690697 -6216063 -4935931
3833 -4935931 -3311290 -2971167 -4160589 -5436269 -5216438 -3716935 -2472809 -1627247 812221
3824 812221 5850718 11052891 13109278 12004701 10528349 10117494 9550395 7904370 6495530
3815 6495530 6965230 8915543 10280918 9247378 5692733 1659587 56975 1515097
3807 1515097 2992635 1363007 -2011227 -2720860 572390 4189395 4389402 1647967 -1307538
3798 -1307538 -3263991 -4428404 -4527792 -3305333 -1853553 -1500447 -1998804 -2221627 -1844794
3789a844794P79858J366529J615785K15895k206914k901163o79674K300469L609937
3780B255928L375551K730305J494263p04369k489918k114905j65039R48744Q6029
3771E416589j432336j846919j080451l78764m06263l93988N58085J733095J272694
3762C441742j264576l793705m008686k010849L75267K002619K687241J987114
3754e83833k29432k310850k151499k07966Q97471K01726l33226Q13607K221359
3745a682643J783877j55700j518507j269678m8693J195220J890873J688353P02828
3736B585930l75098j031819j312041j114142n6549J396196J794500N44980j106272
3727A325685j793145j644222j221579j83361J540248K473689J462529k7382K51906
$$ plain form
3789 -1844794 -1064936 301593 1917378 2133273 -73641 -2974804 -3654478 -1354009 2255928
3780 2255928 5631479 8361784 9856047 9151678 6661760 4546855 4381816 5330560 5416589
3771 5416589 3984253 2137334 1056883 678119 271856 -122132 435953 2169048 3441742
3762 3441742 2177166 -1616539 -5625225 -7636074 -7260807 -5258188 -2570947 -583833
3754 -583833 -813265 -3124115 -5275614 -5483580 -4586109 -4384383 -4717609 -3904002 -1682643
3745 -1682643 101234 -54466 -1572973 -2842651 -2891344 -1696124 194749 1883102 2585930
3736 2585930 2210832 1179013 -133028 -1247170 -1303719 92477 1886977 2431957 1325685
3727 1325685 -467460 -2111682 -3333261 -3516622 -1976374 497315 1959844 1932462 2184368
3718B184368J604546J095382j758519l741739k569451l15477j68663j541037j123417
3709f334007J900150M531799M169647J693229n70272j852728k489114k195483
3701a146779p85220M19188j6963j269002j216670L89034J609188J196337r6483
3692i17370j258800k064200j962737j26788K507541L331314J466280p11814p86225
3683e22799O60161J569244J155874m14226l099188n709565n467142j358122L516507
3674i669256N431696M475085K996711J478722o70395j820188O9838L007881K858240
3665H158334k26686j767840N98J666868N93519j189245j189701m23654n03018
3656E119175m72441L93166L8032k607208m302703j980926J757144J960485j359527
$$ plain form
3718 2184368 3788914 4884296 3125777 -615962 -3185413 -3500890 -3669553 -5210590 -6334007
3709 -6334007 -4433857 97942 4267589 5960818 5390546 3537818 1048704 -1146779
3701 -1146779 -1931999 -1512811 -1529774 -2798776 -4015446 -3626412 -2017224 -820887 -917370
3692 -917370 -2176170 -4240370 -6203107 -6329895 -3822354 -491040 975240 263426 -522799
3683 -522799 137362 1706606 2862480 2448254 -650934 -6360499 -11827641 -13185763 -9669256
3674 -9669256 -4237560 237525 3234236 4712958 4042563 2222375 2292213 5300094 8158334
3665 8158334 7931648 6163808 6164406 7831274 8424793 7235548 6045847 5622193 5119175
3656 5119175 4646734 5039900 5077932 2470724 -1831979 -3812905 -2055761 -95276 -1454803
3647a454803l561137k233077M06860J777303J758325R48268m93620j626236j208770
3638e686887l751n4010j239601j188490P95303K385291J807716M08793L74015
3629b401621J722559K857276K792350J831798R87817J206506K198603K043254
3621A3238542o63385m341801n825463m277139j858961m17888L47513J088518J514734
3612a195330J627472K072194K478678J642839J02379p5961Q29681l87406m538569
3603B555977p136142l982793K442785N833750M100850Q59396n58371n70288l57015
3594C188149O63698K626558L448671J543883j628451l738752m546928m557221
3586c000393k612700K018886O218470N540987N57231l007894j886671M67762k94865
$$ plain form
3647 -1454803 -5015940 -7249017 -6842157 -5064854 -3306529 -2358261 -2851881 -4478117 -5686887
3638 -5686887 -5690638 -5744648 -6984249 -8172739 -7377436 -4992145 -3184429 -2775636 -2401621
3629 -2401621 -679062 2178214 4970564 6802362 7790179 8996685 11195288 13238542
3621 13238542 12575157 8233356 2407893 -1869246 -3728207 -4146095 -3798582 -2710064 -1195330
3612 -1195330 432142 2504336 4983014 6625853 6728232 6652271 7481952 7094546 2555977
3603 2555977 -4580165 -8562958 -6120173 -286423 3814427 4673823 4115452 3545164 3188149
3594 3188149 3851847 6478405 9927076 11470959 9842508 6103756 1556828 -3000393
3586 -3000393 -5613093 -3594207 2624263 8165250 8722481 5714587 3827916 4295678 4000813
3577D000813k573825j834396J568617K781945M94645q70548J305470L178335P27366
3568H778422l322003l553616l15699J191304o54451j771167O42760L772019L758605
3559H526174J048042j169630j393880n20210J35055k57417j727798k829322j708980
3550A02034J140618K825731J674469q63037k735272l503113l045929p18844K578604
3541b544739M124661L188168K495802L515016L171696j316419o802712p766644
3533a935171m122811q98767o16955p29814P98837J972737P12331j232397q67423
3524f919433J696711L724767L441792J551497K3400K68835J700800J868840o90291
3515F666918l765268l572000J55919L387163K823710m47247l243547l989970k854904
$$ plain form
3577 4000813 1426988 -407408 1161209 3943154 4437799 3567251 4872721 8051056 8778422
3568 8778422 5456419 1902803 1587104 2778408 2123957 352790 995550 4767569 8526174
3559 8526174 9574216 8404586 7010706 6490496 6625551 6368134 4640336 1811014 102034
3550 102034 1242652 4068383 5742852 4879815 2144543 -1358570 -4404499 -5123343 -2544739
3541 -2544739 1579922 4768090 7263892 10778908 13950604 12634185 5831473 -1935171
3533 -1935171 -6057982 -6956749 -7573704 -8303518 -7504681 -5531944 -4819613 -6052010 -6919433
3524 -6919433 -5222722 -1497955 1943837 3495334 3518734 3787569 5488369 7357209 6666918
3515 6666918 2901650 -670350 -514431 2872732 5696442 5249195 2005648 -1984322 -4839226
3506d839226l53142K424378L776357L236267K191723J482944P7338k473160m213899
3497A309580l382127j142228M01053J319373K550087L006867J115093j617349
3489C560349j962289J03919J098759o57286k402423r90970K707555N177456M499498
3480A1134568J652584j316938k932837k788293j713106j136656j463542j531203
3472i5423m08976R07087O98353q48911j482677K13323K629508K800714J43874
3463D556872k558936k615887r78067p47336k332842k446043Q77557M493355L980568
3454B229241L5983k266339n89245J802750J528543J20849R21912L264240L358036
3445A0405970K70280k575418k505034j160901j378024k779177k804726r13780
$$ plain form
3506 -4839226 -5192368 -2767990 1008367 4244634 6436357 7919301 7996639 5523479 1309580
3497 1309580 -2072547 -3214775 -2813722 -1494349 1055738 4062605 5177698 3560349
3489 3560349 1598060 1701979 2800738 2143452 -258971 -1249941 1457614 6635070 11134568
3480 11134568 12787152 11470214 8537377 5749084 4035978 2899322 1435780 -95423
3472 -95423 -504399 402688 1101041 252130 -1230547 -1017224 1612284 4412998 4556872
3463 4556872 1997936 -617951 -1596018 -2343354 -4676196 -7122239 -6244682 -1751327 2229241
3454 2229241 2265224 -1115 -590360 1212390 2740933 2861782 3783694 7047934 10405970
3445 10405970 10676250 8100832 5595798 4434897 3056873 277696 -2527030 -3440810
3437c440810P95939R60691N34713M23352k33701j953317k838910r25328K207667
3428d469704K831085K71237j935547j145981O79486M01503j253444j085091J198376
3419d508080K436903R78700j095751j661907j468799j749541j585556L5967J595804
3410g022260J166953k83249n23466J33692j98514r06464N26028L599459M364505
3401H56684J339702j607308o56089K470881L417730J611901K55467Q29023J234098
3392I752089k99829k519367l382509k789370j914721j301383n69007R29823L456654
3383A362380N872984N700259K059785j874820k135935K55496L07443l235431n487004
3374B825157l149395k28277j684085m937068l695043J648384M346421K063202
$$ plain form
3437 -3440810 -2644871 -1684180 -1149467 -726115 -959816 -2913133 -5752043 -6677371 -4469704
3428 -4469704 -1638619 -1367382 -3302929 -4448910 -3769424 -3367921 -4621365 -5706456 -4508080
3419 -4508080 -2071177 -1092477 -2188228 -3850135 -5318934 -7068475 -8654031 -8618064 -7022260
3410 -7022260 -5855307 -6138556 -6662022 -6528330 -6726844 -7633308 -7107280 -3507821 856684
3401 856684 2196386 589078 -67011 2403870 5821600 7433501 7688968 8517991 9752089
3392 9752089 9452260 6932893 3550384 761014 -1153707 -2455090 -3024097 -2094274 1362380
3383 1362380 7235364 12935623 14995408 13120588 10984653 11240149 11547592 8312161 2825157
3374 2825157 -324238 -552515 -2236600 -7173668 -10868711 -9220327 -4873906 -2810704
3366b810704J81248K327528M350546J782527k232230j956733J761772L358824
3358F762778J459583j11410N25409Q78527p15759k440378k725903k492337k355646
3349a215136j333779K51583J85756j652151k167370J08749K379793K121041J009990
3340c11524J420051K003376M52583j673336j174286J066088J064967j798863l625275
3331b576219k034563N07798J012710M06589J276212L300696L631330J028958k575276
3322C978235m596063m314988k673648p76461P19920J329517P92562l19998o40418
3313f501342O37345K574991L465545K996887K428891K433403K112544Q24668m48700
3304A0524232p20984p38150j637419k892885l216028k632821j945883r85847O37135
$$ plain form
3366 -2810704 -2629456 -301928 4048618 5831145 3598915 1642182 3403954 6762778
3358 6762778 8222361 8110951 8636360 9514887 8799128 6358750 3632847 1140510 -1215136
3349 -1215136 -2548915 -2297332 -2111576 -3763727 -5931097 -5822348 -3442555 -1321514 -311524
3340 -311524 1108527 3111903 3564486 1891150 716864 1782952 2847919 1049056 -2576219
3331 -2576219 -4610782 -4102984 -3090274 -2683685 -1407473 1893223 5524553 6553511 3978235
3322 3978235 -617828 -4932816 -7606464 -8382925 -7663005 -6333488 -5540926 -5860924 -6501342
3313 -6501342 -5863997 -3289006 176539 3173426 5602317 8035720 10148264 10972932 10524232
3304 10524232 9803248 9065098 7427679 4534794 1318766 -1314055 -3259938 -4245785 -3608650
3295c608650J824581J312996J01062q842J86460j506262m012742l244735J724133
3286g231999O160143N525939J163759k334731l194319l032783l000347k498092
3278h442430j136227O23204K456701L789238L163248K96812k019943q90561K202819
3269D2861K989851O48271r24708R07454L562600L280251M83783j567454j732004
3260G690905j628580k132377k147302j022104K12236P31954J281681K700869M223626
3251I910908M134863J551031k815223o977364q583689o534680k278411J205808
3243a0386757K146330J077572p65690k672565l517165j571576K908359O264274
3235f517218N139020J132559r48010L71214J497521l06575k451855j060431K851902
$$ plain form
3295 -3608650 -1784069 -471073 -370011 -378853 -192393 -1698655 -5711397 -8956132 -7231999
3286 -7231999 -1071856 4454083 5617842 3283111 88792 -2943991 -5944338 -8442430
3278 -8442430 -9578657 -8955453 -6498752 -2709514 453734 750546 -1269397 -2159958 42861
3269 42861 3032712 3680983 2756275 3663729 7226329 10506580 10990363 9422909 7690905
3260 7690905 6062325 3929948 1782646 760542 972778 1704732 2986413 5687282 9910908
3251 9910908 14045771 15596802 12781579 5804215 -2779474 -9314154 -11592565 -10386757
3243 -10386757 -8240427 -7162855 -7928545 -10601110 -14118275 -15689851 -12781492 -6517218
3235 -6517218 -1378198 -245639 -1193649 -822435 675086 368511 -2083344 -3143775 -291873
3226b91873M802734L435884J810753J869413J503008j168064l770540k837469
3218E353846P26767K494680M91386k401223k618610m36416R54011j90167k175084
3209B199190k227673J26375K639991L027579J299369r06286k511404l473963l504388
3200c331210j930352O90124K235656J314654r64385k411061k177318r11344O17212
3191f868024J882847K302460J909443J899179L150974M455537L627690M54027
3183A2814133k723664l643091k374321p17940k14014r85127j849774j408057M24913
3174f76942J984724J538520p30137k999322l736355k641470k64476K144814K860760
3165b519884J283693p61346q59910P72742J526714J26012j668000j802099o83868
$$ plain form
3226 -291873 4510861 7946745 9757498 11626911 13129919 11961855 8191315 5353846
3218 5353846 6080613 8575293 9066679 6665456 4046846 3610430 4564441 4374274 2199190
3209 2199190 -28483 97892 2737883 5765462 7064831 6158545 3647141 173178 -3331210
3200 -3331210 -5261562 -4571438 -2335782 -1021128 -1985513 -4396574 -6573892 -7485236 -6868024
3191 -6868024 -4985177 -2682717 -773274 1125905 4276879 8732416 12360106 12814133
3183 12814133 10090469 6447378 4073057 3355117 3141103 2155976 306202 -1101855 -676942
3174 -676942 1307782 2846302 2116165 -883157 -4619512 -7260982 -7525458 -5380644 -2519884
3165 -2519884 -1236191 -1997537 -2857447 -2084705 -557991 -431979 -2099979 -3902078 -4585946
3156d585946j4383j78838k15424L69319J012728R41663k34829k325802m267176
3147i498688m591735k905672m39555J367793K203402K387919K022860J378622
3139h075054J233043J901547K634325K765951K620791K430401J430053p04048
3131F237009k465646k171310m45311N65263J38063m91112m42700l75016j056562
3122e07322k140102k822495k705845j702646o0085J266936J262331K16036m19680
3113g612872J43764J161931J611569J490063J427543J625616J639995R42739m28978
3104B001370j608675j579128m82705L13305Q0937j63407N34228J125886J55474
3095C77285j385717j057664J230302K781033J912735p6112j464818k288531k809073
$$ plain form
3156 -4585946 -4600329 -4779167 -4994591 -4625272 -3612544 -2670881 -2905710 -5231512 -9498688
3147 -9498688 -14090423 -16996095 -17435650 -16067857 -13864455 -11476536 -9453676 -8075054
3139 -8075054 -6842011 -4940464 -2306139 459812 3080603 5511004 6941057 6237009
3131 6237009 3771363 1600053 1154742 1720005 1858068 1366956 924256 549240 -507322
3122 -507322 -2647424 -5469919 -8175764 -9878410 -9938495 -8671559 -7409228 -7193192 -7612872
3113 -7612872 -7469108 -6307177 -4695608 -3205545 -1778002 -152386 1487609 2430348 2001370
3104 2001370 392695 -1186433 -1669138 -1355833 -1274896 -1438303 -904075 221811 377285
3095 377285 -1008432 -2066096 -835794 1945239 3857974 3781862 2317044 28513 -2780560
3086b780560k117007J6585J745993J495826K40127k84904j28748q9545J81908
3077a720325Q70064M92755j613049k847512o45957K896221L422436P78440j034897
3068E98176m55897l46998k226127l149428q57221J933500J771016q4445l27612
3059c145036O01163k40626k547096k807576l2889K688252L102645K652563L046932
3050C318332K998086M30780l889662o824246o117292k235244K174147M156851
3042e988248K840009K98112r27838r03505j350703k193857j629731L52701J631350
3033g871710J804708K961030N194563N085655J208792k325509j462448J476432
3025F071513J498553j029900j264699J909953M036840K241209p92523j889284
$$ plain form
3086 -2780560 -4897567 -4880982 -3134989 -1639163 -1399036 -1683940 -1812688 -1902233 -1720325
3077 -1720325 -850261 -357506 -1970555 -4818067 -5464024 -2567803 854633 1633073 598176
3068 598176 142279 -204719 -2430846 -5580274 -6437495 -4503995 -2732979 -2817424 -3145036
3059 -3145036 -2543873 -2784499 -5331595 -8139171 -8172060 -5483808 -2381163 271400 3318332
3050 3318332 6316418 6747198 2857536 -3966710 -10084002 -12319246 -10145099 -5988248
3042 -5988248 -3148239 -2850127 -3777965 -4681470 -6032173 -8226030 -9855761 -9503060 -7871710
3033 -7871710 -6067002 -3105972 2088591 7174246 8383038 6057529 4595081 6071513
3025 6071513 7570066 6540166 5275467 7185420 11222260 13463469 12670946 10781662
3017A0781662k091816l550932n114128m340031j752418P5674L90130N04451J054754
3008d042654J372489J106883O10693J03121k06854J58916R64382J027337J20447
2999A214760l15106K36175j36922k587871m606020l191568K71835J685646K97433
2990g131638n14484J072275K406914O45399k815291m296302k579371K71802J909900
2981a1030796J870138J109929O23339O66151R27281J269622J881222K400867J790397
2972A508150K1041j143971n81165M2991j226803k877349j748492J558054K715397
2963a732147K1550k869131k402957p6810O91166m6042J73390J488358J594626
2954c157997k65456k235392k670061j637428J86565J868752J784984o96345l155777
$$ plain form
3017 10781662 8689846 5138914 24786 -4315245 -6067663 -5991989 -5601859 -5097408 -4042654
3008 -4042654 -2670165 -1563282 -952589 -849468 -1056322 -897406 66976 1094313 1214760
2999 1214760 899654 1135829 998907 -1588964 -6194984 -9386552 -9114717 -7429071 -7131638
2990 -7131638 -7646122 -6573847 -4166933 -3521534 -6336825 -10633127 -13212498 -12940696 -11030796
2981 -11030796 -9160658 -8050729 -7427390 -6761239 -5833958 -4564336 -2683114 -282247 1508150
2972 1508150 1529191 385220 -195945 -152954 -1379757 -4257106 -6005598 -4447544 -1732147
2963 -1732147 -1710597 -4579728 -6982685 -7059495 -6368329 -6414371 -6240981 -4752623 -3157997
2954 -3157997 -3423453 -5658845 -8328906 -9966334 -9779769 -7911017 -6126033 -6822378 -9978155
2945i978155k303900J448641M052124L076785N50745m42003K44180P77685N94122
2936a979776P36775J732178K767748K834314J698059j32407j775468k519963k431605
2927I29855k168671k008354j565006o95656n243j7764m19467o03455m69872j85850
2917g209483L94554J436319K457333K570482J513451J29993l71655L84067J576008
2908B881069K059475J459287K30895j066348k009368k034673q53575O99069J222014
2899B587845N09202k72334n44313j092413k182763k563216j636322r68693j762572
2890g925579k349699p25110J570605J283899j185756j759155J276834M457553
2882e356408L965156O63261j749690j737066q03436m67577n33110j52412Q63295
$$ plain form
2945 -9978155 -12282055 -10833414 -6781290 -3704505 -3153760 -3595763 -3351583 -2573898 -1979776
2936 -1979776 -1243001 489177 3256925 6091239 7789298 7656891 5881423 3361460 929855
2927 929855 -1238816 -3247170 -4812176 -5507832 -5513075 -5530839 -5950306 -6553761 -7023633 -7209483
2917 -7209483 -6814929 -5378610 -2921277 -350795 1162656 1292649 920994 1305061 2881069
2908 2881069 4940544 6399831 6630726 5564378 3555010 1520337 666762 1365831 2587845
2899 2587845 3097047 2824713 2280400 1187987 -994776 -3557992 -5194314 -6163007 -7925579
2890 -7925579 -10275278 -11000388 -9429783 -8145884 -9331640 -11090795 -9813961 -5356408
2882 -5356408 -1391252 -727991 -2477681 -4214747 -5018183 -5485760 -6018870 -6171282 -5307987
2873e307987J891921K025514R88551k27808l25170N22241Q23675o4878j142334
2864h16275j455129j201121o73360L72810J619874J985826J321228Q00939Q25236
2855B780028K11475j529989k872427k474189j074486O2604Q85623J419039Q45446
2846a746876n84691p00249J440397L331557K283911o84917k653882k894137k454389
2837d663276j264245J052924K647938J400070j124790j324528R52481K243200
2829h0226J048972j98193L71833J210995N00447q97149j395734j110425o73095
2820a222575J45108J097783R43458k09071l15772J089072J163616k078379n797127
2811e183887n393410n78759M260468N432008L459513J235503N48999R58163R87737
$$ plain form
2873 -5307987 -3416066 -1390552 -402001 -629809 -954979 -432738 390937 326059 -816275
2864 -816275 -2271404 -3472525 -4145885 -3773075 -2153201 -167375 1153853 1954792 2780028
2855 2780028 2991503 1461514 -1410913 -3885102 -4959588 -4896984 -4011361 -2592322 -1746876
2846 -1746876 -2331567 -3031816 -1591419 1740138 4024049 3339132 685250 -2208887 -4663276
2837 -4663276 -5927521 -4874597 -2226659 -826589 -1951379 -3275907 -2323426 -80226
2829 -80226 968746 770553 1142386 2353381 2853828 1956679 560945 -549480 -1222575
2820 -1222575 -1077467 20316 963774 754703 438931 1528003 2691619 613240 -5183887
2811 -5183887 -10577297 -11156056 -6895588 -1463580 1995933 3231436 3780435 4738598 5726335
2802E726335j39986j702639k325429j507142J28523J766760K611823J600867j353447
2793D805665l841394k863187J094517M017426L362737R52922l75653p04881j687310
2784D760842l221916l881004l434965k736589j982929j011174l81426l11525L87849
2775a1812837K316597L608179K425146K94945J52291J659879J599049r79612l090473
2766c826836k141626P09542K800109L377245L142759K034107m86117l481896m627715
2757b500428k639841J069742L554855L099900P35991j084085j140886l09301Q9029
2748H74976j90051p23723j249048j455345r66682j72732N4741Q1740J372436L670160
2738A296472M248609J632955j761521k869080k198372k208725k915580k350308
$$ plain form
2802 5726335 5586349 3883710 1558281 51139 179662 1946422 4558245 6159112 4805665
2793 4805665 964271 -1898916 -804399 3213027 6575764 7528686 7153033 6448152 4760842
2784 4760842 1538926 -2342078 -5777043 -8513632 -10496561 -11507735 -11889161 -12200686 -11812837
2775 -11812837 -9496240 -5888061 -3462915 -3167970 -3015679 -1355800 243249 -736363 -3826836
2766 -3826836 -5968462 -5258920 -2458811 918434 4061193 6095300 5609183 2127287 -2500428
2757 -2500428 -5140269 -4070527 -515672 2584228 3320219 2236134 1095248 785947 874976
2748 874976 684925 -38798 -1287846 -2743191 -3709873 -3882605 -3827864 -3746124 -2373688 1296472
2738 1296472 5545081 7178036 5416515 2547435 349063 -1859662 -4775242 -7125550
2730g125550o13866J5046j003483j688348j018920j82004J73489R55984K153774
2721h333878K241829J065968N37677J281329J353783k44756j496899o67224P23725
2712c538446L80496j211862j848742p37487J279102L219675M066600K951462Q52399
2703E413197L18312J742686K018233q03833l719488k776292Q29341K403649N92050
2694F017855j454475j641892j463790k027810j568238R47842K926625J723916
2686C460033j052459j965099j172725j991942n180518p027513m371747R16635
2678a8385335M330558M132233K401740J521353J698128J857269J121558q50419
2670b172915l330792m038400j113228L733173O093454M081600O57436p87887q47906
$$ plain form
2730 -7125550 -7739416 -7724370 -8727853 -10416201 -11435121 -11617125 -11443636 -10487652 -8333878
2721 -8333878 -6092049 -5026081 -4488404 -3207075 -1853292 -2098048 -3594947 -4262171 -3538446
2712 -3538446 -3157950 -4369812 -6218554 -6956041 -5676939 -2457264 1609336 4560798 5413197
2703 5413197 5731509 7474195 9492428 8688595 4969107 2192815 3022156 5425805 6017855
2694 6017855 4563380 2921488 1457698 -570112 -2138350 -1190508 1736117 3460033
2686 3460033 2407574 442475 -730250 -2722192 -7902710 -14930223 -19301970 -18385335
2678 -18385335 -14054777 -9922544 -7520804 -5999451 -4301323 -2444054 -1322496 -2172915
2670 -2172915 -5503707 -9542107 -10655335 -6922162 -828708 3252892 3910328 3122441 2274535
2661B274535j677800k408824o90919K360347K996830O56559j122098m06622M19568
2652B401576q06877k361004j742784L84267J769075J820334J068237m57694k095113
2643a9983j978137m9359M95614k375550n547496m478162L51781M084743L931341
2634e585208J747552L37083J97465M04753M17366L20229N82070J568741K401851
2625B391902J324432j422381k651417l20085K959183L278578J010231k96433K98803
2616F572813K89320j408715k677519k104514j241398j702218k792527l227703
2608h292461k779875j295618J391473L701091L265393P83436n2585J950856L143889
2599A815599M89908l397647l791939n61324K106214J864936P05356R81488J799060
$$ plain form
2661 2274535 596735 -1812089 -2503008 -142661 2854169 3510728 2388630 1982008 2401576
2652 2401576 1594699 -766305 -2509089 -2124822 -355747 1464587 2532824 2075130 -19983
2643 -19983 -1998120 -2047479 -1551865 -3927415 -9474911 -13953073 -13601292 -9516549 -5585208
2634 -5585208 -3837656 -3500573 -3303108 -2898355 -2480989 -2160760 -1578690 -9949 2391902
2625 2391902 3716334 2293953 -357464 -677549 2281634 5560212 6570443 6274010 6572813
2616 6572813 6862133 5453418 2775899 671385 -570013 -2272231 -5064758 -8292461
2608 -8292461 -11072336 -12367954 -10976481 -7275390 -4009997 -3226561 -3279146 -1328290 1815599
2599 1815599 2305507 -1092140 -4884079 -5445403 -3339189 -1474253 -768897 212591 2011651
2590B011651P87333k027997l834360k533506M25148J709527N59479Q5015K856487
2581C8777O457737N925229M96791m827235n391109k179894M68139M32454r49277
2572D71612j915360k226050k250240j828062n32687J538849L422394L756183K015287
2563B451926p22170k765329l330842k431379r9034K753508L545219O26950l419390
2554c390541l966978m77760K478749J572249r19533j157494N23351R01180p65952
2545e202729j902613p27251J420904K123830N95769j826339k906594j445754J275624
2536h595153K563561J407259m54979j121679o89796N2677J230779K656199K767718
2527a83414Q32399j180763j127486L6020j61770j733520k394173j280797L6988
$$ plain form
2590 2011651 2798984 770987 -3063373 -5596879 -5171731 -3462204 -2902725 -2817710 38777
2581 38777 6496514 12421743 12918534 8091299 2700190 520296 988435 1420889 471612
2572 471612 -1443748 -3669798 -5920038 -7748100 -8280787 -6741938 -3319544 436639 2451926
2563 2451926 1729756 -1035573 -4366415 -6797794 -6896828 -4143320 -598101 28849 -3390541
2554 -3390541 -7357519 -7835279 -5356530 -3784281 -4703814 -5861308 -5337957 -4436777 -5202729
2545 -5202729 -7105342 -7832593 -6411689 -4287859 -3692090 -5518429 -8425023 -9870777 -8595153
2536 -8595153 -6031592 -4624333 -5079312 -6200991 -6890787 -6838110 -5607331 -2951132 -183414
2527 -183414 648985 -531778 -1659264 -1623244 -1785014 -3518534 -5912707 -7193504 -7156516
2518g156516L90146N84045J548878K603696K340840L51690k280905l714893k796948
2509h129967l29217J570408J788448J038071Q6389j157898j998202o67288K515331
2500e283925L860671Q16021l823606n164199k559408M09520J471733J656770J887743
2491f728680J271175l24818j035789K69195K170864K759278J816515K20921j111472
2482f92811j141486N96600K624359K678199P82357p78222j060425j653175l235651
2473a880255l526995p37732K801740L147489J94357j965913n40853K205088K126258
2464A823184r47557k730218m22554K978078K596609j197962l088924o97118J823317
2455A36855L47934k710788k374556R26842K235059r3512k436696k039431m34693
$$ plain form
2518 -7156516 -6766370 -6182325 -4633447 -2029751 311089 662779 -1618126 -5333019 -8129967
2509 -8129967 -8459184 -6888776 -5100328 -4062257 -3975868 -5133766 -7131968 -7799256 -5283925
2500 -5283925 -1423254 -607233 -4430839 -9595038 -12154446 -11744926 -10273193 -8616423 -6728680
2491 -6728680 -5457505 -5782323 -6818112 -6548917 -4378053 -1618775 197740 418661 -692811
2482 -692811 -1834297 -1237697 1386662 4064861 4847218 4068996 3008571 1355396 -1880255
2473 -1880255 -5407250 -6144982 -3343242 -195753 -1396 -1967309 -2508162 -303074 1823184
2464 1823184 875627 -1854591 -2277145 700933 3297542 2099580 -989344 -1686462 136855
2455 136855 484789 -2225999 -4600555 -3673713 -1438654 -1532166 -3968862 -6008293 -6442986
2446f442986L48296P90233J411262R73170p45626j446375J75658J965049J560033
2437a411286j10355p76190l24799r7861k24350J85392J215314K190109K644630
2428C290604K114367J83536k229007l082066j798943j62423L83926O39914J672405
2419A012313K645904K094784J09500j910577k652575j514625P63997J935431O25018
2410C109170j155604m45343J818166J876679o37080j956895p78362n51111k864077
2401a584457l849370r17388J931845N44434j970669l87448L380465L192205j021663
2392f82046l243698j271133O05646k08356n71818J931515M354878L479624J021398
2383E416010K58579Q99478P49038q5791K0334R03363R56399j80646j394709j857616
$$ plain form
2446 -6442986 -6094690 -5304457 -3893195 -2920025 -3665651 -5112026 -4936368 -2971319 -1411286
2437 -1411286 -1521641 -2297831 -2622630 -2720491 -2944841 -2759449 -1544135 645974 3290604
2428 3290604 5404971 5588507 3359500 277434 -1521509 -1683932 -1300006 -660092 1012313
2419 1012313 3658217 5753001 5862501 3951924 1299349 -215276 548721 2484152 3109170
2410 3109170 1953566 1508223 3326389 5203068 4565988 2609093 1830731 1279620 -1584457
2401 -1584457 -5433827 -6351215 -4419370 -3874936 -5845605 -6233053 -2852588 339617 -682046
2392 -682046 -3925744 -5196877 -4591231 -4799587 -5371405 -3439890 914988 4394612 5416010
2383 5416010 5674589 6574067 7323105 7237314 7257648 8161011 9117410 8936764 7542055 5684439
2373E684439j597527j093092j207524k488794l837803l138267N4239L588753M956358
2364I20782L398807q7708l280535l571209m44803K950340L040860M86264j113738
2355B299060q64104j258321k930081l131814q86038Q16888L67423P18814L820617
2346a047556N939967L189411j378450j769148J570757K334568j798892n688604
2338A352053m577839m96649J807034J596871J440581K099147J769480k38836k103913
2329B647929k231297j399467j291698k026331k172527q58561J037834K040275
2321d253843J822822J232788R01675P15730O58271J040521J426882N11932j934701
2312B122077l926194l420810j151047J15873r81502l001450l760134k474009L29618
$$ plain form
2373 5684439 4086912 2993820 1786296 -702498 -4540301 -7678568 -7624329 -4035576 920782
2364 920782 4319589 4231881 951346 -2619863 -3064666 -114326 2926534 3412798 2299060
2355 2299060 1434956 176635 -2753446 -5885260 -6771298 -5954410 -5586987 -4868173 -1047556
2346 -1047556 4892411 8081822 6703372 4934224 6504981 8839549 7040657 1352053
2338 1352053 -3225786 -3722435 -1915401 -318530 1122051 3221198 4990678 4751842 2647929
2329 2647929 416632 -982835 -2274533 -4300864 -6473391 -7331952 -6294118 -4253843
2321 -4253843 -2431021 -1198233 -296558 419172 1077443 2117964 3544846 4056778 2122077
2312 2122077 -1804117 -5224927 -6375974 -6260101 -7241603 -10243053 -14003187 -16477196 -16147578
2303a6147578L565238N618571N006611K182435j89005k4498J680689K462810J936271
2294F091544J835772K525476J930779q24615l007131j933155M55278m6977l363108
2285C663863m711084j700220J827635J396559j642484k586458m14629J443301
2277b723517O47918j367484k371320j840370l9729K562347M312880L443293R13305
2268C537323k44177Q43226J829326J113298K2029k27196q09381k620395l953375
2259e09322l216707j763301j385232r36191J429507M023006L260413o22144k887015
2250b606986l64864M189015N415800J844866k524699l071740J65745K975559K433752
2241H456448K03973o69129m33759j449734l353971l136987l48692J735752J451256
$$ plain form
2303 -16147578 -12582340 -6963769 -1957158 225277 36272 11774 1692463 4155273 6091544
2294 6091544 7927316 10452792 12383571 11558956 8551825 6618670 7073948 7026971 3663863
2285 3663863 -1047221 -2747441 -919806 476753 -1165731 -3752189 -4166818 -2723517
2277 -2723517 -2075599 -3443083 -5814403 -7654773 -7694502 -5132155 -819275 2624018 3537323
2268 3537323 3293146 4136372 5965698 7078996 7101025 6873829 6064448 3444053 -509322
2259 -509322 -3726029 -5489330 -6874562 -7810753 -6381246 -2358240 902173 280029 -2606986
2250 -2606986 -2971850 1217165 6632965 8477831 5953132 2881392 3047137 6022696 8456448
2241 8456448 8660421 7991292 7557533 6107799 2753828 -383159 -731851 1003901 2455157
2232B455157J234384K650946L087767O98368j282730K96980K298560p7324m611280
2223F750828m602732N00597L936158K192238o5497J453452L285470K15120n594703
2214H070931p305481l352643Q05984Q11051j335928j346874J374737L817809L617744
2205E157330J341756q54433j532072q84239j7758L19432K63090K52464K72562
2196D318132j45850j299967k736131l267905j933747O58303K344291J516935r27392
2187a473331k496903j842435J63576J879935K437167J831214N14184q16416j661867
2178a464876k005216j690545q9547K589111M315143L232332M30227j109370l86710
2169C820549Q06215J205334J719776K743165K420688l05990k895518k222498O58254
$$ plain form
2232 2455157 3689541 6340487 9428254 10126622 8843892 9140872 11439432 11362108 6750828
2223 6750828 2148096 2648693 6584851 8777089 8711592 10165044 13450514 13665634 8070931
2214 8070931 765450 -2587193 -1781209 -970158 -2306086 -3652960 -2278223 1539586 5157330
2205 5157330 6499086 5644653 4112581 3228342 3210584 3530016 3793106 4045570 4318132
2196 4318132 4172282 2872315 136184 -3131721 -5065468 -4407165 -2062874 -545939 -1473331
2187 -1473331 -3970234 -5812669 -5649093 -3769158 -1331991 499223 1013407 196991 -1464876
2178 -1464876 -3470092 -5160637 -5250184 -2661073 1654070 4886402 5316629 4207259 3820549
2169 3820549 4626764 5832098 7551874 10295039 12715727 12409737 9514219 7291721 7949975
2160G949975J761380k8048j512820l40780J324565K90637k574982l572708j699420
2151A597799P3757n10594j820988j374961J57608L85071o74770p43056P34801
2142b175333J570623K94691j857065l250565l769361l322320r66372K691999M484334
2133f299369K444128j043658k221207o88561J211391K250434K729599K276521
2125F59278N25282o59977R26046L826778M168920J192357j727522k157394j437244
2116E316524j442954j693871j231700o60137n14403J59816J784570K697624J421740
2107E837209j005092k532709k636241k040039j189612k54863M01888P03451Q43359
2098a872649M40847q62605j828656p18527J618944K174018R9809j888751j525570
$$ plain form
2160 7949975 9711355 9683307 8170487 7829707 9154272 9444909 6869927 3297219 1597799
2151 1597799 1671556 1160962 -660026 -2034987 -1877379 -1492308 -2167078 -2910134 -2175333
2142 -2175333 -604710 -310019 -2167084 -5417649 -9187010 -12509330 -13475702 -10783703 -6299369
2133 -6299369 -3855241 -4898899 -7120106 -7808667 -6597276 -4346842 -1617243 659278
2125 659278 1184560 524583 1450629 5277407 9446327 10638684 8911162 6753768 5316524
2116 5316524 3873570 2179699 947999 287862 -226541 -66725 1717845 4415469 5837209
2107 5837209 4832117 2299408 -336833 -2376872 -3566484 -3821347 -3419459 -2716008 -1872649
2098 -1872649 -1431802 -2294407 -4123063 -4841590 -3222646 -1048628 -948819 -2837570 -4363140
2089d363140J28527J127950J379917J354069O00952o04808n71624R03166J350371
2080A305380n33244k301800j397681R62003K114093J909222J544979O16393j506997
2071B712348l156039k482066p27154l65724j307620j778960j465178q98507N42252
2062h926648K912439L904284K212901O23552J788519L116760O89003l594889m447952
2053a722031j689488j61305j406292j916397l99313j41382k259306k987789n68264
2044a3251567J045188r50452k892082n80961L875503N881518N329086M780952
2036C237185L790926N16566l065598l126060k38771J342193K24354j011171j115310
2027E54314j774776l208544k734460N80467L551879L272613J014235l79713n47366
$$ plain form
2089 -4363140 -4234613 -3106663 -1726746 -372677 228275 -376533 -948157 -44991 1305380
2080 1305380 772136 -1529664 -2927345 -1965342 148751 2057973 3602952 4219345 2712348
2071 2712348 -443691 -2925757 -3652911 -4018635 -5326255 -7105215 -8570393 -9468900 -8926648
2062 -8926648 -6014209 -2109925 102976 726528 2515047 5631807 6320810 2725921 -1722031
2053 -1722031 -3411519 -3572824 -4979116 -6895513 -7294826 -7436208 -9695514 -12683303 -13251567
2044 -13251567 -12206379 -13156831 -16048913 -16629874 -12754371 -6872853 -1543767 3237185
2036 3237185 7028111 7544677 4479079 1353019 1114248 2456441 2680795 1669624 554314
2027 554314 -1220462 -4429006 -7163466 -6582999 -3031120 241493 1255728 876015 328649
2018C28649o79739n15881Q91672K409909J692622j158604l221279k716909j344794
2009d314354j412346k268943j613395M99932J555608P25289L81962K040856L268303
2000a137088J242559k273953k910569j06290K026319Q01740j433304j288946P81934
1991d297598J681012N5863k462726l501070k094140P23311K794366L031034K607372
1982a462576K633023J482151k657822o906282n628217J431059P252615O394110
1974B538061J914361J8884J209749J301573j021245k744663j947306k76926J95048
1965A187536p00921k121053k804630j313263J774615L079945Q62531j341310N39108
1956h37442M262737M248508N53712j215737N38828O40046l671511p115690m268378
$$ plain form
2018 328649 -351090 -866971 24701 2434610 4127232 2968628 -252651 -2969560 -4314354
2009 -4314354 -5726700 -7995643 -9609038 -9109106 -7553498 -6828209 -6446247 -4405391 -1137088
2000 -1137088 105471 -2168482 -5079051 -5185341 -3159022 -2357282 -3790586 -5079532 -4297598
1991 -4297598 -2616586 -2560723 -5023449 -8524519 -10618659 -9895348 -7100982 -4069948 -1462576
1982 -1462576 1170447 2652598 -5224 -6911506 -12539723 -11108664 -3856049 2538061
1974 2538061 4452422 4471306 5681055 6982628 5961383 3216720 1269414 992488 1187536
1965 1187536 486615 -1634438 -4439068 -5752331 -3977716 -897771 -35240 -1376550 -837442
1956 -837442 3425295 7673803 8227515 7011778 7550606 8190652 4519141 -2596549 -6864927
1947f864927J814463M199975K057129L75883J430518K189071K70463k334657k811365
1938C26553j445671l62461l71321m74092M84980K385403L575130K305946q45750
1929E578717k788923j461090J202819J565656r33845l207438k601958K96060L058057
1920G08055L856006K236700q10796l030632k681004p63453q4239j526708k836709
1911d932780j952067J97010J614910K336746L446067M068936K197734j393743
1903E582813k945835o88083K306128K239643j68334j214238L135O21993q78466
1894D858756j974200k00227K632100K909456M41434j548258j102041L93622R16651
1885G327293K82714p41012j932496l174674l671692k624020k49645K275460L582185
$$ plain form
1947 -6864927 -5050464 -850489 1206640 1582523 3013041 5202112 5472575 3137918 326553
1938 326553 -1119118 -1481579 -1852900 -2326992 -1842012 543391 4118521 6424467 5578717
1929 5578717 2789794 1328704 2531523 4097179 3163334 -44104 -2646062 -2350002 708055
1920 708055 4564061 6800761 5989965 2959333 278329 -485124 -569363 -2096071 -4932780
1911 -4932780 -6884847 -6687837 -5072927 -2736181 709886 4778822 6976556 5582813
1903 5582813 2636978 1948895 4255023 6494666 6326332 5112094 5115229 5737222 4858756
1894 4858756 2884556 2684329 5316429 8225885 8667319 7119061 6017020 6410642 7327293
1885 7327293 7610007 6868995 4936499 1761825 -1909867 -4533887 -4783532 -2508072 1074113
1876A074113K984202J225940K5210N2632q2415j672049l428728k934202k75596
1867c030893J773391J365272n18997k052616k480919j594467O33181K998730L479642
1858E72324J697792n32236j800373k464338k741503j726012L96466J412004J80436
1849e005440j289496r59233j45658j235258l398294l568379j162799J047470R77069
1840a4740018k50101m05612J009201K712991L205257J944048r7549r40434L83034
1831g179183K370852K685317J203496J76086J045049K288513J287359k122022
1823A755467m868381l891183R4473L051299K398852J49697k57655Q85449M07342
1814b74640j958462k379737J069584M715294M254967P71154j392615q39638J71411
$$ plain form
1876 1074113 4058315 5284255 5309465 5362097 5279682 3607633 178905 -2755297 -3030893
1867 -3030893 -1257502 107770 -411227 -2463843 -4944762 -6539229 -5906048 -2907318 572324
1858 572324 2270116 1737880 -62493 -2526831 -5268334 -6994346 -6597880 -5185876 -5005440
1849 -5005440 -6294936 -7254169 -7399827 -8635085 -12033379 -15601758 -16764557 -15717087 -14740018
1840 -14740018 -14990119 -15395731 -14386530 -11673539 -8468282 -6524234 -6621783 -7562217 -7179183
1831 -7179183 -4808331 -2123014 -919518 -743432 301617 2590130 3877489 1755467
1823 1755467 -3112914 -7004097 -6909624 -3858325 -1459473 -1309776 -1567431 -681982 -274640
1814 -274640 -2233102 -4612839 -3543255 1172039 5427006 6198160 4805545 3965907 4137318
1805D137318r1469j332225l057144m628863m110511l77198L911304M693745J820870
1796I65827j045328j669945j102666l67544R72388K332524J807966n09322k068313
1787f84413j786792j332959j475191o56656J256980J428265j428693m116580l298861
1778a2094900k36247J633479J659981J558917J807415J594210J258003J860157
1770i58985K914543K986620K117606J542197J373025M81792j483833l449855m149586
1761A373524l128533j064375L22440k75611j816603j871075p7645J319204J108971
1752d109703P50152J156522Q31032q33563j486900K26764J609772J97054j640034
1743c298904n12645J843659J149511k052601k862692M14314M158046N265090M376846
$$ plain form
1805 4137318 4045849 2713624 -343520 -4972383 -9082894 -9460092 -5548788 -855043 965827
1796 965827 -79501 -1749446 -2852112 -3219656 -2247268 85256 1893222 1383900 -684413
1787 -684413 -2471205 -3804164 -5279355 -5936011 -4679031 -3250766 -4679459 -8796039 -12094900
1778 -12094900 -12331147 -10697668 -9037687 -7478770 -5671355 -4077145 -2819142 -958985
1770 -958985 1955558 4942178 7059784 8601981 9975006 10456798 8972965 5523110 1373524
1761 1373524 -1755009 -2819384 -2496944 -2772555 -4589158 -6460233 -6537878 -5218674 -4109703
1752 -4109703 -3359551 -2203029 -1371997 -2205560 -3692460 -3465696 -1855924 -1658870 -3298904
1743 -3298904 -3811549 -1967890 -818379 -2870980 -5733672 -5319358 -1161312 4103778 8480624
1734H480624K498276q54789m510548m965580j250865K790140L356362J125320
1726F668940j102107k465010l526526l987517l255252j773044j23742J693359
1718g870899L015566K611955J181569J296720L328840M075319J486225j857688
1710G267607k635010j831002k578855m510309m029684O558M182887M847756K287868
1701C007816m10562j244050r20063j045826j584638q71163J574386L390845K135943
1692D032688r24994k118322m67293J164716N90529r35281j585504j620327j519660
1683c383448l96637J551416J800709o71366k867842k001741J47958L59563q26020
1674f287408p75217L04644L43480n0047J433927L949562M137865J569241o94035
$$ plain form
1734 8480624 10978900 10124111 5613563 647983 -602882 2187258 5543620 6668940
1726 6668940 5566833 3101823 -424703 -4412220 -7667472 -9440516 -9564258 -7870899
1718 -7870899 -4855333 -2243378 -1061809 234911 3563751 7639070 9125295 7267607
1710 7267607 4632597 2801595 222740 -4287569 -8317253 -8310695 -4127808 719948 3007816
1701 3007816 2597254 1353204 433141 -612685 -2197323 -3068486 -1494100 1896745 4032688
1692 4032688 3107694 989372 522079 1686795 2277324 1342043 -243461 -1863788 -3383448
1683 -3383448 -3780085 -2228669 -427960 -1099326 -3967168 -5968909 -5820951 -5461388 -6287408
1674 -6287408 -7062625 -6757981 -6414501 -6464548 -5030621 -1081059 3056806 4626047 3932012
1665C932012j127911j169922j339510l37665J238694P33012j773886k805106j166948
1656c817230N5685q82858j303735O43929K066413L20842j971356j346879K61313
1647e973876j098572l942724l063791J900904N242265L406063l49603j334320
1639e213654M02287J729659J447245Q14231N69368N7368j068389k063470k092479
1630e417834j054392N23769J787541J948751R92714l2351J17042J538158K832540
1621C235938K358062O9613k092343k221125p83884k3966q03416j315822J69555
1612a407388K472956K958513J204068n63457p24848k71072r19022k492961l246879
1603b990090k302167q27143o44238k047413l317166k556199J13680K584809L082105
$$ plain form
1665 3932012 2804101 1634179 294669 -42996 1195698 1928710 154824 -2650282 -3817230
1656 -3817230 -3761545 -4644403 -5948138 -5304209 -3237796 -2916954 -4888310 -6235189 -5973876
1647 -5973876 -7072448 -11015172 -14078963 -12178059 -6935794 -3529731 -3879334 -5213654
1639 -5213654 -4811367 -3081708 -1634463 -820232 -250864 -193496 -1261885 -3325355 -5417834
1630 -5417834 -6472226 -5948457 -4160916 -2212165 -1219451 -1251802 -1134760 403398 3235938
1621 3235938 5594000 5663613 3571270 1350145 566261 542295 -261121 -1576943 -1407388
1612 -1407388 1065568 4024081 5228149 4664692 3939844 3668772 2749750 256789 -2990090
1603 -2990090 -5292257 -6119400 -6763638 -8811051 -12128217 -14684416 -14570736 -11985927 -8903822
1594h903822J945529Q21569O36244R32242R00194M69991L48736J124425K215684
1585D90792J951756n78982l787075m753419k523299Q01081K760392L139574L061052
1576E61872K746101J563361m24039k325120l484432l700837k880738j363257N2630
1567i254459J226087K829838M409337L793223K56695l071120k536142R53759K952349
1558A559567J495930p99430j184778m03382m78170j231797r92570N60926K019288
1549E45584K078445O92516j011413j424001J5193J622521J150614r19278j585218
1540A164963L17752K049818Q34618k077838l407835k566546j837590k473919l174280
1531a1170857k546726r20370P88902K311397L494640L854109L311708K475329
$$ plain form
1594 -8903822 -6958293 -6136724 -5500480 -4568238 -3668044 -3198053 -2849317 -1724892 490792
1585 490792 2442548 1863566 -1923509 -6676928 -9200227 -8399146 -5638754 -2499180 561872
1576 561872 3307973 4871334 4447295 2122175 -1362257 -5063094 -7943832 -9307089 -9254459
1567 -9254459 -8028372 -5198534 -789197 3004026 3260721 189601 -2346541 -1392782 1559567
1558 1559567 3055497 2256067 1071289 667907 189737 -1042060 -2034630 -1473704 545584
1549 545584 2624029 3316545 2305132 881131 896324 2518845 3669459 2750181 1164963
1540 1164963 1482715 3532533 4367151 2289313 -1118522 -3685068 -5522658 -7996577 -11170857
1531 -11170857 -13717583 -14637953 -13849051 -11537654 -8043014 -4188905 -877197 1598132
1523A598132J698576N61030j354157l605314m926527l994098p74424K470629K711459
1514e614694j32032k229784m80095K960189L447503N93345j231299L02367J940918
$$ plain form
1523 1598132 3296708 3857738 2503581 -1101733 -6028260 -10022358 -10796782 -8326153 -5614694
1514 -5614694 -5746726 -7976510 -8456605 -5496416 -2048913 -1455568 -2686867 -2384500 -443582
$$ [...]
##END NTUPLES=NMR SPECTRUM
##END=
