##TITLE=31Pdec_DE-97k2_TFA
CDCl3, 64 sc
 21.8.2025
##JCAMPDX= 6.0         $$ Bruker NMR JCAMP-DX V2.0
##DATA TYPE= NMR SPECTRUM
##DATA CLASS= NTUPLES
##ORIGIN= UXNMR, Bruker Analytische Messtechnik GmbH
##OWNER= root
$$ XWIN-NMR		Version 3.5
$$ Thu Aug 21 14:17:23 2025 Russian Standard Time (UT+4h)  she@DPX200
##.OBSERVE FREQUENCY= 81.013821
##.OBSERVE NUCLEUS= ^31P
##.ACQUISITION MODE= SIMULTANEOUS
##.ACQUISITION SCHEME= undefined
##.AVERAGES= 64
##.DIGITISER RES= 17
##SPECTROMETER/DATA SYSTEM= spect
##.PULSE SEQUENCE= zgpg30
##.SOLVENT NAME= CDCl3
##.SHIFT REFERENCE= (INTERNAL, CDCl3, 0, 198.062)
##AUDIT TRAIL= $$ (NUMBER, WHEN, WHO, WHERE, WHAT)
$$ ##TITLE= Audit trail, XWIN-NMR		Version 3.5
$$ ##JCAMPDX= 5.01
$$ ##ORIGIN= Bruker BioSpin GmbH
$$ ##OWNER= she
$$ F:/spectra/data/she/nmr/P31/2/pdata/1/auditp.txt
$$ ##AUDIT TRAIL=  $$ (NUMBER, WHEN, WHO, WHERE, WHAT)
(   1,<2025-08-21 14:16:31.21 +0400>,<she>,<DPX200>,
      <created by zg, POWCHK disabled, PULCHK disabled
       configuration hash MD5:
       00 E9 B6 7A A2 85 ED C7 34 08 36 98 17 FE 4E 26
       data hash MD5: 32K
       99 31 BA EB 5C FA 44 C3 B6 EC 74 2B C7 60 20 59>)
(   2,<2025-08-21 14:16:35.25 +0400>,<she>,<DPX200>,
      <Start of raw data processing
       efp BC_mod = 2 LB = 1.5 FT_mod = 6 PKNL = 1 PHC0 = 1595.846 PHC1 = -437.5005 SI = 64K 
       data hash MD5: 64K
       DF 24 DC A2 61 3D 71 E6 06 CA 8F 7B 17 4C 8A 68>)
(   3,<2025-08-21 14:16:49.06 +0400>,<she>,<DPX200>,
      <pk PHC0 = -17.87873 PHC1 = 0 
       data hash MD5: 64K
       77 94 34 8F 35 49 2C A0 E6 45 63 33 75 2D CA 14>)
(   4,<2025-08-21 14:16:55.37 +0400>,<she>,<DPX200>,
      <abs ABSG = 5 
       data hash MD5: 64K
       FC 49 3B 56 A7 10 7A E9 A0 8F E7 03 EF 4B 04 F1>)
$$ ##END=
$$ 
$$ hash MD5
$$ 2B 6F ED 25 F9 B9 4D 03 60 17 5B 8A D0 6A 74 92
##$RELAX= 
##$RELAX= 
##$RELAX= 
##$RELAX= 
##$RELAX= 
##$RELAX= 
##$RELAX= 
##$RELAX= 
$$ Bruker specific parameters
$$ --------------------------
##$DU= <F:/spectra>
##$EXPNO= 2
##$NAME= <P31>
##$PROCNO= 1
##$TYPE= <nmr>
##$USER= <she>
##$AMP= (0..31)
100 100 100 100 100 100 100 100 100 100 100 100 100 100 100 100 100 100 
100 100 100 100 100 100 100 100 100 100 100 100 100 100 
##$AQSEQ= 0
##$AQ_mod= 1
##$AUNM= <au_zg>
##$AUTOPOS= <>
##$BF1= 81.014009
##$BF2= 200.13
##$BF3= 200.13
##$BF4= 200.13
##$BF5= 200.13
##$BF6= 200.13
##$BF7= 200.13
##$BF8= 200.13
##$BYTORDA= 1
##$CFDGTYP= 0
##$CFRGTYP= 5
##$CHEMSTR= <none>
##$CNST= (0..31)
1 1 145 1 1 1 1 1 1 1 1 1 1 1 1 1 1 1 1 1 1 1 1 1 1 1 1 1 1 1 1 1 
##$CPDPRG= <waltz16>
##$CPDPRG1= <>
##$CPDPRG2= <waltz16>
##$CPDPRG3= <>
##$CPDPRG4= <mlev>
##$CPDPRG5= <mlev>
##$CPDPRG6= <mlev>
##$CPDPRG7= <mlev>
##$CPDPRG8= <mlev>
##$CPDPRGB= <>
##$CPDPRGT= <>
##$D= (0..31)
0 1 0 0 0 0 0 0 0 0.06 0 0.03 2e-05 3e-06 0 0 0.0002 0 0 0 0 0 0 0 0 0 
0 0 0 0 0 0 
##$DATE= 1755771390
##$DBL= (0..7)
120 120 120 11 120 120 24 19 
##$DBP= (0..7)
150 150 150 150 150 150 150 150 
##$DBP07= 0
##$DBPNAM0= <>
##$DBPNAM1= <>
$$ [...]
##$SUBNAM3= <"">
##$SUBNAM4= <"">
##$SUBNAM5= <"">
##$SUBNAM6= <"">
##$SUBNAM7= <"">
##$SUBNAM8= <"">
##$SUBNAM9= <"">
##$SW= 400.765351723535
##$SWIBOX= (0..15)
0 1 3 0 0 0 0 0 0 0 0 0 0 0 0 0 
##$SW_h= 32467.5324675325
##$TD= 32768
##$TD0= 1
##$TE= 0
##$TE2= 300
##$TE3= 300
##$TEG= 300
##$TL= (0..7)
0 120 53 12 22 120 120 120 
##$TP= (0..7)
150 150 150 150 150 150 150 150 
##$TP07= 0
##$TPNAME0= <>
##$TPNAME1= <>
##$TPNAME2= <>
##$TPNAME3= <>
##$TPNAME4= <>
##$TPNAME5= <>
##$TPNAME6= <>
##$TPNAME7= <>
##$TPOAL= (0..7)
0.5 0.5 0.5 0.5 0.5 0.5 0.5 0.5 
##$TPOFFS= (0..7)
0 0 0 0 0 0 0 0 
##$TUNHIN= 0
##$TUNHOUT= 0
##$TUNXOUT= 0
##$USERA1= <user>
##$USERA2= <user>
##$USERA3= <user>
##$USERA4= <user>
##$USERA5= <user>
##$V9= 5
##$VALIST= <valist>
##$VCLIST= <CCCCCCCCCCCCCCC>
##$VD= 0
##$VDLIST= <DDDDDDDDDDDDDDD>
##$VPLIST= <PPPPPPPPPPPPPPP>
##$VTLIST= <TTTTTTTTTTTTTTT>
##$WBST= 1024
##$WBSW= 4
##$XGAIN= (0..3)
0 0 0 0 
##$XL= 0
##$YL= 0
##$YMAX_a= 12918
##$YMIN_a= -7376
##$ZGOPTNS= <>
##$ZL1= 120
##$ZL2= 120
##$ZL3= 120
##$ZL4= 120
##$ABSF1= 198.0616
##$ABSF2= -202.7028
##$ABSG= 5
##$ABSL= 3
##$ALPHA= 0
##$AQORDER= 0
##$ASSFAC= 0
##$ASSFACI= 0
##$ASSFACX= 0
##$ASSWID= 0
##$AUNMP= <proc_1d>
##$AZFE= 0.1
##$AZFW= 0.5
##$BCFW= 0
##$BC_mod= 2
##$BYTORDP= 0
##$COROFFS= 0
##$CY= -3
##$DATMOD= 1
##$DC= 0
##$DFILT= <>
##$DTYPP= 0
##$F1P= 0
##$F2P= 0
##$FCOR= 1
##$FTSIZE= 65536
##$FT_mod= 6
##$GAMMA= 0
##$GB= 0
##$INTBC= 1
##$INTSCL= 9.790993e-09
##$ISEN= 30
##$LB= 1.5
##$LEV0= 0
##$LPBIN= 0
##$MAXI= 10000
##$MC2= 0
##$MEAN= 0
##$ME_mod= 0
##$MI= 50
##$NCOEF= 0
##$NC_proc= -8
##$NLEV= 6
##$NOISF1= 182.463
##$NOISF2= 159.3651
##$NSP= 0
##$NTH_PI= 0
##$NZP= 0
##$OFFSET= 198.0616
##$PC= 4
##$PHC0= 1577.967
##$PHC1= -437.5005
##$PH_mod= 1
##$PKNL= yes
##$PPARMOD= 0
##$PSCAL= 0
##$PSIGN= 0
##$REVERSE= no
##$SF= 81.0140089999434
##$SI= 65536
##$SIGF1= 159.3651
##$SIGF2= -187.1042
##$SINO= 113.3802
##$SIOLD= 16384
##$SREGLST= <1H.CDCl3>
##$SSB= 0
##$STSI= 65536
##$STSR= 0
##$SW_p= 32467.5324675325
##$SYMM= 0
##$S_DEV= 0
##$TDeff= 32768
##$TDoff= 0
##$TI= <>
##$TILT= no
##$TM1= 0
##$TM2= 0
##$TOPLEV= 0
##$USERP1= <user>
##$USERP2= <user>
##$USERP3= <user>
##$USERP4= <user>
##$USERP5= <user>
##$WDW= 1
##$XDIM= 65536
##$YMAX_p= 273548732
##$YMIN_p= -364473926
$$ End of Bruker specific parameters
$$ ---------------------------------
##NTUPLES= NMR SPECTRUM
##VAR_NAME=  FREQUENCY,     SPECTRUM/REAL,   SPECTRUM/IMAG
##SYMBOL=    X,             R,               I
##VAR_TYPE=  INDEPENDENT,   DEPENDENT,       DEPENDENT
##VAR_FORM=  AFFN,          ASDF,            ASDF
##VAR_DIM=   65536,         65536,           65536
##UNITS=     HZ,            ARBITRARY UNITS, ARBITRARY UNITS
##FACTOR=    0.49542278885378, 1,            1
##FIRST=     16045.7642231865, 0,            0
##LAST=      -16421.768244346, 0,            0
##MIN=       -16421.768244346, -364473926,   0
##MAX=       16045.7642231865, 273548732,    0
$$ Real data points
##PAGE= N=1
##DATA TABLE= (X++(R..R)), XYDATA
$$ [...]
6761d022545L175473L903138L335961J753596M60767L48996O19943J21647q60311
6752H836665j372454j340412j027161j63639Q99513O64927j032689j699172K61066
6743D026644K345218J405002j114695j210232J157514J890646o86223l421452
6735D392422l548671k275357j545625r66816p8302k55026j786512k078856L73930
6726g768813K902998K649997J176660J513511K660094J257345k330066m003194
6718a941468k054343O21533J194357M19997K78040Q39057J032542N99035j04206
6709H84544q39510j040043O8673K057016L211026K604834J145964k3058r53111
6700G116335k043239k908010k899372j966783m61219J152674K091578J733233
$$ plain form
6761 -4022545 -847072 3056066 6392027 8145623 8606390 8955386 9575329 9696976 8836665
6752 8836665 7464211 6123799 5096638 4932999 5832512 6497439 5464750 3765578 4026644
6743 4026644 6371862 7776864 6662169 5451937 6609451 8500097 7813874 4392422
6735 4392422 843751 -1431606 -2977231 -3944047 -4022349 -4277375 -6063887 -8142743 -7768813
6726 -7768813 -4865815 -2215818 -1039158 474353 3134447 4391792 2061726 -1941468
6718 -1941468 -3995811 -3374278 -2179921 -1759924 -1481884 -642827 389715 988750 884544
6709 884544 45034 -995009 -926336 1130680 4341706 6946540 8092504 8069446 7116335
6700 7116335 5073096 2165086 -734286 -2701069 -3162288 -2009614 81964 1815197
6692A815197O59184K25732P27762J009352K74786q09383j308112j258360j141643
6683A94515j040184q64611o15636l2623J160243K382286K559614J598312L84518
6674E726434q09167k396595l636498k703206L40303K496586J450559j128394j871843
6665b531821l99852N28465o12875j854674o95527K178080L570601J866265p82450
6656A266212j038599J323890K957103J332771j655528k118136M12301K289617
6648D769631R00805j812932k371022n18027R96850M62356j014541j631346j108281
6639a326507l22703K75314J132183K478652L148252J432408k169051m148742j908749
6630a408943K001958K375854j418700l919343j032415M059827N419347K449825
$$ plain form
6692 1815197 2474381 2700113 3427875 4437227 4712013 3902630 2594518 1336158 194515
6683 194515 -845669 -1710280 -2325916 -2358539 -1198296 1183990 3743604 5341916 5726434
6674 5726434 4917267 2520672 -1115826 -3819032 -3478729 -982143 468416 -659978 -2531821
6665 -2531821 -2931673 -2403208 -3016083 -4870757 -5566284 -3388204 182397 2048662 1266212
6656 1266212 227613 1551503 4508606 5841377 4185849 2067713 2480014 4769631
6648 4769631 5670436 3857504 1486482 968455 1965305 2427661 1413120 -218226 -1326507
6639 -1326507 -1649210 -1373896 -241713 2236939 5385191 6817599 4648548 499806 -1408943
6630 -1408943 593015 2968869 1550169 -2369174 -3401589 658238 6077585 8527410
6622H527410l73476o60595o63592k380277m088439l431383j174696K38020K70000
6613c737028M51590J659871K783681K137296m59835l134458l578808j480030J019473
6604d338248J785478J038360M63812P44025J214888J368541J158816J59773j896120
6595A699325l749480l397361n76014K706509M306133L709162J864471K87512K5884
6586F876141N12380J7063j755562k684461j398210P9563p20135k459693j931117
6577c464031N87951J752662P97225N28698J952054K303734J86161j492866l32585
6568B819003J407037O82968j257279j317803J82992N73027l47698m51059N20933
6559B812121O51301l63808n22887R24768K035729J008402j624310m082121m824406
$$ plain form
6622 8527410 8153934 7493339 6829747 4449470 361031 -3070352 -4245048 -4007028 -3737028
6613 -3737028 -3285438 -1625567 1158114 3295410 2835575 -298883 -3877691 -5357721 -4338248
6604 -4338248 -2552770 -1514410 -1050598 -306573 908315 2276856 3435672 3595445 1699325
6595 1699325 -2050155 -5447516 -6023530 -3317021 989112 4698274 6562745 6850257 6876141
6586 6876141 7388521 7405584 5650022 2965561 1567351 1646914 926779 -1532914 -3464031
6577 -3464031 -2876080 -1123418 -326193 202505 2154559 4458293 4644454 3151588 2819003
6568 2819003 4226040 4909008 3651729 2333926 2516918 3089945 2742247 2291188 2812121
6559 2812121 3463422 3099614 2576727 3501495 5537224 6545626 4921316 839195 -3985211
6550c985211k921408R87598L978507L338552K43611j239914M77870K370314J242762
6541D492681j688926k620047m36235K011148J902486n6131j041952r0074P95378
6532C268328k06509j792084j216732J489123K953780Q26770k937907m507788k767024
6523d890043O4761J685790J854593J418407P94370n4082r48309j356409q96380
6514b327302k7782q784j443841k927981k285157N49452L143852L546237K313594
6505E32288J012831K59841O1235M59536P98935j8642j462338j362634Q05243K641910
6495C728205K264381P73190m31705k132419m651921n479938k878608M25120R86163
6486g397532J89572J735413M964783N523284K245368j305905k333952j527732
$$ plain form
6550 -3985211 -6906619 -5919021 -1940514 1398038 1641649 401735 879605 3249919 4492681
6541 4492681 2803755 183708 -252527 1758621 3661107 3604976 2563024 2472950 3268328
6532 3268328 3061819 1269735 53003 1542126 4495906 5322676 2384769 -2123019 -4890043
6523 -4890043 -4825282 -3139492 -1284899 133508 927878 873796 -74513 -1430922 -2327302
6514 -2327302 -2355084 -2363868 -3807709 -6735690 -9020847 -8471395 -5327543 -1781306 532288
6505 532288 1545119 1804960 1866195 2325731 3124666 3106024 1643686 281052 1086295 3728205
6495 3728205 5992586 6765776 6334071 4201652 -450269 -5930207 -8808815 -8383695 -7397532
6486 -7397532 -7207960 -5472547 -507764 5015520 7260888 5954983 3621031 2093299
6478B093299m9161J834556K629762N61953k545495k681126J77515J825299P84226
6469D630828M13466K336888L153593N73077k161001j640779K51215K76902o49190
6460G184999k42242L45422p47230j552027L90878K548109P49907l521275m776746
6451C79795j766534J257354J463625N43888L46182J34499o31661q21864k80843
6442F24441n14688j533248j211948R99164K738006K298537P30622o70026k043321
6433A417539k980197j943865P09068J978285L92320j572586j193498P50472K025597
6424d16865K433916K767359K260083r5k407474k521628p55956K91793j60041l71331
6414A119761N57013J171893K31796j300606j902613j577991j118556m95161O07518
$$ plain form
6478 2093299 2044138 3878694 6508456 7070409 4524914 1843788 2021303 3846602 4630828
6469 4630828 5044294 7381182 10534775 11107852 8946851 7306072 7557287 7834189 7184999
6460 7184999 6942757 7288179 6540949 4988922 5379800 7927909 8677816 5156541 379795
6451 379795 -1386739 -129385 1334240 1878128 2224310 2358809 1727148 905284 624441
6442 624441 109753 -1423495 -2635443 -1636279 1101727 3400264 4130886 3460860 1417539
6433 1417539 -1562658 -3506523 -2797455 -819170 -426850 -1999436 -3192934 -2442462 -416865
6424 -416865 2017051 4784410 7044493 7044398 4636924 2115296 1359340 1651133 1491092 1119761
6414 1119761 1676774 2848667 3080463 1779857 -122756 -1700747 -2819303 -3314464 -2706946
6405b706946J407425P65156q11417j371572j27720J352136J279713k4215r20244
6396a157684p03300K45480J798174L720085M339801J936059k187982m456248l700899
6387a66514k481407k352951r55250L344667O650807L791519l657580q233883n916324
6378i976916n04790K482624K418432J946568K028490J726889J065015R62732J022766
6369C171810k8031j796347k236682n76917J312859J197749o72765j792969n18313
6360a939606J560920J229170k057261m705217l193246J175760L874847L136904
6352i17729J630089J742610K256355J273028l02942o83857n47162j453255k220986
6343G76151l46955L183262M004123L28962l966477m004102J37313M045101M441655
$$ plain form
6405 -2706946 -1299521 -534365 -1345782 -2717354 -2845074 -1492938 -213225 -237440 -1157684
6396 -1157684 -1860984 -1615504 182670 3902755 8242556 10178615 7990633 3534385 -166514
6387 -166514 -2647921 -5000872 -5956122 -2611455 4039352 7830871 4173291 -4060592 -9976916
6378 -9976916 -10481706 -7999082 -5580650 -3634082 -1605592 121297 1186312 2149044 3171810
6369 3171810 3143779 1347432 -889250 -1466167 -153308 1044441 371676 -1421293 -1939606
6360 -1939606 -378686 850484 -1206777 -5911994 -9105240 -7929480 -4054633 -917729
6352 -917729 712360 2454970 4711325 5984353 5681411 4997554 4450392 2997137 776151
6343 776151 429196 3612458 7616581 7945543 3979066 -25036 112277 4157378 8599033
6334H599033K007089p93348k572017l247549l084852k563597k255336j855101
6326e765678j80657K711464M334853K554228q91109k045370k03272J024811o95665
6317H43605k688527j587180J041256R86964j985960l847655k457062k4944J231538
6308h487965J983059K810944J999015j172708l748658k716777N80682K583941
6300f168467K599104K606666K895275J423130k090313m518878l261932O2078J623074
6291d830263K71136j265152k35164K431096L434413J620263n83578q59695k46194
6282b63138r27504k309996k043309k09670P63645M08692R01809K649616K864199
6273A834344K27844k455883k571000j472991j186831m24105K419919M775163K885561
$$ plain form
6334 8599033 10606122 9812774 7240757 3993208 908356 -1655241 -3910577 -5765678
6326 -5765678 -5946335 -3234871 1099982 3654210 2763101 717731 514459 1539270 843605
6317 843605 -1844922 -3432102 -2390846 -1403882 -3389842 -7237497 -9694559 -9719503 -8487965
6308 -8487965 -6504906 -3693962 -1694947 -2867655 -6616313 -9333090 -8752408 -6168467
6300 -6168467 -3569363 -962697 1932578 3355708 1265395 -3253483 -6515415 -6453337 -4830263
6291 -4830263 -4559127 -5824279 -6059443 -3628347 -193934 1426329 842751 -16944 -263138
6282 -263138 -1190642 -3500638 -5543947 -5753617 -4989972 -4581280 -3679471 -1029855 1834344
6273 1834344 2062188 -393695 -2964695 -4437686 -5624517 -6048622 -3628703 1146460 4032021
6264D032021j909920m254991j931056J821797L280102K164503J91413j288747
6256B105122j529270o15892J11112k71056m98657Q25913K238384J380429p39404
6247C006681r93480O30633J017557n77314j327665j59287J78655j682918k710066
6238b617204n59463J946845J145926j336097r40654K726913N140653L015243j845754
6229F676408n149659m423636n81923L124465L640045Q18520k477634l645918k874571
6220d893903j669907m15801J053690J877108J228371L1254l65509l65472r44684
6211d464853j254262Q6004J896741J499489j075991k748248j822165j10207M28159
6202g565333O34821J970906L341681K482732k91801j923211l21118L158545N229813
$$ plain form
6264 4032021 2122101 -2132890 -4063946 -2242149 1037953 3202456 3393869 2105122
6256 2105122 575852 -40040 71072 -199984 -698641 127272 2365656 3746085 3006681
6247 3006681 2013201 2643834 3661391 3084077 1756412 1597125 1775780 92862 -2617204
6238 -2617204 -3176667 -1229822 -83896 -1419993 -2360647 366266 5506919 8522162 6676408
6229 6676408 1526749 -2896887 -3478810 -354345 3285700 4104220 1626586 -2019332 -4893903
6220 -4893903 -6563810 -6979611 -5925921 -4048813 -2820442 -2789188 -3154697 -3520169 -4464853
6211 -4464853 -5719115 -5633111 -3736370 -2236881 -3312872 -6061120 -7883285 -7993492 -7565333
6202 -7565333 -6930512 -4959606 -1617925 864807 573006 -1350205 -1671323 1487222 6717035
6193F717035L799263n08214n025753o898941n015558q37451K722942L676033K430019
6184A059375R39100N53418J000532J425955J738844K267076K474164J187068j537067
6175A1108465l791241l934166k691982k054349k376963j953008J84470K329042
6167c179732K070054m15167k363372j792597L32672J824376K048884J905363J802097
6158B232578J221007J86725m09114k51904R5504O83906K157636L524029K206877
6149A1647244j983861n027584l395859R00639K935097J488261l94081r36095j612962
6140C620799k978999k723917J44727K624550J850764o67920j678667r81858p16413
6131a506934j388288j576536p66351Q3329K86534k13806j422297k466043j529649
$$ plain form
6193 6717035 10516298 10008084 4982331 -1916610 -6932168 -7769619 -5046677 -1370644 1059375
6184 1059375 1998475 2551893 3552425 4978380 6717224 8984300 11458464 12645532 11108465
6175 11108465 7317224 3383058 691076 -1363273 -3740236 -5693244 -5508774 -3179732
6167 -3179732 -1109678 -1524845 -3888217 -5680814 -5348142 -3523766 -1474882 430481 2232578
6158 2232578 3453585 3640310 3231196 2979292 3074796 3758702 5916338 9440367 11647244
6149 11647244 9663383 4635799 1239940 2140579 5075676 6563937 6169856 5233761 3620799
6140 3620799 641800 -2082117 -1937390 687160 2537924 1870004 191337 -790521 -1506934
6131 -1506934 -2895222 -4471758 -5238109 -5154780 -4868246 -5082052 -6504349 -8970392 -10500041
6122a0500041J296103K780484R29627j116172P49999M737599N010216L30771l954237
6113B64349l716595j236105l62743o07285N80102K625597K841817R87606q07259
6104E69484j773862k779074l290359j476657K224249M605202L783514J475061
6096C337558L9531o10059j565316k192031j076560J143206K171227J274433J48495
6087B670484R8248J53708r43370k319557k160354n63970N72951L77035R386N66958
6077a538481J515253J820873J324244K76401j208861k393312j943897J04231J608731
6068d34818R34796p26725j189146m42348j81709r40359j754234k207611k578734
6059i520888k141040J79013L061360L232449j77292l642945l143406J074663M910458
$$ plain form
6122 -10500041 -9203938 -6423454 -5493827 -6609999 -5860000 -1122401 3887815 4218586 264349
6113 264349 -3452246 -4688351 -5051094 -5658379 -5078277 -2452680 389137 1376743 569484
6104 569484 -1204378 -3983452 -7273811 -8750468 -6526219 -1921017 1862497 3337558
6096 3337558 3377089 2767030 1201714 -990317 -2066877 -923671 1247556 2521989 2670484
6087 2670484 2768732 2922440 1979070 -340487 -2500841 -3064811 -2491860 -2114825 -2105439 -1538481
6077 -1538481 -23228 1797645 3121889 3398290 2189429 -203883 -2147780 -2043549 -434818
6068 -434818 499978 -226747 -1415893 -1858241 -2039950 -2980309 -4734543 -6942154 -9520888
6059 -9520888 -11661928 -11482915 -8421555 -5189106 -5366398 -9009343 -12152749 -11078086 -6167628
6050f167628M906554J453192j981368k293772J66891J979472P91138j516207j351072
6041d012800J373054K976954J313776j331108j837501l48388J010082J529928
6033F73997J862664J943573J237716K73776j0146J32472q0953m64367o56782j450821
6023C461129l309406m368307k394133J457532L346565J673803q30958p97998J660959
6014a00814L562316K669491m92448l612723m782439l867190k096512n46312N42366
6005h724265J057057Q03277M64070J278305K752075K434331l12055k154181p0209
5996b471595L632203M025047O09435k249090k035788r71974j112400r91109M83581
5987a081690Q04020j943849m705712l444496M46662K069930L50851r35892O05567
$$ plain form
6050 -6167628 -1261074 192118 -1789250 -4083022 -3916131 -1936659 -1145521 -2661728 -4012800
6041 -4012800 -2639746 337208 1650984 319876 -1517625 -1866013 -855931 673997
6033 673997 2536661 4480234 5717950 5991726 5981580 6114052 6033099 5568732 4911950 3461129
6023 3461129 151723 -4216584 -6610717 -5153185 -1806620 -132817 -963775 -1761773 -100814
6014 -100814 3461502 6130993 5638545 2025822 -2756617 -6623807 -8720319 -9266631 -8724265
6005 -8724265 -7667208 -6863931 -6399861 -5121556 -2369481 64850 -247205 -2401386 -2471595
5996 -2471595 1160608 5185655 5795090 3546000 1510212 538238 -574162 -1565271 -1081690
5987 -1081690 -277670 -2221519 -6927231 -10371727 -9925065 -7855135 -7504284 -8440176 -7834609
5978g834609K880622L215641J840334K10926j195020j994266j335995L01332R46809
5969b964226J45736o2059J344976K190005M14181k454728l494733k448445j109440
5960h438733K526J541327K729651J857721o43824k254664j802727o02629J55205
5951g456147Q70156J781042J944099R72306M6030J64968Q32242J282186J523461
5942A960343J436240N54112l92135K80819K151910K092893j249285m347160k994535
5933e06798J610764M177912K327003r70745k331636k080535k022563j844863j53770
5924a795231K370507L377466K108343L30707k00573K15345K53066l75836p80525
5915E503269n29283n09075j588060k834207k181304O71788L112451K594454J26647
$$ plain form
5978 -7834609 -4953987 -1738346 101988 312914 -882106 -2876372 -4212367 -3911035 -2964226
5969 -2964226 -2818490 -2880549 -1535573 654432 1068613 -1386115 -4880848 -7329293 -8438733
5960 -8438733 -8436207 -6894880 -4165229 -2307508 -2951332 -5205996 -7008723 -7611352 -7456147
5951 -7456147 -6585991 -4804949 -2860850 -1888544 -1842514 -1677546 -845304 436882 1960343
5942 1960343 3396583 3950695 3558560 3839379 5991289 8084182 6834897 2487737 -506798
5933 -506798 1103966 5281878 7608881 6638136 4306500 2225965 203402 -1641461 -1795231
5924 -1795231 575276 3952742 6061085 6391792 6191219 6406564 6659630 6283794 5503269
5915 5503269 4973986 4464911 2876851 42644 -2138660 -1466872 1645579 4240033 4366680
5906D366680r20497N50200J890201O30586j927412k614563p89091J060280Q60681
5897C107065n92847j142388n1073J441034J815866Q77486l69981j145515j785114
5888B154533k838584l588172k517834L78032K889074L165375K108852J818640
5880C569916K291189J595711n85498j753898o6445K596772K802178M4239k769658
5871G724506l194407j856554p38975m12518n8131O97450J290153J325723J126174
5862E903421J049639R27858L26458r91486k767707m095328l942030k394683r32482
5853f916340o47412o96442K86891J682462J533685k37954j308343l49725J042024
5844e611154J050539M04452P15126J652074J889899J572515J429876N50306k068108
$$ plain form
5906 4366680 3446183 3996383 5886584 6517170 4589758 1975195 1186104 2246384 3107065
5897 3107065 2514218 1371830 1320757 2761791 4577657 5455143 5085162 3939647 2154533
5888 2154533 -684051 -4272223 -6790057 -6412025 -3522951 -357576 1751276 3569916
5880 3569916 5861105 7456816 6871318 5117420 5050975 7647747 10449925 10494164 7724506
5871 7724506 4530099 2673545 1934570 1522052 1463921 2161371 3451524 4777247 5903421
5862 5903421 6953060 7880918 8207376 7215890 4448183 352855 -3589175 -5983858 -6916340
5853 -6916340 -7563752 -8260194 -7973303 -6290841 -4757156 -4995110 -6303453 -6653178 -5611154
5844 -5611154 -4560615 -4156163 -3441037 -1788963 100936 1673451 3103327 3653633 1585525
5835A585525m447019l539664k70458J027836q65585j908942P82170L849803K376738
5826a409596k609706n236376k626849J910160L755910K122586m60038j538098
5818f092007n15975J470241K481650J463865m95185j359274o37028M10567J009336
5809b263810J726726K645667K402491K30276k240420k731665j306634j34254l55134
5800b026757o34154N83416K440559K449345l08839l831615n391069m278402j771478
5791a2768994Q29961K979760M096883L557390J838143M13439n2545l07066p59288
5782a72317m88031J010264K355312J974441L56368q36822j119541j064720n85301
5773A429653P12616J823340J119419j019638k339689j881007j117080j277614
$$ plain form
5835 1585525 -2861494 -6401158 -6671616 -5643780 -6509365 -8418307 -7636137 -3786334 -1409596
5826 -1409596 -4019302 -9255678 -11882527 -9972367 -6216457 -4093871 -4553909 -6092007
5818 -6092007 -6607982 -5137741 -2656091 -1192226 -1687411 -3046685 -3683713 -3273146 -2263810
5809 -2263810 -537084 2108583 4511074 4741350 2500930 -230735 -1537369 -1671623 -2026757
5800 -2026757 -2660911 -2077495 363064 2812409 2503570 -1328045 -6719114 -10997516 -12768994
5791 -12768994 -11939033 -8959273 -4862390 -1305000 533143 946582 894037 586971 -172317
5782 -172317 -660348 349916 2705228 4679669 5036037 4199215 3079674 2014954 1429653
5773 1429653 2142269 3965609 5085028 4065390 1725701 -155306 -1272386 -2550000
5765b550000j420907k85405J478346K294234J822771Q70313k4813p04672p93142
5756F86725k23694J28824m67432j239992q37729N23017J043078k85228k200150
5747b872581k554803p75219J418079J704241m16018k906095l193740r37581J732553
5738h801164K908250K956881L189860L365483J985807r96993l289729k811177
5730a492782k36748J904192K193260J459946J122719J395136J486968Q65156l11578
5721H386269j643853k688419k821326j641690K65216J514970J244267m0336j147560
5712A427538j395436r21471k61413L697m48602j310829j857275j826594j647609
5703h237994j421189l70742J896444M109637M405411K545279R5386j503276j961826
$$ plain form
5765 -2550000 -3970907 -4256312 -2777966 -483732 1339039 2209352 2184539 1479867 686725
5756 686725 463031 591855 124423 -1115569 -1953298 -1430281 -387203 -672431 -2872581
5747 -2872581 -5427384 -6202603 -4784524 -3080283 -3496301 -6402396 -9596136 -10533717 -8801164
5738 -8801164 -5892914 -2936033 253827 3619310 5605117 4608124 1318395 -1492782
5730 -1492782 -1729530 174662 2367922 3827868 4950587 6345723 7832691 8697847 8386269
5721 8386269 6742416 4053997 1232671 -409019 -143803 1371167 2615434 2575098 1427538
5712 1427538 32102 -889369 -1150782 -1147085 -1595687 -2906516 -4763791 -6590385 -8237994
5703 -8237994 -9659183 -10029925 -8133481 -4023844 381567 2926846 3022232 1518956 -442870
5694d42870j294430N44860K543396K562352k21460l481618l912620j268570J150183
5685c820777N65205j899221k904073j138293J585708L200339L541534L158021
5677B288443J882300K1053o00744R99380K489062Q08035l021361m695874k706572
5668b536278l18718j60611l22589J568161L478780K009693j632140l036571j207880
5659b158153N25629K66931j02525P20117Q83988q85060k413055j496116L81171
5650d277073M74371r30809j373640j29714J280323J783939J736324J550424J133416
5641A247561N20162j73689j041993j715727j260405K07267R44502p92r95454k06312
5631b474880J228625N43164k581919n285888m869015j398942K829936N106594
$$ plain form
5694 -442870 -1737300 -1192440 1350956 3913308 3691848 210230 -3702390 -4970960 -3820777
5685 -3820777 -3255572 -5154793 -8058866 -9197159 -7611451 -4411112 -869578 2288443
5677 2288443 4170743 4191796 3591052 4590432 7079494 7887529 4866168 170294 -2536278
5668 -2536278 -2854996 -3015607 -3338196 -1770035 1708745 3718438 2086298 -950273 -2158153
5659 -2158153 -1632524 -1365593 -1468118 -748001 135987 -749073 -3162128 -4658244 -4277073
5650 -4277073 -3802702 -4733511 -6107151 -6236865 -4956542 -3172603 -1436279 114145 1247561
5641 1247561 1767723 1594034 552041 -1163686 -2424091 -2216824 -1272322 -1273114 -2268568 -2474880
5631 -2474880 -1246255 -703091 -3285010 -8570898 -13439913 -14838855 -12008919 -6902325
5623f902325L975066N80629j927162j601359K20215J252738J535811K387514L208788
5614B729915K188972j50775j201901l84073J0688j107154j761960n65433O72994
5605D31273J40363o38186N80492K558773K169708o58876k740558k313623j024000
5596a494634o77038o46858K63281J461218J694685J145498P30331K62507r60708
5587A778282k290401k287653j141231p33974j738973k230198l45135K713737L848495
5578b427051J932182q80144j897486q15327O06292Q92476O8734j027275j741769
5569e289368j788782j029235M55903K059445K747107J912846K75496n21873L24273
5560h54188J677710J719834J87506j321367j318213L449J385815K040453K093609
$$ plain form
5623 -6902325 -2927259 -2346630 -4273792 -5875151 -5654936 -4402198 -2866387 -478873 2729915
5614 2729915 4918887 4768112 3566211 3182138 3192826 2085672 323712 -241721 431273
5605 431273 571636 -66550 513942 3072715 5242423 4583547 1842989 -470634 -1494634
5596 -1494634 -2171672 -2818530 -2555249 -1094031 600654 1746152 2476483 2738990 1778282
5587 1778282 -512119 -2799772 -3941003 -4674977 -6413950 -8644148 -8989283 -6275546 -2427051
5578 -2427051 -494869 -1375013 -3272499 -4087826 -3481534 -2589058 -2520324 -3547599 -5289368
5569 -5289368 -7078150 -8107385 -7651482 -5592037 -2844930 -932084 -656588 -1178461 -854188
5560 -854188 823522 2543356 2730862 1409495 91282 94731 1480546 3520999 5614608
5551E614608J827399R75640r95098l758931n508077m354582q42494J953487J926442
5542c161606O12870P73221K118327J849629o50125k507904j635345L19718Q71215
5533a410000K58750O3797K12456j09837r183J719045L494068K313638j719713
5524D813021m966895m863037k581010m04937J151452K312483K219843J89558k249072
5515d378594k617938p16328R45802L70820j313285j353480Q63248K732882J790434
5506c676439p75214j541980L66617K019105J040530q91830q06287R23094J312760
5497b029644n76343k460479k314134n15520J810652M101414N278111L813069K13864
5488G320990k490819k240255m08971N34591K42555k08718o79553j587256k239242
$$ plain form
5551 5614608 7442007 8417647 7422549 3663618 -1844459 -6199041 -7041535 -5088048 -3161606
5542 -3161606 -2548736 -1775515 342812 2192441 1542316 -965588 -2600933 -2281215 -1410000
5533 -1410000 -1151250 -1087453 -874997 -984834 -994017 725028 4219096 6532734 4813021
5524 4813021 -153874 -5016911 -7597921 -8002858 -6851406 -4538923 -2319080 -2129522 -4378594
5515 -4378594 -6996532 -7712860 -6767058 -6396238 -7709523 -9063003 -8199755 -5466873 -3676439
5506 -3676439 -4451653 -5993633 -5627016 -3607911 -2567381 -3459211 -4265498 -3342404 -2029644
5497 -2029644 -2605987 -5066466 -7380600 -7896120 -6085468 -1984054 3294057 7107126 7320990
5488 7320990 4830171 2589916 2180945 2715536 2958091 2749373 2069820 482564 -1756678
5479a756678j718138p55700n62015l35396J535267L897879L442322k38030l071506
5470D38005j899239R20709J036703j398895k263765l1787K057189J316487m80227
5461c04820n43504O01820J066701J438193L109711M485468K978148r1244j052047
5452A1688426j27040j165801m442812n193352j498165J736798K68294k772090
5444a505742k343202L61645R78356J22881J738786M871698M349371j56330k822727
5435E594736j080742K76830k539418n600233l375518K525413N733584L943881
5427E478533P04317o17759n57824j027985k073185k172110m76234J888977K673008
5418C819738J056562q66880m32593J899769L066110J749992q0618m90495Q3922
$$ plain form
5479 -1756678 -3474816 -4230516 -4792531 -5127927 -3592660 305219 3747541 3509511 438005
5470 438005 -1461234 -540525 496178 -902717 -3166482 -3198269 -1141080 175407 -304820
5461 -304820 -848324 -246504 820197 2258390 5368101 9853569 12831717 12740473 11688426
5452 11688426 11561386 10395585 5952773 759421 -738744 998054 1266348 -1505742
5444 -1505742 -3848944 -3487299 -2508943 -2386062 -647276 4224422 8573793 8417463 5594736
5435 5594736 4513994 4790824 2251406 -3348827 -6724345 -4198932 1534652 5478533
5427 5478533 6182850 5565091 5007267 3979282 1906097 -266013 -742247 1146730 3819738
5418 3819738 4876300 4009420 3576827 5476596 8542706 10292698 10212080 9721585 9805507
5409I805507O43543J119373R15733j246814m466361n385348k730714M08574R38019
5400A512j24293k44632M07462J87777o55701r14249j122138k303466l240590j886752
5390i895070J322943L956049M474783K755972p03875l953340l903091j72190L198751
5381b919068K737428L17400k12324R74325R79760l67287r18654p97519j683748
5372a889687k254334L54338M453106M626690k47967m815914m737349j813508L00189
5363f024436J068548J273833L26703j521580j642470J005420L146997J764695
5355f02290r69015q94062J802091L220037J766252j38402l61774J02818n35722
5346C389933j882749j989906j03580K110850K166119m43064l326723l728244j708535
$$ plain form
5409 9805507 10449050 11568423 12484156 11237342 6770981 1385633 -1345081 -936507 1512
5400 1512 -122781 -367413 40049 227826 -427875 -1342124 -2464262 -4767728 -8008318 -9895070
5390 -9895070 -8572127 -4616078 -141295 2614677 1910802 -2042538 -5945629 -6117819 -2919068
5381 -2919068 -181640 135760 -76564 897761 1877521 1510234 591580 -205939 -1889687
5372 -1889687 -4144021 -3789683 663423 5290113 5042146 226232 -4511117 -6324625 -6024436
5363 -6024436 -4955888 -3682055 -3355352 -4876932 -6519402 -5513982 -2366985 -602290
5355 -602290 -1571305 -2465367 -663276 2556761 4323013 4184611 3822837 3925655 3389933
5346 3389933 1507184 -482722 -586302 1524548 3690667 3247603 -79120 -3807364 -5515899
5337e515899K80378P94739P74500J353248K115203K227351J794618J322468J002143
5328F148749R37527R26523J28342j471764j794842O40349L123188J306158m167004
5319E777226p427867n143628o91789J433598J516842K026947K684735J895381
5311B071445M63795n966l36808j645675k059138K91099K797909J558570k150465
5302I84766l443565j306029M73398q7928o49410N30648J879857K075013J999291
5293B456041J611068q42764m538697n268177j542104K314761K182825j60312o64163
5284d451522Q30274J818458J866516J979845J277167j384369l891370l298746
5276e253747p46325L90228L74097K210695N137404M627060Q8919k925144q04211
$$ plain form
5337 -5515899 -5235521 -4440782 -3666282 -2313034 -197831 2029520 3824138 5146606 6148749
5328 6148749 7086276 8012799 8141141 6669377 4874535 5514884 8638072 9944230 5777226
5319 5777226 -1650641 -6794269 -7486058 -6052460 -4535618 -2508671 176064 2071445
5311 2071445 2535240 2529274 2192466 546791 -1512347 -1221248 1576661 3135231 984766
5302 984766 -2458799 -3764828 -3291430 -3379358 -4028768 -3498120 -1618263 456750 2456041
5293 2456041 4067109 3224345 -1314352 -6582529 -8124633 -5809872 -3627047 -3787359 -4451522
5284 -4451522 -3621248 -1802790 63726 2043571 3320738 1936369 -1955001 -5253747
5276 -5253747 -6000072 -5609844 -5235747 -3025052 2112352 6739412 6828331 3903187 3098976
5267C098976K602455K126654r98670k006982l45030N25384l72506m45775J066252
5258E250758J444204n66108k231438j218846P10439P63958o06094j104285m31191
5249B011397Q1856M60870J733800L058205K183538q55827l122883k740951j221678
5240A588327n76248k08589J327118L031558K608082M27557m61962J087234K207761
5231A1030838L2810l930916n558490l365491J56236K177510K274151J242955m97137
5222C562466k140057j997234M05733K729422K092812j430315m879128n531696
5214g187997k856838J820435N952593O682726L215603j630019l988755l204965
5206a197217j848097j526557r90780R05363K692634K357414M33906p38299j33700
$$ plain form
5267 3098976 5701431 7828085 6829415 4822433 4477403 5002787 4630281 4184506 5250758
5258 5250758 6694962 6128854 3897416 2678570 3389009 4152967 3546873 2442588 2011397
5249 2011397 2093253 2554123 4287923 7346128 9529666 8673839 5550956 2810005 1588327
5240 1588327 1012079 803490 2130608 5162166 7770248 8197805 7735843 8823077 11030838
5231 11030838 11063648 7132732 1574242 -1791249 -1635013 542497 2816648 4059603 3562466
5222 3562466 1422409 -574825 -169092 2560330 4653142 3222827 -1656301 -7187997
5214 -7187997 -10044835 -8224400 -2271807 4410919 7626522 5996503 2007748 -1197217
5206 -1197217 -3045314 -4571871 -5562651 -4657288 -1964654 392760 826666 88367 -45333
5197d5333J024872J202048M02625o8532N19658Q60273j109455m754504o014658
5188g983006k195257L587159N739457L500697J253097J380606J353381n92579
5180F043555j715552J87938K219058J051982j192410o42845J309053K77983l235862
5171D302900m148224r25017K204171K193762J283120K262388L877222L446169
5163A4496491J008368j465173k813099k929360k202462j913764l214057m826142
5155c859198l979112m26957K874010L876555L547916K928790J091671k378774
5147C674901n482983o175854m619874j868564J385549L697957L328191J249326
5139d811351Q21001K828326L921075J943483n29545o12117J99878q62298k798421
$$ plain form
5197 -45333 979539 2181587 2584212 2515680 3035338 3895611 2786156 -1968348 -7983006
5188 -7983006 -10178263 -6591104 -851647 2649050 3902147 5282753 6636134 6043555
5180 6043555 4328003 4515941 6734999 7786981 6594571 5951726 7260779 7538762 4302900
5171 4302900 154676 -770341 1433830 3627592 4910712 7173100 11050322 14496491
5163 14496491 15504859 14039686 11226587 8297227 6094765 4181001 966944 -3859198
5155 -3859198 -7838310 -8265267 -5391257 -1514702 2033214 4962004 6053675 3674901
5147 3674901 -1808082 -7983936 -12603810 -14472374 -13086825 -9388868 -6060677 -4811351
5139 -4811351 -3990350 -1162024 2759051 4702534 4172989 3560872 3760750 2898452 100031
5130A00031k804607j241785n97708r05668k54738R99007N68759j425789k160369
5121g722867m32593J839274K758293K274742O85066j749430l220656j417197K746370
5112d238998M974313K680057j535590k962017j97538L676368M611632J499355
5104H507582k924347m659516k355589J312849K680853J181919n06679j52555J484195
5095D568712K120254R30020p23202j229321p15283o85900j813514k821567k117174
5086b486975J09012K303131L408158L104641J051763k187881m065027k400276
5078a163454J201668K901474J757237M14637L07756l33253k521012m143122l509800
5069e087869k086675j460563n90898J426961K765833J855836L49114K26446N30236
$$ plain form
5130 100031 -2704576 -3946361 -4544069 -5449737 -5704475 -4705468 -4136709 -5562498 -7722867
5121 -7722867 -8155460 -6316186 -3557893 -1283151 -598085 -2347515 -5568171 -6985368 -4238998
5112 -4238998 735315 3415372 1879782 -1082235 -1279773 2396595 7008227 8507582
5104 8507582 5583235 923719 -1431870 -119021 2561832 3743751 3237072 3084517 4568712
5095 4568712 6688966 7618986 6895784 5666463 4951180 4265280 2451766 -369801 -2486975
5086 -2486975 -2377963 -74832 3333326 6437967 7489730 5301849 1236822 -1163454
5078 -1163454 38214 2939688 4696925 5111562 5419318 5086065 2565053 -1578069 -5087869
5069 -5087869 -7174544 -8635107 -9226005 -7799044 -5033211 -3177375 -2828261 -2601815 -2071579
5060b071579j8895Q5431K083967L384464J142281k607314l609668j618665J56080
5051c073898M36344N34053Q04255O24655Q94701K411308K886279Q1342l133814
5042B465225j969151K457641L906940J31711m039128m045480j287595M61282L61585
5033a556970q5148n0895K80568N52032K96317l47015o999J882978L123979J494133
5023E582980j420366k399714j684398j997560l207978k528600P9835J469796O61365
5014e444640o8251r335j006530k710702k017982J202299K900128J407731K92241
5005e455041K131938M137760L078890M53939o23107k41744j25078k38918k8743
4996C089896l36853j305816j034196J043921K190846N06118j666921j378446L61175
$$ plain form
5060 -2071579 -2090474 -2005043 78924 3463388 4605669 1998355 -1611313 -3229978 -3073898
5051 -3073898 -2637554 -2103501 -1299246 -674591 220110 2631418 5517697 5599039 2465225
5042 2465225 496074 2953715 6860655 6992366 2953238 -1092242 -2379837 -1918555 -1556970
5033 -1556970 -1642118 -1693013 -1412445 -860413 -564096 -911111 -918110 964868 4088847 5582980
5023 5582980 4162614 1762900 78502 -1919058 -5127036 -7655636 -7575801 -6106005 -5444640
5014 -5444640 -5512891 -5522226 -6528756 -9239458 -11257440 -10055141 -7155013 -5747282 -5455041
5005 -5455041 -3323103 814657 3893547 4347486 3724379 3482635 3357557 3118639 3089896
4996 3089896 2753043 1447227 413031 1456952 3647798 4153916 2486995 1108549 1469724
4987A469724O58486p76526k207089l079298l701398l169988m63041L213440N379237
4978b676453N048712L189238J219859K991n47162j264494k196325j850325K56831
4969A182872J527314j80531k115152l6189M452250N136484L21499m576982m953828
4960G57737k432002n25117J78287K63685m76511r57616R28627L950031L961384
4951E648505N76757j550230j83133J132116l45440k143330j706092m92209J32679
4942A069623J576942L493150K478964j280632k358513J028725L064937k00455
4934H872741m164014l703306j247363r28356j158059N01697J328792p60023j462842
4925b720733K455816N815474L014499k146072k883802m05870J54020l68883J404099
$$ plain form
4987 1469724 2128210 1351684 -855405 -3934703 -7636101 -10806089 -11269130 -8055690 -2676453
4978 -2676453 2372259 5561497 6781356 6784347 6237185 4972691 2776366 926041 1182872
4969 1182872 2710186 2529655 414503 378314 4830564 9967048 10288547 5711565 757737
4960 757737 -1674265 -2199382 -2021095 -1757410 -2233921 -3191537 -2262910 1687121 5648505
4951 5648505 6225262 4675032 4491899 5624015 5278575 3135245 1429153 936944 1069623
4942 1069623 2646565 6139715 8618679 7338047 4979534 6008259 9073196 8872741
4934 8872741 4708727 1005421 -241942 -1170298 -2328357 -1826660 -497868 -1257891 -2720733
4925 -2720733 -264917 5550557 8565056 6418984 3535182 3129312 3283332 2914449 4318548
4916D318548K725219p15481n329652m460035N22254L228762L028261L507618L710024
4907A0535518O56825k704171j910636K5593k025314m766998j904375L742973M840860
4898F490275K469398K615376L672601K28393m403439l090373J082119p9221m155910
4889D829219k599652K590964K842916m6654J600607M178169k67780m707004K383072
4880A0803857J1823745O143464o480250l163276J0522634Q807422J202730K8893436
4872F8553762Q5917092R7942015K1135863q0080250j07920800n6846490o342279
4865B2358913l621739j7263503r999914M916191K370443p959231n162542M583007
4857i778375L749034l970761l868517K316408K952519p08982P27042N628094N240702
$$ plain form
4916 4318548 7043767 6328286 998634 -3461401 -2939147 289615 3317876 6825494 10535518
4907 10535518 11192343 8488172 6577536 6603129 4577815 -189183 -2093558 1649415 6490275
4898 6490275 8959673 11575049 15247650 15476043 11072604 7982231 9064350 8985129 4829219
4889 4829219 2229567 4820531 7663447 7616793 9217400 13395569 13127789 8420785 10803857
4880 10803857 22627602 28771066 22290816 19127540 29650174 38457596 39660326 68553762
4872 68553762 154470854 252412869 273548732 193468482 85547682 28701192 22358913
4865 22358913 18737174 1473671 -8526243 -3610052 -1239609 -9198840 -14361382 -9778375
4857 -9778375 -6029341 -10000102 -13868619 -11552211 -8599692 -9308674 -8581632 -2953538 2287164
4848B287164M54704j172815J40091j081199l319937j160480L255622L438740o795
4839B835095j357128q0062J15578n15144P91900K431072J032212j610431j440880
4830B202212O38813R70578l70841j340441k701542m994853m630160N28907N494169
4821d203158M755038Q66503l86261L57455j283448m295599l851961n2888K470738
4812e623581K366829K067896J740042n29606l381210l400419j124989j31736r53952
4803h970726j331582j258353k098228k060911J325764N366293N200297J832603
4795a994843N61957J909912J248658k169707l232622K21730L371903K006060j438207
4786D84841k587787j322845q700Q32426J898160K696600K323447Q87719j257850
$$ plain form
4848 2287164 2741868 1569053 1709144 627945 -2691992 -3852472 -596850 2841890 2835095
4839 2835095 1477967 1397905 1513483 998339 1790239 4221311 5253523 3643092 2202212
4830 2202212 2841025 3811603 3440762 2100321 -601221 -5596074 -10226234 -9697327 -4203158
4821 -4203158 551880 1418383 1032122 1389577 106129 -4189470 -8041431 -8094319 -5623581
4812 -5623581 -3256752 -1188856 551186 21580 -3359630 -6760049 -7885038 -8016774 -8970726
4803 -8970726 -10302308 -11560661 -13658889 -15719800 -14394036 -9027743 -3827446 -1994843
4795 -1994843 -1432886 477026 1725684 -444023 -3676645 -3454915 -83012 1923048 484841
4786 484841 -2102946 -3425791 -3434491 -2602065 -703905 1992695 4316142 5203861 3946011
4777C946011l767342n061093l420934j50135J206447j19369p70107J650481M874702
4768a611339N221164K452573n23179j436409n99830J15947o54881k257928k596820
4759a890702r29009P62048N97564j98644O26911K386548K466202O09402j063038
4750C367282j921785l129350m105595k692813M61369J712103n3114j523937m02111
4741h287951J021644J93479j201268k51746K223064L145421J871757K12692q99225
4732a972133j616569j085803J518736M230534L772181J50587k903588k690342
4724e96397m33458J262912J603356J160541K47080p02119n37616J089367K497143
4715E590809J917093Q7100p82702k83923j35289j113283j726144q01474M33732
$$ plain form
4777 3946011 178669 -4882424 -8303358 -8453493 -7247046 -7366415 -8136522 -6486041 -1611339
4768 -1611339 3609825 6062398 5539219 4102810 3502980 3618927 2964046 706118 -1890702
4759 -1890702 -2819711 -2057663 -1460099 -1658743 -1031832 1354716 3820918 4430320 3367282
4750 3367282 1445497 -1683853 -5789448 -8482261 -8020892 -6308789 -6361903 -7885840 -8287951
4741 -8287951 -7266307 -7072828 -8274096 -8525842 -6302778 -3157357 -1285600 -1072908 -1972133
4732 -1972133 -3588702 -4674505 -3155769 1074765 4846946 4997533 2093945 -596397
4724 -596397 -1029855 233057 1836413 2996954 3244034 2541915 2004299 3093666 5590809
4715 5590809 7507902 7595002 6812300 6528377 6393088 5279805 3553661 2752187 3185919
4706C185919K83049p98034j236261r80016j121636j495177q50500O47368J253856
4697a111432L62871n28363j72553P97196J235681R16721k6832j502729k610216
4688b639656j992949J62900J967687K338022K085896J950606J496550P57491Q27320
4679F953867J717709J786560N30104l47745m2631k58834j923071l032897k138070
4670C244992j233008k214075l037225j074800J813064J807094o37814j554137
4662b885909J63682J594124J022916L1721k54042r21642k079597j557432J496764
4653c389415M556826M903756K682015l37313k796673l585742k023820O08184J805412
4644B423230J070038L29013M66971K9078j610132k581766j626031l69042o12285
$$ plain form
4706 3185919 3468968 2670934 1434673 454657 -666979 -2162156 -3012656 -2365288 -1111432
4697 -1111432 -748561 -1276924 -1449477 -652281 583400 1500121 1473289 -29440 -2639656
4688 -2639656 -4632605 -4469705 -2502018 -163996 1921900 3872506 5369056 6126547 6953867
4679 6953867 8671576 10458136 10988240 10640495 10597864 10339030 8415959 5383062 3244992
4670 3244992 2011984 -202091 -3239316 -4314116 -2501052 -693958 -1331772 -2885909
4662 -2885909 -2722227 -1128103 -105187 -73466 -327508 -1249150 -3328747 -4886179 -3389415
4653 -3389415 1167411 6071167 8753182 8415869 5619196 2033454 9634 617818 2423230
4644 2423230 3493268 3822281 4289252 4318330 2708198 126432 -1499599 -1868641 -2480926
4635b480926j457939j090730L59987J607561K252611K310256J305491m11076j056243
4626A338992L1494Q10507n01187k408744k327064m55645J019057J583269K507494
4617A598173L705754L241189L95299k852262m121660l111400j386538o81757j515819
4608d729021k630253j982101Q27045L555541L816094J951421N2487j148143k372322
4599b659252l155662j795732J337511L002352J339030r67937j55853L069789M293720
4590D307966J701927j291025r82683J497564K331405P30780n28206L2451M13019
4581H213198j257145l703914m781877m515198l800173k114884P52795K311923
4573h895275J87377l341714l387253O42857L860185K796876N1348p3443K210272
$$ plain form
4635 -2480926 -3938865 -5029595 -4669608 -3062047 -809436 1500820 2806311 2395235 1338992
4626 1338992 1370486 2180993 1679806 -728938 -3056002 -3511647 -2492590 -909321 1598173
4617 1598173 5303927 8545116 8940415 6088153 1966493 -1144907 -2531445 -3213202 -4729021
4608 -4729021 -7359274 -9341375 -8514330 -4958789 -1142695 808726 861213 -286930 -2659252
4599 -2659252 -5814914 -7610646 -6273135 -3270783 -1931753 -2899690 -3055543 14246 4307966
4590 4307966 6009893 4718868 3736185 5233749 7565154 8295934 7767728 7800179 8213198
4581 8213198 6956053 3252139 -1529738 -6044936 -9845109 -11959993 -11207198 -8895275
4573 -8895275 -8707898 -12049612 -15436865 -14794008 -10933823 -8136947 -8085599 -8159042 -5948770
4564e948770L152249J014075k147972l493277j937554J742760N242222N555182
4556C178915J677079l305181m649901j107756L559359M730214J697362k183120
4548C596971l382800j587924N99393Q13846o54199j749338j396810m34388M9987
4539d145262j495l73941j176889j768248m97554K853994N313425L576472j322206
4530B458296m284502k068169K555475M118188J209762k065131j788416O04519
4522G40022P37552k157284m031529k039319J164774J432402p24029j397845K80291
4513e994965J078383m70319j271186J206681M333486L891026J33225k919181k993885
4504c006735j308119M20438J549649J276282j047907l798173l971701j169086
$$ plain form
4564 -5948770 -2796521 -1782446 -3930418 -7423695 -9361249 -7618489 -2376267 3178915
4556 3178915 4855994 1550813 -3099088 -4206844 -647485 4082729 5780091 3596971
4548 3596971 214171 -1373753 -774360 39486 -614713 -2364051 -3760861 -4195249 -4145262
4539 -4145262 -4146757 -4520698 -5697587 -7465835 -7963389 -5109395 204030 3780502 2458296
4530 2458296 -1826206 -3894375 -1338900 2779288 3989050 1923919 135503 740022
4522 740022 1477574 -679710 -4711239 -6750558 -5585784 -4153382 -4877411 -6275256 -5994965
4513 -5994965 -4916582 -5386901 -6658087 -5451406 -1117920 2773106 2906331 -12850 -3006735
4504 -3006735 -4314854 -3894416 -2344767 -1068485 -2116392 -5914565 -9886266 -11055352
4496a1055352J544717J785955P23784N04162R01679N16898k20637L13162J929204
4487c056428K622237J690123Q14833J404809K496574K260637L98218j998836l956583
4478B675584m723403l238906O74935M685966N381792K082790j991701l196574
4470B350483j202994J439877K481037J709410L28460k67529L98211J070882k66520
4461H041317l586376n847992m279580L2325L410132L825649K096001m49109l009660
4452B32707m129595k291820J467646L890232L522461K340571K246229K188101
4444I466532M72885j968366k764696j382404O56224J887327J594686n51958l661844
4435C748386n217103l459238J82686K642899K776770J889323J277694R60335N76879
$$ plain form
4496 -11055352 -9510635 -7724680 -7000896 -6496734 -5595055 -5078157 -5298794 -4985632 -3056428
4487 -3056428 -434191 1255932 2070765 3475574 5972148 8232785 8631003 6632167 2675584
4478 2675584 -2047819 -5286725 -4611790 74176 5455968 7538758 5547057 2350483
4470 2350483 1147489 2587366 5068403 6777813 7106273 6838744 7236955 8307837 8041317
4461 8041317 4454941 -1393051 -5672631 -5640306 -2230174 1595475 3691476 3242367 232707
4452 232707 -3896888 -6188708 -4721062 -830830 2691631 5032202 7278431 9466532
4444 9466532 9939417 7971051 5206355 3823951 4480175 6367502 7962188 7410230 3748386
4435 3748386 -1468717 -4927955 -4745269 -2102370 674400 2563723 3841417 4801752 5378631
4426E378631m0353j068277k163174k101252l57070J419116J157588o62120j508740
4417E4349k12493J735331K354773J200382p65913j933165q99827J816774L215643
4408F565854R28144l168884m659146k118489J428199L045154L138444L020694
4400H179970K103387k30555k143308j603360J18907J60350j297987j136221J679850
4391E831033M021487K768973r87073l511803k928315n81113J345329J992797J749704
4382I701019J247121P14060k24310k026393m033750m297691j678589K075036L709208
4373E185711K218274j36590j147353j408766k399811l263612j903037J075170
4365a780014K192682k68066l588262m011342j281450J858361L469608L702639
$$ plain form
4426 5378631 5338278 4270001 2106827 5575 -351495 1067621 2225209 1563089 54349
4417 54349 -158144 1577187 3931960 5132342 4366429 2433264 1533437 3350211 6565854
4408 6565854 7493998 4325114 -334032 -2452521 -1024322 2020832 5159276 8179970
4400 8179970 10283357 10052802 7909494 6306134 6425041 6585391 5287404 4151183 5831033
4391 5831033 9852520 12621493 11634420 8122617 5194302 4613189 5958518 7951315 9701019
4382 9701019 10948140 11662200 11437890 9411497 5377747 1080056 -598533 1476503 5185711
4373 5185711 7403985 7267395 6120042 4711276 2311465 -952147 -2855184 -1780014
4365 -1780014 412668 144602 -3443660 -7455002 -8736452 -6878091 -3408483 294156
4357B94156L018570J466411j72974o19493n9395j22520j132141j112471J219885
4348B780028L944871M125507J602218j193564k665772l311010l642786l025409
4340a385917j287688K53489M64900j59704o64663r24913p44196P20614L003819
4331g24259L415162M98798k784511k416530O70604J566125j278725l671513k233460
4322f958309N25310N72092j313737j389184Q35461K356370J755104N43178l61971
4313c435686j679512k899724k029887P67009K476772J547592J20855L97078J281242
4304c454261N63767j465415k548004j422154J149797L342414L472235J502622
4296A141001k17452N56305K467655K040279p83623j940664K95532J853572r85130
$$ plain form
4357 294156 3312726 4779137 4606163 3986670 3927275 3804755 2672614 1560143 2780028
4348 2780028 6724899 10850406 12452624 11259060 8593288 5282278 1639492 -1385917
4340 -1385917 -2673605 -2420116 -1955216 -2114920 -2779583 -3704496 -4448692 -3728078 -724259
4331 -724259 2690903 3189701 405190 -2011340 -1340736 225389 -1053336 -4724849 -6958309
4322 -6958309 -6432999 -5860907 -7174644 -8563828 -7728367 -5371997 -3616893 -3073715 -3435686
4313 -3435686 -5115198 -8014922 -10044809 -9277800 -6801028 -5253436 -5132581 -4735503 -3454261
4304 -3454261 -2890494 -4355909 -6903913 -8326067 -7176270 -3833856 -361621 1141001
4296 1141001 923549 1479854 3947509 5987788 5204165 3263501 3559033 5412605 4427475
4287D427475n071902m516334L29886L083926O05114k788496k098933J293383K429406
4278b306475K94981j192433O24739L354260L347953J015235j69376Q41104J216825
4269G026813q56529k718422j114180K364960L120469K12917k437886k018719n01092
4260C078331q76682k689099l499941k645899j161820N60666K682708M321128M134924
4251C904316K277989L38501n53773o72399r21749j587250j728192j43528K429141
4242C343056L044020J08245l687559m360763j909274K43863N19576L57179L21752
4233b019905o95864j819882l27742L199006M458104K031298k41798K14649P53787
4224E551653q70764j977710j81001J491123k99705k845145j637529K051337L500792
$$ plain form
4287 4427475 -644427 -5160761 -4830875 -1746949 -1141835 -3930331 -6029264 -4735881 -2306475
4278 -2306475 -2011494 -3203927 -2579188 775072 4123025 5138260 4968884 5809988 7026813
4269 7026813 6170284 3451862 2337682 4702642 7823111 8036028 5598142 3579423 3078331
4260 3078331 2201649 -487450 -3987391 -6633290 -7795110 -7234444 -4551736 -230608 3904316
4251 3904316 6182305 6520806 5967033 5294634 4372885 2785635 1057443 913915 3343056
4242 3343056 6387076 6495321 2807762 -1553001 -3462275 -3218412 -2698836 -2341657 -2019905
4233 -2019905 -2715769 -4535651 -4863393 -1664387 2793717 4825015 4583217 4797866 5551653
4224 5551653 4680889 2703179 2522178 4013301 3713596 868451 -769078 1282259 4783051
4215D783051K166010J334635J797686J363146k90235j325930j686484k790726
4207E351153l879824k844539j86822J535514J515375P46879m11830j549860r23280
4198f47234J736031L262877J406145j411381k312958k684970m342733m679407
4190i673630j074189L190672L384706P54379n24547o79205k122952l107223p51753
4181a0603742K447314K500827J405807L087536N111003K886267j124734j643103
4173D067175p25361l470849o753095l766595K545087L001906k311633m732019
4165a2145384k128758j70436N25881M334201Q293192N047629j962974k401808
4157f08457J884565m96413q471677r344178k973729k333917p249857l714917N719607
$$ plain form
4215 4783051 6949061 8283696 10081382 11444528 11154293 9828363 8141879 5351153
4207 5351153 1471329 -1373210 -1560032 -24518 1490857 2237736 1825906 276046 -647234
4198 -647234 1088797 4351674 5757819 4346438 2033480 -651490 -4994223 -9673630
4190 -9673630 -10747819 -7557147 -4172441 -3418062 -3942609 -4621814 -6744766 -9851989 -10603742
4181 -10603742 -8156428 -5655601 -4249794 -1162258 3948745 6835012 5710278 4067175
4173 4067175 3341814 -129035 -6882130 -10648725 -8103638 -5101732 -7413365 -12145384
4165 -12145384 -14274142 -14444578 -13918697 -9584496 -1291304 3756325 1793351 -608457
4157 -608457 1276108 779695 -7691982 -17036160 -20009889 -22343806 -29593663 -33308580 -27588973
4148b7588973J235628j6201141k1977845j7826753m1348649r5368238j11304766
4141c30380737l4093189Q4185932J35583256R1042154K4834393L685068J2943360
4134a2199763J0504481k980910l605704N591932M891095l675013l637313L615915
4126a495280L755199k662992l259911K094409L175491O7770J223936N078067K794354
4117A0771043l704717m302997Q41855J976072k477353m369883j425260J45693
4109b545547j344608r07391J857129J903850k93283J058062N124045M471724j550976
4100G773005m763394j601463J929690J351881r3338N51619Q07278q38026j318516
4091C798736O76558J792257O06428M75915K696102L286527N8022l016212k255859
$$ plain form
4148 -27588973 -26353345 -42554486 -64532331 -82359084 -123707733 -219075971 -330380737
4141 -330380737 -364473926 -280287994 -144704738 -53662584 -28828191 -25143123 -12199763
4134 -12199763 -1695282 -4676192 -8281896 -2689964 2201131 -1473882 -5111195 -1495280
4126 -1495280 2259919 -403073 -3662984 -1568575 1606916 1674686 2898622 7976689 10771043
4117 10771043 7066326 2763329 3605184 5581256 3103903 -1265980 -2691240 -2545547
4109 -2545547 -3890155 -4797546 -2940417 -1036567 -1329850 -271788 4852257 9323981 7773005
4100 7773005 3009611 1408148 3337838 4689719 4596381 5148000 5955278 5117252 3798736
4091 3798736 4475294 6267551 6873979 7349894 10045996 13332523 13390545 10374333 8118474
4082H118474l8417k98150k421872l313278k371795j195987n81815k08722K61428
4073b050134R85934J454426L59471k064108k685526M58635M032978L337208o56208
4064C172676k799473j598167l85698p99177o07428J172925K277877J693759J382261
4055C509555J970697J213198j523071l449727k909468j864088j952757j764574
4047f770235j14284J310166Q07418n40712q93575k38839M72429O74619k15547
4038e508560k241888l370066j182664L227739N835204M871012K675174J703395
4030F009346J615711J227060N22261l65602j751801l041768k873514j168675Q16432
4021I89450K340230L026405J762978j387816l230109j061224K470019K254717
$$ plain form
4082 8118474 8080057 7781907 5360035 2046757 -325038 -1521025 -2102840 -2311562 -2050134
4073 -2050134 -1064200 390226 749697 -1314411 -3999937 -3541302 491676 3828884 3172676
4064 3172676 373203 -1224964 -1610662 -2409839 -3017267 -1844342 433535 2127294 3509555
4055 3509555 5480252 6693450 5170379 1720652 -1188816 -3052904 -5005661 -6770235
4047 -6770235 -6884519 -5574353 -4766935 -5307647 -6201222 -6440061 -5967632 -5293013 -5508560
4038 -5508560 -7750448 -11120514 -12303178 -9075439 -3240235 1630777 4305951 6009346
4030 6009346 7625057 8852117 9374378 9008776 7256975 4215207 1341693 173018 989450
4021 989450 3329680 6356085 8119063 6731247 3501138 2439914 4909933 7164650
4013G164650j892544n077869m425786j816000M80051K063676K028903n95960l382798
4004e453677k580795O66175J555731l23762m30248K083796K282369j548669m126816
3995g875896k150717N2777j221684j952508K075146O427833M422994j592959l419093
3986e234107O59507M282665L059610m86107k258262j370099R60351K930480K367281
3977D911319q77640l183375j450059J844467J961608q38689k107062n72550N59206
3968B47225j94451m39022R67898J569287p8268j651537j086924J49937N0990o71489
3958a136354n65351j20304j62624L10626K285152M190209L503970K23744k920640
3949E608428l418931j258505J348699K100393R43173J30400J122882K152824O30328
$$ plain form
4013 7164650 5272106 194237 -4231549 -6047549 -5567498 -3503822 -1474919 -2070879 -5453677
4004 -5453677 -8034472 -7368297 -5812566 -6136328 -6566576 -4482780 -2200411 -3749080 -7875896
3995 -7875896 -10026613 -9973836 -11195520 -13148028 -11072882 -4645049 -222055 -1815014 -5234107
3986 -5234107 -4574600 -291935 2767675 2281568 23306 -1346793 -386442 2544038 4911319
3977 4911319 4033679 850304 -599755 1244712 3206320 2367631 260569 -311981 247225
3968 247225 52774 -386248 581650 2150937 2072669 421132 -665792 -515855 -464865 -1136354
3958 -1136354 -1701705 -1822009 -1984633 -1674007 611145 4801354 8305324 8529068 5608428
3949 5608428 2189497 930992 2279691 4380084 5323257 5453657 6576539 8729363 9359691
3940I359691k602117l995023k369412l58287L3662K19115J637892K481632O47696
3931E054849k020426j901574P75262J960898k16874k646217j778406J441975L225804
3922C895291K040848j87944j344860j372811j170810j189648j648061k487246
3914c465241k472193j11540L526309M846339K249252j156501j660851k01501l98875
3905A155198k361432k475601L18088K239164L95166k743624l203122j143524M09743
3896g409944N70948R80557K095258K307328Q73846o76849n23509J513397M007761
3887C738793M747478K110017k826556o101051m665615k16946K517521J365444
3879F69085j097306j246137J224490L374095K596858n75402l098321k669995j60081
$$ plain form
3940 9359691 6757574 2762551 393139 34852 68514 287629 1925521 4407153 5054849
3931 5054849 3034423 1132849 1908111 3869009 3652135 1005918 -772488 669487 3895291
3922 3895291 5936139 5748195 4403335 3030524 1859714 670066 -977995 -3465241
3914 -3465241 -5937434 -6048974 -2522665 2323674 4572926 3416425 1755574 1554073 1155198
3905 1155198 -1206234 -3681835 -3363747 -1124583 -729417 -3473041 -6676163 -7819687 -7409944
3896 -7409944 -6838996 -5858439 -3763181 -1455853 -582007 -1258856 -1782365 -268968 3738793
3887 3738793 8486271 10596288 7769732 1668681 -2996934 -3213880 -696359 669085
3879 669085 -428221 -1674358 -449868 2924227 5521085 4945683 1847362 -822633 -982714
3870i82714J709135J799839J312015J006741j66348k495007l731882k105549M16585
3861c237185N57722j405381k066147j8774K271907K277629N75041q55365j426592
3852c327145j543596q62927J207608L704523M319502J828610k262712m892827
3844a828964m222003j093807K230413M293102M914515M093425J855962o83847
3836I558796j711709r47721k08685q29113j784574j509033l33484L58003M14869
3827C007349O80148J058414N14948j089350k447764k218260l49474J790408K318689
3818C265108O14325j507762j556640L01962J278153j5666j643453j704914j339510
3809b308397k315857l589168k909929n70452J117306J254816Q85170Q64067J413441
$$ plain form
3870 -982714 726421 2526260 3838275 4845016 4678668 2183661 -1548221 -3653770 -3237185
3861 -3237185 -2679463 -4084844 -6150991 -6169765 -3897858 -1620229 -1045188 -1900553 -3327145
3852 -3327145 -4870741 -5733668 -4526060 -821537 3497965 5326575 3063863 -1828964
3844 -1828964 -6050967 -7144774 -4914361 -621259 4293256 8386681 10242643 9558796
3836 9558796 7847087 6899366 6690681 5861568 4076994 2567961 2234477 2592480 3007349
3827 3007349 3687497 4745911 5260859 4171509 1723745 -494515 -843989 946419 3265108
3818 3265108 3879433 2371671 815031 1116993 2395146 2379480 736027 -968887 -2308397
3809 -2308397 -4624254 -8213422 -11123351 -11693803 -10576497 -9321681 -8436511 -7572444 -6159003
3800f159003K854472M496147L955750K75319l406600l429796r87369l77961k334000
3791e113041l111789p18318J933971J638526n18922j238570M65468K738205L564726
3782c59744K526983O73728n54936p83303j037915j908433k162035o28912J483577
3773b750990K172186J644652J362086R83191p86621k897065k841852p14819R58277
3764b870955J407774K052511K646850J133098j867849k700118l60559J468563
3756I09315J03183k163133k200276p52029j73419l48318J02316P77212M94910
3747c250239m61866j447115k891921m477895m054908q49804K278044K405399O31880
3738a2118425J14509J643973L521568M246095L194636M38139k092052j501088
$$ plain form
3800 -6159003 -3304531 1191616 5147366 5422685 2016085 -1413711 -2401080 -2779041 -5113041
3791 -5113041 -8224830 -8943148 -7009177 -5370651 -5889573 -7128143 -6662675 -3924470 -359744
3782 -359744 2167239 2840967 2286031 1502728 464813 -1443620 -3605655 -4234567 -2750990
3773 -2750990 -578804 1065848 2427934 3411125 2624504 -272561 -3114413 -3829232 -2870955
3764 -2870955 -1463181 589330 3236180 4369278 2501429 -198689 -559248 909315
3756 909315 1012498 -1150635 -3350911 -4102940 -4276359 -4624677 -4522361 -3745149 -3250239
3747 -3250239 -3712105 -5159220 -8051141 -12529036 -16583944 -17433748 -15155704 -12750305 -12118425
3738 -12118425 -12003916 -10359943 -6838375 -2592280 602356 1040495 -1051557 -2552645
3730b552645J735228K963021l25909m187208l766711m15351J087669J23897j23648
3721e461657P74805k3103k676569l600855j318662J290059J898424J697480J928622
3712e491456J457905j50675o76513J187073L138919K656435P59834j17872p6014
3703B687636q36678k163996j984763J59687J959197J099766j907771m087222k934852
3694h008996R82390M487221N179237L867243K836674K496841J384988r09026k912058
3685I404514l577874l463883l123893k218650r19575l88131r33618j272544n71802
3676g065456K31951J16625m10408l76492K71282J282935K729301L946952L294142
3667D020832L74355k588087l036559r89666J459474K619441K022139q6876k484464
$$ plain form
3730 -2552645 -817417 2145604 1819695 -2367513 -6134224 -6549575 -5461906 -5338009 -5461657
3721 -5461657 -4686852 -4709955 -7386524 -10987379 -12306041 -11015982 -9117558 -7420078 -5491456
3712 -5491456 -4033551 -4184226 -4860739 -3673666 -534747 2121688 2881522 2763650 2687636
3703 2687636 1850958 -313038 -2297801 -2138114 -178917 920849 -986922 -5074144 -8008996
3694 -8008996 -7026606 -2539385 2639852 6507095 9343769 11840610 13225598 12316572 9404514
3685 9404514 5826640 2362757 -761136 -2979786 -3899361 -4287492 -5221110 -6493654 -7065456
3676 -7065456 -6833505 -6716880 -7127288 -7503780 -7232498 -5949563 -3220262 726690 4020832
3667 4020832 4395187 1807100 -1229459 -2219125 -759651 1859790 3881929 3795053 1310589
3658A310589l075157j071540J437481J847462N22138n8693O44810N57307j087820
3649A026577j866726J6072K150515R47480k702094l992838q22929L151393L583560
3640A491010J069697o84934n25628m54600j283939j275366K74511J339943N31316
3631D82010n27454q7151P44465J70779j040473j046207k15559j87239p11473k90216
3621b708518P52762P81409O621J16229R12141N46785o52088j03412K310299K961541
3611D923769j38269l600157k985327J014554L520621J696581k372036m754714
3603b694978l728801o50461J862183K264924J259547Q24447J974824L744916M367663
3594I224264K948363Q8816k445805k928613j443737n4784r9663j15750J725927
$$ plain form
3658 1310589 -1764568 -2836108 -1398627 448835 970973 912280 1557090 2114397 1026577
3649 1026577 -840149 -824077 1326438 2273918 -428176 -4421014 -5243943 -2092550 1491010
3640 1491010 2560707 1875773 1350145 895545 -388394 -1663760 -1389249 -49306 482010
3631 482010 -45444 -132595 611870 782649 -257824 -1304031 -1519590 -1706829 -2418302 -2708518
3621 -2708518 -1955756 -1174347 -1167726 -1051497 -139356 407429 -244659 -348071 1962228 4923769
3611 4923769 4785500 1185343 -1799984 -785430 2735191 4431772 2059736 -2694978
3603 -2694978 -6423779 -7074240 -5212057 -2947133 -1687586 -863139 1111685 4856601 9224264
3594 9224264 12172627 12261443 9815638 6887025 5443288 5388504 5288841 5173091 6899018
3585F899018L959323L370054J9242k535477k577985k274086l112351l079388p68107
3576i9757J179540J74715j466606J20217L853151M985976K231497p41106j186869
3567I050758n85179r79227j658520j398300j180561k275850l429872k435532L39201
3558d553082K144103J434886l75848j092076n17296k83125j279393k210256j299694
3549h031781J084828K695044K390730J457727J296631J344318N90351k70900j07735
3540B449213L04067m45420j399456k84918K282373K561990j121417n275086n231833
3531f160487r52351L029798K963512l15677k945146k340398N29881K856331L314704
3522a9833K904566K544474J441957r00857k502863j084715K079896L130676P03904
$$ plain form
3585 6899018 10858341 14228395 14247637 11712160 9134175 6860089 3747738 668350 -99757
3576 -99757 1079783 1254498 -212108 -91891 3761260 8747236 10978733 10237627 9050758
3567 9050758 8465579 7486352 5827832 4429532 3248971 973121 -2456751 -4892283 -4553082
3558 -4553082 -2408979 -974093 -1349941 -2442017 -2959313 -3242438 -4521831 -6732087 -8031781
3549 -8031781 -6946953 -4251909 -1861179 -403452 893179 2237497 2827848 2556948 2449213
3540 2449213 2753280 2307860 908404 623486 2905859 5467849 4346432 -928654 -6160487
3531 -6160487 -7112838 -4083040 -1119528 -1435205 -4380351 -6720749 -6190868 -3334537 -19833
3522 -19833 2884733 5429207 6871164 5970307 3467444 2382729 4462625 7593301 8297205
3513H297205k454591l583819l028282k145563p55183J362814K558366J366573
3505A617520q56477j675532r68742l67779k18474M21978J230442O42663j396855
3496a571256k889727k439486p78853O45497J125011O61917J9189O53271K820178
3487a754259M054544J917243j785146k554401L20160K235550L8042k991226k025656
3478b545149J883492L339096N18841k676118k718590q34783J54814K38694J139042
3469a500661K754683L171486J536136r00670k328659j764525O27490L379259M257524
3460I232063K244099j048985k958037k773963k229802k862738l862846l171202
3452g431411l21538K500101K573639k54402l090760l111348p90567R26302N87262
$$ plain form
3513 8297205 5842614 2258795 -769487 -2915050 -3670233 -2307419 250947 1617520
3505 1617520 761043 -914489 -1883231 -2251010 -2469484 -2047506 -817064 -174401 -1571256
3496 -1571256 -4460983 -6900469 -7679322 -7033825 -5908814 -5246897 -5227708 -4574437 -1754259
3487 -1754259 2300285 4217528 2432382 -122019 198141 2433691 2471733 -519493 -2545149
3478 -2545149 -661657 2677439 3196280 520162 -2198428 -3033211 -2878397 -2639703 -1500661
3469 -1500661 1254022 4425508 5961644 5060974 2732315 967790 1595280 4974539 9232063
3460 9232063 11476162 10427177 7469140 4695177 2465375 -397363 -4260209 -7431411
3452 -7431411 -7752949 -5252848 -2679209 -2933611 -6024371 -9135719 -9926286 -8999984 -8412722
3443h412722k1770J297809L900198N075924L336127k39498l346409m060814j838658
3434d309813J668997L357875J840883n29644o09096R72103O53045k418838m554396
3425c928884k774359P56655K005934Q51650L75727J328275J096415j224909k382362
3416c895858K30489L868391L680433l95332l293200j667854J906460K962213R52873
3407D348615j258406k185159k975849m100556l837389j199711J902890L126493
3399f179072K754632K464584K247105P54748j839167l556414l243479j641946
3391h239009K64987K100063L044587K047735j19903r53168M40994J728676N70714
3382H85676j898017k614211p59160J492392K079969J214483L31966K33201N83719
$$ plain form
3443 -8412722 -8434492 -7136683 -3236485 1839439 5175566 4936068 1589659 -2471155 -4309813
3434 -4309813 -2640816 717059 2557942 2028298 1419202 2391305 3044350 625512 -3928884
3425 -3928884 -6703243 -5946588 -3940654 -3089004 -2713277 -1385002 -288587 -1513496 -3895858
3416 -3895858 -3665369 203022 3883455 3488123 194923 -1472931 433529 3395742 4348615
3407 4348615 3090209 905050 -2070799 -6171355 -10008744 -11208455 -9305565 -6179072
3399 -6179072 -3424440 -959856 1287249 2041997 202830 -3353584 -6597063 -8239009
3391 -8239009 -7974022 -5873959 -2829372 -781637 -901540 -1854708 -1413714 314962 885676
3382 885676 -1012341 -3626552 -4385712 -2893320 -813351 401132 733098 966299 1550018
3373A550018M40456q14132k461325k694295p44183J645563K047925M07340j098003
3364a720636j143657n14118M6499J239575L230267L928124J351488k940154m978988
3355a501600l157837L3114J636144J679313J709857J626914K98390j432084j109997
3346b17786J537019L625768L071006J378552P98599N97148j279530l904055l831821
3337A774900j44047L571302L394312l90697l979378m192340j166661K222808L031588
3328D121787R67237j329917j295887O21730K026860J852577Q39324o19589k603790
3319D580332l758601k258065P07570J489884p74891k565704j305379Q85765J141249
3310a857840M39731R84984J638468K8466k514329k527740j48996J020476k93213
$$ plain form
3373 1550018 1990474 1176342 -1284983 -3979278 -4723461 -3077898 -1029973 -622633 -1720636
3364 -1720636 -2864293 -3378411 -3331912 -2092337 1137930 5066054 6417542 3477388 -1501600
3355 -1501600 -4659437 -4626323 -2990179 -1310866 398991 2025905 2324295 892211 -217786
3346 -217786 1319233 4945001 8016007 9394559 10193158 10790306 9510776 5606721 1774900
3337 1774900 1630853 5202155 8596467 8205770 4226392 34052 -1132609 1090199 4121787
3328 4121787 5089024 3759107 2463220 3084950 5111810 6964387 7803711 7184122 4580332
3319 4580332 821731 -1436334 -728764 761120 -13771 -2579475 -3884854 -2999089 -1857840
3310 -1857840 -1418109 -433125 1205343 1233809 -1280520 -3808260 -3957256 -2936780 -3229993
3301c229993j468178o73873P41644J492899K358881L500986L019774J16035k828055
3292C030120l267549j671142r1774O07768N88954j67256j333774j897679j573203
3283e775535j152187n90308J307942M146593N130784K800279l67016j154907K32098
3274D577743J406503J651947J892608J845978J94318k488962l675713k411803
3266B992619q94661j475955l372949l638440j088412J799438J620036j510638
3258e568962l499263j259927L017777M618222K615877N50014P02475J241689L40425
3249B758327m93603L22940R94343n73061k682991k519594r84104q45331j533242
3240e556316k82797K282552K542306J6668j641860o94649K34529p08268j467067
$$ plain form
3301 -3229993 -4698171 -5372044 -4630400 -3137501 -778620 2722366 5742140 5858175 3030120
3292 3030120 -237429 -1908571 -2000345 -1392577 -803623 -970879 -2304653 -4202332 -5775535
3283 -5775535 -6927722 -7518030 -6210088 -2063495 3067289 5867568 5500552 4345645 4577743
3274 4577743 5984246 7636193 9528801 11374779 11569097 9080135 5404422 2992619
3266 2992619 2097958 622003 -2750946 -6389386 -7477798 -5678360 -4058324 -5568962
3258 -5568962 -9068225 -10328152 -7310375 -2692153 -76276 473738 1176213 2417902 2758327
3249 2758327 2264724 2587664 3582007 3008946 325955 -2193639 -3177743 -4023074 -5556316
3240 -5556316 -5839113 -3556561 -1014255 -997587 -2639447 -3334096 -3099567 -3807835 -5274902
3231e274902l42684O69055k70089j180587J65497K018159J732297N62178J238928
3222f82148K715992J917571m55450q03628Q95338N73583k953779n303155l054106
3213g149782J011155K284617R59261O25668K100570K628440Q08700j276675j552669
3204D39285p93748p13090j216566j150936n18580k29044k33844L96933J520089
3195b499501J648498L09274o63427M59531K371171K064313q62176l268041k737540
3186c177898q25865k99520q20976j16314J480764J211839r94242j356367J945550
3177b953029N024097L385541j438354l992957k458357k04256M2525m16399K48684
3168b762505J037318L49338r01104p88994N11982J282003R49470L65003N0978
$$ plain form
3231 -5274902 -5617586 -4948531 -5218620 -6399207 -6233710 -4215551 -2483254 -1921076 -682148
3222 -682148 2033844 3951415 3495965 2692337 3587675 4161258 1207479 -4095676 -7149782
3213 -7149782 -6138627 -3854010 -2894749 -2269081 -168511 2459929 3268629 1991954 439285
3204 439285 -354463 -1067553 -2284119 -3435055 -3953635 -4182679 -4416523 -4019590 -2499501
3195 -2499501 -851003 -541729 -1205156 -745625 1625546 3689859 2827683 -440358 -3177898
3186 -3177898 -4003763 -4303283 -5124259 -5240573 -3759809 -2547970 -3542212 -4898579 -2953029
3177 -2953029 2071068 5456609 4018255 25298 -2433059 -2637315 -2594790 -3011189 -2762505
3168 -2762505 -1725187 -1375849 -2276953 -3065947 -2553965 -1271962 -322492 42511 93489
3159I3489k14872n29612q30664j203981j251926o0872K037095K790388P49601
3150A578646k212469k970244j193376N80902O16395k92653q62675j121977j460959
3141g338410j282505L73597L258244N449034M672768O82186l613322m622114k224285
3132d644807J02145J28205l89275N24993J279772k03343j947661p72554J729256
3123d193269J198011j838259k060052J787264M026330P91585l662097l488891
3115g439378J84073K208864J780320K112536L391723K091585k367664n497058
3107c534999l926737Q5720K326575K011808J315929J375947J153512j64686j401578
3098g58509p30974J618233K942435J225706j853676k856653j451140p20943j836538
$$ plain form
3159 93489 -121383 -650995 -1481659 -2685640 -3937566 -3998438 -1961343 829045 1578646
3150 1578646 -633823 -3604067 -4797443 -4216541 -3600146 -3892799 -4755474 -5877451 -7338410
3141 -7338410 -8620915 -8247318 -4989074 459960 5132728 5814914 2201592 -2420522 -4644807
3132 -4644807 -4542662 -4414457 -4803732 -4278739 -2998967 -3202310 -5149971 -5922525 -4193269
3123 -4193269 -2995258 -4833517 -6893569 -5106305 -1079975 -288390 -3950487 -7439378
3115 -7439378 -7255305 -5046441 -3266121 -1153585 2238138 4329723 1962059 -3534999
3107 -3534999 -7461736 -7376016 -5049441 -3037633 -1721704 -345757 807755 643069 -758509
3098 -758509 -1489483 128750 3071185 4296891 2443215 -413438 -1864578 -2585521 -4422059
3089d422059j771003J396813M140546K222668k400446l876097o87310K882768
3081b514120L383028J935163P24060j94385j232170j694410j298719o79075M88051
3072a082577L062978N439563M256501o45558n152721o199117m991150l405729
3064h717810q43107K866813M861040K954441m66176j666200q17183o91605j710151
3055d229938j903805q78710k50171l90732M7482J241874J689801J014752Q02501
3046b856946J955915L207389L028527J553699J6568o14785j28934Q51659J184740
3037H197832M01554n67317n70450L21787J264488J694180J071292j159701l968216
3028F685449m535182j730638J387481J157416j348542j628256J631068M509098
$$ plain form
3089 -4422059 -6193062 -4796249 -655703 1566965 -833481 -4709578 -5396888 -2514120
3081 -2514120 868908 2804071 3528131 3333746 2101576 407166 -891553 -1570628 -1082577
3072 -1082577 1980401 7419964 11676465 11030907 5878186 -320931 -5312081 -8717810
3064 -8717810 -9560917 -6694104 -1833064 1121377 655201 -1010999 -1828182 -2519787 -4229938
3055 -4229938 -6133743 -7012453 -7262624 -7653356 -7605874 -6364000 -4674199 -3659447 -2856946
3046 -2856946 -901031 2306358 5334885 6888584 6905152 6290367 6161433 7013092 8197832
3037 8197832 8599386 8032069 7461619 7783406 9047894 10742074 11813366 10653665 6685449
3028 6685449 2150267 419629 1807110 2964526 1615984 -12272 1618796 6127894
3020F127894L441428J7103j640009l60272J304917Q70523j385943l355146l447953
3011A572542j781014L34559J670472J796320Q08247r14311k359176k179835j92748
3002a244944K040055K916397K339386Q29840j548408l964912m045882o63809L447735
2993A05458M539420K768891J407301J494563Q24181j311672k284795o83024Q30924
2984G691247k61733k134457j727095J24013K32877j521414k049978r1557K009526
2975B271429K095280Q96245j5336n53176j071065r29627K16275R63194k18799
2966C654420k423893k950549o46865K435948L217115J002259j723108k028329
2958E36998J12515J688434K16741l042004m346557j956925J721491L066028J441071
$$ plain form
3020 6127894 9569322 9586425 7946416 7586144 8891061 9761584 8375641 5020495 1572542
3011 1572542 -208472 126087 1796559 3592879 4401126 3486815 1127639 -1052196 -1244944
3002 -1244944 795111 3711508 6050894 6880734 5332326 1367414 -2678468 -3342277 105458
2993 105458 4644878 7413769 8821070 10315633 11139814 9828142 7543347 6860323 7691247
2984 7691247 7429514 5295057 3567962 3691975 3924852 2403438 353460 261903 2271429
2975 2271429 4366709 5262954 5247618 4694442 3623377 2693750 2910025 3873219 3654420
2966 3654420 1230527 -1720022 -2366887 69061 3286176 4288435 2565327 536998
2958 536998 649513 2337947 2554688 -487316 -4833873 -6790798 -5069307 -2003279 -562208
2949e62208o00978r18343j29444J04849j27172O83570K649003L567404J597460
2940F264141k017593l971812k477151R61658L337392L027336Q06563j353388k108924
2931B468222j627251r33833n16339P6380J063046J521717M94589j308041j999367
2922g60877q67966P09471J068820J80480o80195n16915O23805J895437K145889
2913C797949P09374j674462l119415k433615n27445N82461J05437p12396k47312
2904c519424J388086K294602J032712j334085k133755l29575J965033K168465
2896A532059P56092M43585J872466K258030m66592l913753l870405p1236L081339
2887A621585K138164j097779k367408p06387Q19320k9360j490495p66428J586646
$$ plain form
2949 -562208 -1163186 -2081529 -2210973 -2106124 -2233296 -1549726 1099277 4666681 6264141
2940 6264141 4246548 274736 -2202415 -1240757 2096635 5123971 5930534 4577146 2468222
2931 2468222 840971 -92862 -609201 -532821 530225 2051942 2546531 1238490 -760877
2922 -760877 -1628843 -919372 149448 329928 -350267 -867182 -243377 1652060 3797949
2913 3797949 4507323 2832861 -286554 -2720169 -3247614 -2665153 -2559716 -3272112 -3519424
2904 -3519424 -2131338 163264 1195976 -138109 -2271864 -2601439 -636406 1532059
2896 1532059 2288151 2731736 4604202 6862232 6395640 2481887 -1388518 -1459754 1621585
2887 1621585 3759749 2661970 294562 -411825 407495 378135 -1112360 -1878788 -292142
2878b92142K519322J108583l46523l12044l76375j973083l066261q95724L186075
2869d48172M827845K545845n41473j468359j057676j448668k465239k513512j450919
2860d020328l44527O49972K014965K952962J845347j144310l528527l208911q73224
2851e656581R03776O16943n69204m08927J339082K277777O55658j648566j335010
2842c825052J432278K937458J324520p31995l76099J103690R09426m02912r0395
2833B280919J813309K309412K05978k160125k619632j850141j381484j228290
2825b630054p38067m2274N13009J063081J481150J149264J13310p41743j071946
2816i04270j230742q35808Q77605K732770J992272j611691m364841l025985P64682
$$ plain form
2878 -292142 2227180 3335763 2989240 2677196 2300821 327738 -2738523 -3634247 -448172
2869 -448172 4379673 6925518 6384045 4915686 3858010 2409342 -55897 -2569409 -4020328
2860 -4020328 -4364855 -3714883 -1699918 1253044 3098391 1954081 -1574446 -4783357 -5656581
2851 -5656581 -4752805 -4135862 -4705066 -5113993 -3774911 -1497134 -841476 -2490042 -3825052
2842 -3825052 -2392774 544684 1869204 1137209 761110 1864800 2774226 2371314 2280919
2833 2280919 4094228 6403640 6609618 4449493 1829861 -20280 -1401764 -2630054
2825 -2630054 -3368121 -3410395 -2897386 -1834305 -353155 796109 909419 167676 -904270
2816 -904270 -2135012 -2970820 -2093215 639555 2631827 1020136 -3344705 -6370690 -5606008
2807e606008K643572R98896j873864l406252l317037k589507j779458q09266N85167
2798a5153757K360719L569832K879825O25834n99906R94721L484169L448197Q41147
2789B450781q05417M79876K252158J315556j735631l666285l095836j554343m44551
2780d803692O81992K255693L087350K029148J42412l86672Q09218J826868J143177
2771F785494m96149j378629j087875o66477j054386k145565l124622l149951k013433
2762h331593o41264m30241j394011j634018K59728K860566L440533J586311m26227
2753d710216q99530m02692K46944J485183L293290L981559K475457L35779m51888
2744E353886m01679r82966j351551L53485K883975K576447j035245l614919j898893
$$ plain form
2807 -5606008 -2962436 -1963540 -3837404 -7243656 -10560693 -13150200 -14929658 -15738924 -15153757
2798 -15153757 -12793038 -9223206 -6343381 -5717547 -6317453 -5322732 -1838563 1609634 2450781
2789 2450781 1645364 2125240 4377398 5692954 3957323 291038 -2804798 -4359141 -4803692
2780 -4803692 -4121700 -1866007 1221343 3250491 3392903 3006231 3815449 5642317 6785494
2771 6785494 6289345 4910716 3822841 3156364 2101978 -43587 -3168209 -6318160 -8331593
2762 -8331593 -8972857 -9403098 -10797109 -12431127 -12171399 -9310833 -5870300 -4283989 -4710216
2753 -4710216 -5609746 -6012438 -5765494 -4280311 -987021 2994538 5469995 5805774 5353886
2744 5353886 4952207 3969241 2617690 2971175 5855150 8431597 7396352 3781433 1882540
2735A882540J500580J810720j201758l408308k455808m43868n7128r42087j306957
2726d622074r20700n34353L16258K598448N243392N555281K737119o42295j737683
2717G993393q69591n73703j846449k999666k503984j413593j714911k999578k536922
2708i465004Q47707M376322M252171N50883k526385j779728J153052K374008J018463
2699H01489r6057J023011K673785K140136m38725k526638k642781j664038r86584
2690a716402r52613j244199j583970j685806j368898r46553p99310n66017M01551
2681a0462217J813362K640947K536494J945725Q05685j365448l634736l608143
2673i328331m93316K929766L092100J04439k084057m01645L525965N221236K808239
$$ plain form
2735 1882540 3383120 5193840 3992082 583774 -1872034 -2315902 -2373030 -3315117 -4622074
2726 -4622074 -5542774 -6077127 -5760869 -3162421 2080971 7636252 10373371 9731076 7993393
2717 7993393 7123802 6550099 4703650 1703984 -800000 -2213593 -3928504 -6928082 -9465004
2708 -9465004 -8617297 -4240975 11196 562079 -1964306 -3744034 -2590982 -216974 801489
2699 801489 705432 1728443 4402228 6542364 6103639 3577001 934220 -729818 -1716402
2690 -1716402 -2669015 -3913214 -5497184 -7182990 -8551888 -9498441 -10297751 -10863768 -10462217
2681 -10462217 -8648855 -6007908 -3471414 -1525689 -720004 -2085452 -5720188 -9328331
2673 -9328331 -9821647 -6891881 -3799781 -3695342 -5779399 -6181044 -2655079 2566157 5374396
2664E374396n15202m17772K731356L963732M52242m052934l978156K40659K657197
2655F455518K39301l146834k888140k34133M46625j249534j448002J704620N093854
2646D973275M911798J372638k181647l400241k848344k440500k902989k995049
2638e511059j329884J239174K112434M02788j373914m32683K369895L518621J382957
2629B378329j914415l216805j532251J649566M089401M520610L250879J234090
2621A0459404j213682l809706m696071j890834K682217L643835q55484n314726
2613i95047l720789J889439M369788J776313p92470R9620J543217L13790j607198
2604B876663q73881J710912L160715K969399K335167J004945j665745m229901
$$ plain form
2664 5374396 4859194 4441422 7172778 11136510 11588752 7535818 3557662 3798321 6455518
2655 6455518 6694819 3547985 659845 425712 872337 -377197 -1825199 -120579 4973275
2646 4973275 9885073 11257711 9076064 5675823 2827479 386979 -2516010 -5511059
2638 -5511059 -6840943 -5601769 -3489335 -3086547 -4460461 -4893144 -2523249 995372 2378329
2629 2378329 463914 -2752891 -4285142 -2635576 1453825 5974435 9225314 10459404
2621 10459404 9245722 5436016 739945 -1150889 1531328 5175163 4319679 -995047
2613 -995047 -4715836 -2826397 1543391 3319704 2527234 2626854 4170071 4483861 2876663
2604 2876663 2002782 3713694 6874409 9843808 12178975 13183920 11518175 7288274
2596G288274m887908m245605l549319j941861J403048M144014L405727L82701
2588A999071j329495j106955j226309k061547j523327N53549J544936M26445o28634
2579c352266k75239k53060j936407l531925k776320k69428J833564K781014L148147
2570d631920L172545K680522J645247j04183k431707l575713j371933L009572
2562a607570M851593J522511l397825m166327p9632L972842L888634Q02812j354167
2553D432871p69266R59398J453515K46404j195749j550702j225073j599682k955427
2544b203711l827360k649846L99292L396809M229462K289211q14694k376567j160660
2535b718064J238799K307087J508328K22497o90756j526958k038887j239053N17034
$$ plain form
2596 7288274 2400366 -1845239 -5394558 -7336419 -5933371 -1789357 1616370 1999071
2588 1999071 669576 -437379 -1663688 -3725235 -5248562 -4695013 -3150077 -2723632 -3352266
2579 -3352266 -3627505 -3880565 -5816972 -9348897 -12125217 -12394645 -10561081 -7780067 -4631920
2570 -4631920 -1459375 1221147 2866394 2762211 330504 -3245209 -4617142 -1607570
2562 -1607570 3244023 4766534 1368709 -2797618 -2877250 1095592 4984226 5787038 4432871
2553 4432871 3663605 4623003 6076518 6322922 5127173 3576471 2351398 751716 -2203711
2544 -2203711 -6031071 -8680917 -8281625 -4884816 -655354 1633857 819163 -1557404 -2718064
2535 -2718064 -1479265 827822 2336150 2558647 1867891 340933 -1697954 -2937007 -2419973
2526b419973J274637L14958n60615K02086J558907J737664Q87154J54407m92758
2517B656467j572406k344549j880230j055950j290493j865581q22336J694837
2509f480241L328182K875290J536075M37394p94896k183011k311370n13547J462996
2500b643128J575368K07068p05579m44857R4957K32617J50942j13799q28233j467572
2490c942216p84829J393010L369809L376992J589014m50651j933727l180067l965866
2481d528531k909828M86241M036134M596473J642963k070696l694941k939467
2473e381652j102637R88728K705376K536766m01645l884079l986322N0740M230864
2464d243861M564513J959523L53190R90168J309505m25280k399896k513984j804736
$$ plain form
2526 -2419973 -1145336 -830378 -1390993 -1188907 370000 2107664 2994818 3149225 2656467
2517 2656467 1084061 -1260488 -3140718 -4196668 -5487161 -7352742 -8175078 -6480241
2509 -6480241 -3152059 -276769 1259306 1696700 901804 -1281207 -3592577 -4106124 -2643128
2500 -2643128 -1067760 -860692 -1566271 -2011128 -1916171 -1683554 -1532612 -1646411 -2474644 -3942216
2490 -3942216 -4727045 -3334035 35774 3412766 5001780 4551129 2617402 -562665 -4528531
2481 -4528531 -7438359 -6952118 -2915984 1680489 3323452 1252756 -2442185 -5381652
2473 -5381652 -6484289 -5495561 -2790185 -253419 -655064 -4539143 -8525465 -8474725 -4243861
2464 -4243861 320652 2280175 2633365 3623533 4933038 4507758 2107862 -406122 -2210858
2455b210858k199327k616955n15454L261379M619613J849455j865513k900685
2447b578345j576916l25492K01522P73560J039319Q5017j396218j992102j930984
2438g700639k177700j940955J65022K898559L335307J166377q14545r11655l65676
2429f345905l30733R0921J615191L081428L282640K360071M37641k668372n315832
2420c792950m484315j12840L593412L262536N23675r73160m42062M55464Q00509
2411a169731N87306n62728k290008k619547o17661J602098J842145R93762P57693
2402a476671L35603j435924k652499q94908K170118K804533R53527j24648M90947
2393A70078L70066j455169k743577j905431j62798R90369J493089J263330r4105
$$ plain form
2455 -2210858 -4410185 -7027140 -7542594 -4281215 338398 2187853 322340 -2578345
2447 -2578345 -4155261 -4480753 -4279231 -3505671 -2466352 -2381335 -3777553 -5769655 -7700639
2438 -7700639 -9878339 -11819294 -11654272 -8755713 -5420406 -4254029 -5068574 -5980229 -6345905
2429 -6345905 -6676638 -6585717 -4970526 -1889098 1393542 3753613 4191254 1522882 -3792950
2420 -3792950 -8277265 -8390105 -4796693 -1534157 -1010482 -1983642 -2425704 -1970240 -1169731
2411 -1169731 -582425 -1145153 -3435161 -6054708 -6672369 -5070271 -3228126 -2234364 -1476671
2402 -1476671 -1141068 -2576992 -5229491 -6124399 -3954281 -1149748 -196221 -320869 170078
2393 170078 540144 -915025 -3658602 -5564033 -5726831 -4736462 -3243373 -1980043 -2074148
2384b074148j629851j815174j150998j235951j481471j06959J857683J582334
2376f054535l88584l66952K353020M116455K879279J046624O98718M79692o49359
2367D114358r46125K91330N77626j317803k727038j739524m93424p30609l19734
2358c290943K054137L006641r4822l551925k530410J120185J873389q27286k655840
2349d896874j685840M6579J394303L026987L843329J732445j868582k954932q55638
2340b218223J210005J629942J932480K506512J503753j102780k754492k681140
2332B6057k925382l932325l275753j44018K847448L760434L462953K393131n85546
2323A626999m332751m800585q68021K954999K531178m62960j981245j386568n82060
$$ plain form
2384 -2074148 -3703999 -5519173 -6670171 -7906122 -9387593 -9494552 -7636869 -6054535
2376 -6054535 -6443119 -6810071 -4457051 -340596 2538683 3585307 4284025 4763717 4114358
2367 4114358 3168233 3459563 4037189 2719386 -7652 -1747176 -2240600 -2971209 -3290943
2358 -3290943 -1236806 1769835 1675013 -1876912 -4407322 -3287137 -1413748 -2241034 -4896874
2349 -4896874 -6582714 -6536135 -5141832 -2114845 1728484 3460929 1592347 -1362585 -2218223
2340 -2218223 -1008218 621724 2554204 5060716 6564469 5461689 2707197 26057
2332 26057 -2899325 -6831650 -10107403 -10251421 -7403973 -3643539 -180586 2212545 1626999
2323 1626999 -2705752 -7506337 -8374358 -5419359 -2888181 -3351141 -5332386 -6718954 -7301014
2314g301014l6727Q72856J496662J064619O68676J344346J747233M18605j194830
2305i19574p72689J116033J959019R42378p50913k122862k499046q01669K710455
2296a138868N091532L805585L64094j640963j279782m77917l38033j99780J4525
2287D200393n95559j854789k474910k149216j561847n46142J387649K885969J839821
2278A131369j101326k804646k058577j044487j384548j374143R75547M105523
2270c555288M564381J744785j231707j555429n5965L49917j284771k735469j772865
2261e532411O38723J694338Q20462L39271J580460K590493J256016j181902j990215
2252B15235j052120n43669j197047j585656r90140l24735O4152R48116J947087
$$ plain form
2314 -7301014 -7337741 -6464885 -4968223 -3903604 -3234928 -1890582 -143349 275256 -919574
2305 -919574 -1692263 -576230 1382789 2325167 1574254 -548608 -3047654 -3849323 -1138868
2296 -1138868 3952664 7758249 8122343 6481380 5201598 4723681 4385648 4185868 4200393
2287 4200393 3604834 1750045 -724865 -2874081 -4435928 -4982070 -3594421 -708452 1131369
2278 1131369 30043 -2774603 -4833180 -5877667 -7262215 -8636358 -7660811 -3555288
2270 -3555288 1009093 2753878 1522171 -33258 -89223 260694 -1024077 -3759546 -5532411
2261 -5532411 -4893688 -3199350 -2378888 -2039617 -459157 2131336 3387352 2205450 215235
2252 215235 -836885 -1380554 -2577601 -4163257 -5153397 -5478132 -5413980 -4465864 -2518777
2243b518777J263308j177063k614813j089912J662146K780809K257137K149963
2235B712798K726104J913924j149675m113129m097078j352169J042112R39547
2227a377566n32256q88949K69701R61324m1335j236802n24889J702353L074191
2218A405772K461325J136685O06499P31000N81181N5243k47375k50506p14213
2209E765611k256415m255425m910588k882075Q73175L598272L694334K409927
2201B036816J680794J340512J51598j242747r49159N38220J94368k868957n165057
2192d283612l384225O68804K411390Q08130o67669M99481K433874K202798K22712
2183I11683q95472n87471p12925j789321j616345J027593L399276J907399k532494
$$ plain form
2243 -2518777 -1255469 -2432532 -5047345 -6137257 -4475111 -1694302 562835 2712798
2235 2712798 5438902 7352826 6203151 2090022 -2007056 -3359225 -2317113 -1377566
2227 -1377566 -1909822 -2798771 -2529070 -1567746 -1609081 -2845883 -3370772 -1668419 1405772
2218 1405772 3867097 5003782 5610281 6341281 6922462 6977705 6730330 6479824 5765611
2209 5765611 3509196 -746229 -5656817 -8538892 -7665717 -4067445 -373111 2036816
2201 2036816 3717610 5058122 5209720 3966973 3017814 3556034 3750402 881445 -4283612
2192 -4283612 -7667837 -6999033 -4587643 -3779513 -4447182 -3947701 -1513827 688971 911683
2183 911683 16211 -571260 -1284185 -3073506 -4689851 -3662258 -262982 1644417 -888077
2174h88077m884572k209238K748935N388321M743098L182517K008236K38149k210710
2165H116659l061422r12896J977284K271288N3234j438191m79541R97758P44215
2156H268388m31023m92389M1327j056653l323168l291172J35707K923824J162034
2147C936875k957845l913817o88160K124916J336048p41950p77786N83522Q61231
2138b36966K10758N11091J537286J300679m02239j624070j371675p38184p82582
2129a595902j201967j404160j444569j627126k065313k501371k042932M4803K631907
2120a1206630L305761J744772O31540J639317K769628J987084J039605K315178
2112D226255M023443K763404m86922j677735l14928K36655r69293j269379k71299
$$ plain form
2174 -888077 -5772649 -7981887 -5232952 155369 4898467 8080984 10089220 10327369 8116659
2165 8116659 5055237 4142341 6119625 8390913 8444147 7005956 6526415 7524173 8268388
2156 8268388 7837365 7344976 7386303 6329650 3006482 -284690 -148983 2774841 3936875
2147 3936875 979030 -2934787 -3622947 -1498031 -161983 -903933 -1681719 -1098197 -236966
2138 -236966 -26208 484883 2022169 3322848 2920609 1296539 -75136 -813320 -1595902
2129 -1595902 -2797869 -4202029 -5646598 -7273724 -9339037 -11840408 -13883340 -13838537 -11206630
2120 -11206630 -7900869 -6156097 -5524557 -3885240 -1115612 871472 1911077 4226255
2112 4226255 8249698 11013102 10526180 8848445 8533517 8770172 7800879 6531500 6260201
2103F260201j276104m873842o520021l483275N66506J472201P53327J649676K845945
2094b605386J257575j606688j545120J430217L213091K130775O59027N11913L55650
2085C801054q15377j747520j562804j355991j896108k062547p25431J581502L601214
2076a182008M374698L017745o12396m529979n788782l793613r32980O49394J321298
2067g476623K297511L301779L115319J599554N0642k96150L90956O97680n09233
2058C171435k630910l755526k700606j19835K488199L940794L456081J090656
2050D940288j385780j767545l57309K81246o07666p61605O76544P48339k323555
2041e57043m694190j842568L868101N647788J813841k192415j919279P46658J885108
$$ plain form
2103 6260201 4984097 110255 -6409766 -9893041 -9326535 -7854334 -7101007 -5451331 -2605386
2094 -2605386 -1347811 -2954499 -4499619 -3069402 143689 2274464 2933491 3445404 3801054
2085 3801054 2985677 1238157 -324647 -1680638 -3576746 -5639293 -6364724 -4783222 -1182008
2076 -1182008 3192690 6210435 5598039 1068060 -4720722 -8514335 -9447315 -8797921 -7476623
2067 -7476623 -5179112 -1877333 1237986 2837540 2888182 2592032 2982988 3680668 3171435
2058 3171435 540525 -3215001 -5915607 -6035442 -3547243 393551 3849632 4940288
2050 4940288 3554508 1786963 1429654 1710900 1103234 341629 1018173 1766512 -557043
2041 -557043 -5251233 -7093801 -3225700 2422088 4235929 2043514 124235 870893 2756001
2032B756001R74996k66838j151117j576265p88032J057763K000182R56504m09541
2023C553653k86263N34795L47367n89230q06227r3384N72774P00944M17274k99959
2013D051744j291717j811134j370347l34707Q14967J868160K298397J631985O12565
2004F469913L77676L55530r33541k782892k692439n33710P11152l14455j006711
1995c49477P80425K927418K322480m40125k483385k794611k096897m38510J945653
1986f27029K870448O34698k733399l740530k109520k58996R20818K439864L971709
1977A368063L792749J999906O24179L28949j21870j012824j253199r50646j365826
1968C409481k068016j354923J18109k96174k395867k459298R69878M257835L933586
$$ plain form
2032 2756001 3730997 3464159 2313042 736777 -51255 1006508 3006690 3963194 3553653
2023 3553653 3267390 3802185 4149552 3560322 2754095 2660711 3233485 3934429 4351703 4051744
2013 4051744 2760027 948893 -421454 -756161 58806 1926966 4225363 5857348 6469913
2004 6469913 6847589 7203119 6269578 3486686 794247 260537 971689 657234 -349477
1995 -349477 430948 3358366 5680846 5240721 2757336 -37275 -2134172 -2572682 -627029
1986 -627029 2243419 2878117 144718 -3595812 -5705332 -5964328 -5043510 -2603646 1368063
1977 1368063 5160812 7160718 7784897 8113846 7991976 6979152 5725953 4775307 3409481
1968 3409481 1341465 -13458 104651 -191523 -2587390 -5046688 -4076810 181025 4114611
1959D114611J516329K53769j14029j771551l967531l709989o67339K126198K537085
1950C17553J391663j9014j663852l076235k433148Q68914M122758L812246P762
1941C328647l256309k522354J044476L065075J165682k349319l518110j307389
1933d349601J968452L932170M040708K549536j11650k384438k233384j4917J125984
1924D522860o77749l084517k611102N15299K765016J951658p22939l061034m112489
1915d514997l720163j798093J082625L602458M819295M573860K790195k69230
1907F565950k924184l028210p52801J152767R09739L1473P11045K240719K034728
1898F941226m35638k865137l299690k189762q53468L35908J373223J698955J034934
$$ plain form
1959 4114611 5630940 5884709 5770680 3999129 31598 -3678391 -4345730 -2219532 317553
1950 317553 1709216 1690202 26350 -3049885 -5483033 -4614119 -491361 3320885 3328647
1941 3328647 72338 -2450016 -1405540 1659535 2825217 475898 -3042212 -4349601
1933 -4349601 -2381149 1551021 5591729 8141265 8029615 5645177 3411793 3396876 4522860
1924 4522860 3845111 760594 -1850508 -1335209 1429807 3381465 2658526 -402508 -4514997
1915 -4514997 -8235160 -10033253 -8950628 -5348170 -528875 4044985 6835180 6565950
1907 6565950 3641766 613556 -139245 1013522 1923261 1954734 2665779 4906498 6941226
1898 6941226 6505588 3640451 340761 -1849001 -2702469 -2366561 -993338 705617 1740551
1889A740551J55830k78976p68001j654838j725111K04653K840639L516012J769173
1880E799932r9790m33747j92701o36665j009048j81682Q14774n304k463831m228377
1870b636439l771713j701552P15704K644205L218595J837520m90642j618279q39359
1861b641960K54616K05728l80995l25354P0062l0322N9790J700805M176285M710399
1851G799054J938640j959964l672236k572159r52618p09727j218083j054268n38875
1842b940236j037735k203708j920327M02645K357973J835710L13179O63954K522751
1833e794K618350q5578k452700j646296Q30018J556857O970j458658j515050j240767
1823c392648j551975j565454l29021J378991K036198J326167K83751K1478R19366
$$ plain form
1889 1740551 1896381 1617405 849404 -805434 -2530545 -2325892 514747 4030759 5799932
1880 5799932 5700142 5266395 5073694 4437029 3427981 3246299 4061073 4055769 1591938 -2636439
1870 -2636439 -6408152 -8109704 -7394000 -4749795 -1531200 306320 -184322 -1802601 -2641960
1861 -2641960 -2387344 -2181616 -2562611 -2887965 -2817903 -2848225 -2788435 -1087630 3088655 7799054
1851 7799054 9737694 7777730 4105494 1533335 580717 -129010 -1347093 -2401361 -2940236
1842 -2940236 -3977971 -6181679 -8102006 -7699361 -5341388 -3505678 -3192499 -2528545 -5794
1833 -5794 2612556 2526978 74278 -1572018 -742000 814857 821827 -636831 -2151881 -3392648
1823 -3392648 -4944623 -6510077 -6839098 -5460107 -3423909 -2097742 -1813991 -1792513 -873147
1814h73147K630272M245839M633795L161305K79251k652939m196656l800472k315186
1805A112062j391373j823259k463362j407106J487505L929195L695485J374928
1797D514075l96096m52724n55847k458716m636326l822792K55792L795036L554229
1788b03369Q49762p31057k54974K02972n31668j169640o71381r7788o71825j776502
1778e055470k083683j350473r6723J233481J922448J250107Q1425N15897K677035
1769i05956L646285J381018j951076k780752r51100Q10889J222443J336793J556765
1760C365309Q63340o33834j182193k57811L74491n75201k098836k742489k390898
1751e278122j305921O61292K809838L474615K482689J860656K574530K488960
$$ plain form
1814 -873147 1757125 6002964 10636759 13798064 14077315 11424376 7227720 3427248 1112062
1805 1112062 -279311 -2102570 -4565932 -5973038 -4485533 -556338 3139147 4514075
1797 4514075 4117979 3665255 3109408 650692 -3985634 -7808426 -7552634 -3757598 -203369
1788 -203369 646393 -84664 -339638 -136666 -668334 -1837974 -2509355 -2607143 -3278968 -5055470
1778 -5055470 -7139153 -8489626 -8586349 -7352868 -5430420 -4180313 -4098888 -3582991 -905956
1769 -905956 2740329 4121347 2170271 -610481 -1561581 -750692 471751 1808544 3365309
1760 3365309 4228649 3594815 2412622 2154811 2529302 1954101 -144735 -2887224 -5278122
1751 -5278122 -6584043 -5922751 -3112913 361702 2844391 4705047 7279577 9768537
1743I768537l49697m011531m882204k683867n82416n07899j059255n37160M44003
1734d401489O36301N58052J398274K506815J919857o57585l000480l058043j351347
1725e449645K00402R56227J668794K317340J711650j85276j373216o34288K51854
1716e36158q58859k643066j786342J811662M149900K364112j502795l402157k144619
1707d548322K36782J566671J230095k51973j696956j840997o94868J92772k46786
1698f053582j119820j054554j63289O05070J000028J062968L29996r91289j155036
1689g539508Q96670L267304L149999O46768j499097j657267p28158K1249L87068
1680c054972L52842j81461m47660N55781K068541K015857K1639j697453j186606
$$ plain form
1743 9768537 9418840 5407309 525105 -2158762 -2741178 -3249077 -4308332 -4845492 -4401489
1734 -4401489 -3765188 -3207136 -1808862 697953 2617810 1960225 -1040255 -4098298 -5449645
1725 -5449645 -5249243 -4293016 -2624222 -306882 1404768 1219492 -153724 -788012 -536158
1716 -536158 -1395017 -4038083 -5824425 -4012763 137137 2501249 998454 -2403703 -4548322
1707 -4548322 -4311540 -2744869 -1514774 -1766747 -3463703 -5304700 -5999568 -5806796 -6053582
1698 -6053582 -7173402 -8227956 -8391245 -7786175 -6786147 -5723179 -5393183 -6384472 -7539508
1689 -7539508 -6642838 -3375534 -225535 421233 -1077864 -2735131 -3463289 -3442040 -3054972
1680 -3054972 -2702130 -2883591 -3331251 -2775470 -706929 1308928 1330567 -366886 -1553492
1671a553492Q76946K361064K070383M01369j373043k035975j450970p43033p33656
1662b180407p23143J7672M87132l87659j221583J6370K137354J939146n39805
1653d54923j552364O05841K955789K623762Q89897J58618m6445j166047k169756
1644A844372j273748O29483J305462N76105l82366j637680l378811l643529n21195
1635f481907L845673N342385L348698R94162R4836p31630k518993l833348l272853
1626c212977j558007n6057Q43868J157024Q33871L19388M6108n87811k029815
1617d244408k860282j542216O20318J010036j97034o05754m9047o95877k389088
1608a0953352k048684J100361L773420L792862L024917L026975J867596j719288
$$ plain form
1671 -1553492 -676546 1684518 3754901 4156270 2783227 747252 -703718 -1446751 -2180407
1662 -2180407 -2903550 -2885878 -2398746 -2786405 -4007988 -3991618 -1854264 84882 -454923
1653 -454923 -2007287 -1401446 1554343 4178105 5068002 5226620 5180175 4014128 1844372
1644 1844372 570624 1200107 2505569 3081674 2699308 1061628 -2317183 -5960712 -6481907
1635 -6481907 -2636234 2706151 6054849 7049011 7143847 6412217 3893224 59876 -3212977
1626 -3212977 -4770984 -4827041 -3983173 -2826149 -1992278 -1672890 -1626782 -2214593 -4244408
1617 -4244408 -7104690 -8646906 -8026588 -7016552 -7213586 -7819340 -7868387 -8564264 -10953352
1608 -10953352 -13002036 -11901675 -8128255 -4335393 -1310476 1716499 3584095 1864807
1600A864807m746977m230363j959204j115235q95066J077949L276739K302094
1592d425256q30499j637986P28372K182752K05196k676659l239478j790372l59375
1583a1843305M60743J034365J121467N16196R386N61072K168287L776189L722699
1574A527099J075820k327253k708074P14913L448516J514140k308750k436788
1566a500377N94133R31289k720091m572423j229958K616590J863065j001589p46188
1557e765549J826921K023261l20607r14816J316797K611752Q71871j413472k013290
1548a777132k214662l265776l271759l27609L611776M687373J966066j562536
1540b154259k486387m95181J471831M91155k704183m147911j630212K001611K443069
$$ plain form
1600 1864807 -2882170 -7112533 -9071737 -10186972 -11082038 -10004089 -6727350 -4425256
1592 -4425256 -5255755 -6893741 -6165369 -3982617 -3777421 -6454080 -9693558 -11483930 -11843305
1583 -11843305 -11382562 -10348197 -9226730 -8710534 -8701148 -8140076 -5971789 -2195600 1527099
1574 1527099 2602919 275666 -2432408 -1717495 1731021 3245161 936411 -1500377
1566 -1500377 -906244 25045 -2695046 -7267469 -8497427 -5880837 -4017772 -5019361 -5765549
1557 -5765549 -3938628 -1915367 -2235974 -3150790 -1833993 777759 1649630 236158 -1777132
1548 -1777132 -3991794 -7257570 -10529329 -10856938 -7245162 -2557789 -591723 -2154259
1540 -2154259 -4640646 -5135827 -3663996 -3172841 -5877024 -10024935 -11655147 -9653536 -7210467
1531g210467k67095k261110j591572k10664K6520q2084L78804M87299k14109j24722
1521a1069200J620713K925166J591949j169039k308106q61113J591297L290954
1513d387379L331218J438923j358582k747551j606947L58898J053357Q47531J063441
1504b007091R48291j123879m122877m961046k696980L73851K051631K259055J439212
$$ plain form
1531 -7210467 -7477562 -9738672 -11330244 -11540908 -11514388 -11596472 -11217668 -10730369 -10944478 -11069200
1521 -11069200 -9448487 -6523321 -4931372 -6100411 -8408517 -9269630 -7678333 -4387379
1513 -4387379 -1056161 382762 -975820 -3723371 -5330318 -4971420 -3918063 -3070532 -2007091
1504 -2007091 -1058800 -2182679 -6305556 -11266602 -13963582 -13589731 -11538100 -9279045 -7839833
$$ [...]
##END NTUPLES=NMR SPECTRUM
##END=
