##TITLE=31Pdec_DE-97K2
DMSO-d6, 24 sc
 4.2.2026
##JCAMPDX= 6.0         $$ Bruker NMR JCAMP-DX V2.0
##DATA TYPE= NMR SPECTRUM
##DATA CLASS= NTUPLES
##ORIGIN= UXNMR, Bruker Analytische Messtechnik GmbH
##OWNER= root
$$ XWIN-NMR		Version 3.5
$$ Wed Feb  4 13:55:19 2026 Russian Standard Time (UT+4h)  she@DPX200
##.OBSERVE FREQUENCY= 81.013821
##.OBSERVE NUCLEUS= ^31P
##.ACQUISITION MODE= SIMULTANEOUS
##.ACQUISITION SCHEME= undefined
##.AVERAGES= 24
##.DIGITISER RES= 17
##SPECTROMETER/DATA SYSTEM= spect
##.PULSE SEQUENCE= zgpg30
##.SOLVENT NAME= DMSO
##.SHIFT REFERENCE= (INTERNAL, DMSO, 0, 198.062)
##AUDIT TRAIL= $$ (NUMBER, WHEN, WHO, WHERE, WHAT)
$$ ##TITLE= Audit trail, XWIN-NMR		Version 3.5
$$ ##JCAMPDX= 5.01
$$ ##ORIGIN= Bruker BioSpin GmbH
$$ ##OWNER= she
$$ F:/spectra/data/she/nmr/P31/2/pdata/1/auditp.txt
$$ ##AUDIT TRAIL=  $$ (NUMBER, WHEN, WHO, WHERE, WHAT)
(   1,<2026-02-04 13:54:14.98 +0400>,<she>,<DPX200>,
      <created by zg, POWCHK disabled, PULCHK disabled
       configuration hash MD5:
       00 E9 B6 7A A2 85 ED C7 34 08 36 98 17 FE 4E 26
       data hash MD5: 32K
       DD 4E 54 BA FA CA 1B 3C 33 A8 E3 76 EE 2C 86 7C>)
(   2,<2026-02-04 13:54:18.35 +0400>,<she>,<DPX200>,
      <Start of raw data processing
       efp BC_mod = 2 LB = 1.5 FT_mod = 6 PKNL = 1 PHC0 = 1379.867 PHC1 = 67.30091 SI = 64K 
       data hash MD5: 64K
       14 2C 77 4C 15 04 0F A2 E8 D1 CB 38 15 A2 E5 D4>)
(   3,<2026-02-04 13:54:37.43 +0400>,<she>,<DPX200>,
      <pk PHC0 = 15.59581 PHC1 = 0 
       data hash MD5: 64K
       C7 DA 72 C2 23 08 FD 0D 5F 87 99 AB 7D 4F 0D 0E>)
(   4,<2026-02-04 13:54:47.26 +0400>,<she>,<DPX200>,
      <abs ABSG = 5 
       data hash MD5: 64K
       DA B5 F1 2A 0B 8C 0D E6 FD 9D 22 67 0F 66 89 4A>)
$$ ##END=
$$ 
$$ hash MD5
$$ 1C 5E 19 A9 E2 88 A7 22 9C 95 A3 9B 5F 15 AA 3F
##$RELAX= 
##$RELAX= 
##$RELAX= 
##$RELAX= 
##$RELAX= 
##$RELAX= 
##$RELAX= 
##$RELAX= 
$$ Bruker specific parameters
$$ --------------------------
##$DU= <F:/spectra>
##$EXPNO= 2
##$NAME= <P31>
##$PROCNO= 1
##$TYPE= <nmr>
##$USER= <she>
##$AMP= (0..31)
100 100 100 100 100 100 100 100 100 100 100 100 100 100 100 100 100 100 
100 100 100 100 100 100 100 100 100 100 100 100 100 100 
##$AQSEQ= 0
##$AQ_mod= 1
##$AUNM= <au_zg>
##$AUTOPOS= <>
##$BF1= 81.014009
##$BF2= 200.13
##$BF3= 200.13
##$BF4= 200.13
##$BF5= 200.13
##$BF6= 200.13
##$BF7= 200.13
##$BF8= 200.13
##$BYTORDA= 1
##$CFDGTYP= 0
##$CFRGTYP= 5
##$CHEMSTR= <none>
##$CNST= (0..31)
1 1 145 1 1 1 1 1 1 1 1 1 1 1 1 1 1 1 1 1 1 1 1 1 1 1 1 1 1 1 1 1 
##$CPDPRG= <waltz16>
##$CPDPRG1= <>
##$CPDPRG2= <waltz16>
##$CPDPRG3= <>
##$CPDPRG4= <mlev>
##$CPDPRG5= <mlev>
##$CPDPRG6= <mlev>
##$CPDPRG7= <mlev>
##$CPDPRG8= <mlev>
##$CPDPRGB= <>
##$CPDPRGT= <>
##$D= (0..31)
0 1 0 0 0 0 0 0 0 0.06 0 0.03 2e-05 3e-06 0 0 0.0002 0 0 0 0 0 0 0 0 0 
0 0 0 0 0 0 
##$DATE= 1770198854
##$DBL= (0..7)
120 120 120 11 120 120 24 19 
##$DBP= (0..7)
150 150 150 150 150 150 150 150 
##$DBP07= 0
##$DBPNAM0= <>
##$DBPNAM1= <>
##$DBPNAM2= <>
$$ [...]
##$SUBNAM3= <"">
##$SUBNAM4= <"">
##$SUBNAM5= <"">
##$SUBNAM6= <"">
##$SUBNAM7= <"">
##$SUBNAM8= <"">
##$SUBNAM9= <"">
##$SW= 400.765351723535
##$SWIBOX= (0..15)
0 1 3 0 0 0 0 0 0 0 0 0 0 0 0 0 
##$SW_h= 32467.5324675325
##$TD= 32768
##$TD0= 1
##$TE= 0
##$TE2= 300
##$TE3= 300
##$TEG= 300
##$TL= (0..7)
0 120 53 12 22 120 120 120 
##$TP= (0..7)
150 150 150 150 150 150 150 150 
##$TP07= 0
##$TPNAME0= <>
##$TPNAME1= <>
##$TPNAME2= <>
##$TPNAME3= <>
##$TPNAME4= <>
##$TPNAME5= <>
##$TPNAME6= <>
##$TPNAME7= <>
##$TPOAL= (0..7)
0.5 0.5 0.5 0.5 0.5 0.5 0.5 0.5 
##$TPOFFS= (0..7)
0 0 0 0 0 0 0 0 
##$TUNHIN= 0
##$TUNHOUT= 0
##$TUNXOUT= 0
##$USERA1= <user>
##$USERA2= <user>
##$USERA3= <user>
##$USERA4= <user>
##$USERA5= <user>
##$V9= 5
##$VALIST= <valist>
##$VCLIST= <CCCCCCCCCCCCCCC>
##$VD= 0
##$VDLIST= <DDDDDDDDDDDDDDD>
##$VPLIST= <PPPPPPPPPPPPPPP>
##$VTLIST= <TTTTTTTTTTTTTTT>
##$WBST= 1024
##$WBSW= 4
##$XGAIN= (0..3)
0 0 0 0 
##$XL= 0
##$YL= 0
##$YMAX_a= 3923
##$YMIN_a= -3554
##$ZGOPTNS= <>
##$ZL1= 120
##$ZL2= 120
##$ZL3= 120
##$ZL4= 120
##$ABSF1= 198.0616
##$ABSF2= -202.7028
##$ABSG= 5
##$ABSL= 3
##$ALPHA= 0
##$AQORDER= 0
##$ASSFAC= 0
##$ASSFACI= 0
##$ASSFACX= 0
##$ASSWID= 0
##$AUNMP= <proc_1d>
##$AZFE= 0.1
##$AZFW= 0.5
##$BCFW= 0
##$BC_mod= 2
##$BYTORDP= 0
##$COROFFS= 0
##$CY= -3
##$DATMOD= 1
##$DC= 0
##$DFILT= <>
##$DTYPP= 0
##$F1P= 0
##$F2P= 0
##$FCOR= 1
##$FTSIZE= 65536
##$FT_mod= 6
##$GAMMA= 0
##$GB= 0
##$INTBC= 1
##$INTSCL= 9.790993e-09
##$ISEN= 30
##$LB= 1.5
##$LEV0= 0
##$LPBIN= 0
##$MAXI= 10000
##$MC2= 0
##$MEAN= 0
##$ME_mod= 0
##$MI= 50
##$NCOEF= 0
##$NC_proc= -9
##$NLEV= 6
##$NOISF1= 182.463
##$NOISF2= 159.3651
##$NSP= 0
##$NTH_PI= 0
##$NZP= 0
##$OFFSET= 198.0616
##$PC= 4
##$PHC0= 1395.463
##$PHC1= 67.30091
##$PH_mod= 1
##$PKNL= yes
##$PPARMOD= 0
##$PSCAL= 0
##$PSIGN= 0
##$REVERSE= no
##$SF= 81.0140089999434
##$SI= 65536
##$SIGF1= 159.3651
##$SIGF2= -187.1042
##$SINO= 113.3802
##$SIOLD= 16384
##$SREGLST= <1H.CDCl3>
##$SSB= 0
##$STSI= 65536
##$STSR= 0
##$SW_p= 32467.5324675325
##$SYMM= 0
##$S_DEV= 0
##$TDeff= 32768
##$TDoff= 0
##$TI= <>
##$TILT= no
##$TM1= 0
##$TM2= 0
##$TOPLEV= 0
##$USERP1= <user>
##$USERP2= <user>
##$USERP3= <user>
##$USERP4= <user>
##$USERP5= <user>
##$WDW= 1
##$XDIM= 65536
##$YMAX_p= 401862553
##$YMIN_p= -89886415
$$ End of Bruker specific parameters
$$ ---------------------------------
##NTUPLES= NMR SPECTRUM
##VAR_NAME=  FREQUENCY,     SPECTRUM/REAL,   SPECTRUM/IMAG
##SYMBOL=    X,             R,               I
##VAR_TYPE=  INDEPENDENT,   DEPENDENT,       DEPENDENT
##VAR_FORM=  AFFN,          ASDF,            ASDF
##VAR_DIM=   65536,         65536,           65536
##UNITS=     HZ,            ARBITRARY UNITS, ARBITRARY UNITS
##FACTOR=    0.49542278885378, 1,            1
##FIRST=     16045.7642231865, 0,            0
##LAST=      -16421.768244346, 0,            0
##MIN=       -16421.768244346, -89886415,    0
##MAX=       16045.7642231865, 401862553,    0
$$ Real data points
##PAGE= N=1
##DATA TABLE= (X++(R..R)), XYDATA
$$ [...]
43388A2374252N01694k655504n275258m876311l459364l822694m138969j306188
43380a2658342K557058K721874k84211j266308J384650L608934K627627R97646
43372c11072K005149M727395N663742L097411j302792l866338k102764J969218
43364I879949K916607j438005o302963o131982k481169j105315k818412l060932
43356a0542222k39414J889031J314714J025871K777728L376514O32176k007880
43348a773482j028303J090317J95652k313717j846666J678604L631186J523758
43340A157349k265628m473468m026857j311163K228429L786334J712388j584161
43332d776777k225393k61525P62780l61730q77985R80798L188899L636484L238167
$$ y = [12374252, 12875946, 10220442, 4945184, 68873, -3390491, -7213185, -11352154, -12658342, -10101284, -7379410, -7663621, -8929929, -7545279, -3936345, -1308718, -311072, 1694077, 6421472, 12085214, 15182625, 13879833, 10013495, 7910731, 9879949, 12796556, 11358551, 5055588, -1076394, -3557563, -4662878, -7481290, -10542222, -10781636, -8892605, -7577891, -6552020, -3774292, -397778, 234398, -1773482, -2801785, -1711468, -1515816, -3829533, -5676199, -3997595, -366409, 1157349, -1108279, -5581747, -9608604, -10919767, -8691338, -4905004, -3192616, -4776777, -7002170, -7263695, -6500915, -6862645, -7740630, -6759832, -3570933, 65551, 3303718]
43323C303718L282078K715389O13988j197455q93195K521q88520k515863j989286
43314B433375M98659J864227J033635K44345R97484J817922J069546n72440j709218
43305G677535k186946k251873j548806j78763P65470P26939L17326k15844j307395
43296A797643k191770j111047J334725J616827j926017n927585o058053k529966
43288a4995243R00628J895050R51474p13367j934800j325335J106019K989764
43280a1125810K604466J434056J135408K7884l650520o835466m872758J112923
43272b0169817N215655N084828L994906M033555K926493n31468l210601k606867
43264e263316o93003L9160L87430J355693J144845j414548l770151l349128j392685
$$ y = [3303718, 6585796, 9301185, 9915173, 8717718, 7824523, 7827044, 6938524, 4422661, 2433375, 2932034, 4796261, 5829896, 6074241, 7071725, 8889647, 9959193, 9386753, 7677535, 5490589, 3238716, 1689910, 1511147, 2276617, 3003556, 3320882, 3105038, 1797643, -394127, -1505174, -170449, 1446378, -479639, -6407224, -12465277, -14995243, -14094615, -12199565, -11248091, -11961458, -13896258, -15221593, -14115574, -11125810, -8521344, -7087288, -5951880, -5923996, -9574516, -16409982, -21282740, -20169817, -14954162, -9869334, -5874428, -1840873, 1085620, 554152, -2656449, -5263316, -5956319, -5917159, -5529729, -4174036, -3029191, -4443739, -8213890, -11563018, -12955703]
43255a2955703n8403J135837K842211L264235J520743K38676J039675J043789
43247a928940j849413m003333j586606K456450L036016J418527K132769L836026
43239C511496J415326l763655m491388M27319L449412J38709l942602k387922
43231e643305K332489L560772M16667k339970j817748L07225J290391J15392k333866
43222d111953l768523k392147L55560R38196j194400k394462l26740K426756K670726
43213g796987J553718K121002M176920M916957L210963K49762k910741n613210
43205i1616o319132l861094L24443L335664L894376K781974J029972n73041j006943
43196d85397k7113P92265k41358k439635l360234j754661J188665L275837L175493
$$ y = [-12955703, -13014106, -11878269, -9036058, -5771823, -4251080, -4012404, -2972729, -1928940, -3778353, -7781686, -9368292, -6911842, -3875826, -2457299, -324530, 3511496, 4926822, 1163167, -3328221, -2900902, 548510, 687219, -3255383, -5643305, -3310816, 249956, 666623, -1673347, -3491095, -3183870, -1893479, -1778087, -4111953, -7880476, -10272623, -9917063, -8978867, -10173267, -12567729, -12894469, -10467713, -7796987, -6243269, -4122267, 54653, 4971610, 8182573, 8432335, 5521594, -91616, -6410748, -10271842, -9947399, -6611735, -2717359, 64615, 1094587, 521546, -485397, -512510, 279755, 38397, -2401238, -5761472, -7516133, -6327468, -3051631, 123862]
43187A23862J323363l40234p0648J756301L095201K785077J510702L6175j827233
43178H392566l800805m420052k911029n32598R72738J187576N68168n12029j481211
43169b536676j598794j008139n93055l69105N06655J738537J712488J0674j567873
43160c705288j264185P07861K779286L153911O41934l555254n416782k316170
43152h974687K657534L997024J225259j047082o26649j98364j148198o62515K283366
43143b494312L470539M3154l831963k621292K459042N544093L927930k71546m011316
43134B214329n125915k450256K242590M530301K695003K05596k5647j85371k647408
43125A453222m721254l247265n28111K0035M27454L819998O858592M193757j772223
$$ y = [123862, 1447225, 1106991, 1036343, 2792644, 5887845, 8672922, 10183624, 10219799, 8392566, 4591761, 171709, -2739320, -3271918, -2299180, -1111604, -543436, -1055465, -2536676, -4135470, -5143609, -5736664, -6105769, -5599114, -3860577, -2148089, -2137415, -3705288, -4969473, -4261612, -1482326, 1671585, 2313519, -1241735, -6658517, -8974687, -6317153, -2320129, -1094870, -2141952, -2768601, -2966965, -4115163, -4777678, -2494312, 976227, 1019381, -2812582, -5433874, -2974832, 2569261, 6497191, 6225645, 2214329, -2911586, -5361842, -3119252, 1411049, 4106052, 4311648, 4286001, 4100630, 1453222, -3268032, -6515297, -7043408, -7023373, -6595919, -2775921, 4082671, 8276428, 6504205]
43116F504205l677974n14644K039954J967627K916429N373623M694441p7349l600718
43107A5625594l226903l037059n576532o764631l286929J235977K227162J105178
43099a698143J510124K921498K694232J036165j96655r06358j648084j763612
43091A949167j145550j001275j062270L68050K112895N65889l621129m720836
43083f555059n90336L473002K998034P07663M69538P82266n46847q71759K011413
43074A877915M049078J175418k875513k138310J842626L270262J935334J910145
43066A1046955K915798J373714j490796j184357J076987l74372n114577o097570
43058B151782j214279K964186J654426j544656j976729r79946j378868j734734
$$ y = [6504205, 2826231, 2311587, 4351541, 6319168, 9235597, 14609220, 19303661, 19226312, 15625594, 12398691, 9361632, 3785100, -2979531, -6266460, -5030483, -2803321, -1698143, -188019, 2733479, 5427711, 6463876, 6267221, 5360863, 3712779, 1949167, 803617, -197658, -1259928, -891878, 1221017, 1786906, -1834223, -6555059, -7145395, -3672393, -674359, 33304, 502842, 1285108, 738261, -133498, 1877915, 5926993, 7102411, 4226898, 2088588, 3931214, 7201476, 9136810, 11046955, 13962753, 15336467, 13845671, 12661314, 13738301, 13363929, 8249352, 2151782, 937503, 3901689, 5556115, 4011459, 2034730, 1054784, -324084, -2058818]
43050b058818J48711K400833K295751Q85746M79047M52061p96257k265954k066825
43041e25705o48184L79767P00152N03568m98613j543419r39765P15222O13983
43032a242994j354777j657294P99253K133852J74096j095645J704064M494563
43024C955118J624023m484390o360446k626020Q47821P76279N18524K831829M880538
43015A963276L498782N87377l87921J79886j76247j228539p89030J105763K018549
43006F771896O30472k017156m388860n497411m568776j762705J009910J902218
42998g920412J517564J529324J316165j307226n602228p213425l672509J822808
42990a9529939M518177M172944M050455N007212M350201Q79225k579868l251845
$$ y = [-2058818, -1910107, 490726, 2786477, 3672223, 4151270, 4603331, 3807074, 1541120, -525705, -1173889, -794122, -93970, 409598, -89015, -1632434, -2572199, -1856977, -1242994, -2597771, -4255065, -3455812, -1321960, -1147864, -2243509, -539445, 3955118, 5579141, 1094751, -5265695, -7891715, -7043894, -6267615, -5749091, -2917262, 1963276, 5462058, 6049435, 5661514, 5841400, 5665153, 4436614, 3647584, 4753347, 6771896, 7402368, 5385212, 996352, -4501059, -9069835, -10832540, -9822630, -7920412, -6402848, -4873524, -3557359, -4864585, -10466813, -17680238, -21352747, -19529939, -15011762, -10838818, -6788363, -1781151, 2569050, 3448275, 868407, -2383438]
42982b383438k145975j567549j229433L83236K324735K126256O2322n86632J739531
42973a276947M180929K874566j972509n656296l766357K741612P719626O096901
42965A0941525j14683l992388k398099L68458m92636l001616k081142J724414
42957I53833K741644q57468m275113l728798j583342j078653o36910K392580N704136
42948c68091M783313Q2405l337947k948778j220873n69095P3859K078513L788558
42939B361864K893977L36485p82779K77536P17641j806358n408926n666116j026654
42930h103330M845309P116698N269361K857741K130975J371379j387803m358257
42922I742073m184342j102443Q80163p02925l519110l626453m97354K674180L161047
$$ y = [-2383438, -4529413, -6096962, -7326395, -6943159, -4618424, -2492168, -2429846, -3016478, -1276947, 2903982, 5778548, 3806039, -1850257, -5616614, -2875002, 4844624, 10941525, 10826842, 6834454, 4436355, 4804813, 4312177, 1310561, -770581, 953833, 3695477, 2838009, -1437104, -5165902, -6749244, -7827897, -8464807, -6072227, -368091, 4415222, 4497627, 1159680, -1789098, -3009971, -3579066, -3505207, -1426694, 2361864, 5255841, 5592326, 4809547, 5087083, 5804724, 3998366, -1410560, -7076676, -8103330, -3258021, 3858677, 9128038, 11985779, 14116754, 15488133, 14100330, 9742073, 5557731, 4455288, 5335451, 4632526, 1113416, -2513037, -3010391, -336211, 2824836]
42913B824836J624142M42004L85594K95050l20400k05844J269286K204105M25342
42904H944115l031070m722671l122454l06794J043343O29799j17438k02085K84557
42895f00698O69703L27425l65412J88511K650388M620359K886447j909180n376180
42886C091363m974256k852452j760484r66052J421341M311484M791002K317086
42878E379032p82706k388169k228666j162710n09307j298344k761644k685455
42870h437969n73608J203822J000121M74389J379915K171830R12925o37901K28735
42861b277741K002248J111874j627187j763647J450922L550543J863065o68181
42853C641896o29446J033593J792515J553663J050500p33194m250970o697920
$$ y = [2824836, 4448978, 4890982, 5276576, 5571626, 5251226, 5045382, 6314668, 8518773, 8944115, 5913045, 1190374, -1932080, -2238874, -1195531, -565732, -683170, -885255, -600698, 69005, 396430, 31018, 219529, 2869917, 7490276, 10376723, 8467543, 3091363, -1882893, -4735345, -6495829, -7461881, -6040540, -1729056, 3061946, 5379032, 4596326, 2208157, -20509, -1183219, -1692526, -2990870, -5752514, -8437969, -9011577, -7807755, -6807634, -6333245, -4953330, -2781500, -1868575, -2506476, -2277741, -275493, 836381, -790806, -2554453, -1103531, 2447012, 4310077, 3641896, 3012450, 4046043, 5838558, 7392221, 8442721, 7709527, 3458557, -3239363]
42845c239363n020907m89266K529044J726544j244866l316416k754272j41037
42837a1950539J992966J357842j287474k763553j674654j076O08862J481860L785416
42828h450350N377027L811558N37890j255840j467550k113391k728623r77436
42820g266715K453864M018021L002140K720041M509248M790262Q89755l705710
42812A1410906l817756k36854J380744j284544m282111l509447j47591K157044
42804A670391K908460M307682O208210N267033K51141m663370m432908K47991
42796A1764630L568991J723812l017113n893888n087616k406693l88555l38988
42788g5420k054354l876011l730096j323555J420841K912892L519675L656373
$$ y = [-3239363, -8260270, -8749536, -6220492, -4493948, -5738814, -9055230, -11809502, -11950539, -9957573, -8599731, -9887205, -12650758, -14325412, -14326488, -13717626, -12235766, -8450350, -3073323, 738235, 1276125, 20285, -1447265, -3560656, -6289279, -7266715, -4812851, -794830, 2207310, 4927351, 9436599, 14226861, 15116616, 11410906, 7593150, 7356296, 8737040, 7452496, 3170385, -339062, -486653, 1670391, 4578851, 8886533, 15094743, 20361776, 20612917, 15949547, 11516639, 11764630, 15333621, 17057433, 14040320, 8146432, 3058816, 652123, 263568, -75420, -2129774, -6005785, -9735881, -11059436, -9638595, -6725703, -3206028, 450345]
42780D50345K340006l84951j731701O3671J907883k99189m795890n514753q70594
42771h835173L765143L923275J699279P87048K35575k437874n010975l004222
42763h877924K627681N648692L062848j091933k079337o35601j74905q35172M6629
42754b309022K751714M122087K202872p34139j342226Q4096O7542k953208n893218
42745d003502m710312J38223L960964L727733J492242O43298Q17325p76450l907160
42736b617639m637570r35199L816621M818053J681265j840910l005077k627518
42728e347974k432292k048262n4242K900389L907924J516663j491964q92975L232586
42719g10147N689792K692021k567563l661892M68550M093255K494407k117210
$$ y = [450345, 2790351, 2405400, 673699, 737370, 2645253, 2346064, -2449826, -7964579, -8835173, -5070030, -1146755, 552524, 1339572, 1575147, -862727, -5873702, -8877924, -6250243, -601551, 2461297, 1369364, -709973, -1345574, -1520479, -2355651, -2309022, 442692, 4564779, 6767651, 6033512, 4691286, 4775382, 4842924, 1889716, -4003502, -8713814, -8575591, -4614627, -886894, 605348, 1248646, 2065971, 1289521, -2617639, -7255209, -8190408, -4373787, 444266, 2125531, 284621, -2720456, -5347974, -7780266, -9828528, -9882770, -6982381, -3074457, -1557794, -3049758, -3942733, -710147, 4979645, 7671666, 5104103, 1442211, 1910761, 6004016, 8498423, 6381213]
42711F381213m219837j868752K250100M597410L279027j390035o187225o419358
42703c577457j038953M775738N149877O28533l439208m490884m481634m390453
42695a0864441k171220K311694M970349K974243q05907j847295J20608K182811
42687c129158K877895K571875J080920j590278l275568j776825J543352L162326
42679A464539J999456Q2791q61708r31196o06218k36411m57490q74793N43414
42670A22384L963029N154109N74761o003455p091735j896969K448700J497646
42662a231530n34713J474946N197415N119616J405115j103820p10226k91913j658335
42653G666555l250385l498173k538011n32431K142761L171972N60345l297145
$$ y = [6381213, 2161376, 292624, 2542724, 7140134, 10419161, 9029126, 2841901, -3577457, -4616410, 159328, 5309205, 5937738, 2498530, -1992354, -6473988, -10864441, -13035661, -10723967, -5753618, -2779375, -3585282, -5432577, -5311969, -3129158, -251263, 2320612, 3401532, 1811254, -1464314, -3241139, -1697787, 1464539, 3463995, 3546786, 2685078, 1753882, 1147664, 911253, 453763, -421030, 122384, 4085413, 9239522, 9814283, 3810828, -3280907, -5177876, -2729176, -1231530, -1766243, -291297, 4906118, 10025734, 11430849, 10327029, 9616803, 9324890, 7666555, 4416170, 917997, -1620014, -2152445, -9684, 3162288, 3722633, 425488]
42645D25488l794987p99929J016743n95942k386608j479985J14176l23015j370231
42636i194290l59802J756523K153173O01768j279121l167996m756188l473815
42628a7719748J909351O850993N495868o48739l837205o89907L601195L562035
42620a476157R09953N05350K815473M464549L745514J654978r04281l364981m150536
42611D199862k392814j8747Q66350J366055L167923M063268P30726m551576n394691
42602B036356n87765L343537J375041k861186k947293R22771L330514K419976
42594G031951J820839L661231M655469J364339l871598n405655j691982K452874
42586A0017468J611250l682423p521744n609072j79669L101412K055331k83874
$$ y = [425488, -3369499, -4169428, -3152685, -3748627, -6135235, -7615220, -7501044, -7824059, -9194290, -9554092, -7797569, -5644396, -5042628, -6321749, -9489745, -14245933, -17719748, -15810397, -8959404, -3463536, -4112275, -7949480, -8639387, -5038192, -1476157, -566204, -60854, 2754619, 7219168, 10964682, 12619660, 11715379, 8350398, 4199862, 1807048, 1788301, 2654651, 4020706, 7188629, 11251897, 11982623, 7431047, 2036356, 1448591, 4792128, 6167169, 3305983, 358690, 1281461, 4611975, 7031951, 8852790, 12514021, 17169490, 18533829, 14662231, 9256576, 7564594, 10017468, 11628718, 7946295, 424551, -5184521, -5364190, -2262778, -207447, -491321]
42578d91321o20172O35917J386591J336398J430562J542184J054499O18806J009273
42569G902737J082443o59683k972721k921712j05200K462878K100660o86645l300619
42560B902138l379261j61661M539488O760108L913725j849610n752674n863853
42552A108400m221241k654994o73040J740677K641536J292332k8915L12929L33017
42543a49299k078819m726203l698472N20514L148820J602780j148633q44040K643421
42534d729931N660573N284478J929593k043615m800905n666120m354757r93880
42526i714564K917180M969698M365686L021870K798555K670086P29036j868734
42518I888813k009166L16245J491217k35300k201518j978550j122620j720384
$$ y = [-491321, -1111493, -475576, 911015, 2247413, 3677975, 5220159, 6274658, 6893464, 7902737, 8985180, 8325497, 5352776, 2431064, 2325864, 4788742, 6889402, 6202757, 2902138, -477123, -638784, 3900704, 10660812, 14574537, 12724927, 6972253, 1108400, -3112841, -5767835, -6440875, -4700198, -2058662, -766330, -795245, -482316, -149299, -2228118, -6954321, -10652793, -10132279, -6983459, -5380679, -6529312, -7373352, -4729931, 930642, 6215120, 8144713, 6101098, 1300193, -4365927, -8720684, -9714564, -6797384, -1827686, 2538000, 5559870, 8358425, 11028511, 11757547, 9888813, 7879647, 8195892, 9687109, 9451809, 7250291, 5271741, 4149121, 2428737]
42510B428737k342111q39303J344694J514170L99207L43447M61756j606050m096744
42501b392197k752991J743603L607385O46923k331405j361863O72986j58820j532131
42492c858510J072946N717818N833191L67329l868340j650994L539875M662770
42484A1816085J88674n200722p150229n602672k895110q62460k25856o74905p77617
42475a1384812P16014K896696L421616J754478K4443k08486j03594q95615j089462
42466d868722J138003M163941M799071L202371K206041J907170n54342m801369
42458G192164n817627j534011K694941J406314k730246l156394N47581K797224
42450A399946J133337r05479m89535N83013J88011p54716j161431j825873k571450
$$ y = [2428737, 86626, -752677, 592017, 2106187, 2505394, 2848841, 3310597, 1704547, -2392197, -5145188, -3401585, 205800, 852723, -1478682, -2840545, -2167559, -2326379, -3858510, -2785564, 2932254, 8765445, 9132774, 5264434, 3613440, 7153315, 11816085, 12004759, 6804037, -346192, -5948864, -8843974, -9706434, -9932290, -10607195, -11384812, -10668798, -7772102, -4350486, -2596008, -2571565, -2780051, -2883645, -3779260, -4868722, -3730719, 433222, 5232293, 8434664, 10640705, 12547875, 11993533, 7192164, 1374537, -159474, 2535467, 3941781, 1211535, -1944859, -1397278, 1399946, 2533283, 1627804, 1138269, 1721282, 1909293, 1154577, -6854, -1832727, -4404177]
42441d404177j333770J767175L319845J913371N90109J349575J394724j614922
42433B981930m558339l547378l28977R40187N84362J602020L063004J480089k128011
42424H8887k913359k52931J030738j185803k875310r68963J464216O90662j398867
42415f320730q24329J659696J907796r49669l379025k611111L53649K946560L647620
42406c569543K253049k99752k021450j392237R08304K857377L475671L214252
42398E425671K378065P04450j428413k685332k055086J71074K632115L599753
42390H742297J979479j469504m259079m441192k567264p59261l20734r70490j734249
42381e799997j650837l08416J288616J248924n72727j553888L18994L089227L258205
$$ y = [-4404177, -5737947, -3970772, -650927, 1262444, 1852553, 3202128, 4596852, 2981930, -1576409, -5123787, -5452764, -4512577, -3928215, -2326195, 736809, 2216898, 88887, -2824472, -3077403, -2046665, -3232468, -6107778, -7076741, -5612525, -4921863, -6320730, -7145059, -5485363, -3577567, -4527236, -7906261, -10517372, -10163723, -7217163, -3569543, -1316494, -1616246, -3637696, -5029933, -4121629, -1264252, 2211419, 5425671, 7803736, 8508186, 7079773, 4394441, 2339355, 2510429, 5142544, 8742297, 10721776, 9252272, 4993193, 552001, -2015263, -2774524, -3095258, -4065748, -5799997, -7450834, -7759250, -6470634, -5221710, -5794437, -7348325, -7029331, -3940104, -681899]
42372f81899R29139m63905L83299Q38155r57572k906738k610584j397011j754070
42363h621186k749537j513439J712833L662094L119694K383082K869392K603054
42355C465987j40014l311696l650807j156900J415632K500165K643441J978504
42347C744312m37394m089667o045723m026369O31761M332474M914699L002375
42339B026468L45694j781160k654318k093689j012189q94901j846261k046038
42331i956394l90030J104202m18724l901471m465204K62017O027819O790540K552510
42322b394735q58105J49573K573974J980759j028520k329738n65444J399809J169823
42313I7396K9095L84288J936111K154707j1852k510985k847947j486279j225525
$$ y = [-681899, 247240, -216665, 166634, 1004789, 47217, -2859521, -5470105, -6867116, -8621186, -11370723, -12884162, -11171329, -7509235, -4389541, -2006459, 862933, 3465987, 3325973, 14277, -3636530, -4793430, -3377798, -877633, 1765808, 3744312, 3306918, -782749, -6828472, -10854841, -10223080, -5890606, -975907, 2026468, 2372162, 591002, -2063316, -4157005, -5169194, -6064095, -7910356, -9956394, -10346424, -9242222, -9660946, -13562417, -18027621, -17765604, -11737785, -4947245, -2394735, -3252840, -3103267, -529293, 1451466, 422946, -1906792, -2472236, -1072427, 97396, 126491, 510779, 2446890, 4601597, 4589745, 2078760, -769187, -2255466, -3480991]
42304c480991l020633m153771k087464J264814J847323m32341j371358J055844
42296a0378577L637374L232923J466872J053292P89728j460291l326876q93816
42288e879371M007792N226237J295706k521483k434844r77255j393748k252895
42280d929861j130558M32941j84902j819343j789301q70698j656961l324286k416370
42271a7689339J482589M721423M588170K287798M14048k0642N91552J591001K314926
42262B81526K437105K239826J831498P93521m76378m28187J145373J877834J51202
42253I853320j968397j702414N0263M20699o18836q82521o28539k272171n214642
42244b963238n293910p34525M872297P103775N344599J650570k010344l946989
$$ y = [-3480991, -6501624, -10655395, -12742859, -11478045, -9630722, -10063063, -11434421, -10378577, -6741203, -3508280, -2041408, -988116, -198388, -1658679, -4985555, -5879371, -1871579, 3354658, 4650364, 2128881, -305963, -1283218, -2676966, -4929861, -6060419, -5627478, -5812380, -7631723, -9421024, -10291722, -11948683, -15272969, -17689339, -16206750, -11485327, -6897157, -4609359, -4195311, -4215953, -3624401, -2033400, 281526, 2718631, 4958457, 6789955, 7583476, 7107098, 6678911, 7824284, 9702118, 9853320, 7884923, 6182509, 6232772, 6653471, 6034635, 5152114, 4523575, 2251404, -2963238, -8257148, -8991673, -4119376, 2984399, 8328998, 9979568, 7969224, 4022235]
42236D022235l195284j496246j974625m147287l484339J727938O459753N292074
42228C204219J9987l208594k587951j883047l459836m706860k503063K235060
42220a2890085O144793P186017N322192J439455k634136m350012k572906Q43242
42212a511440K807335K147653K49203j098231j460191j275439o00384Q55306K656031
42203B769843L456687K349045K0993j870670k213650r86774J082329K591427J809073
42194I008303j619418n302681n862349k536124J942628M282588L428337M88922
42186C830206k501031l414300j451344J474942K430766J297761R02329K266636
42178D835965K390629r81258m854617m715432j214880J058275R73293K188529
$$ y = [4022235, 826951, -669295, -2643920, -6791207, -10275546, -8547608, -2087855, 3204219, 3224206, 15612, -2572339, -4455386, -7915222, -12622082, -15125145, -12890085, -6745292, 440725, 5762917, 7202372, 4568236, 218224, -2354682, -1511440, 1295895, 3443548, 3692751, 2594520, 1134329, -141110, -741494, 113812, 2769843, 6226530, 8575575, 8596568, 6725898, 4512248, 3525474, 4607803, 7199230, 9008303, 7388885, 2086204, -3776145, -6312269, -4369641, -87053, 3341284, 3830206, 1329175, -2085125, -3536469, -2061527, 369239, 1667000, 2569329, 4835965, 7226594, 6245336, 1390719, -3324713, -4539593, -3481318, -2508025, -319496]
42170c19496O006523P859679M159311j105042j356791K788329M002890j274868
42162B0760535p815953r025608n278091j523571L75795K322216M284564L155133
42154G255020j602066n442241m373703k66959K144980J450611j12819q53791q75417
42145b676385j8509K039226L667390K390554j343361m113191l875773j998157
42137e928206l87585Q17085J723941J431501j40169j144491j83972J633691K303258
42128A25053J284669o59652k433480k554188k371L729389N248261L138866m73416
42119G403131l113750m421754m338664j831534K441436M945787L511096N23774
42111E119522q38970j098398j923006j738706J545512N158100M155845p96189
$$ y = [-319496, 5687027, 13546706, 17706017, 16600975, 15244184, 18032513, 22035403, 20760535, 12944582, 3918974, -1359117, -2882688, -2506893, -184677, 4099887, 7255020, 5652954, 210713, -4162990, -4429949, -2284969, -834358, -947177, -1800968, -2676385, -2694894, -655668, 3011722, 5402276, 4058915, -54276, -3930049, -5928206, -6315791, -5498706, -3774765, -2343264, -2483433, -3627924, -3811896, -2178205, 125053, 1409722, 750070, -1683410, -4237598, -4239969, -510580, 4737681, 7876547, 7403131, 4289381, -132373, -4471037, -6302571, -3861135, 1084652, 4595748, 5119522, 4280552, 3182154, 1259148, -479558, 1065954, 6224054, 10379899, 9583710]
42103I583710l522090r80854K890560L413283R92509j291557k202502j980904
42095F902155m06575K188641M086276M339278L677776J859496k754755q705008
42087A1187284j0099903l818171M388006N867359J71240m790671l839297n59710
42079a493863m04612k540493k425275M56028K264576J448456J024366L049665
42071A378848M633648K188949k588128m390866j457123K052985J604821k129851
42063A293283m718980l546136k31642J922417J368369r02555k951158l630390
42055a1396792k828492n28155L289908P143086P732690L219417l441423o802039
42047c611800n038086j533929K18216N17871R28178R33592k77825j075066L68070
$$ y = [9583710, 6061620, 5080766, 7971326, 11384609, 12377118, 11085561, 8883059, 6902155, 6495580, 8684221, 12770497, 17109775, 20787551, 22647047, 19892292, 11187284, 1087381, -2730790, 1657216, 7524575, 7695815, 2905144, -934153, -1493863, -1898475, -4438968, -6864243, -6408215, -4143639, -2695183, -1670817, 1378848, 6012496, 8201445, 5613317, 1222451, -234672, 1818313, 3423134, 1293283, -3425697, -6971833, -7203475, -5281058, -3912689, -4815244, -7766402, -11396792, -14225284, -14753439, -11463531, -4320445, 3412245, 6631662, 3190239, -3611800, -8649886, -10183815, -9965599, -9447728, -8519550, -7585958, -7863783, -8938849, -8570779]
42038h570779K617703K956017J654394R99816R50006o17180l535573m843258l174652
42029a1563506o23227N03441K34925l24212m35166N20434K447089L522558K196899
42020c520765J55681M40692K594214L018854O04474j651744j634461j006051j517998
42011b517104j966055j023716j07513r65030k746727l614351l127255j331671
42003a7399422J965478N174218N080685J416987j494564l85740K297064K426262
41995i19032L96843k98009J209541K673931K779925K101136Q24505j160019k467493
41986E141328j613139J85246L93179j042489j866848r96492O91517K460009M017126
41977G369437M257165K283921o74552k620378l395751l799097l294090j215181
$$ y = [-8570779, -5953076, -2997059, -1342665, -342849, 607157, -10023, -3545596, -8388854, -11563506, -12186733, -11683292, -11448367, -11772579, -12207745, -11687311, -9240222, -5717664, -3520765, -3365084, -2924392, -330178, 2688676, 3293150, 1641406, 6945, -999106, -2517104, -4483159, -5506875, -5614388, -6579418, -9326145, -12940496, -16067751, -17399422, -15433944, -10259726, -5179041, -3762054, -5256618, -5642358, -3345294, -919032, -522189, -820198, 389343, 3063274, 5843199, 7944335, 8768840, 7608821, 5141328, 3528189, 3713435, 4106614, 3064125, 1197277, 200785, 892302, 3352311, 7369437, 11626602, 13910523, 13235971, 10615593, 7219842, 3420745, 126655, -1088526]
41969a088526J021613J877714K504988M226706M692500Q09712n336509q116974
41961E91224n758011j660296J511090M080982N433600L435158p44232k506611
41953D382904n71903J138870N47579Q36108L616899M391674k74163n781934n693152
41944B592882j463845N08628p39759m38567K512459L121318j224708n986904o009818
41935g128314k372151M12231Q13518P56791J760056L391641M459529L890803J472927
41926G457031j104140j447082J96421P41824j158703k668272j129944J346387
41918B233522R44532j596905j739689J914998N312657M594529P24142l110377
41910I277409n613909o605298m939293n82717K979576K235341j088619j977343
$$ y = [-1088526, -66913, 1810801, 4315789, 8542495, 13234995, 14044707, 8708198, 591224, -5166787, -6827083, -5315993, -1235011, 4198589, 7633747, 6889515, 4382904, 3811001, 4949871, 5497450, 6333558, 9950457, 14342131, 14067968, 8286034, 2592882, 1129037, 1637665, 897906, 459339, 2971798, 6093116, 4868408, -1118496, -7128314, -9500465, -9088234, -8274716, -7517925, -5757869, -2366228, 2093301, 5984104, 7457031, 6352891, 4905809, 5102230, 5844054, 4685351, 2017079, 887135, 2233522, 3178054, 1581149, -158540, 1756458, 7069115, 11663644, 12387786, 9277409, 3663500, -2941798, -7881091, -8463808, -5484232, -3248891, -4337510, -6314853]
41902f314853O60067K667193J411056k40715R65916L038282J788961k441209m929319
41893c394621k919326J346020M026957L509566N53276k920221m398355k168922
41885f365626K530797N764317M431346n38030m794983m493969j44786L345348
41877b65586J551370m152985p700462n525727o06769K112440J868012J127284
41869a1592423Q24474J95770j11345J102867K315299J087017j129778n16741K559177
41860e265683L484339R24521q58123O37186J737523r32557m171080l121207Q39543
41851f725538K378096L69354j476114j190358n65883m80107Q39752L515065M201974
41842H66241J065306k337643j214611L739680O759784M321443l47895j550567
$$ y = [-6314853, -5654786, -2987593, -1576537, -1817252, -851336, 2186946, 3975907, 1534698, -3394621, -6313947, -4967927, -940970, 2568596, 3121872, 201651, -4196704, -6365626, -3834829, 1929488, 6360834, 5822804, 1027821, -3466148, -3610934, -265586, 1285784, -2867201, -10567663, -16093390, -16700159, -14587719, -12719707, -11592423, -10767949, -10572179, -10683524, -9580657, -7265358, -6178341, -7308119, -7824860, -5265683, -1781344, -856823, -1714946, -1077760, 659763, -272794, -4443874, -7565081, -6725538, -4347442, -3978088, -5454202, -6644560, -7210443, -7690550, -6850798, -3335733, 866241, 1931547, -406096, -1620707, 2118973, 8878757, 13200200, 12852305, 11301738]
41834A1301738J426484L675794J741763j695883k448890j532389l086205o706366
41826B676046p141315k542656K172232K583310P45353N83131J512829R64603j42093
41817A411440N61035J784817O58535j740555j998964k45562O95717R35394K701500
41808D763357M496243K288937k961337n248764k482476N19606J97696o48713P41141
41799A665690J396663j789994n347061m023832M91841J770675j555140l941326
41791a1332484j335834L365278M900946K374025o36867q87809J347426L282041
41783A076722K815796O33799q90992o41746K85506N87214K26077n51892j842173
41774A698311k824055j924113L86583J130111r31687k810463j629135O93475N74510
$$ y = [11301738, 12728222, 16404016, 18145779, 16449896, 14001006, 12468617, 9382412, 2676046, -4465269, -7007925, -4835693, -2252383, -1507030, -923899, 588930, 1553533, 1411440, 1972475, 3757292, 4415827, 2675272, 676308, 430746, 1126463, 2061857, 4763357, 9259600, 11548537, 8587200, 3338436, 855960, 1375566, 1573262, 924549, 1665690, 3062353, 1272359, -4074702, -8098534, -7606693, -5836018, -7391158, -11332484, -12668318, -9303040, -4402094, -2028069, -2664936, -3552745, -2205319, 1076722, 3892518, 4526317, 3635325, 2993579, 3279085, 3866299, 4092376, 3540484, 1698311, -1125744, -3049857, -2663274, -1533163, -2464850, -5275313, -6904448, -6210973, -5636463]
41765e636463j088307m28746K207436J805509l158341o937359m192671J956905
41757a5472037L933805J67779l101247q44106M067576N316593J636206k130202
41749f425633j627914K044170M380339K635137j867722n404159n043718j060511
41741a2370011L164098M400273L124434K647199M202147M809408J582809l586002
41733G974355o118179m506683j245656J397444L315531M118901K331265j524099
41725E742879l922348k485196Q58530K744443K607028K042983J605384P01588
41717I895291k78085k43329L69132k86411k809801n384852n663017l150530L50287
41708g201315K341755J872974K71646p13883r77372j162023n56843J780301M094098
$$ y = [-5636463, -6724770, -7153516, -4946080, -3140571, -6298912, -13236271, -17428942, -15472037, -11538232, -11370453, -14471700, -15315806, -11248230, -5931637, -4295431, -6425633, -8053547, -6009377, -1629038, 1006099, -861623, -6265782, -11309500, -12370011, -9205913, -4805640, -1681206, 965993, 5168140, 9977548, 11560357, 7974355, 1856176, -2650507, -3896163, -2498719, 816812, 4935713, 7266978, 5742879, 1820531, -664665, 193865, 2938308, 5545336, 7588319, 9193703, 9895291, 9617206, 9373877, 9743009, 9456598, 6646797, 1261945, -4401072, -7551602, -7201315, -4859560, -2986586, -2714940, -3428823, -4406195, -5568218, -6125061, -4344760, -250662]
41699b50662L322756P0370j363776M97739J504398j722940o109786o665191l899898
41690a4616990k078492j920167k80886L414513N665039M636950K929416L023414
41682G72797L551072K009327j424764m477252n263378l181297P46923L736145
41674c530427L489390J127769k16575J27520j5412j380420j993783j128015r53438
41665d473391k522360l418828j672106R04852J837814J838984K696763L601441
41657a206831K747434Q73195k6279k29880j323162k669513k155726k1535J215176
41648b797121O33616j68762j50349J8335K43942J546163L374857L122121p5184
41639E747618l147076k658792P89599L624427L793648K180525P6635k282045m087888
$$ y = [-250662, 3072094, 3142464, 1778688, 2276427, 3780825, 2057885, -4051901, -10717092, -14616990, -16695482, -18615649, -18896535, -15482022, -9816983, -5180033, -2250617, 772797, 4323869, 6333196, 4908432, 431180, -4832198, -8013495, -7266572, -3530427, -41037, 1086732, 870157, 997677, 982265, -398155, -2391938, -3519953, -4473391, -6995751, -10414579, -12086685, -11181833, -9344019, -7505035, -4808272, -1206831, 1540603, 2413798, 2387519, 2157639, 834477, -1835036, -3990762, -4012297, -2797121, -2163505, -2332267, -2482616, -2464281, -2220339, -674176, 2700681, 5822802, 5747618, 2600542, -58250, 731349, 4355776, 8149424, 10329949, 10406584, 8124539, 4036651]
41630D036651l279833M81105L496257J612493l725342o116636k507721K054556
41622c948470J145425l635535m659100O14491N797652M773126M0446j784241N41282
41613a114924K565367J643505j39809n96680p03664j921762l305355l070740j258838
41604g902900O30248J577768J611183J167046N92167n036m68443q1259J713120
41595a166106L408341J898279l221467p169146m833612K085819O055308K806638
41587a35946l327639m990364o78940M360938N214655K662448P96859J084288Q39330
41578E825629k188767n701567n467652j455421J598294O95771j274106j34168
41570h101987L262486M572518K366593o36668k161061k545174k213875n37865
$$ y = [4036651, 756818, 1237923, 4734180, 6346673, 2621331, -3495305, -6003026, -3948470, -2803045, -6438580, -11097680, -10483189, -4685537, 87589, 128035, -1656206, -1114924, 1450443, 3093948, 2954139, 2357459, 1653795, -267967, -3573322, -6644062, -7902900, -7272652, -5694884, -4083701, -2916655, -2324488, -2329524, -2797967, -2879226, -1166106, 2242235, 4140514, 919047, -6250099, -11083711, -8997892, -2942584, -135946, -3463585, -8453949, -9132889, -4771951, 442704, 3105152, 3902011, 4986299, 5825629, 3636862, -2064705, -7532357, -8987778, -7389484, -6693713, -7967819, -8101987, -4839501, -266983, 2099610, 1462942, -698119, -3243293, -5457168, -5995033]
41562e995033J912850K933909J605284o04560k206632k813865j744619J441344
41554e471322M458707L750556l63941l217167j963143R06634J893847J080426
41546A074597K07857o64489j777744j583028Q50818L229743K710071k53666l012637
41537G81522l998207k838546O05808M834647O496047M298145J111761l86243j585735
41528I319199m328632o333259m536049p84772O26175l93498n05080P17118N66841
41519e651957r74831o63814K094711L746232K232666j99638j143875j041045p95794
41510b397345j26629N03307j29595j138345k85480J734057J948501P33079J813996
41501B655546N283634O042451J656264l424028m600548l190894k250315j244419
$$ y = [-5995033, -4082183, -1148274, 457010, -147550, -2354182, -5168047, -6912666, -5471322, -1012615, 2737941, 2374000, -843167, -2806310, -1899676, -5829, 1074597, 1282454, 617965, -1159779, -2742807, -1891989, 1337754, 4047825, 3794159, 781522, -3216685, -6055231, -5449423, -614776, 5881271, 10179416, 11291177, 10904934, 9319199, 4990567, -1342692, -5878741, -6663513, -6037338, -6430836, -6935916, -6218798, -5651957, -6626788, -7290602, -5195891, -1449659, 783007, 583369, -560506, -1601551, -2397345, -2523974, -2020667, -2150262, -3288607, -3574087, -1840030, 108471, 841550, 2655546, 7939180, 13981631, 15637895, 12213867, 7613319, 4422425, 2172110, 927691]
41493I27691P89820J313086j385830l700931j886379J557569K157881R41825J493358
41484B208090K388277k13031m097103l004587K892990O180930L228176j063923
41476H519819j909801j418598l071165m960796l286959J066196M038300M207994
41468C184990L224416K134149Q20237k4484M03821Q56228p15121l794724n371602
41459G17910l722615o72019M70594j438262m248315n067330l625292k199479j950257
41450b1735065j051363K076380N423898N875718L892725K583200K674145J934772
41442A674410k73603j529115l41801J535332J885766M62453k027957m522064m753244
41433g889823j204155L464610M672155K313869N68947M50610j809241o618787
$$ y = [927691, 1717511, 3030597, 1644767, -2056164, -3942543, -2384974, -227093, 714732, 2208090, 4596367, 4383336, 286233, -2718354, 174636, 6355566, 9583742, 8519819, 6610018, 5191420, 2120255, -2840541, -6127500, -5061304, -1023004, 3184990, 6409406, 8543555, 9363792, 9339308, 9743129, 10599357, 9884236, 6089512, 717910, -3004705, -3676724, -3206130, -4644392, -8892707, -13960037, -17585329, -19784808, -21735065, -22786428, -20710048, -15286150, -9410432, -5517707, -2934507, -260362, 1674410, 1400807, -128308, -470109, 1065223, 2950989, 3413442, 1385485, -3136579, -7889823, -9093978, -5629368, -957213, 1356656, 1925603, 2376213, 566972, -6051815]
41425f051815p566357p54867P579547Q753892L297163j342261j976742j688904
41417B49656k143213j149717J664155L136092K060228J231002K277557K967201
41409A0292961J571949r7558k04829l0189j287132l010279l329693k268825r50803
41400F85602K26970J176160J471646J223407J100021Q71703k77619j587255j132798
41391C757837R26380J863149Q4534k823447m588039m621001l186151o48100J522301
41382g712537J520289J04448K22244K615069M550950M324161L929541N112403
41374A4666568N667724K651554k706047o304717o180421l730086j081107L93764
41366C377232n2128j787508k550500q98235J689919K705279J690892m8716j576531
$$ y = [-6051815, -13618172, -14373039, -6793492, 1960400, 5257563, 3915302, 1938560, 249656, -1893557, -3043274, -1379119, 1756973, 3817201, 5048203, 7325760, 10292961, 11864910, 11767352, 11562523, 11532334, 10245202, 7234923, 3905230, 1636405, 685602, 912572, 2088732, 3560378, 4783785, 5883806, 6755509, 6477890, 4890635, 3757837, 4684217, 6547366, 6631900, 3808453, -779586, -5400587, -8586738, -9234838, -7712537, -6192248, -6087800, -5865556, -3250487, 1300463, 5624624, 9554165, 14666568, 20334292, 22985846, 20279799, 13975082, 7794661, 4064575, 2983468, 3377232, 3325104, 1537596, -1012904, -1911139, -221220, 2484059, 4174951, 4126235, 2549704]
41357B549704k461450k122919r60886q23775k269504k739340J00213M413775O336063
41348B021881N122914L215214J815767k50554l154047m824712m042893k183552
41340b279982p80424M56744J957846K559677J115870j282445k235977q06281J588833
41331B93861K827987K037425N3326j564601j816035p93500M71026L48560k295556
41322d37507o101693p116691k970264K976059M569383O94899l024739j888559
41314a3299112J955749L793365L175810K714839K706244J525142k18446n87041
41306A766550m26309j952814l946654l302570j046293j295481l759256l240325
41298a7203152J661959N234359L091735j199769j927995N02219J703906O78882
$$ y = [2549704, 88254, -2034665, -2995551, -3819326, -6088830, -8828170, -8727957, -4314182, 2021881, 7144795, 10360009, 12175776, 11925222, 8771175, 3946463, -96430, -2279982, -3060406, -2603662, -645816, 1913861, 3029731, 1747286, -488691, -1294972, 293861, 3121848, 5159273, 5212599, 3647998, 1831963, 1038463, 1509489, 1858049, -437507, -6539200, -13655891, -16626155, -13650096, -9080713, -8385814, -11410553, -13299112, -11343363, -7549998, -4374188, -1659349, 1046895, 2572037, 2353591, 1766550, 1340241, -612573, -4559227, -7861797, -8908090, -10203571, -13962827, -17203152, -15541193, -10306834, -7215099, -8414868, -10342863, -9840644, -8136738, -7457856]
41290g457856J86001J375217K429850J978895N57516r54627j968147j957177j367856
41281g178184j425966j588057M00377L905741M201546o90020n195461l136469
41273a0706493K844025M710133Q82615j856810R12955M973734M561753N66253
41265F888165k228542k518340k690686l483868k712002O35741M070429M408165
41257B369062J520400j522276j626723J337526M630335N407672K946883j570895
41249A3491984o001377p515022m186497J853213M853274J797856l173629l930752
41241b810950n56469J724472Q71686L649P20986L98548j776436j844781K114497
41232a154798N170767K517973k508265l140605O13357K697866P47483j336788
$$ y = [-7457856, -7271855, -5896638, -3466788, -1487893, -930377, -1885004, -3853151, -5810328, -7178184, -8604150, -10192207, -9791830, -5886089, -1684543, -2374563, -7570024, -10706493, -7862468, -3152335, -2269720, -4126530, -3213575, 1760159, 6321912, 6888165, 4659623, 2141283, -549403, -4033271, -6745273, -6109532, -2039103, 2369062, 3889462, 2367186, 740463, 2077989, 6708324, 12115996, 15062879, 13491984, 7490607, -24415, -4210912, -2357699, 2495575, 4293431, 1119802, -2810950, -3367419, -1642947, -771261, -767612, -46626, 351922, -1424514, -3269295, -1154798, 4015969, 6533942, 4025677, 885072, 1498429, 4196295, 4943778, 3606990]
41224C606990q38524p1899j044813j667760j18704J259185k12004k922045l560615
41215e570189k018680m54588O37693K012287K688747J032136j706335k417356
41207e796285q24375J49649o22812l95344K846476O368512N868193J288377l147947
41198E734444m292284l128149k219822k209128k010509j245052r06305j665359
41190a1942164k566652j963296M37636K862427L160442J312840j94741R13327
41182g980181L848427N491501M073912J087826r65823j594871j952768k287531
41174b79508j494218O72135K465021K010583m85012l017604l747823k288277L17258
41165e847445K323283K464163J044189l11324l51684N19679Q49726k38915k167433
$$ y = [3606990, 2768466, 2696567, 1651754, -16006, -134710, 1124475, 912471, -2009574, -5570189, -7588869, -8043457, -7405764, -5393477, -2704730, -1672594, -3378929, -5796285, -6620660, -6471011, -7093823, -7489167, -4642691, 1725821, 7594014, 8882391, 5734444, 1442160, -1685989, -3905811, -6114939, -8125448, -9370500, -10276805, -11942164, -14508816, -16472112, -16034476, -13172049, -10011607, -8698767, -8893508, -7980181, -4131754, 1359747, 5433659, 6521485, 5555662, 3960791, 2008023, -279508, -1773726, -1101591, 1363430, 3374013, 2889001, -128603, -3876426, -6164703, -5847445, -3524162, -1059999, -15810, -327134, -678818, -159139, 690587, 451672, -1715761]
41156a715761l372011k627584k56339K028159K865579K575427K162673J549804
41148C209947N015j992287k956107k566464j874909j036096J032481L899479M897400
41139B618459K792766J16281k91990O90136L79800j254539j976377j147955j34786
41130A791795N40627J254365R64586j488424l803033k179743K285079L689453
41122C054705k26047m147386k849752J151269J909172r50320k636961r76628J475137
41113d196811K571321K694465J539881j966497n407627l905651K162432N529076
41105i79411J865336l143727j710299M240923N664673k16703o017357n121783
41097e418348l53139J782683Q24360J269998M189236N409606K146146k923376
$$ y = [-1715761, -5087772, -7715356, -7971695, -5943536, -3077957, -502530, 1660143, 3209947, 3214962, 1222675, -1733432, -4299896, -6174805, -7210901, -6178420, -2278941, 2618459, 5411225, 5527506, 5235516, 5925652, 6305452, 5050913, 3074536, 1926581, 1791795, 2332422, 3586787, 4551373, 3062949, -740084, -2919827, -634748, 3054705, 2828658, -1318728, -4168480, -3017211, -1108039, -2058359, -4695320, -5671948, -4196811, -1625490, 1068975, 2608856, 642359, -4765268, -8670919, -6508487, -979411, 885925, -2257802, -3968101, 272822, 5937495, 5720792, -296565, -5418348, -5771487, -3988804, -3164444, -1894446, 2294790, 7704396, 9850542, 6927166]
41089F927166n499109m494080j509332J983054M848241N371355K613218j622912
41081H617601l907015k520547J032516L650206L245651K87270k575702k918811
41073D911169j107341K68436p0547n58794J70597N61373j274321l543890k548934
41064c192252J633045M515953L187261L4645j129969k66719k13300k167454m383883
41055a982673m697534k622395N79216K759047K600250J404359J885898M163345
41047D089513M876994K012623j597795k253013q61384q78328k226832j723465
41039A438313Q41994J952278N07837j11156J946346L444987J463167j531664j735956
41030H216146n6362J01684j237977j464027n66826o83884j343989k44191J360976
$$ y = [6927166, 1428057, -3066023, -4575355, -2592301, 2255940, 7627295, 10240513, 8617601, 4710586, 2190039, 3222555, 6872761, 10118412, 10405682, 7829980, 4911169, 3803828, 4072264, 4001717, 3442923, 3613520, 4174893, 2900572, -643318, -3192252, -1559207, 2956746, 6144007, 6178652, 5048683, 4781964, 4568664, 2401210, -1982673, -6680207, -9302602, -8723386, -5964339, -3364089, -1959730, -73832, 4089513, 8966507, 10979130, 9381335, 7128322, 6266938, 5388610, 3161778, 1438313, 2280307, 4232585, 4740422, 4629266, 6575612, 10020599, 11483766, 9952102, 8216146, 8159784, 8261468, 7023491, 5559464, 4992638, 4308754, 2964765, 2720574, 4081550]
41021D081550m32631m783583n250447Q93827P347596O882045J202348k151975
41013G788730n94488J213901m65607l120929k493048J129262L586112K164664
41005I208597j686060m318006l463230j55486K494484K611478J270686L92702
40997F355165K3006p77983j422964o83617M20665k25865j561037N4183M574557
40988F756110O540161K510137l107114l763794O6137K468282J587491J546540
40980A4603950M179487N073684R86640l794277l259348J282654L245168L41814
40972B2659772l210048l956694l462980l894783l883248j530787J611911K703145
40964G036288J791167R40433O12791j35586p97982O3691J591787J018020k062914
$$ y = [4081550, 3648919, -1134664, -6385111, -5491284, 1856312, 8738357, 9940705, 7788730, 7194242, 8408143, 7942536, 4821607, 2328559, 3457821, 7043933, 9208597, 7522537, 3204531, -258699, -414185, 2080299, 4691777, 5962463, 6355165, 6378171, 5600188, 4177224, 3493607, 3914272, 3688407, 2127370, 2181553, 6756110, 13296271, 15806408, 12699294, 8935500, 9001637, 11469919, 13057410, 14603950, 18783437, 23857121, 24843761, 21049484, 17790136, 19072790, 22317958, 22659772, 19449724, 15493030, 12030050, 8135267, 4252019, 2721232, 4333143, 7036288, 8827455, 9767888, 10380679, 10245093, 9447111, 9510802, 11102589, 12120609, 10057695]
40955A0057695m485860l767002j288045L50090J143496K592125M131339L528440
40947A2262278P55555j230751n03350J160733J114577l05450r12901p20795k045564
40938I574332n124180o311456k518536M093335Q133526P164863L775129J599007
40930B0386020J510177K284419K802921K246091j52964l678648n506409l464214
40922A6427393R99055M225750M382691K572513M55734j210549j741764m82005
40914B5628818J763825L027991K605053J641894R16760M8694m47409J096454M201247
40905D0483327N265632K279214j606627k093305M70263K667793L773287N578418
40897E6818002P299844N988821K764102L094207Q421516J2506122R924310M177163
$$ y = [10057695, 5571835, 1804833, 516788, 866878, 2010374, 4602499, 8733838, 12262278, 13017833, 11787082, 11283732, 12444465, 13559042, 13253592, 12340691, 11619896, 9574332, 4450152, -1861304, -4379840, -286505, 7847021, 15011884, 18787013, 20386020, 21896197, 24180616, 26983537, 29229628, 29076664, 25398016, 19891607, 16427393, 17426448, 21652198, 26034889, 28607402, 29063136, 27852587, 26110823, 25628818, 27392643, 30420634, 33025687, 34667581, 35584341, 35633035, 35185626, 36282080, 40483327, 45748959, 48028173, 46421546, 44328241, 44798504, 47466297, 51239584, 56818002, 64117846, 70106667, 72870769, 75964976, 84386492, 96892614, 106816924, 110994087]
40889A10994087K651044O508002J0820216J2676295J3382839J3557392J2100118
40882A82689993J0426568J1957424J6085736J7947347J5892058J3831490J3863414
40875B82694030J2303427O740597J586172J446518L469257K424094j26732J121712
40867C11659075N183200N763607K067506O84680M997304R934638J0443556Q928384
40859C59661950R883131J2034307J1005674O622743K499771J54977k077259n369183
40851C94416111r351430j3873326j8528295k1239550k0462529j8139455j7474912
40844B75346614j8379454j8123014j5986609j4007998j3141922j1939544r677932
40837A74090141p993389q297472r558350r663674p733950m709834k752333l805989
$$ y = [110994087, 113645131, 120153133, 130973349, 143649644, 157032483, 170589875, 182689993, 193116561, 205073985, 221159721, 239107068, 254999126, 268830616, 282694030, 294997457, 301738054, 303324226, 304770744, 308240001, 310664095, 310537363, 311659075, 316842275, 322605882, 324673388, 325358068, 330355372, 340290010, 350733566, 359661950, 369545081, 381579388, 392585062, 399207805, 401707576, 401862553, 399785294, 394416111, 385064681, 371191355, 352663060, 331423510, 310960981, 292821526, 275346614, 256967160, 238844146, 222857537, 208849539, 195707617, 183768073, 174090141, 166096752, 157799280, 148240930, 138577256, 130843306, 126133472, 123381139, 119575150]
40829A19575150p304428r765485q421039m713653k222597j909233k012993j949806
40821H1275916k850708m135770l382049p25647K18478k233806m661147l372818
40813F0132449M1239J086687j182760l237327k206838O65058K090651O25142k057655
40804E5956646l112441j622253K46884j27815k200178k890595j202051J10089
40796D5158286j096280k585946q97809L149706N176934L194499j2835r49152N86512
40787E1723915K570524L766030M035015K988167L92390k279155k499069L95815
40779F1093632L896723M797532K557033n20099k036111j460027L44607K083087
40771G0756377K322508M99597j653134j457453P99830J341421j800769n041252
$$ y = [119575150, 112270722, 102505237, 94084198, 89370545, 87147948, 85238715, 83225722, 81275916, 78425208, 74289438, 70907389, 70181742, 70400220, 68166414, 63505267, 60132449, 60173688, 61260375, 60077615, 56840288, 54633450, 55298508, 57389159, 58014301, 55956646, 52844205, 51221952, 51468836, 51341021, 49140843, 46250248, 45048197, 45158286, 44062006, 41476060, 40578251, 43727957, 48904891, 52099390, 52086555, 51137403, 51723915, 54294439, 58060469, 62095484, 65083651, 65476041, 63196886, 60697817, 61093632, 64990355, 69787887, 72344920, 71824821, 69788710, 68328683, 68673290, 70756377, 73078885, 73578482, 71925348, 70467895, 71267725, 72609146, 70808377, 65767125]
40763F5767125l802554O55474K774443N53557k241907k142116j39930J422121
40755F2846213K233119K402141J019037j336365j846638J70634J162035j424904
40747F5225272m682912m538007j992130j000003j964689j825107K87102J887471
40739E1396997J565362O64769J90248n48852j684978k202677k116907k493168
40731D4770794k907799j667797R10887K119145M44411k735215n392899o393875
40723B9147652m706551j25546M465002M593107m86210o115278p253324l642285
40715A5876567P71032J966820r65855n000750n418886q55333M165111M249502
40707A4788208K30912k112491k27605K546596L037434K146693J032980j641511
$$ y = [65767125, 61964571, 62620045, 65394488, 65948045, 63706138, 61564022, 61424092, 62846213, 65079332, 67481473, 68500510, 67164145, 65317507, 65488141, 66650176, 65225272, 60542360, 56004353, 54012223, 53012220, 51047531, 49222424, 49509526, 51396997, 52962359, 53627128, 53817376, 53268524, 51583546, 49380869, 47263962, 44770794, 41862995, 40195198, 41106085, 43225230, 43669641, 40934426, 35541527, 29147652, 24441101, 24315555, 28780557, 33373664, 32887454, 26772176, 19518852, 15876567, 16647599, 18614419, 17648564, 12647814, 7228928, 6373595, 10538706, 14788208, 15019120, 12906629, 12679024, 15225620, 18263054, 20409747, 21442727, 19801216]
40699A9801216n664981o905404k937547K393967M142050K976931K357243J881989
40691A8045464j053291m677793l996393J327798N507365M227601m17010l890839
40683A5072902m577668l662457k562714k060553j959632p70000K253288M633117
40675F366283L112836r85580k334028J149749N065791M640516R40989j782079
40667A6174477k292051k436406k854468k533908j936858k716460m079869l004517
40659e680060Q43423L518281J939179j763272l277764j757139J38879P91721J267357
40650c979395K389183K948927J870933J33806p91786q97888o68830L97944K511749
40641C914643L908749K620588m78540k435740j949289l80108J001103K545025
$$ y = [19801216, 14136235, 7230831, 4293284, 6687251, 10829301, 13806232, 16163475, 18045464, 16992173, 12314380, 8317987, 9645785, 15153150, 19380751, 18963741, 15072902, 10495234, 6832777, 4270063, 2209510, 249878, -520122, 1733166, 6366283, 9479119, 8493539, 6159511, 7309260, 12375051, 17015567, 17956556, 16174477, 13882426, 11446020, 8591552, 6057644, 4120786, 1404326, -2675543, -5680060, -4836637, -1318356, 620823, -1142449, -4420213, -6177352, -6038473, -5246752, -3979395, -1590212, 1358715, 3229648, 3363454, 2571668, 1673780, 1004950, 1402894, 3914643, 7823392, 10443980, 9965440, 7529700, 5580411, 5200303, 6201406, 8746431]
40633H746431M367351N076919L636134J063406r34110j944543k471445k658392
40625A4881751k440761k037715j355386J28681J933197K109145m85485m119280
40617H614147n652224l849204n19328J360653L56191k020368k598867k18319K159271
40608b368048Q13564l237823m744251j175512L672046M966061L165753K252571
40600C344361L507649M414012K985211O9206k577317l950058l508813j548961
40592B735290j8927q57573l207482m080170k085246J051557K858460K579325J173686
40583A48920J62021N41235J820478K291335J042199q92031k086773k230811j210709
40574d14136J354747M098402L804377j16636l329337k092150J034522J194138
$$ y = [8746431, 13113782, 18190701, 21826835, 22890241, 21956131, 20011588, 17540143, 14881751, 12440990, 10403275, 9047889, 9176570, 11109767, 13218912, 12733427, 8614147, 2961923, -887281, -1406609, -45956, 310235, -1710133, -4309000, -4527319, -2368048, -1554484, -4792307, -9536558, -10712070, -7040024, -2073963, 1091790, 3344361, 6852010, 11266022, 14251233, 14320439, 11743122, 7793064, 4284251, 2735290, 2716363, 1858790, -1348692, -5428862, -7514108, -6462551, -3604091, -1024766, 148920, 310941, 852176, 2672654, 4963989, 6006188, 5114157, 3027384, 796573, -414136, 940611, 5039013, 8843390, 8726754, 5397417, 3305267, 4339789, 5533927]
40566E533927q47888j61794L655041N325986K348953j260713j800409j121499
40558A1671604k042612l227002k373866p07361l06270j19269J341540K264822
40550F501586Q98851j8432K641453N757414L362500l741970p837757m913408P9502
40541B729739J032979j003573j047001J653356L259890J714853q76167k200779
40533E263297k392057j958604l48356J815737J838053j301126m332168l757441
40525e172665j075918l66170j397142K92149N589242Q894886N783357l22105l035683
40516I189951j760555j021559k769546m218651k952307J66233L382990N656426
40508E672982N758081L267208M33154l64890m82958k417123m340665k508420J317400
$$ y = [5533927, 4686039, 4524245, 8179286, 13505272, 15854225, 14593512, 12793103, 11671604, 9628992, 6401990, 4028124, 3320763, 3014493, 2895224, 4236764, 6501586, 7400437, 7382005, 10023458, 15780872, 19143372, 15401402, 7563645, 2650237, 2729739, 3762718, 2759145, 1712144, 3365500, 6625390, 8340243, 7464076, 5263297, 2871240, 912636, 564280, 2380017, 4218070, 2916944, -1415224, -5172665, -6248583, -6614753, -8011895, -7719746, -2130504, 6764382, 12547739, 12225634, 9189951, 7429396, 6407837, 3638291, -580360, -3532667, -3366434, 16556, 5672982, 11431063, 14698271, 15131425, 14766535, 14283577, 11866454, 7525789, 5017369, 6334769]
40499F334769J271187l001089n075277k112556P44907k91681j256520J563968
40491a822292L957830Q13165m538337n500114k700377j457660j808740N10667
40483a2545858M742885N328452J443098j559951j131102o20570j828067j500626
40475g671739K031095M801846L223898n70159k663240k700182k248700j282063
40467g079244N96886K093740K098817J529204J324621P99817l16795n22702J069766
40458A594110L073990L971077L844424K918153P72591j833293k874763k104092
40450I362197j794171l190451m568654m036610j993247K48439J980209K422541
40442a569747J059257o20234m33021Q66629L75238k012186l152010k004252j219972
$$ y = [6334769, 7605956, 4604867, -470410, -2582966, -1838059, -2129740, -3386260, -1822292, 2135538, 2948703, -1589634, -7089748, -9790125, -11247785, -13056525, -12545858, -7802973, -2474521, -1031423, -2591374, -3722476, -4343046, -6171113, -7671739, -5640644, -838798, 2385100, 1814941, -848299, -3548481, -5797181, -7079244, -6482358, -4388618, -2289801, -760597, 564024, 1363841, 1047046, 524344, 1594110, 4668100, 8639177, 12483601, 15401754, 16174345, 14341052, 11466289, 9362197, 7568026, 4377575, -191079, -4227689, -6220936, -5972497, -3992288, -1569747, -510490, -1130724, -1563745, -697116, -321878, -2334064, -5486074, -7490326, -8710298]
40433h710298j911830j307681K094581N223335M999519K419415n03295l771903
40425a468157o456047n200255L82584M862734L939366N78270m01367m1255j885599
40416e689726m183056k220017L226903O429847N184516K719822J284624k88936
40408F463977k203936k523902j371873j228264j991787o99794K634090M016538
40400C095049K034402L58228J324681J921025o11764l579127l322011j458611
40392b38128j993019m407425m458912j023527K293123K691425J617792J520976
40384c997695K047701J430875Q4528N24216L653548O728686O110703J602067l140759
40375A5043870m730314l406516j643855p70756m48749n67279j563672k840190
$$ y = [-8710298, -10622128, -11929809, -9835228, -4611893, 387626, 2807041, 2303746, -1468157, -7924204, -13124459, -12741875, -7879141, -3939775, -3361505, -3762872, -3804127, -5689726, -9872782, -12092799, -8865896, -2436049, 2748467, 5468289, 6752913, 6463977, 4260041, 1736139, 364266, -863998, -2855785, -3555579, -921489, 3095049, 5129451, 5487679, 6812360, 8733385, 8121621, 4542494, 1220483, -238128, -2231147, -6638572, -11097484, -12121011, -9827888, -7136463, -5518671, -3997695, -1949994, -519119, -434591, 89625, 3743173, 10471859, 16582562, 18184629, 15043870, 10313556, 6907040, 5263185, 4492429, 4043680, 3476401, 1912729, -927461]
40367i27461k704834n67926J864056K218947j15006l284457m475307k517636P57809
40358i751815K464798K075571J575776K005417K021017Q57395J56161J025921
40350B430241J763326Q36118l47123m17299j076289l578513m941997k314884J240812
40341f405608R70289j303932J96798M991753O324476K324747o96565J092097K671138
40332A0165193q60285n450071m488154N84080K907067P54825j174396P4951K196589
40323D709799K469090J377887N04722J14362l40945j390245l264417m936175m306241
40314e062163r42716K755332M791221N945111O902046N716314J232627l453622
40306A7884150m741099l719960l634270m082675k373533P45603J788172L66330
$$ y = [-927461, -3632295, -4200221, -2336165, -117218, -232224, -3516681, -7991988, -10509624, -9751815, -7287017, -5211446, -3635670, -1630253, 390764, 1248159, 1404320, 2430241, 4193567, 5029685, 4682562, 4265263, 3188974, -389539, -5331536, -7646420, -6405608, -5435319, -6739251, -6542453, -1550700, 4773776, 7098523, 6401958, 7494055, 10165193, 9304908, 3854837, -633317, -49237, 2857830, 3612655, 2438259, 2513210, 4709799, 7178889, 8556776, 9061498, 9175860, 8834915, 7444670, 4180253, -755922, -5062163, -6004879, -3249547, 1541674, 7486785, 14388831, 20105145, 21337772, 17884150, 13143051, 9423091, 5788821, 1706146, -667387, 78216, 1866388, 2232718]
40298B232718n88991j89416k37306n58703J019832L444157K611795j837343n055391
40289H41352m166547j976565j306672o45681J539367K884089J353330n74871r8751
40280b150949R45139k69332j957437p42826J975515K062227j83842l95765K455151
40271A737881M321508K750140N59984Q21990J905396L15916l787339o620541n404039
40262c399104j120719K947391M309667L074110J193574m9509j290122l204338
40254B460950m454139l305026p96346L7295j558839k807986j353154J479766K760350
40245g537129J879369P92492J104624K356915L001284K138699L69412o75276l0886
40236C399504J138335N65935k167500m663025m512525k273512n45185o04890j262440
$$ y = [2232718, 1643727, 1454311, 1217005, 658302, 1678134, 5122291, 7734086, 5896743, 841352, -3325195, -5301760, -6608432, -7254113, -5714746, -2830657, -1477327, -2052198, -2150949, -1205810, -1475142, -3432579, -4175405, -2199890, -137663, -321505, -717270, 1737881, 6059389, 8809529, 9369513, 10191503, 12096899, 12412815, 8625476, 2004935, -3399104, -4519823, -1572432, 2737235, 5811345, 7004919, 6955410, 5665288, 2460950, -1993189, -5298215, -6094561, -6057266, -7616105, -10424091, -11777245, -10297479, -7537129, -5657760, -4865268, -3760644, -1403729, 1597555, 3736254, 4105666, 3430390, 3399504, 4537839, 5103774, 2936274, -1726751, -6239276, -8512788, -9057973, -9662863, -10925303]
40227a0925303j039241k50696k72730j266137j428064J069807N438267Q183905
40219d90192O449757J351061k930792l525092j312852J235386L056312M183511
40211H017099L922143J548843j461269k098419N80909L883308M275765R16806
40203A9585185l984531p333089p232317m047313k11631J737263J512708Q06166
40195H32441N28637j99813j616512j790932O25347L473492L414770P18806r03606
40186E082630M27084K187952J268764j727805l740030l497193k569457k582875
40178e150930l013334k057486J006202M463169N152253J553009l785786o090732
40170g923635l589438K68294J279439O4928P66005M410112O666969L777228j638087
$$ y = [-10925303, -11964544, -12215240, -12487970, -13754107, -15182171, -14112364, -8674097, -490192, 5959565, 7310626, 4379834, 854742, -458110, 777276, 3833588, 8017099, 11939242, 13488085, 12026816, 9928397, 10509306, 14392614, 18668379, 19585185, 15600654, 8267565, 1035248, -3012065, -3223696, -1486433, 26275, 832441, 1361078, 1161265, -455247, -2246179, -1620832, 1852660, 5267430, 5986236, 5082630, 5509714, 7697666, 8966430, 7238625, 3498595, 1402, -2568055, -5150930, -8164264, -10221750, -9215548, -4752379, 399874, 1952883, -1832903, -7923635, -11513073, -11244779, -9965340, -9900412, -9134407, -4724295, 1942674, 5719902, 4081815]
40161D081815l563306n95040K265911P01395k923337l142853O87646L633997K510873
40152C657101K46998Q92360L239126K946430n00269l143220k851384k024984k636476
40143a74318k503888O92977M554374M727027J073164k375575k993579j879089
40135A121093p33842L69294J395183J222300n38084k285175k179512j85035K165871
40126C52093L104223J664393j318506l236864k234397K78269J319854N04767L01449
40117G35281J762976K610839Q56891j918909k774569j338687L31666P33185L5959
40108A034632r37578j273998j99558J809420K810439J710648J56124N60255K678926
40099H349310L748246J945550j659482m623600n359166l739934p06342K203797
$$ y = [4081815, 518509, -76531, 2189380, 2890775, -32562, -3175415, -2487769, 1146228, 3657101, 3904099, 4796459, 8035585, 10982015, 10481746, 7338526, 4487142, 2462158, -174318, -2678206, -1985229, 2569145, 7296172, 8369336, 5993761, 3000182, 1121093, 387251, 756545, 2151728, 3374028, 2835944, 550769, -1628743, -1813778, 352093, 3456316, 5120709, 3802203, 565339, -1669058, -1390789, -70935, 433832, 735281, 2498257, 5109096, 5965987, 4047078, 1272509, -66178, 265488, 998673, 1034632, 97054, -1176944, -1376502, 432918, 3243357, 4954005, 5110129, 5670384, 8349310, 12097556, 14043106, 12383624, 7760024, 2400858, -1339076, -2045418, 158379]
40091A58379L622391L212404J707839P1767j323588k803765m608170n778333m416935
40082a0158011j23304M190312M642196R00614l262865m422444k666952K65358
40074a0635096L455408N782884N024675Q33260l016158k577123Q77856K593029
40066B338735J058493m33233O51959K400877J771498j017695l260579l185088
40058C24967r92943K070398M091557L153755n85953m108194m404882j932603P2312
40049b311586k98090j403308m68316K519463M425784K871124m05781j560212R6683
40040C465761J020891j267201m059642l093841J200238M305032L882509J943775
40032G397522O04680n51749j752870j422331N04652Q26745k385780n870498n194082
$$ y = [158379, 3780770, 6993174, 8701013, 8772780, 7449192, 4645427, 37257, -5741076, -10158011, -10281315, -6091003, -1448807, -548193, -3811058, -8233502, -10900454, -10635096, -7179688, -1396804, 3627871, 4461131, 1444973, -1132150, -254294, 2338735, 3397228, 2963995, 3615954, 6016831, 7788329, 6770634, 3510055, 324967, -667976, 1402422, 5493979, 8647734, 8061781, 3953587, -451295, -2383898, -2311586, -2609676, -4012984, -4481300, -1961837, 2463947, 5335071, 4929290, 3369078, 3465761, 4486652, 3219451, -840191, -3934032, -2733794, 1571238, 5453747, 7397522, 8002202, 7450453, 5697583, 4275252, 4779904, 5606649, 3220869, -2649629, -7843711]
40023g843711j173440J289123J07202j773571j212020J294257L506883M497102
40015a308175M312068K529664r39086m398960n349672l050587O08228K951608
40007d644912K947011J693375P16742L13112l0820k18308K60803R12661O33921
39998B583585j68984L06518K215556L107847J428157r03765j388820p88292j526745
39989D865057l358327l554153j180643J478127K077321O92690j111480j864093
39981a955501p40273J679089L195760K284930L79070o558J101564J755281J700271
39972I393633K177541K263532o37210n607855p444547l307179K845316N032168
39964D715399K258781j642736l228339j969394R41549L714307M542439K930758
$$ y = [-7843711, -9017151, -7728028, -7620826, -9394397, -10606417, -9312160, -5805277, -1308175, 3003893, 5533557, 4594471, 195511, -5154161, -8204748, -7596520, -4644912, -1697901, -4526, 712216, 1025328, 994508, 776200, 1037003, 1949664, 2583585, 2414601, 2721119, 4936675, 8044522, 9472679, 8568914, 7180094, 6391802, 4865057, 1506730, -2047423, -3228066, -1749939, 327382, 1020072, -91408, -1955501, -2695774, -1016685, 2179075, 4464005, 4843075, 4836517, 5938081, 7693362, 9393633, 11571174, 13834706, 13197496, 7589641, 145094, -3162085, -316769, 4715399, 6974180, 5331444, 2103105, 133711, 1075260, 4789567, 9332006, 12262764]
39956A2262764J26014k455075m109066l952460j418563J655531K171387M7290
39948D327822j669914j958962l009096m606833k616690L538039P355629M352584
39940E712579l64350j64390K111595m05058n671696n408832O19720L927707J661734
39931B019009M11551K956459K738579l139821o435221j253569M466516J078312
39923B841815o489669o193679K084435P198255M415585M18418K68924O15070j557883
39914C601271l035719j082238J589695K329547K512404K645463O644n051505o712111
39905c196549k160589L027543K823863p40261k054743n81653M70363N92875J428804
39896c90347K357386J931239J599291L041750L898408J235488k665026l341766
$$ y = [12262764, 12388778, 9933703, 5824637, 1872177, 453614, 2109145, 4280532, 4327822, 2657908, 698946, -2310150, -6916983, -9533673, -5995634, 1359995, 5712579, 5348229, 5183839, 7295434, 6890376, 1218680, -4190152, -3570432, 357275, 2019009, 2430560, 5387019, 8125598, 4985777, -1449444, -2703013, 1763503, 2841815, -3647854, -9841533, -7757098, -558843, 3856742, 4275160, 4544084, 5159154, 3601271, 565552, -516686, 1073009, 3402556, 5914960, 8560423, 8567067, 3515562, -3196549, -5357138, -2329595, 494268, -245993, -2300736, -2882389, -2412026, -1819151, -390347, 1967039, 3898278, 5497569, 8539319, 12437727, 13673215, 11008189, 7666423]
39888G666423j395730j047433k552188k078687J039440K917761J679138j07592
39880F121132o52878j367894k577892j952292O93417J823211n2145j537809k69565
39871B27285P27786j485071l716690j073031M838093P375373L918447j165446
39863I646746l060425k126729j623773k631262l253373j702696J348810L391785
39855a0917K592231k83980k611339k724411j469268n83594l52797K31785J468431
39846c743859K159236J004947j624442l550104k767079J14795K107635J496781
39838d802090M01849J816129M681449M834441J328204j568089n06351J939830
39830H125372J504192q92479p20821K474966L558939q11141o858781q168250l510120
$$ y = [7666423, 6270693, 5223260, 2671072, 592385, 1631825, 4549586, 6228724, 6121132, 5468254, 4100360, 1522468, -429824, 263593, 2086804, 2034659, 496850, 227285, 955071, -530000, -4246690, -5319721, -481628, 6893745, 10812192, 9646746, 6586321, 4459592, 2835819, 204557, -3048816, -4751512, -3402702, -10917, 2581314, 2297334, -314005, -3038416, -4507684, -5091278, -5444075, -5212290, -3743859, -1584623, -579676, -2204118, -5754222, -8521301, -8406506, -6298871, -4802090, -4400241, -2584112, 2097337, 6931778, 8259982, 6691893, 6185542, 8125372, 9629564, 8737085, 8016264, 10491230, 14050169, 13239028, 6380247, -1788003, -5298123]
39821e298123K263061M288124K508679M42575P70721K787670L555636J111056
39813A2429399l303650o144805m960715r12651K375342K502065M17435j236635
39805A165785j178149j50775Q46726J517658J335567n43844l351590m226072j516013
39796f100707K321117L229535O25338k158840k451701j001190K33918P73956J175905
39787c352669J746800K628969L568382L032974l50730m691746n682040k002311
39779e102371K526110L959717K871373J690411J69138k972919n870080n317378
39771h045999k089923k48966r94800j297943M55936J486734o75889l737471l747543
39762a8895864p50074J551651R72682p92522j009502P52266K744762L545688L590193
$$ y = [-5298123, -3035062, 1253062, 3761741, 4204316, 4975037, 7762707, 11318343, 12429399, 9125749, 2980944, -1979771, -2892422, -517080, 1984985, 2402420, 1165785, -12364, -163139, 683587, 2201245, 3536812, 2992968, -358622, -4584694, -6100707, -3779590, -550055, 75283, -2083557, -4535258, -5536448, -5302530, -4528574, -3352669, -1605869, 1023100, 4591482, 7624456, 7273726, 2581980, -3100060, -5102371, -2576261, 1383456, 4254829, 5945240, 6114378, 3141459, -2728621, -8045999, -10135922, -10384888, -11379688, -12677631, -12221695, -10734961, -11410850, -15148321, -18895864, -19645938, -18094287, -17121605, -17914127, -18923629, -18171363, -15426601, -11880913, -8290720]
39753h290720M100218M900648M194300J117103k261643k820041j56472K773983
39745C557376L014008O04043j985796k551794j034558P06480R35501J10458K85018
39736C640736J995238L080967J854291r6963m12862N0265j261579l742304l887823
39727A219966q19899K020794J988161Q17994J158659K233960J511358j055843
39719I075150k942651k354807R5708K287227K149790n15906l063503k563291j6711
39710B151006N10510j843647k610115J377900O343379O299349J268175l436604
39702A0059953m799629m494202m228844l375251j795542q69102o10266O02674
39694i510209K348847J982302m27757r54701K124728M981183M131185K199598
$$ y = [-8290720, -4190502, 710146, 4904446, 6021549, 3759906, 939865, 783393, 3557376, 6571384, 7175427, 5189631, 2637837, 1603279, 2309759, 3245260, 3355718, 3640736, 5635974, 8716941, 10571232, 10474269, 10061407, 10111672, 8850093, 5107789, 1219966, 400067, 2420861, 4409022, 5227016, 6385675, 8619635, 10130993, 9075150, 6132499, 3777692, 3873400, 6160627, 8310417, 7794511, 4731008, 2167717, 2151006, 2661516, 817869, -1792246, -414346, 5929033, 12228382, 13496557, 10059953, 5260324, 766122, -3462722, -6837973, -8633515, -9502617, -10112883, -9510209, -7161362, -5179060, -5606817, -6561518, -4436790, 544393, 4675578, 6875176]
39686F875176L429018N897772L661638l762476r323858p363620o93649L607626
39678B327627K853147M58039K87812K043158K626561N26503k287472k898650j186350
39669D750375J13261o26608j595109p46635K93703j429597m521294l915957J498968
39660f178893N784410L427897k756040n017726p08707M944437O018830K406383
39652G920591j526449k009202J312761N384053N774832P55874o028355q958396
39644B625709o789446l158314p01015J669562M573145N564998L398346J152814
39636H335799J542218K198903k14218l826874m374406k273877j407501j863670
39628a883626N2807M270702N551955J433705l763869n374560m154825k718600
$$ y = [6875176, 10304194, 16201966, 19863604, 16101128, 6777270, -586350, -1279999, 2327627, 5180774, 5638813, 5926625, 7969783, 10596344, 11122847, 8835375, 5936725, 4750375, 4863636, 4237028, 2641919, 1895284, 2188987, 759390, -3761904, -7677861, -6178893, -394483, 3033414, 277374, -4740352, -5449059, -504622, 5514208, 7920591, 6394142, 4384940, 5697701, 11081754, 16856586, 17612460, 11584105, 2625709, -4163737, -7322051, -8023066, -6353504, -1780359, 3784639, 7182985, 8335799, 9878017, 12076920, 11862702, 8035828, 3661422, 1387545, -19956, -1883626, -1830819, 2439883, 7991838, 9425543, 5661674, 287114, -3867711, -6586311]
39620f586311o45117K981766N598122M151014R8154k427846k160616j201845j123961
39611a316640j471575j310352j1390K456910M299495K817247j479373m104521
39603a20199k469778K20831J90811p75600J104776M375024M237706M98110k224113
39594E037568k071112j908940l006684k600303M02777K656217J969951R58350
39586A437824J944278K499968l7636l106687k486147R78330K732440J348454j93679
39577E117145L63896J823524K108502O53046k016620m618864m942974j824219
39569c336564K373973L582974R34999k151250k379762j24441K159351L069472
39561D128752K594366J006296r63230j901815j237116l12231n90984j505937j629382
$$ y = [-6586311, -7231428, -4249662, 1348460, 5499474, 5597628, 3169782, 1009166, -192679, -1316640, -2788215, -4098567, -4109957, -1653047, 2646448, 5463695, 3984322, -120199, -2589977, -2369146, -2178335, -2953935, -1849159, 2525865, 6763571, 7261681, 5037568, 2966456, 1057516, -1949168, -4549471, -4146694, -1490477, 479474, 1437824, 3382102, 5882070, 5844434, 2737747, 251600, 1229930, 3962370, 5310824, 5117145, 5481041, 7304565, 9413067, 10066113, 8049493, 3430629, -1512345, -3336564, -962591, 2620383, 3555382, 1404132, -975630, -1100071, 1059280, 4128752, 6723118, 7729414, 6766184, 4864369, 3627253, 3315022, 2724038, 1218101, -411281]
39552d11281j228151j482427j495127R89436N067267O022327J480695m289620
39544D653119n503644k532978l84061n03377O72383M256310N645837J652518l737883
39535D218224m892930k347602m32083O7558J354344K533048L52393m109014n552908
39526h808970k336853J235409K155343K833735N343380O670932L753937o00129
39518A0246784j488124Q21916J926386J39316k038065k747472l007097l687216
39510A66428l616510j877213L16057J357569J463418J940969K967669L177802
39502E896189J549665q98882k011988j251431o27205k002091m327296m986362
39494h659401l234829n73268J707801L275136L604428K610326K037417L310721
$$ y = [-411281, -1639432, -3121859, -4616986, -3627550, 1439717, 7462044, 8942739, 4653119, -850525, -3383503, -3767564, -4270941, -3598558, 657752, 6303589, 7956107, 4218224, -674706, -3022308, -3454391, -3386833, -2032489, 500559, 852952, -3256062, -8808970, -11145823, -9910414, -7755071, -4921336, 422044, 7092976, 10846913, 10246784, 8758660, 9580576, 11506962, 11646278, 9608213, 6860741, 3853644, 166428, -3450082, -5327295, -5011238, -3653669, -2190251, -249282, 2718387, 5896189, 7445854, 6546972, 4534984, 3283553, 2656348, 654257, -3673039, -8659401, -11894230, -12467498, -10759697, -7484561, -3880133, -1269807, 767610, 4078331]
39486D078331M284314J684141l078194m710868j587736J920059K315980J546754
39478F452781K035166J709616j976877o508991p322049m199220o25123J494951
39470h939746K686831L034873K237770J484606J947356K343206Q93911j453928
39462D234879k522976k239562j759123q70953Q76989K119520J576429K88574n77048
39453A126729j755736l039557j736719K375720M275936P38870l372647j825531
39445c212935K959369L569731o89316l281358r26025K721958L989074K985221
39437H115719K65346l682947n487913k261439K082361J280711k591522j552620
39429c832304M549666O779487J951549j962413K51886K310847j684676o248159
$$ y = [4078331, 8362645, 10046786, 6968592, 2257724, 669988, 2590047, 4906027, 6452781, 8487947, 10197563, 8220686, 1711695, -5610354, -9809574, -10434697, -8939746, -6252915, -3218042, -980272, 504334, 2451690, 4794896, 5688807, 4234879, 1711903, -527659, -2286782, -3157735, -2280746, -161226, 1415203, 1703777, 1126729, -629007, -3668564, -5405283, -3029563, 1246373, 1985243, -1387404, -3212935, -253566, 3316165, 2626849, -654509, -1580534, 1141424, 5130498, 8115719, 8381065, 4698118, -789795, -3051234, -968873, 311838, -2279684, -3832304, 717362, 7496849, 9448398, 7485985, 7737871, 10048718, 8364042, 2115883]
39421B115883m016939J632109L121236J533635K599105M585086J292506n429675
39413G432946p140460k335157J403245l19340l067539k055313J278024L551939
39405a251655M095577L017202j04074l574481m237795k323667j315625j958344
39397g652862j138993K025341M003348K722483J022932J724314L089912J990349
39389G786824j221172l443010k578522Q44453M152482M295061J194687j170431
39381I860372J05998J821798p81716n267460m082552L522037Q443226M054875
39373A7676578m102743n915454o2331N613151M934828m74393n178439n906824
39365F584373l335390o82007q20304l239347m344538j946237J831550L591258
$$ y = [2115883, -1901056, -268947, 2852289, 4385924, 6985029, 11570115, 12862621, 7432946, 292486, -2042671, -639426, -958766, -4026305, -6081618, -4803594, -1251655, 2843922, 5861124, 5757050, 2182569, -2055226, -4378893, -5694518, -7652862, -8791855, -6766514, -2763166, -40683, 982249, 2706563, 5796475, 7786824, 6565652, 3122642, 544120, 1388573, 5541055, 9836116, 11030803, 9860372, 9966370, 11788168, 11006452, 5738992, 1656440, 5178477, 13621703, 17676578, 13573835, 7658381, 7596050, 13209201, 18144029, 17669636, 12491197, 6584373, 3248983, 2566976, 1746672, -1492675, -5837213, -7783450, -5951900, -2360642]
39357b360642K964630J865130J005059k32100j355690r72874O05196J222118j89847
39348B550980k045436k014415L06647K886673L116008M25327k735603l165865
39340f75684m51591K572495L207843J689853R7359l96973l32209p56964j952873
39331C001256l002753k559296o74317N04071q73134l526107m268387k014365J270145
39322a2142887L629207M891695N047429L426581N88479j187517o82400O91424
39314D262011J157866O40743l36383j667426k428730j002596J933661K863348
39306E422494j2717l663412m031880j313716J029038J142120M5968r34277j283246
39297c599628m16119J676030L054569J552725j878353l626188j769821J590153
$$ y = [-2360642, 603988, 2469118, 3474177, 3242077, 1886387, 913513, 1518709, 2740827, 2550980, 505544, -1508871, -1202224, 1684449, 4800457, 5225784, 2490181, -675684, -1127275, 1445220, 4653063, 6342916, 6440275, 6043302, 5711093, 4954129, 3001256, -1497, -2560793, -3235110, -2731039, -3604173, -7130280, -11398667, -13413032, -12142887, -8513680, -3621985, 1425444, 4852025, 5440504, 4252987, 3570587, 4262011, 5419877, 6060620, 5724237, 4056811, 1628081, 625485, 2559146, 5422494, 5409777, 1746365, -2285515, -3599231, -2570193, -1428073, -1382105, -2316382, -3599628, -4015747, -2339717, 714852, 2267577, 389224, -3236964, -5006785, -3416632]
39289c416632K947253J243915j377022k023853l0327K264158K006171p30691k882471
39280a999499k231147l5572J146664R37644Q87622J708091K580281K776578K281152
39271H051814J036419p81893j831976p66839J260056J046364k480486n772063
39263b38604m325805J208576M816333K471674k110348k158570K287229L716217
39255E666702j803790p645811n343794K935592P092496L223063k070606k570565
39247e16713m77981k96888j014443M73577K692071K249566L80925J016223L810482
39238H316819M546435J984380n98452r54843p45294k070665m338273n451144m019679
39229c330716l03788L334951L770177R28773j119491O07187L472383L182859M10071
$$ y = [-3416632, -469379, 774536, -602486, -2626339, -2656666, -392508, 1613663, 882972, -1999499, -4230646, -4266218, -3119554, -2181910, -1294288, 413803, 2994084, 5770662, 8051814, 9088233, 8306340, 6474364, 5707525, 6967581, 8013945, 5533459, -238604, -4564409, -3355833, 1460500, 3932174, 1821826, -336744, 1950485, 5666702, 3862912, -3782899, -9126693, -6191101, 901395, 4124458, 2053852, -516713, -994694, -1291582, -2306025, -1832448, 859623, 3109189, 3490114, 4506337, 8316819, 12863254, 14847634, 14249182, 13294339, 12549045, 10478380, 6140107, 688963, -3330716, -3634504, -299553, 3470624, 4399397, 3279906, 3887093, 7359476, 10542335, 10952406]
39220A0952406q04844N2175l25910k743853m017522k570408q62317r11685j481764
39211b713722j213273q65024r56413o67786m46045k038885m376205l343999K062047
39202a4559305O963112O762080L052720M17067j1538m32832j735536k471771j752777
39193c768780m68720K10257o6198q10063q60994M68234J837572J129937j068611
39184c397366j517045R54341L265302K411161m31243k324742k840128l204216
39176g083936l070903j334430R18804J435407L95736K01062J656353K846587K214725
39167a820595P07000J23839P34338J308114Q01561n19535j455533j231651k59268
39158a611730P99096K115079L710587M019095J471608k513489m478990l258132
$$ y = [10952406, 10147562, 10199737, 9873827, 7129974, 3112452, 542044, -320273, -1231958, -2713722, -3926995, -4792019, -5748432, -6416218, -6862263, -8901148, -13277353, -16621352, -14559305, -7596193, -834113, 2218607, 2635674, 2624136, 2191304, 455768, -2016003, -3768780, -4237500, -4027243, -4093441, -4903504, -5764498, -5296264, -3458692, -2328755, -3397366, -4914411, -3960070, -694768, 1716393, 1285150, -1039592, -3879720, -7083936, -10154839, -11489269, -10570465, -9135058, -8739322, -8538260, -6881907, -4035320, -1820595, -1113595, -989756, -255418, 1052696, 1854257, 1334722, -120811, -1352462, -1611730, -812634, 1302445, 5013032, 9032127, 10503735, 7990246, 3511256, 253124]
39150B53124r13319R83254K779524L622643J100878l673403m899046M6111N081836
39141D381602K933000m172887p274212l212850J971877K847678J388663J458548
39133C21419K175214J047683l56003Q64618K790207P94079m615052p303478m062754
39124h344067Q08682J838340l47742j519724r24999j255499k573605j520260K386991
39115a1451883M583798K287300o49128L01925K774055J143540m091202o562111
39107a1663706l555370O74892K318364K923865M408724M590840J638180j314496
39099B1293o54901J691654J499546q47213j650071n27696n60860k306378k634820
39090e969446j11493K622454K924695J401266J00930J1219R75411J909449J030335
$$ y = [253124, -660195, 323059, 3102583, 6725226, 7826104, 4152701, -746345, -700234, 4381602, 7314602, 3141715, -4132497, -7345347, -5373470, -2525792, -1137129, 321419, 2496633, 3544316, 3188313, 4052931, 6843138, 7637217, 3022165, -4281313, -8344067, -7535385, -5697045, -6044787, -7564511, -8489510, -9745009, -12318614, -13838874, -11451883, -6868085, -4580785, -5229913, -4927988, -2153933, -1010393, -5101595, -11663706, -15219076, -14544184, -12225820, -9301955, -4893231, -302391, 1335789, 21293, -633608, 1058046, 2557592, 1710379, 60308, -467388, -1028248, -3334626, -5969446, -6080939, -3458485, -533790, 867476, 968406, 979625, 1955036, 3864485, 4894820]
39081D894820j820786l447212p54003M286328O333175L440093j140371m054916
39073G737128n095288m796843k795075j9505J055038J38648p3029J451144J989238
39064d08544k19158k527788j959841J94049J019091O87537J037745J563024O77556
39055F3671n37279Q0726J380436L51737k251588k150944J800987N264206M355703
39046H357655N52148k408837l559706m036398l774396k051632K8324P18665O12733
39037e561444J504613K688313J663462j188604k118864M95239L358565L059628
39029C900908Q43261k30736m13425j744471l083406j363427K486639L786443J254840
39020E436626q32345L24800J456463r80325m355624l866071m30834O32911k158072
$$ y = [4894820, 3074034, -373178, -1127181, 3159147, 9492322, 12932415, 11792044, 7737128, 2641840, -2155003, -4950078, -4969583, -3914545, -3775897, -3848926, -2397782, -408544, -627702, -3155490, -5115331, -4921282, -3902191, -3214654, -2176909, -613885, 63671, -473608, -392882, 987554, 1339291, -912297, -3063241, -1262254, 4001952, 8357655, 8909803, 6500966, 2941260, -1095138, -4869534, -6921166, -6892842, -6174177, -5561444, -4056831, -1368518, 294944, -893660, -3012524, -2517285, 841280, 3900908, 4744169, 4513433, 4100008, 2355537, -727869, -2091296, 395343, 4181786, 5436626, 4604281, 4929081, 6385544, 5405219, 1049595, -2816476, -3247310, -2614399, -4772471]
39011d772471m582573l325159j6644K369062L359921L604661K665960K04611k512090
39002c004722l832952l206803q15495K596521N016224M391607J552189Q348J649129
38993D354046M220289M269386J257115k381309m122326l295449j143600J50020
38985C308172p39311k865808m106608l785976l052820k484957r17042K489079
38977a2155271O125582O998984L764237j577300n023026m138816o08968J655668
38969d958910J285106O55959J579063K408482J488404O93620K184417L914379
38961I250520K550329q12500k495685k418799l128079l674588q32199L545914
38953A984913L493119j250117l570061J63L554445J323016l402493m218508j235666
$$ y = [-4772471, -9355044, -12680203, -12696847, -10327785, -6967864, -3363203, -697243, -492632, -3004722, -6837674, -10044477, -10859972, -8263451, -3247227, 1144380, 2696569, 2704917, 4354046, 8574335, 12843721, 14100836, 11719527, 7597201, 4301752, 3158152, 3308172, 2568861, -296947, -4403555, -8189531, -11242351, -13727308, -14644350, -12155271, -6029689, 969295, 4733532, 3156232, -1866794, -6005610, -6614578, -4958910, -3673804, -3017845, -1438782, 969700, 2458104, 3151724, 5336141, 9250520, 11800849, 10988349, 8492664, 6073865, 2945786, -728802, -1561001, 1984913, 5478032, 4227915, 657854, 658017, 4212462, 5535478, 2132985, -2085523, -3321189]
38944c321189J232682K370626L867541M412865J702593k072382k768209r01204
38936D523323k89281j505620k061224j800768k577063l488086j981729Q58707
38928h321741J531262J98073J48183J476978R89675j382148j868236N31197K207546
38919d489211J099627l47529k7016N94903j41775j451491k308932k680666j761360
38910a1513450J098158L326462J604928k168845k670778L67060J463017j404856
38902i898304l466571j533185R94360J092388J558133M712339O590085L223291
38894C272536k078642l780189k412576j737176j419347P65541K531399J88883
38886d669571l817020l782700j16136J333776r66119k252279P8539K731197K756182
$$ y = [-3321189, -2088507, 282119, 4149660, 8562525, 10265118, 8192736, 5424527, 4523323, 4234042, 2728422, 667198, -1133570, -3710633, -7198719, -9180448, -8321741, -6790479, -6592406, -6444223, -4967245, -3977570, -5359718, -7227954, -6696757, -4489211, -3389584, -3737113, -3764129, -3169226, -3311001, -4762492, -7071424, -9752090, -11513450, -10415292, -7088830, -5483902, -7652747, -10323525, -9956465, -8493448, -9898304, -13364875, -14898060, -13903700, -12811312, -11253179, -6540840, 49245, 3272536, 1193894, -2586295, -4998871, -6736047, -8155394, -7389853, -4858454, -4669571, -8486591, -12269291, -12385427, -11051651, -12017770, -14270049, -14191510, -11460313, -8704131]
38877h704131J540409O12279j083338l381880l292936N7754K975826K374016r9471
38868i001472j503396j800269k122527j890361k61457J880610L374771M024806
38860g299295L247662M70481k044992p16767L253716L817264j038969n034001
38852e344901k431479L112177M129531O14765j026188J058997J491220k983683
38844a379561p704481o527302J34221O719070R189498P633880M261580J395090
38836A3721995M27687Q66378Q59404m66500k021489k577028k271615j653084o13683
38827F272065Q65027K059674K307936J439105q44525m452962p399229o849680
38819f602589k711789J635764L349563L029964K346952R73802j882488m573907
$$ y = [-8704131, -7163722, -6551443, -7634781, -11016661, -14309597, -14251843, -11276017, -8902001, -9001472, -10504868, -12305137, -14427664, -16318025, -16579482, -14698872, -11324101, -7299295, -4051633, -3581152, -5626144, -6342911, -3089195, 728069, -310900, -5344901, -7776380, -4664203, -534672, 80093, -946095, 112902, 1604122, -1379561, -9084042, -15611344, -15477123, -8758053, 431445, 8065325, 12326905, 13721995, 14149682, 15016060, 15875464, 15408964, 13387475, 10810447, 8538832, 6885748, 6272065, 7137092, 9196766, 11504702, 12943807, 12099282, 7646320, 247091, -6602589, -9314378, -7678614, -4329051, -1299087, 1047865, 2021667, 139179, -4434728]
38811d434728m466238j703034R00689J522983Q77033K83693J71505N40411J200618
38802e107068J417418O89395k30662l51427R19J13387O40408K490346M560398
38793D223114M752154K738198n04793m931902j0024863j2055782p379727R72084
38785b2211517M953572J784969k030537J43N347247P006295L671780J69059k86156
38776a595145J070680K553909L719465L205216q6621l118666j040271N161106
38768I869673P983778K781090n963418j0430083q421896l717875k53050P06459
38760g445322n65171k790748l827721k748138j107578l39923O93647L245873N330143
38751i554938M054509O17015n42236K018626M476642K937297j484551m410657
$$ y = [-4434728, -8900966, -10604000, -9703311, -8180328, -7303295, -7019602, -6848097, -6307686, -5107068, -3689650, -3000255, -3230917, -3582344, -3581425, -3468038, -2827630, -337284, 4223114, 8975268, 11713466, 11208673, 6276771, -3748092, -15803874, -23183601, -22211517, -17257945, -15472976, -17503513, -17503370, -12156123, -5149828, -1478048, -1308989, -1595145, -524465, 2029444, 5748909, 8954125, 8867504, 5748838, 4708567, 9869673, 17853451, 20634541, 14671123, 4241040, -4180856, -7898731, -8151781, -7445322, -8010493, -10801241, -14628962, -17377100, -18484678, -18824601, -18130954, -14885081, -9554938, -5500429, -4883414, -5425650, -3407024, 1069618, 4006915, 2522364, -1888293]
38743a888293l489826k87751K284102K916599K363556J885635J584568L74261
38735E742851k162389m281633l511058J18694L305682K838429p25873l632132
38727b307429l057981J55587L003803L613912K436384R20579J80348P61743K322541
38718H029487L156711J440910k138359m255870k803326R2312N73677k050732m716903
38709b672093m519244j323919L187367O799452P091287L175573k087167m062949
38701E588307j741128J004083Q14544q68109q16509Q95406J521742N9902j736414
38692D721824k247742j521428j47076J275535J600362N6754k085642k495199p77728
38683a620340R25012O93825j057691k627226l075101k667739j984901j131342
$$ y = [-1888293, -5378119, -5665870, -3381768, -465169, 1898387, 3784022, 5368590, 5742851, 3580462, -701171, -4212229, -4093535, -787853, 2050576, 1324703, -2307429, -5365410, -5209823, -2206020, 1407892, 3844276, 4764855, 4945203, 5706946, 8029487, 11186198, 12627108, 10488749, 6232879, 3429553, 3521865, 4095542, 2044810, -2672093, -7191337, -8515256, -5327889, 1471563, 8562850, 11738423, 9651256, 5588307, 3847179, 4851262, 5665806, 4797697, 3981188, 4876594, 6398336, 6458238, 4721824, 2474082, 952654, 805578, 2081113, 3681475, 3738229, 1652587, -842612, -1620340, -695328, -1503, -1059194, -3686420, -6761521, -9429260, -11414161, -12545503]
38675a2545503L38509K732106N279459O218584M313898K25928l789980n386499
38667b613498l653098m8083K237475J037259k346851m417146l204306M19399M584947
38658h003902P386767O394656O87398n734106o363046k35707N727221N230880
38650E090161L84182k465345j714164p32643j094834q81463O41379J463606N07386
38641A198265r80351k190368l424424l721233j402408K497671M732832M217816
38633I27800K613918N26337k890791o175310n951802k325754M17809J06001m90821
38624a3242613J083830L139917L506550K887314K021253l46260l731819m364730
38616i046558q79536K460620K140985R17166K314730L704525R07035l435092l178318
$$ y = [-12545503, -12206994, -9474888, -4195429, 2023155, 6337053, 6562981, 2773001, -2613498, -6266596, -6314679, -4077204, -3039945, -5386796, -9803942, -13008248, -12588849, -8003902, -617135, 5777521, 6464919, 730813, -5632233, -5867940, -140719, 5090161, 5474343, 3008998, 1294834, 562191, -532643, -1414106, -772727, 690879, 1198265, 217914, -1972454, -5396878, -9118111, -10520519, -8022848, -3290016, 927800, 3541718, 4068055, 1177264, -4998046, -10949848, -13275602, -12857793, -12751792, -13242613, -12158783, -9018866, -5512316, -2625002, -603749, -950009, -4681828, -9046558, -9926094, -7465474, -5324489, -4407323, -2092593, 1611932, 2518967, -916125, -4094443]
38607d094443J174743K941980j82459l067828j864648P02278J095827L51091M71140
38598b472319O5379k527110m984262l790747N24552M047967M209403J628308j526607
38589d825436l102215k048907M17815J787354J453307J400534K686244L416514
38581A185210J929197j45757l34021Q11603Q39027p18089k098425k227968j526980
38572b286203l81967Q64939Q92059j101595l029433j758899K272864M901706L604794
38563C978265N82645q99790q94459j275860j660564N4569L458389N056076K918500
38554A1317771m44007j524386n44369o05361k838364m753638l814278q01702J395396
38545b612938J245851k04627r63617r0668J622577K482960J712323M99968M97976
$$ y = [-4094443, -2919700, 22280, -160179, -3228007, -5092655, -4390377, -3294550, -2943459, -2472319, -2406940, -4934050, -9918312, -13709059, -13184507, -9136540, -4927137, -3298829, -4825436, -7927651, -9976558, -9558743, -7771389, -6318082, -4917548, -2231304, 1185210, 3114407, 2968650, 2634629, 3446232, 4285259, 3567170, 1468745, -759223, -2286203, -2668170, -1803231, -911172, -2012767, -5042200, -6801099, -4528235, 373471, 3978265, 4560910, 3661120, 2766661, 1490801, -169763, -115194, 3343195, 8399271, 11317771, 10873764, 9349378, 8805009, 8199648, 5361284, 607646, -3206632, -4008334, -2612938, -1367087, -1571714, -2535331, -2625999, -1003422, 1479538, 3191861, 3691829, 4189805]
38536D189805J306624Q78231j152005k373013j027684J232254J853960J076673
38528E984845O14315j67801l374400p859672q907489m083990L099207P158730
38520g536255O500997L595418Q95430j158300k732089l359417k486969k07373
38512f488558K782572N451062O796999O394647M453841J313999k507234n687716
38504A2509612o569660m839895j998463K98569J568852J893207J221807K7335
38496D111364n23064p8626J22612r64715k397639k238247K25360L888517O572613
38487H718175N858747Q10605n832266q744223n314551R57173M139220K168932
38479B761812k179770n401724n885533l330735J308184N152295N563412L625283
$$ y = [4189805, 5496429, 6374660, 5222655, 2849642, 1821958, 3054212, 4908172, 5984845, 6599160, 6431359, 3056959, -4802713, -13710202, -17794192, -14694985, -7536255, -1035258, 2560160, 3455590, 2297290, -434799, -3794216, -6281185, -6488558, -3705986, 1745076, 8542075, 14936722, 19390563, 20704562, 18197328, 12509612, 5939952, 1100057, -898406, -599837, 969015, 2862222, 4084029, 4111364, 3588300, 3509674, 3632286, 2667571, 269932, -1968315, -1742955, 2145562, 8718175, 14576922, 15387527, 9555261, 811038, -4503513, -3546340, 592880, 2761812, 582042, -4819682, -10705215, -14035950, -12727766, -7575471, -2012059, 1613224]
38471A613224K950634M392617M711742J643155k490971m055732k678111m56228
38463E630330J363520K423539J601745j678813n163039n612718k993581n36398
38455d965415l84402j215814p11786J342364L263056L699802K913254K244848
38447F185907K518343K888870J904395k2124o52139N13485N83637k546522n890684
38438E483168m566628J165573N673363N253248K148203J01546n93466j500973
38430A3164034k553064l011795l689664n106896n063476j420013L583921N211503
38422A114550K379100j090816j722071j30858J204781J311638M70000j380076
38414B156248m047514n828915m642386n99878L440916M432786K310330K63482
$$ y = [1613224, 4563858, 8956475, 13668217, 15311372, 12820401, 8764669, 6086558, 5630330, 6993850, 9417389, 11019134, 9340321, 4177282, -1435436, -4429017, -4965415, -5349817, -6565631, -7277417, -5935053, -2671997, 1027805, 3941059, 6185907, 8704250, 11593120, 13497515, 13475391, 12823252, 13336737, 13920374, 11373852, 5483168, 916540, 2082113, 7755476, 13008724, 15156927, 15258473, 14665007, 13164034, 10610970, 7599175, 3909511, -1197385, -6260861, -7680874, -4096953, 1114550, 3493650, 2402834, 680763, 549905, 1754686, 3066324, 3536324, 2156248, -1891266, -7720181, -12362567, -12962445, -9521529, -5088743, -2778413, -2514931]
38406b514931J156189L752179L850960k50681n098973o241615l476008J9383K338329
38397f465168L853285M426860L020957M05020q24160J21604J106995N89905k27442
38388F007856k7062K69862m60546j161872l43902J155927J227579m46161k088268
38379D133413k214438j125860k86526q44317k322414k660825n49377K322755K955359
38370e92230J125911k83999M25245J553989J145863o2533m22859O002L75113O99775
38360C970277Q93200N6154j545786j859405k44889J017676N70892O49424K955958
38351F463501M483243J464336m160988o539306l543888J213491L720147L372894
38343F473430J569797j69928n60713K08883p2402k321327l479824o46002L427042
$$ y = [-2514931, -1358742, 2393437, 6244397, 5993716, 894743, -5346872, -8822880, -8803497, -6465168, -2611883, 1814977, 4835934, 5240954, 4416794, 4538398, 5645393, 6235298, 6007856, 5980794, 6250656, 5790110, 4628238, 4284336, 5440263, 6667842, 6221681, 4133413, 1918975, 793115, 506589, -337728, -2660142, -5320967, -5870344, -3547589, -592230, 533681, 249682, 674927, 2228916, 3374779, 3312246, 2889387, 2895389, 3270502, 3970277, 4863477, 4919631, 3373845, 1514440, 1269551, 2287227, 2858119, 3507543, 6463501, 10946744, 12411080, 8250092, 1710786, -1833102, -619611, 3100536, 6473430, 8043227, 7873299, 7312586, 7521469, 7449067, 5127740, 1647916, 1001914, 4428956]
38334D428956L504188k00169k469530j449803q12273k514246l342073j021988
38326c876938J618012J700613P28848M90636r02614m632323o787223l418736K677168
38317a2402557N182414K540179j403148l519475l734472k339065N32258K992243
38309a2151623K858966J103273O93538K227024L673752L944523L528552K076226
$$ y = [4428956, 7933144, 7732975, 5263445, 3813642, 3001369, 487123, -2854950, -3876938, -2258926, -558313, 170535, 661171, -241443, -4873766, -11660989, -15079725, -12402557, -7220143, -4679964, -6083112, -9602587, -13337059, -15676124, -15143866, -12151623, -9292657, -8189384, -7495846, -5268822, -1595070, 2349453, 5878005, 7954231]
$$ [...]
##END NTUPLES=NMR SPECTRUM
##END=
