##TITLE=31Pdec_DE-97K
 CDCl3, 64 sc
 7.7.2025
##JCAMPDX= 6.0         $$ Bruker NMR JCAMP-DX V2.0
##DATA TYPE= NMR SPECTRUM
##DATA CLASS= NTUPLES
##ORIGIN= UXNMR, Bruker Analytische Messtechnik GmbH
##OWNER= root
$$ XWIN-NMR		Version 3.5
$$ Mon Jul  7 14:18:34 2025 Russian Standard Time (UT+4h)  she@DPX200
##.OBSERVE FREQUENCY= 81.013821
##.OBSERVE NUCLEUS= ^31P
##.ACQUISITION MODE= SIMULTANEOUS
##.ACQUISITION SCHEME= undefined
##.AVERAGES= 64
##.DIGITISER RES= 17
##SPECTROMETER/DATA SYSTEM= spect
##.PULSE SEQUENCE= zgpg30
##.SOLVENT NAME= CDCl3
##.SHIFT REFERENCE= (INTERNAL, CDCl3, 0, 198.062)
##AUDIT TRAIL= $$ (NUMBER, WHEN, WHO, WHERE, WHAT)
$$ ##TITLE= Audit trail, XWIN-NMR		Version 3.5
$$ ##JCAMPDX= 5.01
$$ ##ORIGIN= Bruker BioSpin GmbH
$$ ##OWNER= she
$$ F:/spectra/data/she/nmr/P31/2/pdata/1/auditp.txt
$$ ##AUDIT TRAIL=  $$ (NUMBER, WHEN, WHO, WHERE, WHAT)
(   1,<2025-07-07 14:17:22.95 +0400>,<she>,<DPX200>,
      <created by zg, POWCHK disabled, PULCHK disabled
       configuration hash MD5:
       00 E9 B6 7A A2 85 ED C7 34 08 36 98 17 FE 4E 26
       data hash MD5: 32K
       87 D1 5C 23 69 08 20 2C 23 5C 0B B1 F6 21 54 A6>)
(   2,<2025-07-07 14:17:25.31 +0400>,<she>,<DPX200>,
      <Start of raw data processing
       efp BC_mod = 2 LB = 1.5 FT_mod = 6 PKNL = 1 PHC0 = 1413.233 PHC1 = 58.4939 SI = 64K 
       data hash MD5: 64K
       41 BA E3 67 53 AA 6A 9C 8F 0B AF 50 CD 30 57 56>)
(   3,<2025-07-07 14:17:47.75 +0400>,<she>,<DPX200>,
      <pk PHC0 = -12.50522 PHC1 = 0 
       data hash MD5: 64K
       09 27 26 5A 18 64 D0 2A 07 53 A0 80 D7 FB 3C 5D>)
(   4,<2025-07-07 14:17:54.68 +0400>,<she>,<DPX200>,
      <abs ABSG = 5 
       data hash MD5: 64K
       81 EF D1 A3 7A 51 3A 8B 3D 0A CA 8F 62 CE 3C 88>)
$$ ##END=
$$ 
$$ hash MD5
$$ 7C BA 9D 6B 20 0C 61 B5 EC A5 54 62 F8 27 DE 1B
##$RELAX= 
##$RELAX= 
##$RELAX= 
##$RELAX= 
##$RELAX= 
##$RELAX= 
##$RELAX= 
##$RELAX= 
$$ Bruker specific parameters
$$ --------------------------
##$DU= <F:/spectra>
##$EXPNO= 2
##$NAME= <P31>
##$PROCNO= 1
##$TYPE= <nmr>
##$USER= <she>
##$AMP= (0..31)
100 100 100 100 100 100 100 100 100 100 100 100 100 100 100 100 100 100 
100 100 100 100 100 100 100 100 100 100 100 100 100 100 
##$AQSEQ= 0
##$AQ_mod= 1
##$AUNM= <au_zg>
##$AUTOPOS= <>
##$BF1= 81.014009
##$BF2= 200.13
##$BF3= 200.13
##$BF4= 200.13
##$BF5= 200.13
##$BF6= 200.13
##$BF7= 200.13
##$BF8= 200.13
##$BYTORDA= 1
##$CFDGTYP= 0
##$CFRGTYP= 5
##$CHEMSTR= <none>
##$CNST= (0..31)
1 1 145 1 1 1 1 1 1 1 1 1 1 1 1 1 1 1 1 1 1 1 1 1 1 1 1 1 1 1 1 1 
##$CPDPRG= <waltz16>
##$CPDPRG1= <>
##$CPDPRG2= <waltz16>
##$CPDPRG3= <>
##$CPDPRG4= <mlev>
##$CPDPRG5= <mlev>
##$CPDPRG6= <mlev>
##$CPDPRG7= <mlev>
##$CPDPRG8= <mlev>
##$CPDPRGB= <>
##$CPDPRGT= <>
##$D= (0..31)
0 1 0 0 0 0 0 0 0 0.06 0 0.03 2e-05 3e-06 0 0 0.0002 0 0 0 0 0 0 0 0 0 
0 0 0 0 0 0 
##$DATE= 1751883442
##$DBL= (0..7)
120 120 120 11 120 120 24 19 
##$DBP= (0..7)
150 150 150 150 150 150 150 150 
##$DBP07= 0
##$DBPNAM0= <>
##$DBPNAM1= <>
##$DBPNAM2= <>
$$ [...]
##$SUBNAM3= <"">
##$SUBNAM4= <"">
##$SUBNAM5= <"">
##$SUBNAM6= <"">
##$SUBNAM7= <"">
##$SUBNAM8= <"">
##$SUBNAM9= <"">
##$SW= 400.765351723535
##$SWIBOX= (0..15)
0 1 3 0 0 0 0 0 0 0 0 0 0 0 0 0 
##$SW_h= 32467.5324675325
##$TD= 32768
##$TD0= 1
##$TE= 0
##$TE2= 300
##$TE3= 300
##$TEG= 300
##$TL= (0..7)
0 120 53 12 22 120 120 120 
##$TP= (0..7)
150 150 150 150 150 150 150 150 
##$TP07= 0
##$TPNAME0= <>
##$TPNAME1= <>
##$TPNAME2= <>
##$TPNAME3= <>
##$TPNAME4= <>
##$TPNAME5= <>
##$TPNAME6= <>
##$TPNAME7= <>
##$TPOAL= (0..7)
0.5 0.5 0.5 0.5 0.5 0.5 0.5 0.5 
##$TPOFFS= (0..7)
0 0 0 0 0 0 0 0 
##$TUNHIN= 0
##$TUNHOUT= 0
##$TUNXOUT= 0
##$USERA1= <user>
##$USERA2= <user>
##$USERA3= <user>
##$USERA4= <user>
##$USERA5= <user>
##$V9= 5
##$VALIST= <valist>
##$VCLIST= <CCCCCCCCCCCCCCC>
##$VD= 0
##$VDLIST= <DDDDDDDDDDDDDDD>
##$VPLIST= <PPPPPPPPPPPPPPP>
##$VTLIST= <TTTTTTTTTTTTTTT>
##$WBST= 1024
##$WBSW= 4
##$XGAIN= (0..3)
0 0 0 0 
##$XL= 0
##$YL= 0
##$YMAX_a= 6283
##$YMIN_a= -5768
##$ZGOPTNS= <>
##$ZL1= 120
##$ZL2= 120
##$ZL3= 120
##$ZL4= 120
##$ABSF1= 198.0616
##$ABSF2= -202.7028
##$ABSG= 5
##$ABSL= 3
##$ALPHA= 0
##$AQORDER= 0
##$ASSFAC= 0
##$ASSFACI= 0
##$ASSFACX= 0
##$ASSWID= 0
##$AUNMP= <proc_1d>
##$AZFE= 0.1
##$AZFW= 0.5
##$BCFW= 0
##$BC_mod= 2
##$BYTORDP= 0
##$COROFFS= 0
##$CY= -3
##$DATMOD= 1
##$DC= 0
##$DFILT= <>
##$DTYPP= 0
##$F1P= 0
##$F2P= 0
##$FCOR= 1
##$FTSIZE= 65536
##$FT_mod= 6
##$GAMMA= 0
##$GB= 0
##$INTBC= 1
##$INTSCL= 9.790993e-09
##$ISEN= 30
##$LB= 1.5
##$LEV0= 0
##$LPBIN= 0
##$MAXI= 10000
##$MC2= 0
##$MEAN= 0
##$ME_mod= 0
##$MI= 50
##$NCOEF= 0
##$NC_proc= -8
##$NLEV= 6
##$NOISF1= 182.463
##$NOISF2= 159.3651
##$NSP= 0
##$NTH_PI= 0
##$NZP= 0
##$OFFSET= 198.0616
##$PC= 4
##$PHC0= 1400.728
##$PHC1= 58.4939
##$PH_mod= 1
##$PKNL= yes
##$PPARMOD= 0
##$PSCAL= 0
##$PSIGN= 0
##$REVERSE= no
##$SF= 81.0140089999434
##$SI= 65536
##$SIGF1= 159.3651
##$SIGF2= -187.1042
##$SINO= 113.3802
##$SIOLD= 16384
##$SREGLST= <1H.CDCl3>
##$SSB= 0
##$STSI= 65536
##$STSR= 0
##$SW_p= 32467.5324675325
##$SYMM= 0
##$S_DEV= 0
##$TDeff= 32768
##$TDoff= 0
##$TI= <>
##$TILT= no
##$TM1= 0
##$TM2= 0
##$TOPLEV= 0
##$USERP1= <user>
##$USERP2= <user>
##$USERP3= <user>
##$USERP4= <user>
##$USERP5= <user>
##$WDW= 1
##$XDIM= 65536
##$YMAX_p= 233784177
##$YMIN_p= -137055979
$$ End of Bruker specific parameters
$$ ---------------------------------
##NTUPLES= NMR SPECTRUM
##VAR_NAME=  FREQUENCY,     SPECTRUM/REAL,   SPECTRUM/IMAG
##SYMBOL=    X,             R,               I
##VAR_TYPE=  INDEPENDENT,   DEPENDENT,       DEPENDENT
##VAR_FORM=  AFFN,          ASDF,            ASDF
##VAR_DIM=   65536,         65536,           65536
##UNITS=     HZ,            ARBITRARY UNITS, ARBITRARY UNITS
##FACTOR=    0.49542278885378, 1,            1
##FIRST=     16045.7642231865, 0,            0
##LAST=      -16421.768244346, 0,            0
##MIN=       -16421.768244346, -137055979,   0
##MAX=       16045.7642231865, 233784177,    0
$$ Real data points
##PAGE= N=1
##DATA TABLE= (X++(R..R)), XYDATA
$$ [...]
7501i1702j100293j855385k711293k723779p01357K250083K737420l35428l217047
7492g748781j928912K274961M956801M477074K620977N23009k062447l900498
7484g87816k939660l24815K39474j813402k666101j38040K797327K888736J639933
7475a104364K257179M106630L986286J493056o97577j453020k489849m675271
7467A423070o193548n497864l561775j735453N66646M108499P168258O955694
7459C233527L378472n68028k374811k293282j583180l82969J290417J902069Q9
7450B602304k996981l915881j960628M61233J561354K314150L580464L797186
7442E443201J820283j87393K38691J577221N41243k417638l718128k421559j184109
$$ y = [-91702, -1191995, -3047380, -5758673, -8482452, -9183809, -6933726, -4196306, -4531734, -7748781, -9677693, -7402732, -2445931, 2031143, 4652120, 5175129, 3112682, -787816, -3727476, -4052291, -3812817, -5626219, -8292320, -8430360, -5633033, -2744297, -1104364, 1152815, 5259445, 9245731, 10738787, 10041210, 8588190, 6098341, 1423070, -4770478, -10268342, -13830117, -15565570, -14998924, -10890425, -3722167, 3233527, 6611999, 6043971, 3669160, 1375878, -207302, -590271, 700146, 2602215, 2602304, -394677, -4310558, -6271186, -5809953, -4248599, -1934449, 1646015, 5443201, 7263484, 7076091, 7314782, 8892003, 9433246, 7015608, 3297480, 875921, -308188]
7433c08188j032969K88402L256609M265541J099165k885488l347839r71862N64615
7424I27986L22715L2733J8648p30136j312741K24880K919997L475158J183092
7415G062332j004098r37428K08421O89559O08146L97459n71568k337746l239353
7406H75724k009738L28969J802409J596161J33779j610257k204517o60574J906200
7397A58156K874540J242909j065235j744422o58444Q46704J748480J623934N44148
7388E570770l64600L44953K145808K458244P3834k835487l630405k707270k187814
7379a131967k264689j293557Q16808J844326N51747j208631r88278Q02037J509527
7370a362677K3507j702648j601068n77133r08399k180190j455351J765329L621587
$$ y = [-308188, -1341157, -1052755, 2203854, 6469395, 7568560, 4683072, 1335233, 363371, 927986, 1250701, 1283434, 1302082, 571946, -740795, -515915, 2404082, 5879240, 7062332, 6058234, 5120806, 5329227, 6018786, 6626932, 7024391, 6452823, 4115077, 875724, -1134014, -805045, 997364, 2593525, 2727304, 1117047, -1087470, -1748044, 158156, 3032696, 4275605, 3210370, 1465948, 807504, 1654208, 3402688, 5026622, 5570770, 5206170, 5551123, 7696931, 10155175, 10229009, 7393522, 3763117, 1055847, -1131967, -3396656, -4690213, -3873405, -2029079, -1477332, -2685963, -3674241, -2872204, -1362677, -1339170, -3041818, -4642886, -5220019, -6128418, -8308608, -9763959, -7998630, -4377043]
7361d377043J151511k875999l639831j113475Q13350J077339K292432M565484
7353b106232M046934k98626l682746k579992k70994j053888k897864j239817K748622
7344g334603L806362J131516q06860J70182J352531Q07504K43121P27943M14970
7335E12666j421541k313588q52049P06864M18295k18833M91363J396902J282969
7326C048J420988K441384J927200j371593l892344k000177J909354K627906l4077
7317C031689j459604K67829J885228N82114k072285l217982k512347j280745k19710
7308d995813O20870J178038J584441J790168R31190j268228k790368j356555J922420
7299b383837L594053K718917J697213J763805J089903j300933l107854k417707
$$ y = [-4377043, -3225532, -6101531, -9741362, -10854837, -10041487, -8964148, -6671716, -2106232, 1940702, 1642076, -2040670, -4620662, -4891656, -5945544, -8843408, -10083225, -7334603, -3528241, -2396725, -3203585, -3033403, -1680872, -873368, -630247, 97696, 512666, -908875, -3222463, -4074512, -3367648, -2949353, -3168186, -2676823, -1279921, 3048, 1424036, 3865420, 5792620, 4421027, 528683, -1471494, 437860, 3065766, 3031689, 1572085, 1839914, 3725142, 4307256, 2234971, -983011, -3495358, -4776103, -4995813, -4374943, -3196905, -1612464, 177704, 1108894, -159334, -2949702, -4306257, -2383837, 1210216, 3929133, 5626346, 7390151, 8480054, 7179121, 4071267, 1653560]
7291A653560r66901j155377k116272j616631o2955M28920k83217n95930k23163
7282d937966j44194o8361J151868K809766K871028J279061M7017j67849q46602
7273A993768k470905l380746k693734j751836j427560m84812J791175L631385
7265d793265L372574K033515J282806P69609j78934j62280J894493L445554J239506
7256H903578l047401m242170j200392J311278j44273k545669j454507J928384
7248d91172K761918N4994k083883o68694K388177L725002K831359J260414l71423
7239I406692k498773m601663m932696k488790J417171L809033K574770j134241
7231A551503l430156j692656K149458L709372J487609j587887k301923q55455
$$ y = [1653560, 686659, -468718, -2584990, -4201621, -4264576, -3835656, -4118873, -4714803, -4937966, -5082160, -5150521, -3998653, -1188887, 1682141, 2961202, 3008219, 2840370, 1993768, -477137, -3857883, -6551617, -8303453, -9731013, -10215825, -8424650, -4793265, -1420691, 612824, 1895630, 2665239, 2486305, 2324025, 4218518, 7664072, 8903578, 5856177, 1614007, 413615, 1724893, 1580620, -965049, -2419556, -491172, 2270746, 2325740, 241857, -426837, 1961340, 5686342, 8517701, 9778115, 9406692, 6907919, 2306256, -2626440, -5115230, -3698059, 110974, 2685744, 1551503, -1878653, -3571309, -1421851, 2287521, 3775130, 2187243, -114680, -970135]
7223i70135N14572P33214J96868o70795j474946j486610p55802n59322j226852
7214e699808q50411J784755M247550L223640l78902k191708m01692K095652K351864
7205D180940J140613N13363K50752q90607k151577j596838P55125K740437K715792
7196G658000R04804j499054l153320k929171r16787J158182J707681J079246M86601
7187D496182l9024j016644j638068p65611N20384J1578j673509j140276K507704
7178A262716N239644L292185j279642l314857j666539p2014r19343j914480n18032
7169A09638J454154N68868k605722l951880j642345J424904J795489k27092j748654
7160d822640j192384M81223J594945J457963O51663M74002J624252K881794K052607
$$ y = [-970135, -455563, 277651, 474519, -196276, -1671222, -3157832, -3913634, -4472956, -5699808, -6550219, -4765464, -517914, 2705726, 2326824, 135116, -266576, 1829076, 4180940, 5321553, 5834916, 6085668, 5195061, 3043484, 1446646, 2201771, 4942208, 7658000, 8562804, 7063750, 3910430, 981259, 64472, 1222654, 2930335, 4009581, 4496182, 4457158, 3440514, 1802446, 1036835, 1557219, 1568797, -104712, -1244988, 1262716, 6502360, 9794545, 8514903, 5200046, 3533507, 3461493, 2542150, 627670, 109638, 1563792, 2132660, -473062, -4424942, -6067287, -4642383, -2846894, -3073986, -4822640, -6015024, -5533801, -3938856, -2480893, -1829230, -1355228, 269024, 3150818, 5203425]
7151E203425q91271k823442j158825K350394L519608J129432j733468k064018
7143C531835o04508p9440j289248k482282k051684n43497K56233l39916j034212
7134d636719l24279J156281J223253n62792j750474l99307J894774K347310J031056
7125b0897j3155n56212j651654j991845Q48147N054866N241063K52064m284106
7116B878271l952170j628831j765167k883600j169895J644051O33852l418387
7108i661876m337030j33271M108507M400203K959575K695425K137324l92098k052754
7099b75995L86156M603125N545183K481046r29229k435858k999841l302970k439892
7090F31725n89428K63407o57372j508466n52928J323915J863656K60818j961429
$$ y = [5203425, 4312154, 1488712, 329887, 2680281, 6199889, 7329321, 5595853, 3531835, 2927327, 2847887, 1558639, -923643, -2975327, -3518824, -3262591, -3602507, -4636719, -4960998, -3804717, -2581464, -3144256, -4894730, -5294037, -3399263, -1051953, -20897, -34052, -590264, -2241918, -4233763, -3385616, 1669250, 6910313, 7162377, 2878271, -1073899, -2702730, -4467897, -7351497, -8521392, -6877341, -6243489, -9661876, -13998906, -14132177, -10023670, -5623467, -2663892, 31533, 2168857, 1776759, -275995, 110161, 4713286, 10258469, 12739515, 11810286, 9374428, 6374587, 3071617, 631725, 42297, 305704, -351668, -1860134, -2413062, -1089147, 774509, 1035327, -926102]
7081i26102k512073p07460J471144J276971j389365l476514k511932L83002K384311
7072f008018K517119J690117N23473o82571q00021Q14236K400339J733068l00189
7063A887553p52384O85998R58711j598444m445130m230544j059908K143517L158190
7054c252441K004515K7499j316203j329404m94302L04464R20146J526003J560977
7045d8746O44717J52627J708494M087111M140864J312017j440863k076951j938731
7036F540539k416280k275184n76412O28758l97063j416461M25520L182129K312067
7027F007613k112056m675761j976207K815875M375610J675808j857329l062687
7019A190866k074200j105156j360016j566848M2600K422179K122836j780115n223145
$$ y = [-926102, -3438175, -4145635, -2674491, -1397520, -2786885, -6263399, -8775331, -8392329, -6008018, -3490899, -1800782, -1277309, -1959880, -2759901, -1945665, 454674, 2187742, 1887553, 1135169, 1821167, 2779878, 1181434, -3263696, -7494240, -8554148, -6410631, -3252441, -1247926, -1220427, -2536630, -3866034, -4360336, -4055872, -3135726, -1609723, -48746, 595971, 748598, 2457092, 6544203, 10685067, 11997084, 10556221, 8479270, 6540539, 4124259, 1849075, 1272663, 1901421, 1504358, 87897, 513417, 3695546, 6007613, 3895557, -780204, -2756411, 59464, 4435074, 6110882, 4253553, 1190866, -883334, -1988490, -3348506, -4915354, -4872754, -2450575, -327739, -2107854, -7330999]
7010g330999m157493l67711J203211j11778l41408K049463L647025K077194j68205
7001c500701l94985k5456r80788j429889P68470L290449K658657L05139L77855
6992A068751K659933K863470j61838k640669k141005q85157j128963j463501j12504
6983a941483J558904J609521Q87312R78617R94544n46903k208258j206143K156411
6974B282522M419462L303871Q0507k358125k172225M30013L264190L462101K82645
6965A2994961l467599m258151j916784N70572J096502M26231l8696m75198j549595
6956C382243k502966j847254L92202K294432K127342K66244j276610j079088K37804
6947A994349R25859K11566r84396j370529o83539M50864J427738K000631K128130
$$ y = [-7330999, -11488492, -11856203, -10652992, -10764770, -11106178, -9056715, -5409690, -3332496, -3500701, -3895686, -3921142, -4901930, -6331819, -5563349, -2272900, 385757, 690896, 1068751, 3728684, 6592154, 6430316, 3789647, 1648642, 763485, -365478, -1828979, -1941483, -382579, 1226942, 2114254, 3092871, 4087415, 3540512, 1332254, 126111, 2282522, 6701984, 10005855, 10086362, 7728237, 5556012, 5986025, 9250215, 12712316, 12994961, 9527362, 5269211, 3352427, 3922999, 5019501, 5445732, 5407036, 4931838, 3382243, 879277, -967977, -575775, 1718657, 3845999, 4112243, 2835633, 1756545, 1994349, 2920208, 3131774, 2147378, 776849, 93310, 544174, 1971912, 3972543, 6100673]
6938F100673J866876J163267k77379k331878l672819k669386M39754L159991L221838
6929G000937Q83822j664697k484738j132980J242850K428398P81480k822153n473475
6920a240556n301367l163609q19095J163061K781982L438407K798946J695717
6912A353486Q87010O2643p93589o34411N89661R28697n33926j544322j22031J697994
6902A891212Q37819j575401j894143j27200J1288k517402m129267k360703M35191
6893i428606J139928K86218O6153O15583Q10754P51712J039470J054101M3307
6884c621380j207930j418410m40153J260320L267244M344533K818404p93915l394538
6875H14175k990331r67574N49092J340391J585867L72443k084473l190142j501389
$$ y = [6100673, 7967549, 9130816, 8853437, 6521559, 2848740, 179354, 619108, 3779099, 7000937, 7884759, 6220062, 3735324, 2602344, 3845194, 6273592, 7055072, 4232919, -1240556, -6541923, -9705532, -10524627, -9361566, -6579584, -3141177, -342231, 1353486, 2240496, 2303139, 1509550, 875139, 1464800, 2393497, 1859571, 315249, 193218, 1891212, 2729031, 1153630, -740513, -867713, -856425, -3373827, -7503094, -9863797, -9428606, -8288678, -8002460, -7936307, -7320724, -6509970, -5758258, -4718788, -3664687, -3621380, -4829310, -6247720, -6687873, -5427553, -2160309, 2184224, 5002628, 4208713, 814175, -2176156, -3143730, -2594638, -1254247, 331620, 704063, -1380410, -4570552, -6071941]
6866f071941P50059J334191J741607L930021N779928M046884K37282j133773N24627
6857A1138885J307014q03855l432669m319716m140157l669933k002818P41746
6849e181503K231295J320408n7654q8205L89434K45181M12073J778446K818310
6840C867785J618893j110235k984352k843317j261756O63749J724628J024148
6832F99543p35637j556389p93256j20194p80905j558112r37764L37089O98026
6823d747599M08855P91868J720149J849936Q33922l68964j004359r69607k39282
6814a725081Q64868J342852O54869l71675q26520j054587j507248j354961R6141
6805c881342J578993J471595N20448O82466J654669J208096p74938j406802Q67950
$$ y = [-6071941, -5321882, -3987691, -2246084, 1683937, 7463865, 11510749, 11748031, 10614258, 11138885, 12445899, 11642044, 8209375, 3889659, -250498, -3920431, -5923249, -5181503, -2950208, -1629800, -1687454, -1775659, -1386225, -1141044, -728971, 1049475, 3867785, 5486678, 4376443, 1392091, -1451226, -2712982, -2049233, -324605, 699543, -36094, -1592483, -2385739, -2505933, -3286838, -4844950, -5782714, -5445625, -4747599, -4338744, -3546876, -1826727, 23209, 857131, 488167, -516192, -1485799, -1725081, -860213, 482639, 1137508, 765833, -60687, -1115274, -2622522, -3977483, -3881342, -2302349, -830754, -310306, 372160, 2026829, 3234925, 2459987, 1053185, 1921135]
6796A921135L424962K907611o7896j988565j469664o54847j302451j878221r2731
6787G99333L107406M277817K008585j349890l110735l483813l936852l907139
6779e595288j623186K214240M275713K914202N01638J25421J556164K173160Q28679
6770G370743j110926k196326k571764k940422l182693k715570j626251p52104
6762i725313n63405l07211J174783L496666M369295K302424p89088j431626P60386
6753g13089K347031R47319j250530q24581J624531K345528R7604k010012j078740
6744A485061J594775K644581J166083p98372j570630j581555j596043j032551
6736C11349P44151K466937J988356p01448k938166k542256m50947P68959K35883
$$ y = [1921135, 5346097, 8253708, 8185812, 6197247, 4727583, 4072736, 2770285, 892064, 799333, 3906739, 8184556, 10193141, 8843251, 5732516, 2248703, -1688149, -5595288, -7218474, -5004234, -728521, 2185681, 2687319, 2812740, 4368904, 6542064, 7370743, 6259817, 4063491, 1491727, -1448695, -4631388, -7346958, -8973209, -9725313, -10288718, -10595929, -9421146, -5924480, -1555185, 747239, -41849, -1473475, -713089, 1633942, 2581261, 1330731, 506150, 2130681, 4476209, 4573813, 2563801, 1485061, 3079836, 5724417, 6890500, 6092128, 4521498, 2939943, 1343900, 311349, 1055500, 3522437, 5510793, 4809345, 1871179, -671077, -1122024, -353065, -117182]
6727a17182o71835o55176n2278M6732p71657j918316k287195j144515R43987K478328
6717d149107K842179K851257K696040R33601k679338n025738l245236N24809J614499
6708c637034l71180j355807K55605J182066n71705j965714k59700K180750K252981
6699b289738J578297K896803M020997J064598l981046m982763q23025K885440
6691C69563K141510n94516j607014j271443j569471j992645j047730O47307J591073
6682c333366J895875K174718J621575l96141k207462j781852M2835O00059p12333
6673b096092j664860m61070J850003K801359J523533k85144m61212P27148N74132
6664B507797k348294n323722m270267O78499M706742M242012J103758p62736o43010
$$ y = [-117182, -789017, -1444193, -1496471, -1449739, -2221396, -4139712, -6426907, -7571422, -6627435, -4149107, -1306928, 1544329, 4240369, 5173970, 2494632, -2531106, -5776342, -5251533, -3637034, -4008214, -5364021, -5108416, -3926350, -4498055, -6463769, -6723469, -4542719, -2289738, -711441, 2185362, 6206359, 7270957, 3289911, -1692852, -2515877, 369563, 2511073, 1916557, 309543, -961900, -2531371, -4524016, -5571746, -4924439, -3333366, -1437491, 737227, 2358802, 1962661, -244801, -2026653, -1983818, -1383759, -2096092, -3760952, -4222022, -2372019, 429340, 1952873, 1667729, 1206517, 1933665, 2507797, 159503, -5164219, -9434486, -8755987, -4049245, 192767, 1296525, 533789, -109221]
6655a09221p73005j952846k378026r76235O41197P24099J89528J168903L454607
6646a0999M342933K449043k6599k79979R71506O41311j653300k609043n04198
6637C320675J465026k82627l964848m709133j517005J861945K892804L108146
6629B174983M059644M188963J830990j429138k851300k219822j280012q47104
6621C627204m65597l3136o8628q43681k156723l221531k452894J014367M973909
6612C73290N460898J713008k222874k482179k7776J617240J313172M39595m16357
6603E768017j900641l533120l583441j495356J337158L197553L134534R43555
6595C868259k413326m798423m689983k586700K08651K982081M700095L721095
$$ y = [-109221, -882226, -2835072, -5213098, -6189333, -5548136, -4824037, -4634509, -3465606, -10999, 4331934, 6780977, 6754378, 6474399, 7445905, 8087216, 6433916, 3824873, 3320675, 4785701, 4503074, 538226, -4170907, -5687912, -3825967, -933163, 2174983, 6234627, 10423590, 12254580, 10825442, 7974142, 5754320, 4474308, 3627204, 3161607, 3128471, 3059843, 2216162, 59439, -3162092, -5614986, -4600619, 373290, 5834188, 7547196, 5324322, 2842143, 2814367, 4431607, 5744779, 6184374, 5768017, 3867376, 334256, -3249185, -4744541, -3407383, -209830, 2924704, 3868259, 1454933, -3343490, -8033473, -10620173, -10411522, -7429441, -2729346, 991749]
6587I91749N36417j135512J062687L991098L007403j017461k938521j298043j64247
6578C035570j895188k953396K07592M864453N548795J716813k068457k779371
6570E676811k062624k442712l481445l102192r49232J164930J601072O32704j44870
6561c107558L41804J518032J766597J21959k558315m021736k441904J632544N104181
6552a644396M992817J788526q07316l11892J528538J553205k40620j273826q00575
6543D784461o58358j382672r93574R92795J677448n94866k520477k88037M054569
6534E071289M899942J227279j973672j245340O05396m46230l303152l851303j367731
6525c83522R55178J209589Q69142J278364J272264l14604k161553k334968j139730
$$ y = [991749, 1528166, 392654, 1455341, 5446439, 8453842, 7436381, 4497860, 3199817, 3035570, 1140382, -1813014, -1605422, 3259031, 8807826, 10524639, 8456182, 5676811, 3614187, 1171475, -2309970, -5412162, -6361394, -5196464, -3595392, -2962688, -3107558, -2765754, -1247722, 518875, 640834, -1917481, -5939217, -8381121, -6748577, -1644396, 3348421, 5136947, 4329631, 4017739, 5546277, 7099482, 6858862, 5585036, 4784461, 4126103, 2743431, 1749857, 2742652, 4420100, 3825234, 1304757, 1016720, 5071289, 9971231, 11198510, 9224838, 7979498, 8584894, 8138664, 4835512, 984209, -383522, 571656, 1781245, 2650387, 3928751, 5201015, 4886411, 2724858, 389890, -749840]
6516g49840l23169m52126p64354q97964j069394r40665J3721J080571Q10274p90967
6506d083913j853676q88539J457748L261580L270739J791140K15322k35580K41878
6497C176699J91215j242201l056331l635301k572097m00986K462197N044944N148685
6488E116824J681116k699763l820253j166394J534411J429297j96232p24561O8393
6479A222838N81775j05856j790322l782533m740931l260860J37382K872553L209726
6470e656228K057692J089041O35983L12080M0704m12914j223503j257501P40595
6461c674051L217550L031797M64344o21507R02058J261758j494464l244681l53937
6452e11133L620769L073367q86188k661712j016949M48553L48061P18870J641425
$$ y = [-749840, -1073009, -1525135, -2289489, -3187453, -4256847, -5197512, -5183791, -4103220, -3292946, -4083913, -5937589, -6826128, -5368380, -2106800, 1163939, 2955079, 3170401, 2934821, 3176699, 3367914, 2125713, -930618, -4565919, -7138016, -7539002, -5076805, -31861, 5116824, 6797940, 4098177, 277924, -888470, 645941, 2075238, 1879006, 1154445, 1222838, 1804613, 1698757, -91565, -3874098, -8615029, -11875889, -11738507, -8865954, -5656228, -3598536, -2509495, -1873512, -1561432, -1520728, -1933642, -3157145, -4414646, -3674051, -456501, 2575296, 3039640, 2418133, 3320191, 4581949, 3087485, -157196, -511133, 3109636, 6183003, 5296815, 2635103, 1618154, 2066707, 2414768, 3133638, 4775063]
6443D775063Q33861j182003j401841k18221j013600l277683k553952J444468L366967
6434G73059J089448o48907J341600L147815Q97667k376009k151093J66936P15898
6425B956414j7486M92446J180002n9961j049676J348127M692709L892338o47102
6416A2787811l684027l132488j722065j156864l03892O93259q633j624855j069589
6407G78657J534263K494436O78733p91726k33450N9940j260687j877128m25042
6398I57996M98564j070433k587640j074738J895801K711740R59186j044100k081590
6389h35214k340239j431770Q41396K765354K463985O51279n81463q48839j158309
6380d73820j424525o86560O75072J128548K36345r89353j680974j592404n06283
$$ y = [4775063, 5608924, 4426921, 3025080, 2806859, 1793259, -1484424, -4038376, -2593908, 773059, 1862507, 1213600, 2555200, 5703015, 6600682, 4224673, 2073580, 2240516, 2956414, 2938928, 3431374, 4611376, 4551415, 3501739, 4849866, 9542575, 13434913, 12787811, 9103784, 5971296, 4249231, 3092367, 2788475, 3481734, 3473101, 1848246, 778657, 2312920, 4807356, 5486089, 4694363, 4460913, 4520853, 3260166, 1383038, 957996, 1456560, 386127, -2201513, -3276251, -1380450, 1331290, 2290476, 1246376, -835214, -3175453, -4607223, -3765827, -1000473, 1463512, 2114791, 1533328, 684489, -473820, -1898345, -2584905, -1909833, -781285, -544940, -1534293, -3215267, -4807671, -5313954]
6371e313954J307860K567749K367466J486297R46795K09570j516007l199336l328428
6362d471988k469837k133608j797130J67228K904336L519718J501274k74512K11456
6353b843063J681366K459830K929603L476376K784151M35233j213486m25893P23621
6344A0007738l88939k317179j891268Q9209q1169k516873l121397n13593J168020
6335D34549j182254m391979l870471n99675J026285L65724P55006L176841M466689
6326A80715K691927L09051J86714J477248J563943N0493j300590j370827p04060
6317C084614m12254j126592k430690k896152j614401K38142Q17857N04327J175082
6308b660067K454472J736738j044987k149362L49504L057635K538785R64025K079680
$$ y = [-5313954, -4006094, -1438345, 929121, 2415418, 3362213, 3571783, 2055776, -1143560, -4471988, -6941825, -9075433, -10872563, -10705335, -7800999, -4281281, -2780007, -3054519, -2843063, -1161697, 1298133, 4227736, 7704112, 10488263, 10923496, 9710010, 9284117, 10007738, 9618799, 7301620, 5410352, 5499561, 5418392, 2901519, -219878, -733471, 434549, -747705, -5139684, -9010155, -9609830, -8583545, -8217821, -7462815, -4285974, 180715, 2872642, 3181693, 3368407, 4845655, 6409598, 6460091, 5159501, 3788674, 3084614, 2672360, 1545768, -884922, -3781074, -5395475, -5157333, -4339476, -3835149, -2660067, -205595, 1531143, 486156, -1663206, -1313702, 1743933, 4282718, 5246743, 7326423]
6299G326423L909929J291377m851913p067884j926349M459868M749933L6188l025236
6290D902336j910674j59561p24357k266489k703591k432731k360011j711181O2104
6281i304155J361443Q08976j6563J118293L021777K397208p99718k632526r14932
6272d960197J400168P32501j696516j984349M56850K522034K449440J666390J390896
6263A977217Q68221j50853m82328l52084j866521m774852n054177n19478M840113
6254e514742N500370J552936k122915k467307o51249J128084J833608J026988
6246B85773p81641j557641k80692O88367j141393l804462l466154q79958m71433
6237a1409234k808477l315118J16055L579589L767869L034844M152439M606213
$$ y = [7326423, 11236352, 12527729, 7675816, 607932, -1318417, 3141451, 7891384, 7927572, 4902336, 2991662, 2832101, 2107744, -158745, -2862336, -5295067, -7655078, -9366259, -9304155, -7942712, -7133736, -7150299, -6032006, -3010229, -613021, -1412739, -4045265, -4960197, -3560029, -2827528, -4524044, -6508393, -6051543, -3529509, -1080069, 586321, 1977217, 2845438, 2694585, 2212257, 1860173, -6348, -4781200, -9835377, -10354855, -5514742, -14372, 1538564, -584351, -3051658, -3702907, -2574823, -741215, 285773, -495868, -2053509, -2334201, -1645834, -2787227, -6591689, -10057843, -10937801, -11409234, -14217711, -17532829, -17416774, -13837185, -10069316, -7034472, -2882033, 1724180]
6229A724180J175923l147976k730881J915655M775419L302085J069656Q56750
6221H940811O57891j392005k961790j609366O23790L97507j516835j820553k69448
6212A050002J94889j498653k986354k438402r50327L6564Q95302J847070J317320
6203b532589j467458l945517k940668Q16337L327168K320910m86918k147395j512994
6194h569124O64173K750237K995959J118903n07698Q15687M138581N396031K687001
6185A1489750j318637l388452l643826l722305l453091j919901j42167Q6016q93159
6176f905772j259889n81615R2171K87476L23623K83540N31986K078985M498062
6167f51433N050128K348368p30060q18842P44653J08711k821618m410781l146950
$$ y = [1724180, 2900103, -247873, -2978754, -1063099, 3712320, 7014405, 8084061, 8940811, 9598702, 8206697, 5244907, 3635541, 4259331, 4656838, 3140003, 1319450, 1050002, 1244891, -253762, -3240116, -5678518, -6628845, -6592281, -5696979, -3849909, -2532589, -4000047, -7945564, -10886232, -10069895, -6742727, -4421817, -4908735, -7056130, -8569124, -7904951, -5154714, -2158755, -1039852, -1547550, -731863, 3406718, 8802749, 11489750, 10171113, 6782661, 3138835, -583470, -4036561, -5956462, -6098629, -6012613, -6905772, -8165661, -8747276, -8655105, -8367629, -8044006, -7760466, -7228480, -5149495, -651433, 4398695, 6747063, 6017003, 5198161, 5942814, 6051525, 3229907, -1180874, -4327824]
6158d327824j234724k01061Q76417K101639J813428P2901n69244Q84149K339354
6149A755035K245231J511603Q26728m43568j638037q57426J100294Q68293j892522
6140C475631l308357j635370j62547j132413j577873J049076L531954J874379
6132B114480j896379l024709j455032p01041j213157k55139K550555M517372M381722
6123E018672L180894J040837k639663n947987n686940k259691M82157Q11363R61703
6114e038655K664088M309583L867641J897496K25021m61902o07078p48935j127007
6105D980252j423145j000453j83869l53269j610954j874647r915J908771J694904
6096B127675M69605K15236j2785j823689l207044r18562L680977N630754L161779
$$ y = [-4327824, -5562548, -5763609, -4887192, -2785553, -972125, -899224, -1468468, -584319, 1755035, 4000266, 5511869, 6338597, 5895029, 4256992, 3399566, 4499860, 5368153, 3475631, 167274, -1468096, -1630643, -2763056, -4340929, -3291853, 240101, 2114480, 218101, -2806608, -4261640, -4962681, -6175838, -6430977, -3880422, 636950, 5018672, 8199566, 9240403, 6600740, 652753, -5034187, -7293878, -6811721, -6000358, -5038655, -2374567, 1935016, 5802657, 7700153, 7925174, 7463272, 6856194, 6107259, 4980252, 3557107, 2556654, 2372785, 2019516, 408562, -1466085, -1476000, 432771, 2127675, 2597280, 2812516, 2799731, 976042, -2231002, -3149564, 531413, 6162167, 9323946]
6087I323946m77253k032196j375757L02727J714919J001924k194870m510398k724293
6078i71251P24392Q00504k077091k741751j65596R26036j275210k264171N85432
6069f458706K951761R67929j910609o73203K991693L869975J529234j64970J94303
6060C297407N50360j3765l12633j26703l95943q28408n09374k02296j168497k597492
6050b307344k878678k265684j739486q37202O50174Q54141j005677j806437J101771
6041a0234422M636896L850419k50915j957661N63873L313856L362820K312969
6033E597835J732860L99396j818715k085202N02720K096336m15036m135186m023104
6024b148096L3512L532745L532290J311706o07879j343362j387588j345985j315040
$$ y = [9323946, 8846693, 6814497, 5438740, 5741467, 7456386, 8458310, 6263440, 1753042, -971251, -246859, 553645, -1523446, -4265197, -4430793, -3504757, -4779967, -7044138, -6458706, -3506945, -2539016, -4449625, -5122828, -2131135, 1738840, 3268074, 3103104, 3297407, 3847767, 3834002, 3521369, 3394666, 2998723, 2170315, 1660941, 1458645, 290148, -2307344, -5186022, -7451706, -9191192, -10028394, -9378220, -8524079, -9529756, -11336193, -10234422, -5597526, -1747107, -1998022, -3955683, -3391810, -77954, 3284866, 5597835, 7330695, 7730091, 5911376, 3826174, 4328894, 6425230, 6010194, 1875008, -2148096, -2114584, 1418161, 4950451, 6262157, 5654278, 4310916, 2923328, 1577343, 262303]
6015B62303p47168P75536K271169K002919P2292j177721m56836N20024q387p65889
6005B748242K74570J921469J176047j870464l780623k808682j169446j182476
5997d691363j890792j319486J03258P17539P36886J611160L066434L358998K268575
5988C961209J354226J083586K62550j107191j147840M17679P94530j702572m219217
5979c03040k987288J115448L838204L506908K223961J417558O4635j926348k346970
5970D603068m03188J377145J024100R1958M21410P44385m83251j414509J61422
5961F122540J965290o564m554579n987524k343505J783875K321946J254745K149769
5952B705993L749306K271295j776992l683671j383224J708569J808745l65951
$$ y = [262303, -484865, 290671, 2561840, 4564759, 4637051, 3459330, 3002494, 3522518, 3514131, 2748242, 3022812, 4944281, 6120328, 4249864, 469241, -2339441, -3508887, -4691363, -6582155, -7901641, -7798383, -7080844, -6343958, -4732798, -1666364, 1692634, 3961209, 5315435, 6399021, 6661571, 5554380, 4406540, 4824219, 5618749, 3916177, -303040, -3290328, -2174880, 1663324, 5170232, 7394193, 8811751, 8876386, 6950038, 4603068, 4199880, 5577025, 6601125, 6693083, 7114493, 7858878, 7375627, 5961118, 6122540, 8087830, 8081266, 3526687, -2460837, -4804342, -3020467, -698521, 556224, 2705993, 6455299, 8726594, 6949602, 3265931, 1882707, 3591276, 5400021, 5034070]
5944E034070j674927j288961r53704j545196j757815l57763J947858L469907L389249
5935F262718K200685J002499O29452Q44173K55237k107266m959268n689266l666153
5926e227189j282413o43112n80635J236285M151054M905052K213936j359112k827438
5917E86428k123293r69319j67419M75939Q02041O20003O51930J528474K293711
5908C698495J538227j79360p72487K91107J099038K87971o88608J20319J609352
5899G004054P24984k710086m768177k516278J610041L019830J316153Q7449O58522
5890D426492K95357k017508k511486J309802N216291L693998j451580l577573
5882E383793j327263j4455k230349l559283l95301L611406L228767l25592j966715
$$ y = [5034070, 3359143, 2070182, 1116478, -428718, -2186533, -2544296, -596438, 2873469, 6262718, 8463403, 9465902, 10095354, 10939527, 11194764, 9087498, 4128230, -1561036, -5227189, -6509602, -7152714, -7733349, -6497064, -2346010, 2559042, 4772978, 3413866, 586428, -1536865, -2506184, -2673603, -2197664, -1395623, -775620, -123690, 1404784, 3698495, 5236722, 5057362, 4284875, 4575982, 5675020, 5962991, 5274383, 5394702, 7004054, 7729038, 5018952, 250775, -2265503, -655462, 2364368, 3680521, 3767970, 4426492, 4721849, 2704341, 192855, 1502657, 6718948, 10412946, 8961366, 5383793, 4056530, 4042075, 1811726, -1747557, -2142858, 1468548, 4697315, 4371723, 2405008]
5873B405008p13880J7318j214397k088812j040505N43287J250723J477904J473250
5864B109896K84832k174760m008928l478765j066623J331759K365742J978067
5856b658780R96215K91813p1635p37739j810233k332882j597014k66704M97621
5847g689338L92221r3782l23210K54295J466082J871648M15912j264078m73660
5838e443910K139162K778568K51568j885657j006666L73280o80632j928180L77545
5829e024922M513863N249948J896310q40836l06884O94177p76795l240322l659402
5820a494863j886509r4443L48330k42406q51219n70911O08460J430334Q41590
5811a911637k64097j49502J127645J760815P52052j049101k217187j761359M66319
$$ y = [2405008, 1691128, 1708446, 494049, -1594763, -2635268, -2091981, -841258, 636646, 2109896, 2394728, 219968, -3788960, -7267725, -8334348, -7002589, -4636847, -2658780, -1662565, -1370752, -1442387, -2180126, -3990359, -6323241, -7920255, -8186959, -7689338, -7297117, -7390899, -7714109, -7459814, -5993732, -4122084, -3706172, -4970250, -5443910, -3304748, -526180, -274612, -2160269, -3166935, -2793655, -3474287, -5402467, -5024922, -511059, 4738889, 6635199, 5794363, 5487479, 6181656, 5404861, 2164539, -1494863, -3381372, -3475815, -3127485, -3369891, -4221110, -4792021, -4183561, -2753227, -1911637, -2175734, -2325236, -1197591, 563224, 1315276, 266175, -1951012, -3712371, -3246052]
5802c246052K937739L057912L68499k052592j403688J020177K132237J542081
5794D356313Q82867K96651r74263j842278r39674K39677l51789j128953O07183
5785A145734L166515K622653k64205j005681P96834P72815k252522l955608j984015
5776i57480L60406M16323L25003J743920J893985j192912m197586l508523p72773
5767e889637N78823P36616J429468J822235O01390p96550q60389r56292k008485
5758e342821j653900J221136K734568k54675l867992k315280L089591N923969
5750d65404M068628J142795n68894k454617m601281m297594r74235J934701J851728
5741d364173L57351J46372J469286K869322L266864K387925P66430l69634n65866
$$ y = [-3246052, -308313, 2749599, 3118098, 1065506, -338182, 681995, 2814232, 4356313, 5239180, 5535831, 4561568, 2719290, 1779616, 2019293, 1667504, 538551, 1145734, 4312249, 6934902, 6670697, 5665016, 6461850, 7234665, 4982143, 1026535, -957480, -597074, -180751, 144252, 1888172, 3782157, 2589245, -1608341, -5116864, -5889637, -5310814, -4574198, -3144730, -1322495, -721105, -1517655, -2378044, -3334336, -5342821, -6996721, -5775585, -3041017, -3295692, -7163684, -9478964, -6389373, -465404, 3603224, 4746019, 4177125, 1722508, -2878773, -7176367, -8150602, -6215901, -4364173, -4006822, -3860450, -2391164, 478158, 3745022, 6132947, 6899377, 6529743, 5963877]
5732E963877r84044k243713k644172p53892J574380J566956k28671j106798n99491
5723E44432m01707p22413l10679K89840p97374l004412l478347j391077R74878
5714h296859J750077J227077K704j624061k245069m24150K424988L135066J166644
5705b883583q11943r38649K8344J028369J854143J770416M9443j754333j140249
5696b798042J322922K452526J332201L43850O84905N30733j102108k243876j531804
5687a008693p31741j548937k519125j396382J253978K912545K201086l22272l069287
5678d228828l990392j798883K171251M640075L851773J212017r63459j814835
5670i21281j674105j125767q02633o74786M30399K903341M454022K615541j185366
$$ y = [5963877, 4979833, 2736120, 91948, -661944, 912436, 2479392, 2250721, 1143923, 544432, 142725, -579688, -890367, -600527, -1397901, -4402313, -7880660, -9271737, -8296859, -6546782, -5319705, -5317001, -6941062, -9186131, -9610281, -7185293, -4050227, -2883583, -3695526, -4634175, -4605831, -3577462, -1723319, 47097, 96540, -1657793, -2798042, -1475120, 977406, 2309607, 2653457, 3338362, 3869095, 2766987, 523111, -1008693, -1740434, -3289371, -5808496, -7204878, -5950900, -3038355, -837269, -1159541, -4228828, -8219220, -10018103, -7846852, -3206777, 644996, 1857013, 893554, -921281, -2595386, -3721153, -4523786, -5198572, -4768173, -1864832, 2589190, 5204731, 4019365]
5661D019365l071287k248213j717745k981744l692384j821200J165204K877947
5653g470057K862688J472073j165963l568659l313942o94855J028431O31547P65363
5644i453374K758242L423067K61592l473339l009287Q80417L270020K247679N97205
5635b497778P47868J765293J817124P99225l06004q71314q17156m38304j97792
5626A162j12939J87888L68947n29226k215869k813473j441094L42780Q78581O48033
5616d685210Q07248J044092N23549l76361q75738j107805j199229m55079J044986
5607e279547J616066M54669o31550P7850J343690J052488j55148Q7523K001013
5598E67054L338752K712097J138346K28717L99339R15049O51108r43676k914244
$$ y = [4019365, 948078, -1300135, -3017880, -5999624, -9692008, -11513208, -10348004, -7470057, -4607369, -3135296, -4301259, -7869918, -11183860, -11878715, -10850284, -10218737, -9453374, -6695132, -3272065, -3010473, -6483812, -9493099, -8612682, -5342662, -3094983, -2497778, -1749910, 15383, 1832507, 2631732, 2325728, 1454414, 637258, 198954, 1162, -111777, 76111, 445058, -84168, -2300037, -5113510, -6554604, -6211824, -5333243, -4685210, -3877962, -2833870, -2310321, -2686682, -3562420, -4670225, -5869454, -6324533, -5279547, -3663481, -3208812, -3840362, -3762512, -2418822, -1366334, -1521482, -1433959, 567054, 3905806, 6617903, 7756249, 7984966, 8384305, 9299354, 9950462, 9006786, 6092542]
5589F092542l486737k303342r15391m31694j71833N07722Q81138N36888M35261
5580A144554Q08417J04449k098444l271223j439613J364318J937082O81910M88509
5571b80041J848356K338744P60375j123334j370850k37011O91669K82923j373623
5562A537208k963728k964467j420149K6975N17937J042511K236825K884547J971844
5553B869503M82036l47842p33265q70531l5909J129172J75963k937760m083731
5544d352364n53677M207248N079071K169537o38731j776344k183430j416826J316563
5535A851047L463914J771308j943137k884979q75271l78957k698262l899393j776214
5526g369944N74374J92676j461251j977222j570025q44173J091157L707287L821402
$$ y = [6092542, 2605805, 302463, -612928, -1044622, -1216455, -708733, 172405, 709293, 1144554, 1952971, 2057420, -41024, -3312247, -4751860, -3387542, -1450460, -768550, -280041, 1568315, 3907059, 4667434, 3544100, 2173250, 1936239, 2627908, 2910831, 1537208, -1426520, -4390987, -5811136, -5784161, -5266224, -4223713, -1986888, 897659, 2869503, 3351539, 3003697, 2270432, 1399901, 1363992, 2493164, 2669127, -268633, -4352364, -4906041, -698793, 4380278, 6549815, 5911084, 4134740, 1951310, 534484, 1851047, 5314961, 7086269, 5143132, 2258153, 1382882, 1003925, -1694337, -5593730, -7369944, -6795570, -6602894, -8064145, -10041367, -11611392, -12455565, -11364408, -7657121, -3835719]
5517c835719J12606l987410m519557j741533J372824K872371K267048k5994j783811
5508i269175l12330L405006M787814J884912j571906j631071N62488J685380J412911
5499I54029J393812J597265J132159O82765Q59883L4728k882937n311529m142283
5490e682108n82619J573224J281626M92368K53348J41048O51359K433308L659671
5481D221225J890840j559757k732330o52014J679423K319504K719799L964603
5473A1851293M225378J928436j249824k838270l112982l833137m669152l443241
5465a141499J15405K951569K112415j244231k731987j37886L255013K472103k367194
5456C283708n589991l255808J648631L444775J163265j291165j208662J42312
$$ y = [-3835719, -3723113, -7710523, -12230080, -13971613, -12598789, -9726418, -7459370, -7485364, -9269175, -9581505, -6176499, -1388685, 496227, -1075679, -2706750, -2144262, -458882, 954029, 2347841, 3945106, 5077265, 5760030, 6619913, 6654641, 3771704, -1539825, -5682108, -6264727, -4691503, -3409877, -2917509, -2664161, -2523113, -1871754, 561554, 4221225, 6112065, 4552308, 1819978, 1167964, 2847387, 5166891, 7886690, 11851293, 16076671, 18005107, 16755283, 13917013, 10804031, 6970894, 2301742, -1141499, -1026094, 1925475, 4037890, 2793659, 61672, -76214, 3178799, 5650902, 3283708, -2306283, -5562091, -3913460, -468685, 694580, -596585, -1805247, -1662935]
5448a662935P29049M95607J06512m16503p06590J86711J888336K315610M15105
5439C350902k122035k983979j892967j85881J084831J587031J236676M13021L9370
5430E26969N59720J242704J089174L2954j126295j558160j019904j62661j70923
5421e86422j402651k589301k322482j039095k79582k77399P7204J036985J778798
5412e603945K454501L988798N270703L485569j193273m090533j796065K684290
5404E200045L656385K29952l265216l607389j860084j88878R05359J222672q7054
5395B205792k474207l432901j773826M67628J039320N28593O16917J101730Q88619
5386h32335N21917J222398K286809J918135J88282j079297j061359m61621L03798
$$ y = [-1662935, -933886, -438279, -331767, -748270, -1454860, -1268149, 620187, 2935797, 3350902, 1228867, -1755112, -3648079, -3833960, -2749129, -1162098, 74578, 487599, 526969, 1086689, 2329393, 3418567, 3451521, 2325226, 767066, -252838, -415499, -586422, -1989073, -4578374, -6900856, -7939951, -8219533, -8496932, -8419728, -7382743, -5603945, -3149444, 839354, 6110057, 9595626, 8402353, 4311820, 2515755, 5200045, 8856430, 9086382, 5821166, 2213777, 353693, 164815, 1070174, 2292846, 2205792, -268415, -3701316, -5475142, -5007514, -3968194, -3439601, -2822684, -1720954, -832335, -310418, 911980, 3198789, 5116924, 5305206, 4225909, 3164550, 2702929, 3006727]
5377C006727J153036R19674j451757m228606m220605j329584R88951O92795k16256
5368d685625N92747K133901K189805Q60945k80122r25257j516292j233173R28914
5359a934157L581723L780174O98607k945898l509005o7906M269350M898965Q08150
5350I580003l182577j641236L864294N857281R84821n053743n480993j576616
5342C351234M46754j171729k740081j941536j90041J414929L266356M155664K044261
5333H635811j340143j632937J216988K081249j353547m548414k887402J656674
5325A828279L982805K670834j13436k769169m712429m685709k108309J049612
5317d857522K437029K242222J841344J145007l98059j736165j570624m31203P02538
$$ y = [3006727, 4159763, 5079437, 3627680, -600926, -4821531, -6151115, -5162164, -4469369, -4685625, -4092878, -1958977, 230828, 1091773, 811651, -113606, -1629898, -2863071, -1934157, 1647566, 5427740, 6126347, 3180449, -328556, -396462, 3872888, 8771853, 9580003, 6397426, 4756190, 8620484, 14477765, 15462586, 10408843, 4927850, 3351234, 3797988, 2626259, -113822, -2055358, -2245399, -830470, 2435886, 6591550, 8635811, 7295668, 5662731, 6879719, 8960968, 7607421, 3059007, 171605, 1828279, 5811084, 8481918, 8368482, 5599313, 886884, -3798825, -5907134, -4857522, -2420493, -178271, 1663073, 2808080, 2410021, 673856, -896768, -1327971, -625433]
5308f25433K220224M131610M415366J823757j293428j846788l36059N11416O1846
5299I062511l59016p48665k166450l797090l571348j550149K07019R58398J669909
5290b94881K318669J742389K57798l71250J21038J02107j143824k543713l337133
5281c148800l725182l337761j457366J093243K643359L245917M059705M379719
5273C752834K410830p97258j715764M00310J998073M87187k079253k503468q96661
5264A056830N67398J044138Q42672j85971j708359j986777k17831J657667J704018
5255B773785R59230J154240J182523q44124l229843k438027R45406K279897q4046
5246B699041k023934j65249K586724J667436j665658k164412J121611L449345
$$ y = [-625433, 1594791, 5726401, 10141767, 11965524, 10672096, 8825308, 8489249, 9000665, 9062511, 8703495, 7954830, 5788380, 1991290, -1580058, -3130207, -2923188, -1964790, -294881, 2023788, 3766177, 4023975, 3652725, 3773763, 3875870, 2732046, 188333, -3148800, -6873982, -10211743, -11669109, -10575866, -7932507, -4686590, -626885, 3752834, 6163664, 5366406, 3650642, 4050952, 6049025, 6536212, 4456959, 1953491, 1056830, 1624228, 2668366, 3511038, 3325067, 1616708, -370069, -587900, 1069767, 2773785, 3733015, 4887255, 6069778, 5225654, 1995811, -442216, 503190, 2783087, 2699041, 675107, 509858, 3096582, 4764018, 3098360, 933948, 2055559, 5504904]
5238E504904J988838k3359Q56476K311960P4685m747254o679031l514847J164186
5229c063442L357706K877968J389630m08698k124765k852231k635123k647120
5221f106075k694246r46872K430810M090278K025099j105526j618960K55835J631082
5212b038575J284209L1295j474608k436946j142656K234384L710111K96178m444474
5203c981082m178923J152742M864459K827364j436046k719325r40105P77445J454378
5194b179093K201386K842115K082393K85444p20952m34937j68158p65645j560303
5185A582250j738737j344058o25014M96415J815183K434223J608270j99934j605573
5176B423025j775293j254714r79947q57130j34327J000098J449645J115629J316535
$$ y = [5504904, 7493742, 7470383, 8326859, 10638819, 10713504, 5966250, -712781, -4227628, -3063442, 294264, 3172232, 4561862, 4153164, 2028399, -823832, -3458955, -6106075, -8800321, -9747193, -7316383, -3226105, -1201006, -2306532, -3925492, -3669657, -2038575, -754366, -723071, -2197679, -4634625, -5777281, -3542897, 167214, 463392, -3981082, -8160005, -7007263, -2142804, 684560, -751486, -3470811, -4410916, -3633471, -2179093, 22293, 2864408, 4946801, 5232245, 4511293, 4076356, 3908198, 3142553, 1582250, -156487, -1500545, -2125559, -1629144, 186039, 2620262, 4228532, 4028598, 2423025, 647732, -606982, -1586929, -2444059, -2578386, -1578288, -128643, 986986, 2303521]
5167B303521K526759L121749J582371j216033l200280l499306k391801j73299
5159i46319K316840L300664K056324K27785o09760j259391k684574l282797j383074
5150b264302J028395Q15260r66463m49797K496911L698325J430498r07654p29657
5141D151516m55836k722292m995680l113660J774925M117577J500874k301186
5133b043762k634763K58469K313678J150687j301863j738953L82792K755473L572874
5124B714632L150278K056677m9643k519845k995030p40724J300064M90203j315869
5115B090743r41977M33468p97682l860032l871997L88337L966849K839267o87583
5106d40607k107200p51935J007015J804326J728967P16069j090439k743834l746121
$$ y = [2303521, 4830280, 7952029, 9534400, 8318367, 5118087, 1618781, -773020, -946319, 1370521, 4671185, 6727509, 6955294, 6345534, 5086143, 2401569, -881228, -2264302, -1235907, -420647, -1387110, -1836907, 660004, 4358329, 5788827, 4881173, 4151516, 3695680, 973388, -4022292, -7135952, -5361027, -1243450, 257424, -2043762, -4678525, -4420056, -2106378, -955691, -2257554, -3996507, -3613715, -858242, 2714632, 5864910, 7921587, 7871944, 5352099, 2357069, 1616345, 2916409, 3406612, 2090743, 1148766, 1582234, 784552, -3075480, -6947477, -6559140, -2592291, 246976, -440607, -2547807, -3299742, -2292727, -488401, 1240566, 1956635, 866196, -1877638, -5623759]
5097e623759m252221l256024O94063N724245O917959K656203k268054k635744
5089b043332N70611K455432R81775j692916l006725k004513J185198M861945N657322
5080F964797J873807l477296n453652k813948J035913K344498N63965j940973
5072i02889k242346N89039M145411M737301J704736j656473k466619j671371j568414
5063F68375k029433j491548j38647M43717j56774j081401j747414j598814M61870
5054f670069M188439O619892N016861N40902l106774m052547l211909j698539
5046b373744K50925J969197K306602J323381M83639P41024J378744R59700j002522
5037F036946l146659l086315n1130L358761L610495N92104k398732l247271l027556
$$ y = [-5623759, -9875980, -13132004, -12437941, -6713696, 204263, 2860466, 592412, -2043332, -1472721, 982711, 1964486, 271570, -2735155, -4739668, -3554470, 1307475, 6964797, 8838604, 5361308, -92344, -2906292, -1870379, 474119, 1038084, -902889, -3145235, -2556196, 1589215, 6326516, 8031252, 6374779, 3908160, 2236789, 668375, -1361058, -2852606, -2991253, -2547536, -2704310, -3785711, -5533125, -7131939, -6670069, -2481630, 4138262, 9155123, 9696025, 6589251, 2536704, -675205, -2373744, -2122819, -153622, 2152980, 3476361, 3960000, 4701024, 6079768, 7039468, 6036946, 2890287, -196028, -247158, 3111603, 6722098, 7314202, 4915470, 1668199, -1359357]
5028a359357k757894j363885J408283L082298J948899P8859K13273J638486J776755
5019D665717J55159j714623k775108k406917J48185L785251M878155J574620k820504
5010E489935l734795j237649R08441Q35851K9093k9860L38228L40683l64819j702664
5000H72444k643098j751094L92253J230966K82620M47685K908385L859763k2755
4991E577169n443003o229534j639076L385163N122860M004475J477627j611637
4983D644044l554925k709960l94770K74060j267214k480381j476800J108487L652319
4974b205140M683818L195910R8068j636172n60296R09345K30183j069013q8206
4965C558497K308674K741534M93431k078071l282860l045190j400703P44886R14090
$$ y = [-1359357, -4117251, -5481136, -4072853, -990555, 958344, 1037203, 1250476, 2888962, 4665717, 4820876, 3106253, 331145, -2075772, -1927587, 1857664, 6735819, 8310439, 5489935, 1755140, 517491, 1425932, 2261783, 2290876, 2261016, 2599244, 2939927, 2575108, 872444, -1770654, -3521748, -3129495, -1898529, -1615909, -1168224, 1740161, 5599924, 5577169, 134166, -6095368, -7734444, -4349281, 773579, 4778054, 6255681, 4644044, 1089119, -1620841, -2015611, -1741551, -3008765, -5489146, -6965946, -5857459, -2205140, 2478678, 5674588, 5772656, 4136484, 3576188, 4485533, 4715716, 3646703, 3558497, 5867171, 8608705, 9102136, 7024065, 3741205, 696015, -704688, 40198, 954288]
4956I54288j523047l009370m71716L651905M958275L468730K093184R97322j352894
4947I766677l377949k237903O32508J294645k50333o87042M03681L69063j157854
4938D755493k075079k313260l163616k955205Q24998N688902O409015K909076
4930A0080324N0066k64616p58635k523095l185471j893691n96390J20724J430591
4921B459807K598430J928135P19345J139185J518557m81893j957270J137615N768218
4912A4830129N410432N83688k222755j128242q7764m66360M759O23620j168337
4903A6379170k955985n64234L293905L056898Q71095K430373M916846J599712
4895B9027780l986488k806003K524928J320978n337332n824720Q82929M125632
$$ y = [954288, -568759, -3578129, -4049845, -397940, 4560335, 8029065, 10122249, 11119571, 9766677, 6388728, 4150825, 4783333, 6077978, 5827645, 5140603, 5544284, 5913347, 4755493, 2680414, 367154, -2796462, -5751667, -4926669, 762233, 7171248, 10080324, 10130390, 9865774, 9107139, 6584044, 3398573, 1504882, 908492, 1029216, 2459807, 5058237, 6986372, 7705717, 8844902, 10363459, 9881566, 7924296, 9061911, 14830129, 20240561, 20824249, 18601494, 17473252, 17385488, 16919128, 16923887, 17547507, 16379170, 13423185, 12858951, 16152856, 19209754, 20080849, 22511222, 27428068, 29027780, 25041292, 22235289, 24760217, 26081195, 20743863, 14919143, 15802072, 19927704]
4887A9927704K473633N098685J0521159P032728k381724j142763R811588J0722405
4879F2063415K47962R11975J5881649J9117815P530247J7384737N4701448N5944929
4871B33784177k6167765j30099451j47606807o6966133J5027015K7506171K824017
4864i1698776r4934J6241831J6809877K524205j03153R363635R618446o24943
4856c7963812l544146L189728N232766K81367j25980N161853N598949N71326K97476
4847b1300473N385428N399298j473586n276031k245066J51246j862268k734755
4839b3956207O08560L606062L127781J518599K53554j428932j602487J801744
4831a6071326M592949J636699l154801k119415K700530K480228l066472n195853
$$ y = [19927704, 22401337, 27500022, 38021181, 45053909, 42672185, 41529422, 51341010, 62063415, 62311377, 63223352, 79105001, 98222816, 105753063, 123137800, 177839248, 233784177, 207616412, 77516961, -70089846, -137055979, -122028964, -94522793, -91698776, -91793710, -75551879, -58742002, -56217797, -56320950, -46957315, -37338869, -37963812, -41507958, -38318230, -33085464, -32804097, -32930077, -27768224, -22169275, -21597949, -21300473, -15915045, -10515747, -11989333, -17265364, -19510430, -19359184, -21221452, -23956207, -23347647, -19741585, -16613804, -15095205, -14841651, -16270583, -17873070, -16071326, -11478377, -9841678, -12996479, -15115894, -12415364, -9935136, -13001608, -18197461]
4823a8197461j377432J038985j423254k414401K444372P629598O671915J512782
4815d114896j963575k000035n00635R36270J348483L27864o01624K75685J500916
4806d791547N93154j144177o96640Q11717k5258k127242j438291J305407J321542
4797f191335j558225k266000N86627K474852J164588o0032N09276j84208l115658
4788h640115l858921R2104M412039M394532J526276j81304r1355N02541J682032
4779a62171L043375K175065j269611l256587r43230K276414J292599l225485n747093
4770e816724l167894K028816N280979M146693n55556n779139q374577p243595
4762a9480997l579897O62962L721412M284786K685843J316502J737693K034209
$$ y = [-18197461, -19574893, -18535908, -19959162, -22373563, -19929191, -12299593, -5627678, -4114896, -6078471, -8078506, -8579141, -7642871, -6294388, -5966524, -6568148, -6292463, -4791547, -4198393, -5342570, -6039210, -5227493, -5252751, -7379993, -8818284, -7512877, -6191335, -7749560, -10015560, -9428933, -6954081, -5789493, -5849525, -5340249, -5524457, -8640115, -12499036, -12406932, -7994893, -3600361, -2074085, -2255389, -2346744, -1844203, -162171, 2881204, 5056269, 3786658, 530071, -413159, 1863255, 3155854, -69631, -5816724, -8984618, -6955802, -1674823, 2471870, 1916314, -3862825, -12237402, -19480997, -23060894, -22397932, -18676520, -14391734, -11705891, -10389389, -8651696, -6617487]
4754f617487k97845l523267l250162J103838N121608N375026L112544R55181o07906
4745A371530j842145j937976n47230R84158J455165J146021M54128q27245k200192
4736a943786k542979k012772j679543j114491R12843L124273K485970q87771k994642
4727f652898j470788J326339K360963J930222J616755J074459o28603k512500
4719b956051k940151j978934o77497O54605J868925K107877J126936K62377N47448
4710a984465Q88596l82030k755494l632862j190000L235580N756052L586016j502611
4701B018782m607618l494417j149380r24614j624369m91841J233996K61178k507779
4692a1286062k813315o777K003850J453929J187022K926458M018401K165312q26552
$$ y = [-6617487, -6915332, -10438599, -13688761, -12584923, -7463315, -2088289, 1024255, 1979436, 1371530, -470615, -2408591, -2955821, -1971663, -516498, 629523, 1083651, 256406, -1943786, -4486765, -6499537, -8179080, -9293571, -8380728, -5256455, -2770485, -3658256, -6652898, -8123686, -6797347, -4436384, -2506162, -889407, 185052, -443551, -2956051, -5896202, -7875136, -8552633, -7898028, -6029103, -3921226, -2794290, -2531913, -1984465, -1095869, -1477899, -4233393, -7866255, -9056255, -5820675, -64623, 3521393, 2018782, -2588836, -6083253, -7232633, -8157247, -9781616, -10273457, -9039461, -8778283, -11286062, -14099377, -14106154, -12102304, -10648375, -9461353, -6534895, -2516494, -351182, -1177734]
4683a177734k427917k696587j970693P46595M458762N176137J468692k378435
4675A198820k112442O00540J403284m53734k552901l532164l304742j323977J786213
4666h291103K967850P70837j319423M64781L903590L530757j334231n690593n826328
4657a0823863l143890n92827J083820K401554L158079K868070J774422O43243
4649b631392K72843J024209K041821J698340j73810j625129j407971r86382k065476
4640c852947l686032l865601k632624j049309J261416M689613O948493N239245
4632C052254P07066k499443k606683j628283j327218j011677k2213O75437O27090
4623d033670J025208K242602K457447M49757j993243k313985n99275R95083J344866
$$ y = [-1177734, -3605651, -6302238, -8272931, -7526336, -3067574, 2108563, 3577255, 1198820, -913622, -313082, 1090202, 636468, -1916433, -5448597, -8753339, -10077316, -8291103, -5323253, -4552416, -5871839, -5407058, -1503468, 2027289, 693058, -4997535, -10823863, -13967753, -14560580, -13476760, -11075206, -7917127, -5049057, -3274635, -2631392, -2358549, -1334340, 707481, 2405821, 2232011, 606882, -801089, -1787471, -3852947, -7538979, -11404580, -14037204, -15086513, -13825097, -9135484, -2186991, 3052254, 3759320, 1259877, -1346806, -2975089, -4302307, -5313984, -5336197, -4660760, -4033670, -3008462, -765860, 1691587, 2141344, 148101, -2165884, -2765159, -1770076, -425210]
4614d25210J112004Q58216J73879j110708k192047k356604j982766j878790k118304
4605i920330k156740j766824j089740R3978K121649M227737M690547K924327M75766
4596c99630r45397j401730j562555q82077J181924L101222K829624R97599N9352
4587B978332M33576K43483r64919j325409k09775L69414q29918k242337k291604
4578c839157j571081p86666O45955K295472K125071L31152M12814L504235M992007
4569H109802P65120n838816q017951m697079q29568M58617P82715J588911J669165
4560f009084Q44960J413797L779875M519140J417023k628624l580974j797163
4552b041050o09288j018969r58946P53355K525403K384676M26903j634258k300104
$$ y = [-425210, 686794, 1545010, 1718889, 608181, -1583866, -3940470, -5923236, -7802026, -9920330, -12077070, -13843894, -14933634, -14839656, -12718007, -8490270, -3799723, -875396, -399630, -1345027, -2746757, -4309312, -5191389, -4009465, -908243, 1921381, 2918980, 2978332, 3411908, 3655391, 2690472, 1365063, 1155288, 1524702, 694784, -1547553, -3839157, -5410238, -6196904, -5550949, -3255477, -1130406, -799254, -386440, 3117795, 8109802, 8874922, 3036106, -4981845, -9678924, -10508492, -10049875, -9267160, -7678249, -6009084, -5164124, -3750327, 29548, 4548688, 5965711, 3337087, -243887, -2041050, -2650338, -3669307, -4628253, -3874898, -1349495, 1035181, 1462084, -172174, -2472278]
4543b472278j416838j87399n7865j050626j543130m39142R34666L45333k018743
4534g906022l268188j534986J348449K243530R77396L48744J846962L425139K565789
4525D6813p9561j764923j333870J1003J034979J621977J745911J148496K41072
4516B671897j71553j25806o5999M88275K001088K999236J492208j620235l170467
4507D498644k186670j015430j246886j432360j73096J267271J170178j37001j643955
4498h99305l272911m516210l829460j163084J238959K268070L488950N374767
4490a310224N274923J877329j554681j903698j135906k363945l799229j846236
4482f761667J707664J611057k207138l899452n10749L830224M349578J717370
$$ y = [-2472278, -3889116, -4076515, -4134380, -5185006, -6728136, -7167278, -6232612, -5887279, -7906022, -11174210, -12709196, -11360747, -9117217, -8139821, -7791077, -5944115, -2518976, 46813, -32748, -1797671, -3131541, -3120538, -2085559, -463582, 1282329, 2430825, 2671897, 2500344, 2374538, 2308539, 2796814, 4797902, 7797138, 9289346, 7669111, 4498644, 2311974, 1296544, 49658, -1382702, -1555798, -288527, 881651, 744650, -899305, -4172216, -8688426, -12517886, -13680970, -12442011, -10173941, -6684991, -1310224, 3964699, 5842028, 4287347, 2383649, 1247743, -1116202, -4915431, -6761667, -5054003, -3442946, -5650084, -9549536, -10060285, -6230061, -1880483, -163113]
4474a63113o60504j687887k133492j886215m91966J160273J796812J280507l0812
4465b816397j905291l138652j782182J911675M406980K741104j405544l299164
4457e287471o05283L979891N675064K638917k083837l709009q95177K787151L062129
4448E562375k64151l746227m556742k715510J46937K171627J723686j248668l992263
4439f918936l160665J010032M380833L632526K8042k454486j780992M16145J455271
4430c392230R48921Q09589J958198K368174l6841l392554l632525m96776J577270
4421c288774m881k130312j246653R07889O09501j542685k176390j125745r07471
4412a0905521j363950j17911J956739J239274j996969k830993P86594M632926
$$ y = [-163113, -823617, -2511504, -4644996, -6531211, -7023177, -5862904, -4066092, -2785585, -2816397, -4721688, -7860340, -9642522, -7730847, -3323867, -582763, -1988307, -5287471, -5892754, -1912863, 3762201, 6401118, 4317281, 608272, -286905, 2500246, 5562375, 5298224, 1551997, -3004745, -5720255, -5573318, -3401691, -1678005, -2926673, -6918936, -10079601, -9069569, -4688736, -1056210, -1028168, -3482654, -5263646, -4847501, -3392230, -2443309, -1633720, 324478, 2692652, 2655811, -736743, -4369268, -4866044, -3288774, -3293655, -5423967, -6670620, -5762731, -5153230, -6695915, -8872305, -9998050, -10905521, -12269471, -12387382, -10430643, -9191369, -11188338, -14019331, -13232737, -8599811]
4404h599811M627669K358380J380539J635293Q84228q58346j631485q16114M17538
4395f02109R60229L46766j424241l336262l710430k031296O17632L069270M393311
4386a717130L088618j271624n539917n561921j951065L18970q23878j796839J98128
4377a5056658K331407J051356j790478j958070M48528J779482J043318R16987
4369a1234128K665775L884662K253652r90270k483037m21308L651277O130264
4361C456887M727302J111199o98389P46289K407499R68532k608139m664716l925922
4352A520542k651769k861453l506954k199852J317188M438741M568483K277686
4344B902612P19467J526246K552041J036198k162176l689599k400517l53186O68270
$$ y = [-8599811, -3972142, -1613762, -233223, 1402070, 2286298, 1427952, -203533, -1019647, -602109, 358120, 704886, -719355, -4055617, -7766047, -9797343, -9179711, -6110441, -1717130, 1371488, 99864, -5440053, -11001974, -12953039, -12634069, -13457947, -15254786, -15056658, -12725251, -11673895, -13464373, -15422443, -14973915, -13194433, -12151115, -11234128, -8568353, -4683691, -2430039, -3420309, -5903346, -6324654, -2673377, 3456887, 8184189, 9295388, 8596999, 9343288, 11750787, 12719319, 10111180, 5446464, 1520542, -1131227, -3992680, -7499634, -9699486, -8382298, -3943557, 624926, 2902612, 3622079, 5148325, 7700366, 8736564, 6574388, 2884789, 484272, 131086, 799356]
4335G99356Q25796L42063r75635j813007j92295K748797L035454o15217m527956
4326c72644n016126k756065m13321J190962K279108K123951N24063o61386J28980
4317b972478J799333K447335J825465L47117k159882m789314m907104j443454
4309i852982K965962N051920M294428J801183j566299m081291l176066Q04703
4301c758442L515259J993472j385426k961877k863393k899987k484923n93245
4293a1438562Q55303n8007j071269R19411M104830M181989J305684l44796O30202
4284i15215J347789P762j717218k181922j812114j084448K10873J353139J343065
4275c448289J088554J938282K580206Q55564j958174k623782j282840j007333
$$ y = [799356, 1625152, 1967215, 991580, -821427, -1013722, 1735075, 4770529, 4155312, -372644, -5388770, -8144835, -8558156, -7367194, -5088086, -2964135, -2440072, -3101458, -2972478, -1173145, 1274190, 3099655, 3446772, 1286890, -3502424, -8409528, -9852982, -6887020, -1835100, 2459328, 4260511, 2694212, -1387079, -4563145, -3758442, -243183, 1750289, 364863, -2597014, -5460407, -8360394, -10845317, -11438562, -10583259, -10641266, -11712535, -10793124, -6688294, -2506305, -1200621, -1545417, -915215, 432574, 440336, -1276882, -3458804, -5270918, -6355366, -6144493, -4791354, -3448289, -2359735, -421453, 2158753, 3014317, 1056143, -1567639, -2850479, -3857812]
4267c857812k149067j845489M22212J693790J010465J149027L218413M262542
4259C904081K516030O03261P48013R62086p27544k137892j001742R2151k442077
4250B516367o533551o688424k060901K423322L193501K009525J770759K133393
4242a236009J385470n451l49617J53993k11702j591570k021449l85407J711779
4233b549963J937528J85167j423321j102849P59369K182554J615010l70541j346441
4224a13487K06212K309405J263158l174472o409295m667197j17938K392922K101560
4215f209132K116310L388360L394848J151663r29921j382401j757020k816974
4207c044267k694747p90705M22014k58378m81426J108126K034444O42353m24892
$$ y = [-3857812, -6006879, -7852368, -7430156, -5736366, -4725901, -3576874, -358461, 3904081, 6420111, 7023372, 7771385, 8733471, 8005927, 5868035, 4866293, 4958444, 2516367, -4017184, -10705608, -12766509, -10343187, -7149686, -5140161, -3369402, -1236009, 149461, 144010, -205607, -51614, -263316, -1854886, -3876335, -4261742, -2549963, -612435, -427268, -1850589, -2953438, -2194069, -11515, 1603495, 1232954, -113487, 92725, 2402130, 3665288, 490816, -5918479, -10585676, -10703614, -8310692, -6209132, -4092822, -704462, 2690386, 3842049, 2912128, 1529727, -227293, -3044267, -5739014, -6529719, -6107705, -6366083, -6847509, -5739383, -3704939, -3062586, -3487478]
4198c487478J097711K745438J591801o65212j143776r72472k418517l886074k783720
4189i922299p45079p86421j532015L34626L701515M568604K588509Q21678J58317
4180h12565q18535j449079K30817K930009L295138J300570m1192J87195K32667
4171E055025m66289q91493j049628j324260p07888Q11910M43792k965736n686005
4162f780572m655162k686000l126199l466288k38288L897121M489728K489669
4154a0075991O37210k013137n054645l372108K714983L041283n665407r934492
4146b9722304j751427L001790q159186j1061316K5901275Q1496516R2170566L5934119
4138A87810033l2003933n0554840k7346587j1206490j6906466j8312988l474397
$$ y = [-3487478, -2389767, 355671, 1947472, 1282260, 138484, -833988, -3252505, -7138579, -9922299, -10667378, -11453799, -12985814, -12651188, -8949673, -4381069, -1792560, -970882, -812565, -1631100, -3080179, -2849362, 80647, 3375785, 4676355, 4635163, 4822358, 5055025, 4588736, 3697243, 2647615, 1323355, 615467, 1427377, 1871169, -1094567, -6780572, -11435734, -14121734, -17247933, -20714221, -20952509, -17055388, -12565660, -10075991, -9438781, -11451918, -16506563, -19878671, -17163688, -14122405, -19787812, -29722304, -31473731, -28471941, -36631127, -47692443, -21791168, 59705348, 151875914, 187810033, 155806100, 105251260, 77904673, 66698183, 49791717, 31478729, 28004332]
4131B8004332P153705J36282r341430n947958K618406L550698m17654j125898
4123B4630483k18606k219492m132550k381714p33007k636246m044331j428727
4115F835810R42499j064207l474654j253046K917629L693387J730762J044549
4107A1372729J889422J749926J90815j481506k548743k189063J96642K312375
4099A1492597Q58399k696311l368648p53379L32695j273543q43589K997430M482860
4090A1228511K98672m145718l179390N79479J703612N60138M90183R25680n29248
4081G931919k542106k304788p13152l05976n58386R1511O9623k612332n484879
4072f428566m285705O76769M859562N283921K787707l43639k061560j047777J887268
$$ y = [28004332, 35158037, 35294319, 25952889, 20004931, 22623337, 26174035, 25756381, 24630483, 24411877, 22192385, 18059835, 15678121, 14945114, 12308868, 8264537, 6835810, 7778309, 6714102, 3239448, 1986402, 4904031, 8597418, 10328180, 11372729, 13262151, 15012077, 15202892, 13721386, 11172643, 8983580, 9180222, 11492597, 12350996, 9654685, 6286037, 5532658, 5865353, 4591810, 3748221, 6745651, 11228511, 11527183, 7381465, 4202075, 4781554, 6485166, 7045304, 7535487, 8461167, 7931919, 5389813, 3085025, 2371873, 2065897, 1507511, 1599022, 1668645, -943687, -6428566, -10714271, -10037502, -5177940, 105981, 2893688, 2550049, 488489, -559288, 1327980]
4063A327980L962709L746760K624160J606401n34540l983305n892591m397858
4055a540284j787639p89865m73023J017401K373562J440402n44210p89965N31067
4046e62554J148261Q13925J111873J948349J469327o87212k572466k456689n87699
4037c74885J406011J910261O67013q04007j004986m75841l82690J29627K217143
4028C287646L598147Q56873m174329n381445j210491K661641J937531k88950L18873
4019A605496K114152J096200k062702l682237l020835j832938k84331K168957
4011c898238L820114K961635J296710J070631Q60773j458286l661346k049449
4003a057456K065128L856275K202202M63435L35859j84050k206167l683218k866395
$$ y = [1327980, 5290689, 9037449, 11661609, 13268010, 12733470, 8750165, 2857574, -1540284, -3327923, -4117788, -4590811, -3573410, -1199848, 240554, -303656, -1093621, -562554, 585707, 1399632, 2511505, 4459854, 5929181, 5241969, 2669503, 212814, -374885, 1031126, 2941387, 3608400, 2804393, 1799407, 1323566, 940876, 1070503, 3287646, 6885793, 7742666, 3568337, -1813108, -3023599, -361958, 1575573, 1286623, 1605496, 3719648, 4815848, 2753146, -929091, -3949926, -5782864, -6067195, -3898238, -78124, 2883511, 4180221, 5250852, 6111625, 4653339, 991993, -1057456, 1007672, 4863947, 7066149, 7529584, 7865443, 7681393, 5475226, 1792008, -1074387]
3994a074387p48600Q67636J184555o3729k426797l924836k767231O2099J975153
3985f916137K155229J697109J144748L23633p9100O42458J343573N02877j025871
3976b11481j223480j93129L63295L09871R53201K141547K193025O66502j038623
3967C960728j710669j145458M48717K071983J935566k13798j940274j282826M26693
3958B550662J107305J376577K633819L604254K253317l02735j427956j349538
3950A0445705k188261l551873l009273m97007J469209J780077J578352J469044
3942G495973J126374J148826K024337K018704l67044k797331k037373L28491k46197
3933H694760l982782o256561m674700j728350M36279K819519N509872N667411
$$ y = [-1074387, -1822987, -955351, 229204, 165475, -2261322, -6186158, -8953389, -8891290, -6916137, -4760908, -3063799, -1919051, -1595418, -1674518, -1032060, 311513, 814390, -211481, -1434961, -1628090, -1264795, -954924, -1723, 2139824, 4332849, 4999351, 3960728, 2250059, 1104601, 1553318, 3625301, 5560867, 5347069, 3406795, 2123969, 2550662, 3657967, 5034544, 7668363, 11272617, 13525934, 13223199, 11795243, 10445705, 8257444, 4705571, 1696298, 1199291, 2668500, 4448577, 6026929, 7495973, 8622347, 9771173, 11795510, 13814214, 13447170, 10649839, 8612466, 8940957, 8694760, 4711978, -1544583, -6219283, -7947633, -7511354, -4691835, 818037, 6485448]
3925F485448K190450j400069j591029M02250J065260n09699k408958k921846j975780
3916f63973o79628l67473j033463p90850J417140L218015J635615j932674l002505
3907b199796m27033K112006J741225o6894p32664o735J222286K560318L110784
3898G313497J525253j598155l694265l538129k295230r02023Q13176K084270J495598
3889A203992j64189n84746J85528J33300k95065J405750M370573M396577Q34503
3880A1486223j765334r85766j60227j794570k831446n22317J899088M61676k480451
3871C306876j910958J814903L964816K678891K82805j392282k440088k496729
3863C808234j072104L52043J37896m58236N07591J657720M34133j819577j428135
$$ y = [6485448, 8675898, 7275829, 5684800, 6087050, 7152310, 6642611, 4233653, 1311807, -663973, -1343601, -1711074, -2744537, -3535387, -2118247, 1099768, 2735383, 802709, -2199796, -2626829, -514823, 1226402, 1159508, 426844, 420109, 1642395, 4202713, 7313497, 8838750, 7240595, 3546330, 8201, -2287029, -3189052, -2375876, -291606, 1203992, 1039803, 455057, 640585, 773885, 478820, 1884570, 6255143, 10651720, 11486223, 9720889, 8735123, 8574896, 6780326, 3948880, 3426563, 5325651, 5787327, 3306876, 1395918, 3210821, 7175637, 9854528, 10137333, 8745051, 6304963, 3808234, 2736130, 3088173, 3226069, 2767833, 3275424, 4933144, 5367277, 3547700, 2119565]
3854B119565J276299J864019j255122m125648l093320J28059J436648n277j485425
3845c140202r41140O48218J125941K43512P211J725390L610753K815378m36861
3836E658200k955158l143333k720347k866692j905419R98051K973047J567146
3828b394505o99430K22497L530900M732085K335358o54148j746806j666905j705112
3819A953934j769227j718348j762783j025119J515288M166933L539921p11610
3811D188989m780430n312996k779706N27434L199364M229353K581361p74562k493643
3802a414836p88505J745380J550039p35871j221709J363806L591514K217894j066689
3793E241023k002882Q8197J306798j079180m469615m521854j238234J302724P04414
$$ y = [2119565, 3395864, 5259883, 4004761, -120887, -3214207, -3086148, -1649500, -1654777, -3140202, -4081342, -3433124, -2307183, -2063671, -2056460, -331070, 3279683, 6095061, 5658200, 2703042, -440291, -3160638, -6027330, -7932749, -6934698, -3961651, -2394505, -3093935, -2871438, 659462, 5391547, 7726905, 7072757, 5325951, 3659046, 1953934, 184707, -1533641, -3296424, -4321543, -2806255, 1360678, 4900599, 4188989, -591441, -5904437, -8684143, -8156709, -4957345, -727992, 1853369, 1078807, -1414836, -2203341, -457961, 1092078, 356207, -865502, 498304, 4089818, 6307712, 5241023, 3238141, 3326338, 4633136, 3553956, -915659, -5437513, -6675747, -5373023, -4668609]
3784d668609j159308j524147J5868K273187L932085L495163M34206k652515j958394
3775a812464K108831M516913K386161j137450k132140j474056j818062k319525
3767a681792q04710J182133M59453k013706k350891p6532J537376J303108J458691
3758i86870K683878K500414l833j960443j049932J241058K410112K129110J079466
3749H042960o88430k559736k898893j440196j31839k27495n10038L00446J361074
3740A247853J378289P83933Q20650J687704K591849K577265Q92503k118041m369913
3731E492092l989083j938839p63001q87879o29001K71654K38403o50672k00873
3722c057199J891553K954920J679142K53124M23373O42466o89494k157658k012192
$$ y = [-4668609, -5827917, -7352064, -7336196, -5063009, -1130924, 2364239, 2798445, 145930, -1812464, 296367, 4813280, 7199441, 6061991, 3929851, 2455795, 637733, -1681792, -2486502, -1304369, -844916, -2858622, -5209513, -5286045, -3748669, -2445561, -986870, 1697008, 4197422, 4193589, 2233146, 1183214, 2424272, 4834384, 6963494, 8042960, 7354530, 4794794, 1895901, 455705, 323866, 96371, -413667, -113221, 1247853, 2626142, 3410075, 4230725, 5918429, 8510278, 11087543, 11980046, 9862005, 5492092, 1503009, -435830, -1198831, -2086710, -2715711, -2444057, -2205654, -2856326, -3057199, -1165646, 1789274, 3468416, 3721540, 4144913, 4787379, 4097885, 1940227, -71965]
3713g1965j227430j240671j112598K69650J475527R94533K81430J182977K321567
3704B873020J516994L6735M92589J754685L14641l610539n627864l432090J71931
3695e509898J593402O77592p33337j766681k327963j884068k23682J595401K290588
3686f288646J749169Q44213N20992J163446K009729J429101r63455k790762j314860
3677c641073K537861M533897K211838k041414l924192j970725J548029L460549
3669B714770K491065j57540k265925k789508k571902k568131k160309m77070J421964
3660f362586J802416J399276K578976M862930M410663k69284m835904m197725
3652f11238O04155L814115K542857l87371j427954r10134j145610k195343j865065
$$ y = [-71965, -1299395, -2540066, -3652664, -3383014, -1907487, -912954, -631524, 551453, 2873020, 4390014, 4426749, 4919338, 6674023, 6988664, 3378125, -2249739, -5681829, -5509898, -3916496, -3238904, -3972241, -5738922, -8066885, -9950953, -10174635, -8579234, -6288646, -4539477, -3695264, -3174272, -2010826, -1097, 1428004, 464549, -2326213, -3641073, -1103212, 3430685, 5642523, 3601109, -323083, -2293808, -745779, 2714770, 5205835, 5048295, 2782370, -7138, -2579040, -5147171, -7307480, -7784550, -6362586, -4560170, -3160894, -581918, 4281012, 8691675, 8422391, 3586487, -611238, -7083, 3807032, 6349889, 5962518, 4534564, 3624430, 2478820, 283477, -1581588]
3643a581588O91106L216579K754054p57760l899543l323934Q2735J715194j144294
3634b247451n439691n955499k041893J923775K777239K095705K406077L059419
3626c422319K198555M05871m64560l96551k56051P50970L319882M929765K505667
3617I571229k077143l393882p6711L032379J803752j822052l508654k333000l60549
3608H35369R73616J348478M98279p55590k74445K162739L378903J197388j756917
3599G607820j822625j7276k40067k970155m779474l749908j577887j40035N73208
3590g116399O84470k07604j246357p07456J212211K490664K424836K017981J200018
3581G52364j060822l427399k652324J319878M070948K383508j588915l710290
$$ y = [-1581588, -890482, 2326097, 5080151, 4322391, 422848, -2901086, -2818351, -1103157, -2247451, -7687142, -13642641, -15684534, -13760759, -10983520, -8887815, -6481738, -3422319, -1223764, -817893, -1282453, -1679004, -1935055, -1184085, 2135797, 7065562, 9571229, 7494086, 4100204, 4023493, 7055872, 8859624, 7037572, 3528918, 1195918, 835369, 1808985, 3157463, 3655742, 2900152, 2625707, 4788446, 8167349, 9364737, 7607820, 5785195, 5767919, 5527852, 2557697, -2221777, -5971685, -7549572, -7689607, -7116399, -6431929, -6639533, -7885890, -8593346, -7381135, -4890471, -2465635, -447654, 752364, -308458, -3735857, -6388181, -5068303, -997355, 1386153, -202762, -3913052]
3573c913052k857726n37930K018918L941886L803518J232702j626240k342147
3565b80071j084870K31942O61702N77691K97695j50118n56991q93400j439151
3556b635571j931204j635430p30361k05098K9731J058514K417806J999418l43255
3547a975450j535444N58061L760286M467275K323408o2903q29573l39254J00955
3538F467361n97559k509049l892344k491293J217070L732010K867675N92460p7916
3529E308415Q35808J235379L28451r83656j719996j103235J158739L274869K186901
3520A0521675k023828m922003l390782o6052Q63053k75401n18726J01627n27686
3511b38123j581033l61943K116495J888940j187391k541030j14171K272947J009633
$$ y = [-3913052, -6770778, -7308708, -5289790, -1347904, 2455614, 3688316, 2062076, -280071, -1364941, -1132999, -471297, 106394, 404089, 253971, -303020, -1196420, -2635571, -4566775, -6202205, -6932566, -7137664, -7107933, -6049419, -3631613, -1632195, -1975450, -3510894, -2952833, 807453, 5274728, 7598136, 7535233, 6705660, 6366406, 6467361, 5869802, 3360753, -531591, -3022884, -1805814, 1926196, 4793871, 5386331, 5308415, 6144223, 7379602, 7708053, 6724397, 5004401, 3901166, 5059905, 8334774, 10521675, 8497847, 3575844, 185062, 119010, 982063, 706662, 187936, 289563, -238123, -1819156, -2181099, -64604, 1824336, 636945, -1904085, -2018256, 254691, 1264324]
3502A264324j901970k425191m31100J079868P54131j8033K54414J678636L534459
3493C789538M705851M058764J549809j440226l448765l967115l034294j102560
3485A111002L59363k58277k418441l417285j640523J244263K309880P73382j424069
3476c360705j855995R2726K697948L500929J928604L0970j79995N22366m6677
3467C330171j840534k355356k82620K538215L554403K447347Q65909K40672M92783
3458H990990L18791j342756l638564m234046k390565n32694r97000k289732j157279
3449g272855K179230L959314K303239l76624j278488p23422m24211o44301p08076
3440b986194n27536j60497O54376J407275Q62129p58200j337638K04796K161220
$$ y = [1264324, -637646, -3062837, -3493937, -2414069, -1659938, -1677971, -1423557, 255079, 3789538, 8495389, 12554153, 14103962, 12663736, 9214971, 5247856, 2213562, 1111002, 1470365, 1212088, -1206353, -4623638, -6264161, -5019898, -2710018, -1936636, -3360705, -5216700, -5123974, -2426026, 1074903, 3003507, 3034477, 2854482, 3376848, 3330171, 1489637, -865719, -1148339, 1389876, 4944279, 7391626, 8257535, 8498207, 8990990, 9309781, 7967025, 4328461, 94415, -2296150, -2828844, -3825844, -6115576, -7272855, -5093625, -1134311, 1168928, 792304, -486184, -1209606, -1633817, -2278118, -2986194, -3513730, -3674227, -3019851, -1612576, -750447, -1508647, -2846285, -2641489, -480269]
3431d80269K393060R34752q17930j931017j922117o74178N26576k62001k589757
3422d822881l323633r49328J905327K175519N84867k28975n9586o41002j870871
3413g230563j735261J09478J571498J480506J304184K476479L813599L056104
3405D846024J59169k309484k128605J47J400710P85506k34489L52692J858241
3396D729911J852043n4077j384217l25871J722377K206626O61458j274124k057598
3387F076528j377394O9134R71229K88270j499784k676084k263662q87049N18485
3378g80327J573602J771946O03532j025453j225342J91509J182484N52358l19273
3369B525036j3544O07741J90477p46126j030133r55634j331387j656743j067328
$$ y = [-480269, 1912791, 2847543, 2029613, 98596, -1823521, -2497699, -1971123, -2233124, -4822881, -8146514, -9095842, -7190515, -5014996, -4430129, -4659104, -4718690, -5359692, -7230563, -8965824, -8856346, -7284848, -5804342, -4500158, -2023679, 1789920, 4846024, 5005193, 2695709, 567104, 567251, 1967961, 2753467, 2518978, 2871670, 4729911, 6581954, 6527877, 5143660, 4817789, 6540166, 8746792, 9408250, 8134126, 6076528, 4699134, 4768268, 5739497, 6027767, 4527983, 1851899, -411763, -1298812, -780327, 793275, 2565221, 3168753, 2143300, 917958, 1109467, 2291951, 2844309, 2525036, 2511492, 3119233, 3309710, 2563584, 1533451, 577817, -753570, -2410313, -3477641]
3360c477641l7370N41007R21156J544630J663856O03685o98600j105428j139689
3351a184394j725502k194988j401956J37776J026987J076015J018869J048391
3343b198802J037284J113129Q33401n67306j883304l62992L600049N122070J291990
3334G985519l718460m087786p19796P35651j114154k051471Q0234K107724J394953
3325F12414j40777k91139m91115k357731l682568j538969K647659M566863K603942
3316A928579p44030k513145k165678j016872l93127m91874l34556R45258K556050
3307b229395K633569P03977j535033k406241k074415j525761q87444K71942J688973
3298e359828K361315J607514p6386j116103k32702J833900K781374J725367N23385
$$ y = [-3477641, -3515011, -2974004, -2052848, -508218, 1155638, 1759323, 1060723, -44705, -1184394, -2909896, -5104884, -6506840, -6369064, -5342077, -4266062, -3247193, -2198802, -1161518, -48389, 785012, 217706, -1665598, -2028590, 1571459, 6693529, 7985519, 4267059, 179273, -540523, 195128, -919026, -2970497, -2890263, -782539, 612414, 471637, 180498, -310617, -2668348, -6350916, -7889885, -5242226, -675363, 1928579, 1184549, -1328596, -3494274, -4511146, -4904273, -5396147, -5730703, -4785445, -2229395, 404174, 1108151, -426882, -2833123, -4907538, -6433299, -7320743, -7048801, -5359828, -2998513, -1390999, -1467385, -2583488, -2816190, -982290, 1799084, 3524451, 4047836]
3289D047836P95135J188609j47411j870083j439436J42023m43939k941656l262146
3280c931068j28406K389131J036212j856785k573552j571042j358090j497390
3272i490990K04281L044171M020068K612380J421044J863537K284941J040477
3264F999909r41719j690502p15144Q85539J870309J786769R89900J00526n86167
3255H699420r80616p65028q091O675j748332l586727k496548J081584K650082
3246B852419j37156l336559k006438K299702L504504j15461l475061k085303J975060
3237e24293L708370K043212J24986J65124R85798P06329m86617j203991j088739
3228D430179q96066r29439p81500o96647j705209l548412l822457r08292L001399
$$ y = [4047836, 4842971, 6031580, 5884169, 4014086, 2574650, 2716673, 2272734, -668922, -3931068, -4059474, -1670343, -634131, -2490916, -5064468, -6635510, -7993600, -9490990, -9286709, -6242538, -2222470, 389910, 1810954, 3674491, 5959432, 6999909, 6058190, 4367688, 3652544, 4538083, 6408392, 8195161, 9185061, 9285587, 8699420, 7718804, 6953776, 6945685, 6952360, 5204028, 1617301, -879247, 202337, 2852419, 2715263, -621296, -2627734, -328032, 3176472, 3061011, -414050, -2499353, -524293, 3184077, 5227289, 5352275, 5517399, 6503197, 7209526, 6722909, 5518918, 4430179, 3534113, 2604674, 1823174, 1126527, -578682, -4127094, -7949551, -8857843, -5856444]
3219e856444M014731J613520p60613o19601P07752J225993J463940K388649K567565
3210F745492M29386k200489k172921J00934J194320J5364p60419O68572K265439
3201F285678J420008j093089k341713j092113J214650K533307J967261M2286j705003
3192G231272j812925l69843R30867P55039l30141q41673l85575Q9416k19595j052915
3182C993927j801786k455497l221458l445775j930841J069556L087929K102070
3174b601875l95647q86213J329240K976546J581801q76950j118019N16006J087488
3165A612377o1770o48842M86210J699821J485006M73302l68630j257003k254752
3156A165719k398137j283828J23122J128106J977828K176226M76188k165929k234803
$$ y = [-5856444, -1841713, -228193, -988806, -1608407, -900655, 325338, 1789278, 4177927, 6745492, 7174878, 4974389, 2801468, 2902402, 4096722, 4112086, 3351667, 4020239, 6285678, 7705686, 6612597, 4270884, 3178771, 4393421, 6926728, 8893989, 8936275, 7231272, 5418347, 5048504, 5979371, 6734410, 6404269, 5562596, 5177021, 5266437, 5046842, 3993927, 2192141, -263356, -3484814, -6930589, -8861430, -7791874, -4703945, -2601875, -2997522, -3883735, -2554495, 422051, 2003852, 1126902, 8883, 524889, 1612377, 1550607, 901765, 1387975, 3087796, 4572802, 5046104, 4677474, 3420471, 1165719, -1232418, -2516246, -2393124, -1265018, 712810, 2889036, 3365224, 1199295, -1035508]
3147a035508J498190M965661L632336j095027l688470k140623r3667p84250k465868
3138a207226j852392M70017R64464j527381m112740l737564p53623K171940L316461
3129f268044K955451J976293Q32118j08650l13137K33588O91029L40765l83510
3120d4097m30073M32809J296032J286972N72493j2256J1066L79916N74715M27231
3110D494808J69289k7044l04760p26595r11699n94587l83202j107917k270004
3101a661711k192022l25771J544141J360718o25213k383403k655077j782876l86628
3092i107842J375855L121338L977960L416317J796417N7393p80128k98683N17135
3083D075762n9726k114477l359318k178567l20028m93056k104910k063640L52274
$$ y = [-1035508, 462682, 5428343, 9060679, 7965652, 4277182, 2136559, 2042892, 1258642, -1207226, -3059618, -2589601, -1625137, -3152518, -7265258, -11002822, -11756445, -9584505, -6268044, -3312593, -1336300, -504182, -612832, -925969, -692381, -1352, 339413, -44097, -474170, -41361, 1254671, 2541643, 3114136, 3101880, 3112946, 3492862, 4067577, 4494808, 4664097, 4637053, 4332293, 3605698, 2693999, 2099412, 1716210, 608293, -1661711, -3853733, -4179504, -2635363, -1274645, -1899858, -4283261, -6938338, -8721214, -9107842, -7731987, -4610649, -632689, 2783628, 4580045, 4637438, 3857310, 3558627, 4075762, 4016036, 1901559, -1457759, -3636326, -3956354, -4449410, -6554320, -8617960, -8265686]
3074h265686K347661J848932J23254p55134m54677P02994K720626M385534L480785
3065F134289M01715j162397N02218J965604j25162l238881k563017J246725K797917
3056E959011J22952k777442k454423o07227k66351j144129j400409j198447j589525
3047e355990j832782p28744O74246M62093q53601j019140L74858J467528J341554
3038e469978J328829K475888L612239L044791R96173p68655j142839n46568J78730
3029C708610Q74810J746088K413659K032151N62466p93378j159678j378795k599499
3020E406434l870949k996922k3962K244464K106161J144320J091714Q73898p68431
3011E206727j811095L20869L682986L651621j39192k987209k252166r59449k128714
$$ y = [-8265686, -5918025, -4069093, -3945839, -4700973, -5155650, -4452656, -1732030, 2653504, 6134289, 6536004, 5373607, 5875825, 7841429, 7716267, 4477386, 1914369, 3161094, 5959011, 6081963, 3304521, 850098, 242871, -23480, -1167609, -2568018, -3766465, -5355990, -7188772, -7917516, -7243270, -6781177, -7634778, -8653918, -8279060, -6811532, -5469978, -4141149, -1665261, 1946978, 4991769, 5987942, 5219287, 4076448, 3529880, 3708610, 4583420, 6329508, 8743167, 10775318, 11337784, 10544406, 9384728, 8005933, 5406434, 1535485, -1461437, -1485399, 759065, 2865226, 4009546, 5101260, 5975158, 5206727, 3395632, 3716501, 7399487, 11051108, 10911916, 7924707, 5672541, 4713092, 2584378]
3002B584378l616623k137284P28196R75501j193658j855967J47422J727272Q94956
2993a745807n23363n58010J29060N29127J080765J555106K86450k472368l425072
2984e144112r84481J575522P88195j502996r92861K293348M131086K490725j35987
2975B518439j101654p61712m27273k32519k14967r16137j658380o09279K042106
2966a361376L202815Q63523k846571m336597k802119j44504J935810K910724K581726
2957C431J207050p7137m50402m79526q32847q44511K03565J290879R03567n16341
2947D07728j105259j95465J224087K320064K996462K881044J521265l13567j173999
2938H562360j025426j295626k488484l190700k037988M27145K412526K637234
$$ y = [2584378, -1032245, -3169529, -2441333, -1465832, -2659490, -4515457, -4368035, -2640763, -1745807, -2269170, -2827180, -2698120, -2168993, -1088228, 466878, 753328, -1719040, -5144112, -6128593, -4553071, -3764876, -5267872, -6260733, -3967385, 163701, 2654426, 2518439, 1416785, 655073, 227800, -4719, -219686, -1135823, -2794203, -3403482, -1361376, 1841439, 2704962, -141609, -4478206, -7280325, -7424829, -5489019, -2578295, 3431, 1210481, 1133344, 682942, 203416, -629431, -1473942, -1270377, 20502, 924069, 407728, -697531, -892996, 331091, 2651155, 5647617, 8528661, 10049926, 9736359, 8562360, 7536934, 6241308, 3752824, 562124, -1475864, -1048719, 1363807, 4001041]
2930D001041J223038m39255p70302K15669N19478j358243m026418m810094l275833
2921h720919j193024O44884K904066M809501L947068K72320k632406k342333j022838
2912c333681j511233k409080o25936K794595L626831R34080j563690j291154j18443
2903c497711l22640p75007L41548J738382J106549o30462m15970K221721M496595
2894D263005M352776K494451K06378k179452l800058k822316P24105L409642J904991
2885H553522k672341n825724m924320j717556N57414R68631R62898J750351K943579
2876E96454L675324L927817M064396L501651R35239l557925p336083p314633l446699
2867d954459R42366K812654K435294J926543J803174P03980j669462l285796k322561
$$ y = [4001041, 5224079, 4784824, 4014522, 4230191, 4749669, 3391426, -634992, -5445086, -8720919, -9913943, -9269059, -6364993, -1555492, 2391576, 2663896, 31490, -2310843, -3333681, -4844914, -7253994, -7879930, -5085335, -1458504, -524424, -2088114, -3379268, -3497711, -3820351, -4595358, -4253810, -2515428, -1408879, -2039341, -2455311, -233590, 4263005, 8615781, 11110232, 11316610, 9137158, 5337100, 2514784, 3238889, 6648531, 8553522, 5881181, 55457, -4868863, -6586419, -6029005, -5060374, -4097476, -2347125, 596454, 4271778, 8199595, 12263991, 15765642, 16700881, 13142956, 5806873, -1507760, -4954459, -4012093, -1199439, 1235855, 3162398, 4965572, 5669552, 4000090, 714294, -1608267]
2858a608267K89678K027758J807769P48228K89965O98548J413790J842217J518190
2849I027876L17420j018863j202980J48995J757635J987358P16237p19070j348021
2840I666587j559071k042876k532363k264384j221113p7159Q40235J533837J322925
2831C666618p60591l863781m885273j706464L541868O033048L432815j532273
2823C925967m167349k657513O88195K350837J044149j521419k784435k060522
2815e182090r65119j050262j723331j350085J81056J476506K053327K850544L859002
2806A49548L305851N04606k219155k319299n49868L84711j14407j83445J055167
2797A3709K118673J679131L72280o87003j456264k072697j865939m01313J474332
$$ y = [-1608267, -1318589, 709169, 2516938, 3265166, 3555131, 4253679, 5667469, 7509686, 9027876, 9345296, 8326433, 7123453, 7272448, 9030083, 11017441, 11733678, 11014608, 9666587, 8107516, 6064640, 3532277, 1267893, 46780, -30379, 809856, 2343693, 3666618, 2906027, -957754, -5843027, -7549491, -4007623, 2025425, 5458240, 3925967, -241382, -2898895, -2210700, 140137, 1184286, -337133, -3121568, -5182090, -6147209, -7197471, -8920802, -10270887, -10089831, -8613325, -6559998, -3709454, 149548, 3455399, 3960005, 1740850, -578449, -1128317, -743606, -858013, -1041458, 13709, 2132382, 3811513, 4183793, 3496790, 2040526, -32171, -1898110, -2299423, -825091]
2788h25091K553577K447104J261416q46406l082286m073703l386796k085383j099065
2779i136633j46164R77934J423344P21877q7797m5053L19589N47435J644481L901237
2769A20250M822576K040104k496109m303919k264162K34442L51195r91403j707368
2760d194394j415499m35907J379559L202227L047043Q08734q38781m41358j31856
2751I79768j666503k833645j154436J165218K70327k744844l075490K45056K953957
2742e860592K469349J371734K173804L071568J773321r9218P077R10386j02574
2733E714855k226286k359939n39839j47866k447167m314964k504391K120715N702751
2724a002131N397896J785031j680750j711852J236579L073683J168608j855197
$$ y = [-825091, 1728486, 4175590, 5437006, 4590600, 1508314, -2565389, -5952185, -8037568, -9136633, -9282797, -8304863, -6881519, -6159642, -6247439, -6292492, -5972903, -5425468, -3780987, 120250, 4942826, 6982930, 4486821, 182902, -2081260, -1846818, -1495623, -2487026, -4194394, -5609893, -6045800, -4666241, -1464014, 1583029, 2391763, 1552982, 1111624, 979768, -686735, -3520380, -4674816, -3509598, -3239271, -5984115, -9059605, -8814549, -5860592, -3391243, -2019509, 154295, 3225863, 4999184, 4899966, 4907043, 5817429, 5714855, 3488569, 1128630, 588791, 440925, -2006242, -6321206, -8825597, -6704882, -1002131, 4395765, 6180796, 4500046, 2788194, 4024773, 7098456, 8267064, 6411867]
2716F411867j813514O59282J024206j910961l847617j623235J819400J882391
2708B601819j056757k942145k341686j705111k637703l362543j818181J112303
2700a2150004K836646K221159M59856m51064N85708K935099M538041L655911Q62436
2691E493788j250822j005437K11566l18620k912139m790102l754551j295009m34564
2682a0055890j165176m72898K618608M795611L168098j6402m21437J888947K692319
2673C031780K12787k379098k113550l07335M58055M16711R99669J414530j4387
2664A719162k372573l059021j620302n5762M63863P79253J585985K218721J924915
2655A584241P49230j001532k766250l322571j958673K954N13934l14438l85231
$$ y = [6411867, 4598353, 5257635, 6281841, 4370880, 523263, -1099972, 719428, 2601819, 1545062, -1397083, -3738769, -5443880, -8081583, -11444126, -13262307, -12150004, -9313358, -7092199, -6632343, -7083407, -6497699, -3562600, 975441, 4631352, 5493788, 4242966, 3237529, 3449095, 3130475, 218336, -4571766, -8326317, -9621326, -10055890, -11221066, -11693964, -9075356, -4279745, -1111647, -1128049, -1549486, 339461, 3031780, 3244567, 865469, -1248081, -1555416, -1097361, -680650, 319019, 1733549, 1719162, -653411, -3712432, -5332734, -5388496, -4924633, -4145380, -2559395, -340674, 1584241, 2333471, 1331939, -1434311, -4756882, -6715555, -6712601, -6198667, -6513105, -6898336]
2646f898336J047231K062480R27832j214883j806734l43015Q95401j47724k282440
2637g760188k154888J153681L910132K159461k185915k989506J418367N003395
2629a445461K334991l185450l966755P88643M244102K067188k014406k508526
2621c685674M66159K852037K561356P87179n86266l87622J580773L708313L350101
2612A0646356J20952k975107l261832j718377r57458j468021j813035j276994
2604b703516l16143O77716J311904Q39072n07320q93372O82819K432845K128995
2595C653000L82562n07638j30002p8331r30174j390698n00248J164517K580479
2586D243467L005230J759799r94440l280758k923747m70005J095888M0505k090892
$$ y = [-6898336, -5851105, -3788625, -2860793, -4075676, -5882410, -6225425, -5330024, -5477748, -7760188, -9915076, -8761395, -4851263, -2691802, -4877717, -7867223, -6448856, -1445461, 889530, -2295920, -6262675, -5474032, -1229930, 837258, -1177148, -3685674, -3219515, -367478, 2193878, 2981057, 2394791, 2007169, 3587942, 7296255, 10646356, 10767308, 7792201, 4530369, 2811992, 1854534, 386513, -1426522, -2703516, -3019659, -2341943, -1030039, -190967, -698287, -1591659, -908840, 1524005, 3653000, 4035562, 3527924, 3397922, 3319591, 2389417, 998719, 498471, 1662988, 4243467, 7248697, 9008496, 8014056, 4733298, 1809551, 1339546, 2435434, 2475939, 385047]
2577C85047k744528j474960N3960M55578O1505o058L88356J58085j198281k248214
2567f169510j250451J071532K023139O22784r65968o21991Q15270J191634J36720
2558c146841j095549j672713j411972p2213J849807K629670J395274k42005l43145
2549b109687O72729J325199J705756K525740K836898J483304j76027j08537N19103
2540H674478j191694m641413n678715k526326J557261K778299J203845o53378
2532d77643j208917l95486J038734J565781K7610k323670k839340j250089j96269
2523f059289j134707k224720j556641n113P80695J000640J467949J645951P70550
2514e314685o17426j770133k741806l087255j669600P84823J408452n71667j842733
$$ y = [385047, -2359481, -3834441, -3780481, -3324903, -3263398, -3269456, -2881100, -2723015, -3921296, -6169510, -7419961, -6348429, -4325290, -3702506, -4668474, -5290465, -4475195, -3283561, -3146841, -4242390, -5915103, -7327075, -7399288, -5549481, -2919811, -1524537, -1766542, -2109687, -1436958, -111759, 1593997, 4119737, 6956635, 8439939, 8263912, 8155375, 8674478, 7482784, 2841371, -2837344, -5363670, -3806409, -1028110, 175735, -477643, -1686560, -2082046, -1043312, 522469, 550079, -1773591, -4612931, -5863020, -6059289, -7193996, -9418716, -10975357, -10980470, -10199775, -9199135, -7731186, -6085235, -5314685, -5932111, -7702244, -10444050, -13531305, -15200905, -14416082, -13007630, -13579297, -15422030]
2505a5422030K73706L540579M260100K819488K181545K540774J640870m22942
2497A412090j032641K63279R48345J16993M5004J850077L031553J397774j248163
2488F784311j817086n23328j91091j832037l281902k361788K40924J936663J426781
2479C81447K08321N98455K541516L356657J259516j848741k470739L8776K666180
2470F731388K486545j38501k502436k647665j023432K94491l10854k375127l828482
2461c314073l254025j185855J022159K526019K642850Q08384j781205k201941
2453d737687L99228K529615O95355l047802l376712P61043M727985M892370K823258
2444E666653J332328J80774j678819k770127j416408P14682R22395o1777M60950
$$ y = [-15422030, -15148324, -11607745, -7347645, -4528157, -2346612, 194162, 1835032, 1412090, 379449, 642728, 1591073, 1708066, 1753070, 3603147, 6634700, 8032474, 6784311, 4967225, 4443897, 4252806, 2420769, -861133, -3222921, -2981997, -1045334, 381447, 589768, 1188223, 3729739, 7086396, 8345912, 6497171, 4026432, 4065208, 6731388, 9217933, 9079432, 6576996, 3929331, 2905899, 3200390, 2889536, 514409, -3314073, -6568098, -7753953, -6731794, -4205775, -1562925, -754541, -2535746, -4737687, -4338459, -1808844, -1113489, -4161291, -7538003, -6776960, -2048975, 2843395, 5666653, 6998981, 7179755, 5500936, 2730809, 1314401, 2029083, 2951478, 2889701, 3350651]
2435C350651K052487J477251j607708l230223r09636K281995J914728j604024
2427C725521l900253k788613o02236q5967o21678m6192J531882K010042Q82540
2418A05046J98098J293646K494155J491360j191443k827451k044910j41842J004454
2409C81113Q92428K01776j20616N00909J527784J424816l01320j671988n49097
2400B285805J986155K763482J061651n23822l35643n4860j496154l460474l733867
2391a507727k370224r38495M0061R18915J470024J540186J967440K923494K606977
2382F650651k83063l948705n625043n150267l997703k131598J014231L476066
2374i995431K600037j58818l36405K875119M995314K824018j009533k327604j079535
$$ y = [3350651, 5403138, 6880389, 5272681, 2042458, 1132822, 3414817, 5329545, 3725521, -174732, -2963345, -3565581, -3651548, -4273226, -4319418, -2787536, -777494, 105046, 303144, 1596790, 4090945, 5582305, 4390862, 1563411, -481499, -623341, 381113, 1273541, 1475317, 1354701, 1855610, 3383394, 4808210, 4506890, 2834902, 2285805, 4271960, 7035442, 8097093, 7573271, 7237628, 7182768, 5686614, 2226140, -1507727, -3877951, -4816446, -4776385, -3857470, -2387446, -847260, 1120180, 4043674, 6650651, 6367588, 2418883, -3206160, -8356427, -12354130, -14485728, -13471497, -9995431, -7395394, -7554212, -7890617, -5015498, -20184, 2803834, 1794301, -533303, -1612838]
2365a612838Q8286L80422O86037O52023n95503j797379j005658P79282P49099
2356a676229r14966q41658K086352M361338K720110j170464l226594k363651q02901
2347a828663p2332L91538P96808L4913j909808k842035j172430J635160L030939
2338a935910K669276J998617J492202M58118p75447r09146j64884l05009j411703
2329A116114j176473J173266K766169J215568j279751j084824J072347J233969
2321E036385j326353k918503j419461O15918O57524L56040K080357M104594K973378
2312A0159879q45123l440676l074060j806420j434404j208499m25807j52267q03534
2303c030911o19218J392598L026715J846480q04589j470678L84668J818957R81011
$$ y = [-1612838, -1524552, -1144130, -458093, 193930, -401573, -2198952, -3204610, -2425328, -1676229, -2591195, -3432853, -1346501, 3014837, 5734947, 4564483, 1337889, -1025762, -1828663, -1900995, -1509457, -712649, -677736, -2587544, -5429579, -6602009, -4966849, -1935910, 733366, 2731983, 4224185, 4682303, 3906856, 2997710, 2832826, 2527817, 1116114, -60359, 1112907, 3879076, 5094644, 3814893, 2730069, 3802416, 5036385, 3710032, 791529, -627932, -12014, 645510, 1001550, 3081907, 7186501, 10159879, 9314756, 5874080, 2800020, 993600, -440804, -1649303, -2075110, -2227377, -3030911, -3650129, -2257531, 769184, 2615664, 1811075, 340397, 725065, 2544022, 3525033]
2294C525033n40537q89073r48972k293557l853610l136702k00988J980349J437035
2285d921022l96543q94397N77334K516067L211869K006334m25387k275699k008971
2276b610415l05645M42121o31312j520093n07482Q55434j265k485631l439881
2267a0204169j567289J239483L022814L678381L399183J875993m0393l95526Q58188
2258A866665J236973l68373j555998k72924J438448M60983k143023k324635Q63142
$$ y = [3525033, 2984496, 2095423, 1146451, -1147106, -5000716, -8137418, -8338406, -6358057, -4921022, -5317565, -6211962, -5634628, -3118561, 93308, 2099642, 1674255, -601444, -2610415, -2916060, -2473939, -3105251, -4625344, -5132826, -4277392, -4278657, -6764288, -10204169, -11771458, -10531975, -7509161, -3830780, -431597, 1444396, 1404003, 1008477, 1866665, 3103638, 2735265, 1179267, 906343, 2344791, 2805774, 662751, -1661884, -798742]
$$ [...]
##END NTUPLES=NMR SPECTRUM
##END=
