##TITLE=31Pec_DE-96rm_3h
 , 64 sc
 6.6.2025
##JCAMPDX= 6.0         $$ Bruker NMR JCAMP-DX V2.0
##DATA TYPE= NMR SPECTRUM
##DATA CLASS= NTUPLES
##ORIGIN= UXNMR, Bruker Analytische Messtechnik GmbH
##OWNER= root
$$ XWIN-NMR		Version 3.5
$$ Fri Jun  6 14:48:32 2025 Russian Standard Time (UT+4h)  she@DPX200
##.OBSERVE FREQUENCY= 81.013821
##.OBSERVE NUCLEUS= ^31P
##.ACQUISITION MODE= SIMULTANEOUS
##.ACQUISITION SCHEME= undefined
##.AVERAGES= 64
##.DIGITISER RES= 17
##SPECTROMETER/DATA SYSTEM= spect
##.PULSE SEQUENCE= zgpg30
##.SOLVENT NAME= D2O
##.SHIFT REFERENCE= (INTERNAL, D2O, 0, 198.062)
##AUDIT TRAIL= $$ (NUMBER, WHEN, WHO, WHERE, WHAT)
$$ ##TITLE= Audit trail, XWIN-NMR		Version 3.5
$$ ##JCAMPDX= 5.01
$$ ##ORIGIN= Bruker BioSpin GmbH
$$ ##OWNER= she
$$ F:/spectra/data/she/nmr/P31/2/pdata/1/auditp.txt
$$ ##AUDIT TRAIL=  $$ (NUMBER, WHEN, WHO, WHERE, WHAT)
(   1,<2025-06-06 14:46:28.28 +0400>,<she>,<DPX200>,
      <continue with go, POWCHK disabled, PULCHK disabled
       configuration hash MD5:
       00 E9 B6 7A A2 85 ED C7 34 08 36 98 17 FE 4E 26
       data hash MD5: 32K
       A2 10 09 9C 0E DA B1 C8 40 5C 91 15 B8 74 6D 4B>)
(   2,<2025-06-06 14:47:08.57 +0400>,<she>,<DPX200>,
      <Start of raw data processing
       efp BC_mod = 2 LB = 1.5 FT_mod = 6 PKNL = 1 PHC0 = 1517.978 PHC1 = -278.9066 SI = 64K 
       data hash MD5: 64K
       6B 15 97 52 79 53 BF 76 69 1F BC 23 8A 43 C3 01>)
(   3,<2025-06-06 14:47:24.34 +0400>,<she>,<DPX200>,
      <pk PHC0 = -6.907228 PHC1 = 0 
       data hash MD5: 64K
       38 FC F1 28 D1 26 ED 9B B9 9D 5E BB 89 00 2B 8C>)
$$ ##END=
$$ 
$$ hash MD5
$$ B5 5C 48 F7 E4 BC 8A 7C FA 6F 8B 60 80 6B 90 0F
##$RELAX= 
##$RELAX= 
##$RELAX= 
##$RELAX= 
##$RELAX= 
##$RELAX= 
##$RELAX= 
##$RELAX= 
$$ Bruker specific parameters
$$ --------------------------
##$DU= <F:/spectra>
##$EXPNO= 2
##$NAME= <P31>
##$PROCNO= 1
##$TYPE= <nmr>
##$USER= <she>
##$AMP= (0..31)
100 100 100 100 100 100 100 100 100 100 100 100 100 100 100 100 100 100 
100 100 100 100 100 100 100 100 100 100 100 100 100 100 
##$AQSEQ= 0
##$AQ_mod= 1
##$AUNM= <au_zg>
##$AUTOPOS= <>
##$BF1= 81.014009
##$BF2= 200.13
##$BF3= 200.13
##$BF4= 200.13
##$BF5= 200.13
##$BF6= 200.13
##$BF7= 200.13
##$BF8= 200.13
##$BYTORDA= 1
##$CFDGTYP= 0
##$CFRGTYP= 5
##$CHEMSTR= <none>
##$CNST= (0..31)
1 1 145 1 1 1 1 1 1 1 1 1 1 1 1 1 1 1 1 1 1 1 1 1 1 1 1 1 1 1 1 1 
##$CPDPRG= <waltz16>
##$CPDPRG1= <>
##$CPDPRG2= <waltz16>
##$CPDPRG3= <>
##$CPDPRG4= <mlev>
##$CPDPRG5= <mlev>
##$CPDPRG6= <mlev>
##$CPDPRG7= <mlev>
##$CPDPRG8= <mlev>
##$CPDPRGB= <>
##$CPDPRGT= <>
##$D= (0..31)
0 1 0 0 0 0 0 0 0 0.06 0 0.03 2e-05 3e-06 0 0 0.0002 0 0 0 0 0 0 0 0 0 
0 0 0 0 0 0 
##$DATE= 1749206687
##$DBL= (0..7)
120 120 120 11 120 120 24 19 
##$DBP= (0..7)
150 150 150 150 150 150 150 150 
##$DBP07= 0
##$DBPNAM0= <>
##$DBPNAM1= <>
##$DBPNAM2= <>
##$DBPNAM3= <>
##$DBPNAM4= <>
##$DBPNAM5= <>
##$DBPNAM6= <>
##$DBPNAM7= <>
##$DBPOAL= (0..7)
0.5 0.5 0.5 0.5 0.5 0.5 0.5 0.5 
##$DBPOFFS= (0..7)
$$ [...]
##$SUBNAM3= <"">
##$SUBNAM4= <"">
##$SUBNAM5= <"">
##$SUBNAM6= <"">
##$SUBNAM7= <"">
##$SUBNAM8= <"">
##$SUBNAM9= <"">
##$SW= 400.765351723535
##$SWIBOX= (0..15)
0 1 3 0 0 0 0 0 0 0 0 0 0 0 0 0 
##$SW_h= 32467.5324675325
##$TD= 32768
##$TD0= 1
##$TE= 0
##$TE2= 300
##$TE3= 300
##$TEG= 300
##$TL= (0..7)
0 120 53 12 22 120 120 120 
##$TP= (0..7)
150 150 150 150 150 150 150 150 
##$TP07= 0
##$TPNAME0= <>
##$TPNAME1= <>
##$TPNAME2= <>
##$TPNAME3= <>
##$TPNAME4= <>
##$TPNAME5= <>
##$TPNAME6= <>
##$TPNAME7= <>
##$TPOAL= (0..7)
0.5 0.5 0.5 0.5 0.5 0.5 0.5 0.5 
##$TPOFFS= (0..7)
0 0 0 0 0 0 0 0 
##$TUNHIN= 0
##$TUNHOUT= 0
##$TUNXOUT= 0
##$USERA1= <user>
##$USERA2= <user>
##$USERA3= <user>
##$USERA4= <user>
##$USERA5= <user>
##$V9= 5
##$VALIST= <valist>
##$VCLIST= <CCCCCCCCCCCCCCC>
##$VD= 0
##$VDLIST= <DDDDDDDDDDDDDDD>
##$VPLIST= <PPPPPPPPPPPPPPP>
##$VTLIST= <TTTTTTTTTTTTTTT>
##$WBST= 1024
##$WBSW= 4
##$XGAIN= (0..3)
0 0 0 0 
##$XL= 0
##$YL= 0
##$YMAX_a= 43344
##$YMIN_a= -48283
##$ZGOPTNS= <>
##$ZL1= 120
##$ZL2= 120
##$ZL3= 120
##$ZL4= 120
##$ABSF1= 0
##$ABSF2= 0
##$ABSG= 0
##$ABSL= 0
##$ALPHA= 0
##$AQORDER= 0
##$ASSFAC= 0
##$ASSFACI= 0
##$ASSFACX= 0
##$ASSWID= 0
##$AUNMP= <proc_1d>
##$AZFE= 0.1
##$AZFW= 0.5
##$BCFW= 0
##$BC_mod= 2
##$BYTORDP= 0
##$COROFFS= 0
##$CY= -3
##$DATMOD= 1
##$DC= 0
##$DFILT= <>
##$DTYPP= 0
##$F1P= 0
##$F2P= 0
##$FCOR= 1
##$FTSIZE= 65536
##$FT_mod= 6
##$GAMMA= 0
##$GB= 0
##$INTBC= 1
##$INTSCL= 9.790993e-09
##$ISEN= 30
##$LB= 1.5
##$LEV0= 0
##$LPBIN= 0
##$MAXI= 10000
##$MC2= 0
##$MEAN= 0
##$ME_mod= 0
##$MI= 50
##$NCOEF= 0
##$NC_proc= -6
##$NLEV= 6
##$NOISF1= 182.463
##$NOISF2= 159.3651
##$NSP= 0
##$NTH_PI= 0
##$NZP= 0
##$OFFSET= 198.0616
##$PC= 4
##$PHC0= 1511.071
##$PHC1= -278.9066
##$PH_mod= 1
##$PKNL= yes
##$PPARMOD= 0
##$PSCAL= 0
##$PSIGN= 0
##$REVERSE= no
##$SF= 81.0140089999434
##$SI= 65536
##$SIGF1= 159.3651
##$SIGF2= -187.1042
##$SINO= 113.3802
##$SIOLD= 16384
##$SREGLST= <1H.CDCl3>
##$SSB= 0
##$STSI= 65536
##$STSR= 0
##$SW_p= 32467.5324675325
##$SYMM= 0
##$S_DEV= 0
##$TDeff= 32768
##$TDoff= 0
##$TI= <>
##$TILT= no
##$TM1= 0
##$TM2= 0
##$TOPLEV= 0
##$USERP1= <user>
##$USERP2= <user>
##$USERP3= <user>
##$USERP4= <user>
##$USERP5= <user>
##$WDW= 1
##$XDIM= 65536
##$YMAX_p= 329830539
##$YMIN_p= -31271401
$$ End of Bruker specific parameters
$$ ---------------------------------
##NTUPLES= NMR SPECTRUM
##VAR_NAME=  FREQUENCY,     SPECTRUM/REAL,   SPECTRUM/IMAG
##SYMBOL=    X,             R,               I
##VAR_TYPE=  INDEPENDENT,   DEPENDENT,       DEPENDENT
##VAR_FORM=  AFFN,          ASDF,            ASDF
##VAR_DIM=   65536,         65536,           65536
##UNITS=     HZ,            ARBITRARY UNITS, ARBITRARY UNITS
##FACTOR=    0.49542278885378, 1,            1
##FIRST=     16045.7642231865, 0,            0
##LAST=      -16421.768244346, 0,            0
##MIN=       -16421.768244346, -31271401,    0
##MAX=       16045.7642231865, 329830539,    0
$$ Real data points
##PAGE= N=1
##DATA TABLE= (X++(R..R)), XYDATA
$$ [...]
$$ plain form
46157 -3016670 -2478463 -1318186 -745044 -1027583 -1479831 -1713016 -2033221 -2562795 -2800076
46148 -2800076 -2415517 -1923510 -2086041 -2919862 -3698497 -3832420 -3445404 -3091269 -3111327 -3349784
46138 -3349784 -3435293 -3228521 -2868712 -2410488 -1699155 -790382 -219459 -480147 -1360749 -2191292
46128 -2191292 -2683764 -3088506 -3525838 -3703578 -3493066 -3306273 -3551886 -4040720 -4305635
46119 -4305635 -4282759 -4267461 -4319371 -4164834 -3755232 -3527146 -3843165 -4369658 -4360281 -3604468
46109 -3604468 -2778410 -2591462 -2795331 -2512512 -1557029 -821798 -1012134 -1551660 -1404556
46100 -1404556 -647765 -368453 -1012739 -1712008 -1549601 -780715 -326714 -575925 -1189575
46091 -1189575 -1721866 -1935453 -1764707 -1410242 -1262714 -1365278 -1208715 -452889 434213
$$ packed form
46157c016670N38207J160277N73142k82539m52248k33185l20205n29574k37281
46148b800076L84559M92007j62531q33821p78635j33923L87016L54135k0058k38457
46138c349784q5509K06772L59809M58224P11333R08773N70923k60688q80602q30543
46128b191292m92472m04742m37332j77740K10512J86793k45613m88834k64915
46119d305635K2876J5298n1910J54537M09602K28086l16019n26493R377P55813
46109c604468Q26058J86948k03869K82819R55483P35231j90336n39526J47104
46100a404556P56791K79312o44286o99269J62407P68886M54001k49211o13650
46091a189575n32291k13587J70746L54465J47528j02564J56563P55826Q87102
$$ plain form
46082 434213 727524 377492 -144816 -710249 -1576750 -2642828 -3362593 -3541253 -3608046 -3865497
46072 -3865497 -3994453 -3621965 -2956207 -2486070 -2349095 -2350935 -2373161 -2392761 -2260150 -1843450
46062 -1843450 -1345056 -1141521 -1288589 -1454395 -1377518 -1125872 -824541 -423474 36976 145811
46052 145811 -511125 -1680873 -2486572 -2343876 -1632194 -1232273 -1564850 -2358277 -3190015
46043 -3190015 -3805612 -3909841 -3187692 -1815120 -578483 -122539 -284400 -477668 -539309
46034 -539309 -837223 -1636955 -2701430 -3525063 -3764777 -3496708 -3208635 -3408479 -4059768
46025 -4059768 -4577609 -4566746 -4286410 -4106729 -3872284 -3303213 -2736119 -2778494 -3297024 -3453120
46015 -3453120 -2854680 -2041007 -1626230 -1551974 -1477182 -1364548 -1277883 -1022627 -452017 129616
$$ packed form
46082D34213K93311l50032n22308n65433q66501j066078p19765j78660o6793k57451
46072c865497j28956L72488O65758M70137J36975j840k2226j9600J32611M16700
46062a843450M98394K03535j47068j65806P6877K51646L01331M01067M60450J08835
46052A45811o56936j169748q05699J42696P11682L99921l32577p93427q31738
46043c190015o15597j04229P22149J372572J236637M55944j61861j93268o1641
46034e39309k97914p99732j064475q23633k39714K68069K88073j99844o51289
46025d059768n17841J0863K80336J79681K34445N69071N67094m2375n18530j56096
46015c453120N98440Q13673M14777P4256P4792J12634Q6665K55256N70610N81633
$$ plain form
46005 129616 287059 27379 -273416 -408278 -548672 -983380 -1783449 -2631870 -2978972 -2604868
45995 -2604868 -2019695 -1935609 -2311444 -2410970 -1909321 -1313662 -1027973 -733438 -216228 -91281
45985 -91281 -870623 -1811925 -1712204 -658215 33125 -334908 -1026046 -1168354 -965071 -1096242
45975 -1096242 -1570507 -1807248 -1510751 -923445 -406631 -195134 -421263 -989576 -1470642
45966 -1470642 -1415951 -808327 -64161 379762 410255 265136 284810 539418 689540 356791
45956 356791 -401053 -1204459 -1888447 -2575171 -3176455 -3255507 -2596124 -1573653 -714265 -163598
45946 -163598 174632 276208 90976 -221545 -468599 -682112 -950721 -1195117 -1385800 -1754419
45936 -1754419 -2427107 -3023525 -3033734 -2513407 -2018887 -1904033 -2083914 -2493609 -3318956 -4562822
$$ packed form
46005A29616J57443k59680l00795j34862j40394m34708q00069q48421l47102L74104
45995b604868N85173Q4086l75835r9526N01649N95659K85689K94535N17210J24947
45985i1281p79342r41302R9721J053989O91340l68033o91138j42308K03283j31171
45975a096242m74265k36741K96497N87306N16814K11497k26129n68313m81066
45966a470642N4691O07624P44166M43923L0493j45119J9674K54608J50122l32749
45956C56791p57844q03406o83988o86724o01284p9052O59383J022471Q59388N50667
45946a63598L38230J01576j85232l12521k47054k13513k68609k44396j90683l68619
45936a754419o72688n96418j0209N20327M94520J14854j79881m09695q25347j243866
$$ plain form
45926 -4562822 -5665692 -5832054 -4733314 -2865459 -1248645 -671319 -1075028 -1723240 -2034118
45917 -2034118 -2057296 -2035068 -1894969 -1567017 -1455749 -1968417 -2713382 -2867794 -2382579 -2107553
45907 -2107553 -2526581 -3090451 -3176924 -3022181 -3114013 -3226653 -2845950 -2237564 -2219229 -2879418
45897 -2879418 -3308076 -2823683 -1876921 -1434553 -1896449 -2920260 -3958310 -4619518 -4734076
45888 -4734076 -4398267 -3856884 -3151838 -2072449 -678100 365028 357367 -584548 -1610142
45879 -1610142 -2090662 -2160011 -2217004 -2260007 -2017605 -1552094 -1349918 -1730765 -2380565 -2620258
45869 -2620258 -2088691 -1085680 -258278 11764 -92484 -124417 53012 83578 -419114 -1304378
45859 -1304378 -1957325 -1977956 -1631978 -1512980 -1856615 -2335853 -2503279 -2297060 -2078246 -2247043
$$ packed form
45926d562822j102870j66362J098740J867855J616814N77326m03709o48212l10878
45917b034118k3178K2228J40099L27952J11268n12668p44965j54412M85215K75026
45907b107553m19028n63870q6473J54743r1832j12640L80703O08386J8335o60189
45897b879418m28658M84393R46762M42368m61896j023811j038050o61208j14558
45888d734076L35809N41383P05046J079389J394349J043128p661r41915j025594
45879a610142m80520o9349n6993m3003K42402M65511K02176l80847o49800k39693
45869b620258N31567J003011Q27402K70042j04248l1933J77429L0566n02692q85264
45859a304378o52947k0631L45978J18998l43635m79238j67426K06219K18814j68797
$$ plain form
45849 -2247043 -2852956 -3539007 -3850897 -3624409 -3084209 -2584315 -2286368 -2061678 -1631952
45840 -1631952 -850771 10854 316306 -306464 -1317265 -1615516 -797207 268585 516814
45831 516814 69023 -21433 716784 1599170 1845790 1535377 1134864 630614 -314347 -1635722
45821 -1635722 -2843638 -3591688 -3830966 -3526772 -2707846 -1777223 -1307643 -1427698 -1745316
45812 -1745316 -1921210 -1947357 -1800784 -1303864 -605748 -415134 -1293647 -2835581 -3955961
45803 -3955961 -4029121 -3435261 -2905544 -2660176 -2454252 -2248914 -2386431 -3021415 -3762768 -4157459
45793 -4157459 -4296495 -4598426 -5127719 -5529734 -5619355 -5616631 -5715486 -5800617 -5721195 -5491189
45783 -5491189 -5093232 -4469516 -3834489 -3516156 -3288560 -2454155 -967930 135456 22043
$$ packed form
45849b247043o05913o86051l11890K26488N40200M99894K97947K24690M29726
45840a631952P81181Q61625L05452o22770j010801k98251Q18309J065792K48229
45831E16814m47791r0456P38217Q82386K46620l10413m00513n04250r44961j321375
45821a635722j207916p48050k39278L04194Q18926R30623M69580j20055l17618
45812a745316j75894k6147J46573M96920O98116J90614q78513j541934j120380
45803c955961p3160N93860N29717K45368K05924K05338j37517o34984p41353l94691
45793d157459j39036l01931n29293m02015q9621K724r8855q5131P9422K30006
45783e491189L97957O23716O35027L18333K27596Q34405J486225J103386j13413
$$ plain form
45774 22043 -762605 -1117487 -946435 -1027616 -1633819 -2276280 -2707473 -3126934 -3305857 -2581440
45764 -2581440 -1052934 173539 398722 158544 133893 50069 -659300 -1755676 -2524389
45755 -2524389 -2727826 -2530239 -1902953 -851795 82705 307517 -14911 -270105 -301175
45746 -301175 -391520 -556526 -548263 -436720 -492745 -565556 -276398 186121 191773 -320855 -661299
45735 -661299 -408457 24807 124920 7166 40579 175368 63348 -387158 -905872 -1187388
45725 -1187388 -1136746 -904818 -768523 -832656 -832069 -439083 219127 603059 375240 -238717
45715 -238717 -723911 -712937 -192420 474890 773963 538710 159373 32370 -20206 -383621
45705 -383621 -878390 -912771 -367450 252772 587341 738566 736092 363189 -239668 -461271
$$ packed form
45774B2043p84648l54882J71052q1181o06203o42461m31193m19461j78923P24417
45764b581440J528506J226473K25183k40178k4651q3824p09369j096376p68713
45755b524389k03437J97587O27286J051158R34500K24812l22428k55194l1070
45746c01175r0345j65006Q263J11543n6025p2811K89158M62519N652n12628l40444
45735f61299K52842M33264J00113j17754L3413J34789j12020m50506n18714k81516
45725a187388N0642K31928J36295o4133N87L92986O58210L83932k27819o13957
45715b38717m85194J0974N20517O67310K99073k35253l79337j27003n2576l63415
45705c83621m94769l4381N45321O20222L34569J51225k474l72903o02857k21603
$$ plain form
45695 -461271 -103561 188018 -147361 -714770 -795235 -503396 -664777 -1629091 -2738977 -3060855
45685 -3060855 -2351706 -1255362 -691959 -1019449 -1719980 -2007122 -1715712 -1333413 -1182181
45676 -1182181 -1026538 -632587 -212203 -8207 119434 310188 291639 -204165 -915059 -1388408
45666 -1388408 -1596352 -1775967 -1904688 -1823919 -1701998 -1869485 -2287943 -2620260 -2729488 -2690246
45656 -2690246 -2439321 -1899109 -1369800 -1293493 -1633839 -1962584 -2166632 -2559629 -3204877 -3641014
45646 -3641014 -3505124 -3038183 -2712146 -2633681 -2567493 -2365240 -2147746 -2135095 -2398470 -2717060
45636 -2717060 -2689448 -2135581 -1385341 -989678 -1135942 -1537982 -1908887 -2285307 -2761768 -3108672
45626 -3108672 -2904740 -2082409 -1194971 -954816 -1437546 -1922485 -1749404 -1192548 -1088596
$$ packed form
45695d61271L57710K91579l35379n67409q0465K91839j61381r64314j109886l21878
45685c060855P09149J096344N63403l27490p00531k87142K91410L82299J51232
45676a182181J55643L93951M20384K03996J27641J90754j8549m95804p10894m73349
45666a388408k07944j79615j28721Q0769J21921j67487m18458l32317j09228L9242
45656b690246K50925N40212N29309P6307l40346l28745k04048l92997o45248m36137
45646c641014J35890M66941L26037P8465O6188K02253K17494J2651k63375l18590
45636b717060K7612N53867P50240L95663j46264m02040l70905l76420m76461l46904
45626c108672K03932Q22331Q87438K40155m82730m84939J73081N56856J03952
$$ plain form
45617 -1088596 -1626202 -2050719 -1755034 -1082299 -642608 -371252 101212 509566 168904
45608 168904 -951017 -2077781 -2645899 -2856111 -3076528 -3228425 -3043665 -2567696 -2128236
45599 -2128236 -1987679 -2161610 -2425058 -2459645 -2169187 -1840612 -1820410 -2109065 -2468734 -2775222
45589 -2775222 -2994143 -2998051 -2759981 -2556472 -2595338 -2634517 -2400057 -2139185 -2205984 -2335609
45579 -2335609 -2039075 -1579272 -1725027 -2507018 -3077483 -2991147 -2782286 -2937145 -3085892 -2710758
45569 -2710758 -2025164 -1598675 -1564342 -1683931 -1822530 -1935258 -1916298 -1810435 -1843323 -1975006
45559 -1975006 -1833458 -1357508 -1027948 -1153079 -1444707 -1663072 -2113901 -3019045 -3900217
45550 -3900217 -4138583 -3747866 -3110765 -2390761 -1715924 -1466376 -1757583 -2021964 -1707159
$$ packed form
45617a088596n37606m24517K95685O72735M39691K71356M72464M08354l40662
45608A68904j119921j126764n68118k10212k20417j51897J84760M75969M39460
45599b128236J40557j73931k63448l4587K90458L28575K0202k88655l59669l06488
45589b775222k18921l908K38070K03509l8866l9179K34460K60872o6799j29625
45579b335609K96534M59803j45755p81991n70465Q6336K08861j54859j48747L75134
45569b710758O85594M26489L4333j19589j38599j12728J8960J05863l2888j31683
45559a975006J41548M75950L29560j25131k91628k18365m50829r05144q81172
45550c900217k38366L90717O37101P20004O74837K49548k91207k64381L14805
$$ plain form
45541 -1707159 -1040323 -562678 -362889 -369832 -821465 -1608016 -1695134 -304928 1611298 2241662
45531 2241662 1206571 -119237 -638981 -741006 -1171204 -1772413 -1945275 -1638524 -1291801
45522 -1291801 -1245037 -1587256 -2167329 -2498412 -2137308 -1388033 -1095898 -1517253 -1994053 -2018012
45512 -2018012 -1927211 -2124282 -2287989 -1975050 -1469960 -1335477 -1477740 -1357500 -912961 -613844
45502 -613844 -709266 -1024296 -1457369 -2089605 -2722842 -2833408 -2218459 -1388816 -1112445 -1686849
45492 -1686849 -2710205 -3443685 -3412798 -2800894 -2232754 -2060140 -1970902 -1492369 -746909 -372938
45482 -372938 -673863 -1180023 -1238813 -815025 -423210 -335379 -196067 406337 1231427 1609383
45472 1609383 1331997 897620 703077 417459 -446270 -1637048 -2383440 -2396786 -2104585
$$ packed form
45541a707159O66836M77645J99789o943m51633p86551q7118J390206J916226O30364
45531B241662j035091j325808n19744j02025m30198o01209j72862L06751L46723
45522a291801M6764l42219n80073l31083L61104P49275K92135m21355m76800k3959
45512b018012R0801j97071j63707L12939N05090J34483j42263J20240M44539K99117
45502f13844r5422l15030m33073o32236o33237j10566O14949Q29643K76371n74404
45492a686849j023356p33480L0887O11904N68140J72614Q9238M78533P45460L73971
45482c72938l00925n06160n8790M23788L91815Q7831J39312O02404Q25090L77956
45472A609383k77386m34377j94543k85618q63729j190778p46392j3346K92201
$$ plain form
45463 -2104585 -1872305 -1569771 -1080167 -710843 -780037 -1151458 -1459946 -1502796 -1188680 -458042
45453 -458042 449068 970139 804048 262347 -249245 -767270 -1401272 -1767421 -1366767 -402406
45443 -402406 337585 427173 152600 -150072 -633103 -1598458 -2950912 -4243443 -5090540
45434 -5090540 -5347287 -5016884 -4188013 -3057914 -1918390 -1079909 -757647 -940858 -1360587
45425 -1360587 -1648857 -1553907 -1021134 -184225 627399 996879 762049 284754 209316 833548
45415 833548 1772853 2345270 2287006 1989092 1960472 2161165 2078674 1479172 782013 478044
45405 478044 438434 171720 -385075 -798970 -847945 -804496 -921885 -1141354 -1497623 -2264744
45395 -2264744 -3315279 -3813340 -3123766 -1788242 -1031577 -1369539 -2166755 -2519833 -2120649
$$ packed form
45463b104585K32280L02534M89604L69324o9194l71421l08488m2850L14116P30638
45453d58042R07110N21071j66091n41701n11592n18025o34002l66149M00654R64361
45443d02406P39991Q9588k74573l02672m83031r65355j352454j292531q47097
45434e090540k56747L30403Q28871J130099J139524Q38481L22262j83211m19729
45425a360587k88270R4950N32773Q36909Q11624L69480k34830m77295p5438O24232
45415H33548R39305N72417n8264k97914k8620K00693q2491n99502o97159l03969
45405D78044l9610k66714n56795m13895m8975M3449j17389k19469l56269p67121
45395b264744j050535m98061O89574J335524P56665l37962p97216l53078L99184
$$ plain form
45386 -2120649 -1254297 -435008 -180195 -729614 -1728943 -2408562 -2282513 -1580626 -937520
45377 -937520 -806063 -1198523 -1771167 -2043696 -1716587 -935695 -163950 300768 578425 873112
45367 873112 1005755 513505 -710496 -2050119 -2675088 -2447177 -2101260 -2371011 -3117244
45358 -3117244 -3576746 -3330844 -2652335 -1939266 -1290598 -792776 -753374 -1295713 -2006684 -2339802
45348 -2339802 -2195095 -1833323 -1432635 -1041232 -774587 -705167 -674718 -528270 -416918 -560954
45338 -560954 -831357 -893395 -679399 -408096 -217842 -96885 -118785 -444205 -1105626 -1987424
45328 -1987424 -2902620 -3507115 -3408859 -2702669 -2130958 -2253463 -2655471 -2489514 -1640676 -778780
45318 -778780 -367344 -282495 -400980 -818679 -1295036 -1180134 -280267 694038 926031 390342
$$ packed form
45386b120649Q66352Q19289K54813n49419r99329o79619J26049P01887O43106
45377i37520J31457l92460n72644k72529L27109P80892P71745M64718K77657K94687
45367H73112J32643m92250j224001j339623o24969K27911L45917k69751p46233
45358c117244m59502K45902O78509P13069O48668M97822L9402n42339p10971l33118
45348b339802J44707L61772M00688L91403K66645O9420L0449J46448J11352j44036
45338e60954k70403o2038K13996K71303J90254J20957k1900l25420o61421q81798
45328a987424r15196o04495R8256P06190N71711j22505m02008J65957Q48838Q61896
45318g78780M11436Q4849j18485m17699m76357J14902Q99867R74305K31993n35689
$$ plain form
45308 390342 -334259 -798358 -939372 -934522 -1108635 -1731140 -2616560 -3116411 -2729201 -1583101
45298 -1583101 -262980 564278 339264 -1076803 -3015219 -4305377 -4290028 -3332799 -2203143
45289 -2203143 -1337329 -877538 -939285 -1438004 -1974979 -2271160 -2481823 -2824029 -3204308 -3475216
45279 -3475216 -3681071 -3741533 -3332323 -2498860 -1948166 -2173947 -2619792 -2309145 -1088297
45270 -1088297 308521 1216886 1498176 1254670 733190 394524 451422 419190 -259063 -1254031
45260 -1254031 -1738308 -1678356 -1885021 -2631522 -3101682 -2607952 -1623267 -1085267 -1245989 -1739610
45250 -1739610 -2275099 -2642667 -2440897 -1518452 -493552 -147977 -338262 -115700 1009748
45241 1009748 2478502 3523071 4138853 4953244 6457009 8649032 11195574 13595709
$$ packed form
45308C90342p24601m64099j41014M850j74113o22505q85420m99851L87210J146100
45298a583101J320121Q27258k25014j416067j938416j290158J5349R57229J129656
45289b203143Q65814M59791o1747m98719n36975k96181k10663l42206l80279k70908
45279c475216k05855o0462M09210Q33463N50694k25781m45845L10647J220848
45270a088297J396818R08365K81290k43506n21480l38666N6898l2232o78253r94968
45260a254031m84277N9952k06665p46501m70160M93730R84685N38000j60722m93621
45250a739610n35489l67568K01770R22445J024900L45575j90285K22562J125448
45241A009748J468754J044569O15782Q14391J503765K192023K546542K400135
$$ plain form
45233 13595709 15287800 15941809 15747099 15243548 14782683 14251443 13364182 12087300 10676178
45224 10676178 9422585 8540719 8220912 8537968 9256677 9959128 10495491 11146214 12211594
45215 12211594 13592165 14886291 15699570 15708949 14706910 12903445 10987136 9506968 8323043
45206 8323043 7066388 5983350 5730265 6288979 6725443 6303450 5321179 4470297 3817687
45197 3817687 2944249 1823008 981387 808384 1102443 1323852 1020506 73843 -1158570
45188 -1158570 -1986769 -1993366 -1490178 -1110854 -1033252 -947015 -694939 -454056 -240170 205098
45178 205098 786335 819757 -125498 -1446414 -2048524 -1566638 -654523 -113546 -118297 -349920
45168 -349920 -541892 -690409 -870466 -1032291 -1047742 -977282 -1185051 -1930396 -2801807 -2939585
$$ packed form
45233A3595709J692091O54009j94710n03551m60865n31240q87261j276882j411122
45224A0676178j253593q81866l19807L17056P18709P02451N36363O50723J065380
45215A2211594J380571J294126Q13279R379j002039j803465j916309j480168j183925
45206H323043j256655j083038k53085N58714M36464m21993r82271q50882o52610
45197C817687q73438j121241q41621j73003K94059K21409l03346r46663j232413
45188a158570q28199o597N03188L79324P7602Q6237K52076K40883K13886M45268
45178B05098N81237L3422r45255j320916o02110M81886R12115N40977m751k31623
45168c49920j91972j48517j80057j61825j5451P0460k07769p45345q71411j37778
$$ plain form
45158 -2939585 -2088076 -1067067 -764955 -978835 -874618 -397341 -391264 -1220765 -2114795 -2246758
45148 -2246758 -1750370 -1187733 -684258 -226852 -212319 -851676 -1425958 -1063795 -64864 474213
45138 474213 262900 51623 187288 8095 -920284 -1896125 -2028623 -1426691 -825784 -563167
45128 -563167 -526732 -648530 -809364 -640191 -71524 232721 -352579 -1455796 -2165127 -2204068
45118 -2204068 -1952109 -1503013 -563156 676486 1395957 1141798 365006 -284322 -665808
45109 -665808 -896287 -910573 -647912 -325946 -190851 -225317 -314655 -436496 -516747 -436953
45099 -436953 -401434 -900947 -1947996 -2680766 -2236266 -886642 200052 367241 179221
45090 179221 525096 1373239 1798414 1137092 -273502 -1588684 -2342647 -2612175 -2596095
$$ packed form
45158b939585Q51509J021009L02112k13880J04217M77277O077q29501q94030j31963
45148b246758M96388N62637N03475M57406J4533o39357n74282L62163R98931N39077
45138D74213k11313k11277J35665j79193r28379r75841j32498O01932O00907K62617
45128e63167L6435j21798j60834J69173N68667L04245n85300j103217p09331l8941
45118b204068K51959M49096R39857J239642P19471k54159p76792o49328l81486
45109f65808k30479j4286K62661L21966J35095l4466q9338j21841q0251P9794
45099d36953L5519m99513j047049p32770M44500J349624J086694J67189j88020
45090A79221L45875Q48143M25175o61322j410594j315182p53963k69528J6080
$$ plain form
45081 -2596095 -2455305 -2437578 -2655397 -2721635 -2139763 -1176974 -754211 -1199361 -1728610 -1582843
45071 -1582843 -1036059 -668693 -283102 566530 1436943 1493504 960368 916025 1561370 1817227
45061 1817227 958722 -369783 -1237508 -1622373 -1949171 -2230055 -2379671 -2802775 -3918306
45052 -3918306 -5413383 -6519193 -6765215 -6120621 -4826940 -3472235 -2728824 -2575247 -2284548
45043 -2284548 -1609812 -1328291 -2003613 -2884832 -2880846 -2114044 -1555433 -1470557 -1244867 -596659
45033 -596659 35767 344210 496078 506084 62519 -789922 -1428252 -1357784 -707320 60270
45023 60270 509796 345970 -340281 -990416 -1231584 -1441833 -2048556 -2510654 -1912909 -549314
45013 -549314 116866 -636301 -1805239 -2012578 -1118150 -32883 439078 90946 -822294
$$ packed form
45081b596095J40790J7727k17819o6238N81872R62789M22763m45150n29249J45767
45071a582843N46784L67366L85591Q49632Q70413N6561n33136m4343O45345K55857
45061A817227q58505j328505q67725l84865l26798k80884j49616m23104j115531
45052c918306j495077j105810k46022O44594J293681J354705P43411J53577K90699
45043b284548O74736K81521o75322q81219L986P66802N58611Q4876K25690O48208
45033e96659O32426L08443J51868J0006m43565q52441o38330P0468O50464P67590
45023F0270M49526j63826o86251o50135k41168k10249o06723m62098N97745J363595
45013e49314O66180p53167j168938k07339Q94428J085267M71961l48132r13240
$$ plain form
45004 -822294 -1724111 -2106480 -2126070 -2419347 -3101655 -3507375 -3228765 -2777644 -2757010 -2966264
44994 -2966264 -2903319 -2667221 -2720219 -3090743 -3415286 -3522840 -3438450 -3026514 -2152823 -1066177
44984 -1066177 -216999 152711 -28183 -766384 -1716987 -2205334 -2036893 -1932215 -2606232
44975 -2606232 -3729446 -4383958 -4240004 -3622684 -2707106 -1474390 -365348 -101661 -690165
44966 -690165 -1301662 -1370137 -1226708 -1377964 -1691411 -1700582 -1397282 -1301496 -1796919 -2637971
44956 -2637971 -3199736 -3191797 -2989710 -3040012 -3038607 -2215838 -578577 795492 1156867 1138361
44946 1138361 1693007 2513494 2489142 1471191 519940 388186 737329 991179 1055412 996464
44936 996464 890705 1212293 2428151 3883366 4093957 2686864 1126469 833385 1418101
$$ packed form
45004h22294r01817l82369j9590k93277o82308m05720K78610M51121K0634k09254
44994b966264O2945K36098n2998l70524l24543j07554Q4390M11936Q73691J086646
44984a066177Q49178L69710j80894p38201r50603m88347J68441J04678o74017
44975b606232j123214o54512J43954O17320R15578J232716J109042K63687n88504
44966f90165o11497o8475J43429j51256l13447r171L03300R5786m95423q41052
44956b637971n61765P939K02087n0302J405Q22769J637261J374069L61375j8506
44946A138361N54646Q20487k4352j017951r51251j31754L49143K53850O4233n8948
44936I96464j05759L21588J215858J455215K10591j407093j560395k93084N84716
$$ plain form
44927 1418101 1603828 1180892 1041564 1689060 2649156 3161185 2739498 1322269 -435950
44918 -435950 -1326278 -803912 194425 376158 -269708 -798323 -957750 -1412846 -2333201 -2867013
44908 -2867013 -2330155 -1063333 224966 1228903 1834304 1848656 1362855 851234 582415
44899 582415 404430 291638 465700 731361 446525 -413003 -865709 -171867 1111328
44890 1111328 1913699 1962111 1682698 1319272 915315 797227 1259366 1957532 2313953 2332641
44880 2332641 2342660 2202687 1599956 974543 1166909 2054152 2457540 1673827 309855
44871 309855 -707732 -1176906 -1275693 -949762 -267837 186633 -9367 -400771 -276768 224244
44861 224244 302722 -283143 -820481 -594699 210777 785561 628881 34209 -292689 -17342
$$ packed form
44927A418101J85727m22936j39328O47496R60096N12029m21687j417229j758219
44918d35950q90328N22366R98337J81733o45866n28615j59427m55096r20355n33812
44908b867013N36858J266822J288299J003937O05401J4352m85801n11621k68819
44899E82415j77985j12792J74062K65661k84836q59528m52706O93842J283195
44890A111328Q02371M8412k79413l63426m03957j18088M62139O98166L56421J8688
44880B332641J0019j39973o02731o25413J92366Q87243M03388p83713j363972
44871C09855j017587m69174r8787L25931O81925M54470j96000l91404J24003N01012
44861B24244P8478n85865n37338K25782Q05476N74784j56680n94672l26898K75347
$$ plain form
44851 -17342 462320 492056 -96419 -938099 -1745544 -2549594 -3257291 -3480994 -3097740 -2541905
44841 -2541905 -2165951 -1713283 -892812 -112999 -48778 -683158 -1346314 -1556420 -1280313 -551052
44831 -551052 501159 1313450 1299747 657403 126954 -94223 -487295 -1167604 -1539410 -1294758
44821 -1294758 -934289 -803549 -379476 776146 1948960 2022984 1000442 -26459 -283001
44812 -283001 15405 308214 289383 -179343 -1078451 -1961661 -2206938 -1771729 -1299319 -1273244
44802 -1273244 -1429596 -1231599 -614300 12794 310256 307568 235007 224912 201143 52615
44792 52615 -116926 -87305 36378 -247839 -1184773 -2262714 -2760029 -2622286 -2334441 -2079656
44782 -2079656 -1659584 -1241165 -1415116 -2223194 -2802399 -2487983 -1774930 -1613957 -2098700
$$ packed form
44851a7342M79662K9736n88475q41680q07445q04050p07697k23703L83254N55835
44841b541905L75954M52668Q20471P79813O4221o34380o63156k10106K76107P29261
44831e51052J052211Q12291j3703o42344n30449k21177l93072o80309l71806K44652
44821a294758L60469J30740M24073J155622J172814P4024j022542j026901k56542
44812b83001K98406K92809j8831m68726q99108q83210k45277M35209M72410K6075
44802a273244j56352J97997O17299O27094K97462k688p2561j0095k3769j48528
44792E2615j69541K9621J23683k84217r36934j077941m97315J37743K87845K54785
44782b079656M20072M18419j73951q08078n79205L14416P13053J60973m84743
$$ plain form
44773 -2098700 -2467339 -2210508 -1546734 -843126 -191060 288725 241948 -481781 -1456276 -2066770
44763 -2066770 -2193919 -2295031 -2799829 -3562224 -3990403 -3701672 -2954286 -2329083 -2037621
44754 -2037621 -1757968 -1218696 -690427 -653326 -1088346 -1374746 -952730 31304 793021 640065
44744 640065 -280779 -983752 -588419 695059 1782782 1988235 1675625 1418595 1032708
44735 1032708 36257 -1268571 -1996371 -1937049 -1788624 -1940398 -1870819 -1236884 -788039 -1372021
44725 -1372021 -2503116 -2909915 -2384977 -2075066 -2722331 -3571421 -3586196 -3010804 -2872636
44716 -2872636 -3313807 -3390167 -2584655 -1660258 -1610830 -2343891 -2930297 -2825272 -2288798 -1748123
44706 -1748123 -1317475 -1019456 -996156 -1254565 -1493822 -1435387 -1143568 -805355 -361975 362266
$$ packed form
44773b098700l68639K56831O63774P03608O52066M79785m6777p23729r74495o10494
44763b066770j27149j01112n04798p62395m28179K88731P47386O25203K91462
44754b037621K79653N39272N28269L7101m35020k86400M22016R84034P61717j52956
44744F40065r20844p02973L95333J283478J087723K05453l12610k57030l85887
44735A032708r96451j304828p27800N9322J48425j51774O9579O33935M48845n83982
44725a372021j131095m06799N24938L09911o47265q49090j4775N75392J38168
44716b872636m41171p6360Q05512R24397M9428p33061n86406J05025N36474N40675
44706a748123M30648K98019K3300k58409k39257N8435K91819L38213M43380P24241
$$ plain form
44696 362266 1224316 1733498 1541728 830259 148322 -60314 240736 748154 1114702 1188067
44686 1188067 991848 545813 -164688 -999438 -1597288 -1673580 -1357214 -1092673 -1192118 -1573386
44676 -1573386 -1930902 -2059663 -1993019 -1896545 -1839405 -1645821 -1064037 -197610 350440 40851
44666 40851 -854324 -1348690 -775297 444681 1272520 1161292 444325 -285137 -795693 -1104592
44656 -1104592 -1103876 -650983 80509 677613 947996 1048001 1098943 953632 495288 -70531
44646 -70531 -447173 -599540 -642364 -553874 -321265 -239358 -643199 -1355606 -1853832 -2075408
44636 -2075408 -2566361 -3587973 -4550304 -4741354 -4252398 -3677225 -3167700 -2407360 -1422023
44627 -1422023 -751242 -688185 -886351 -906445 -691320 -320254 195775 592596 351690 -539138
$$ packed form
44696C62266Q62050N09182j91770p11469o81937k08636L01050N07418L66548P3365
44686A188067j96219m46035p10501q34750n97850p6292L16366K64541r9445l81268
44676a573386l57516j28761O6644R6474N7140J93584N81784Q66427N48050l09589
44666D0851q95175m94366N73393J219978Q27839j11228p16967p29462n10556l08899
44656a104592P16M52893P31492N97104K70383J00005N0942j45311m58344n65819
44646g0531l76642j52367m2824Q8490K32609Q1907m03841p12407m98226k21576
44636b075408m90953j021612r62331j91050M88956N75173N09525P60340R85337
44627a422023O70781O3057j98166k0094K15125L71066N16029L96821k40906q90828
$$ plain form
44617 -539138 -1263880 -1167788 -726216 -877863 -1628922 -2096503 -1900691 -1671949 -1961824 -2443901
44607 -2443901 -2629060 -2681588 -2896812 -2906363 -2204985 -1179816 -771207 -1179418 -1719941 -2011028
44597 -2011028 -2423546 -3069902 -3233662 -2422372 -1330176 -970232 -1257421 -1285403 -792675
44588 -792675 -461421 -730363 -1156452 -1199507 -915629 -499192 228731 1337784 2233792 2195670
44578 2195670 1282342 221193 -489629 -948834 -1422383 -1980634 -2571814 -3096274 -3341718
44569 -3341718 -3107639 -2458574 -1681680 -1006109 -537947 -398718 -663831 -1153914 -1523021
44560 -1523021 -1617262 -1601778 -1716934 -2030775 -2410010 -2614037 -2459211 -1997122 -1455451 -922581
44550 -922581 -267662 479030 907667 672985 -15994 -655859 -1038267 -1235172 -1160658 -614116
$$ packed form
44617e39138p24742R6092M41572j51647p51059m67581J95812K28742k89875m82077
44607b443901j85159n2528k15224r551P01378J025169M08609m08211n40523k91087
44597b011028m12518o46356j63760Q11290J092196L59944k87189k7982M92728
44588g92675L31254k68942m26089m3055K83878M16437P27923J109053Q96008l8122
44578B195670r13328j061149p10822m59205m73549n58251n91180n24460k45444
44569c341718K34079O49065P76894O75571M68162J39229k65113m90083l69107
44560a523021r4241J5484j15156l13841l79235k04027J54826M62089N41671N32870
44550i22581O54919P46692M28637k34682o88979o39865l82408j96905P4514N46542
$$ plain form
44540 -614116 251124 920961 1053912 746803 323195 178405 699705 1854671 2888158
44531 2888158 2948168 2078545 1129250 664156 496068 337045 237624 182070 -94857 -574625
44521 -574625 -821110 -689737 -561499 -534953 -111536 782908 1186453 284960 -1313736 -2306247
44511 -2306247 -2286392 -1778401 -1077629 -86009 876719 1207422 1082848 1405917 2420840
44502 2420840 3241301 3119608 2425869 1923447 1731356 1533390 1302838 1247970 1358655 1496869
44492 1496869 1724094 2149878 2613074 2787333 2446921 1496667 48761 -1359738 -2022893
44483 -2022893 -1828413 -1440246 -1469264 -1830862 -2180663 -2494452 -2785401 -2723185 -2153902 -1683040
44473 -1683040 -2054968 -3086894 -3846983 -3823793 -3311981 -2671203 -1877481 -943785 -166726
$$ packed form
44540f14116Q65240O69837J32951l07109m23608j44790N21300J154966J033487
44531B888158O0010q69623r49295m65094j68088j59023r9421n5554k76927m79768
44521e74625k46485J31373J28238K6546M23417Q94444M03545r01493j598696r92511
44511b306247J9855N07991P00772R91620R62728L30703j24574L23069J014923
44502B420840Q20461j21693o93739n02422j92091j97966k30552n4868J10685J38214
44492A496869K27225M25784M63196J74259l40412r50254j447906j408499o63155
44483b022893J94480L88167k9018l61598l49801l13789k90949O2216N69283M70862
44473a683040l71928j031926p60089K3190N11812O40778P93722R33696P77059
$$ plain form
44464 -166726 315916 735757 1179416 1274806 711662 -244794 -1077299 -1600617 -1932740 -2129372
44454 -2129372 -2183533 -2211065 -2279083 -2142528 -1504681 -550700 71397 -103379 -891223 -1698777
44444 -1698777 -2127539 -2324043 -2796946 -3841844 -5063311 -5563438 -4769108 -3030092 -1258399
44435 -1258399 -70489 497104 547024 51627 -799644 -1359104 -1040303 -6482 982837
44426 982837 1438602 1593826 1915586 2420322 2682517 2418563 1841222 1388411 1217588 1067847
44416 1067847 623068 -60587 -573289 -600556 -250935 119722 285322 223390 -52378 -480097
44406 -480097 -800324 -707100 -235050 225144 382607 298098 113569 -165618 -466169 -565848
44396 -565848 -483343 -615337 -1094770 -1304602 -575968 764865 1639262 1506194 811603 66207
$$ packed form
44464a66726M82642M19841M43659R5390n63144r56456q32505n23318l32123j96632
44454b129372n4161k7532o8018J36555O37847R53981O22097j74776p87844q07554
44444a698777m28762j96504m72903j044898j221467n00127P94330J739016J771693
44435a258399J187910N67593M9920m95397q51271n59460L18801J033821R89319
44426I82837M55765J55224L21760N04736K62195k63954n77341m52811j70823j49741
44416A067847m44779o83655n12702k7267L49621L70657J65600o1932k75768m27719
44406d80097l20227R3224M72050M60194J57463q4509j84529k79187l00551r9679
44396e65848Q2505j31994m79433k09832P28634J340833Q74397j33068o94591p45396
$$ plain form
44386 66207 -808433 -1829391 -2276615 -1386249 468689 1915602 1969531 904437 -290163
44377 -290163 -952050 -1124546 -1183403 -1312416 -1302123 -815968 103894 872737 881156 166756
44367 166756 -625899 -980909 -975485 -906932 -721743 -122662 838485 1627981 1804369 1468175
44357 1468175 971298 444233 -73770 -250708 264888 1149236 1524048 1032178 355315
44348 355315 301065 752739 989226 748821 413587 303784 367855 504034 626428 436083
44338 436083 -298545 -1214122 -1691974 -1766225 -2056112 -2703915 -3094392 -2834672 -2277345 -1766463
44328 -1766463 -1124008 -309754 180849 159898 273663 983537 1665880 1539768 914294 577099
44318 577099 439334 -106175 -812348 -842547 -386406 -700227 -2164751 -3406173 -2987116
$$ packed form
44386F6207q74640j020958m47224Q90366J854938J446913N3929j065094j194600
44377b90163o61887j72496n8857j29013J0293M86155R19862P68843Q419p14400
44367A66756p92655l55010N424O8553J85189N99081R61147P89496J76388l36194
44357A468175m96877n27065n18003j76938N15596Q84348L74812m91870o76863
44348C55315n4250M51674K36487k40405l35234j09803O4071J36179J22394j90345
44338D36083p34628r15577m77852p4251k89887o47803l90477K59720N57327N10882
44328a766463O42455Q14254M90603k0951J13765P09874O82343j26112o25474l37195
44318E77099j37765n45509p06173l0199M56141l13821j464524j241422M19057
$$ plain form
44309 -2987116 -1231103 263857 437773 -415738 -1254357 -1255083 -447063 289547 53080 -1105456
44299 -1105456 -2309891 -2973817 -3297296 -3546376 -3473576 -2831731 -1985584 -1548323 -1662645
44290 -1662645 -1955788 -1975147 -1467505 -546203 195000 67301 -960023 -2150191 -2773933
44281 -2773933 -2657924 -1930148 -828222 -3184 -315145 -1755448 -3023074 -2782762 -1102409
44272 -1102409 802476 1921892 2040760 1336955 126386 -1031409 -1593811 -1560384 -1400730
44263 -1400730 -1396833 -1336403 -916581 -243059 177782 -34636 -557561 -474348 690871 2142770
44253 2142770 2578981 1829953 1028157 938817 1007371 591881 213864 622210 1280539 1017985
44243 1017985 -71266 -619125 43375 1013019 1232155 846628 658808 932372 1323542
$$ packed form
44309b987116J756013J494960J73916q53511q38619p26Q08020P36610k36467j158536
44299a105456j204435o63926l23479k49080P2800O41845Q46147M37261j14322
44290a662645k93143j9359N07642R21302P41203j27699j027324j190168o23742
44281b773933J16009P27776J101926Q25038l11961j440303j267626K40312J680353
44272a102409J904885J119416J18868p03805j210569j157795n62402L3427J59654
44263a400730L897O0430M19822O73522M20841k12418n22925Q3213J165219J451899
44253B142770M36211p49028q01796q9340O8554m15490l78017M08346O58329k62554
44243A017985j089251n47859O62500R69644K19136l85527j87820K73564L91170
$$ plain form
44234 1323542 1561089 1636155 1508553 1057168 341485 -251173 -176986 811347 2238919 3133206
44224 3133206 2965543 2211355 1674957 1504769 1302855 939919 661044 526005 368246
44215 368246 228005 207594 1690 -711161 -1462218 -1385738 -476371 372116 695525 910839
44205 910839 1191912 894117 -345682 -1739075 -2236159 -1712990 -721210 370017 1396577
44196 1396577 2083848 2313664 2302534 2060840 1218413 -107730 -945301 -702185 -201153
44187 -201153 -632910 -1918090 -2989324 -3310681 -3134214 -2535603 -1330272 46052 642297
44178 642297 218246 -472370 -857860 -1227158 -1939215 -2663570 -2804872 -2183420 -1008348
44169 -1008348 356638 1375692 1586511 1126805 614672 373387 263823 349188 986726
$$ packed form
44234A323542K37547P5066j27602m51385p15683n92658P4187R88333J427572Q94287
44224C133206j67663p54188n36398j70188k01914l62936k78875j35039j57759
44215C68246j40241k0411k05904p12851p51057P6480R09367Q48487L23409K15314
44205I10839K81073k97795j239799j393393m97084N23169R91780J091227J026560
44196A396577O87271K29816j1130k41694q42427j326143q37571K43116N01032
44187b01153m31757j285180j071234l21357J76467N98611J205331J376324N96245
44178F42297m24051o90616l85490l69298p12057p24355j41302O21452J175072
44169a008348J364986J019054K10819m59706n12133k41285j09564Q5365O37538
$$ plain form
44160 986726 1957248 2272428 1427011 279231 39233 782198 1593466 1846133 1649500
44151 1649500 1276409 915537 958659 1809187 3239149 4477309 5119846 5499346 5971129
44142 5971129 6310554 6154630 5708860 5600905 6145492 7082686 8044681 9050882 10466744
44133 10466744 12561220 15141389 17614549 19455148 20632840 21510482 22302491 22771124
44125 22771124 22561109 21705005 20587916 19425511 17999564 16024336 13632069 11321808
44117 11321808 9464121 8007471 6687831 5398866 4302331 3656288 3568582 3833312 3989820
44108 3989820 3675541 2994280 2420809 2269141 2402654 2562301 2741218 2973942 2952801 2294515
44098 2294515 1200023 403806 283680 389552 126379 -426496 -766343 -776358 -746495 -666135
$$ packed form
44160I86726R70522L15180q45417j147780k39998P42965Q11268K52667j96633
44151A649500l73091l60872M3122Q50528J429962J238160O42537L79500M71783
44142E971129L39425j55924m45770j07955N44587R37194R61995J006201J415862
44133A0466744K094476K580169K473160J840599J177692Q77642P92009M68633
44125B2771124k10015q56104j117089j162405j425947j975228k392267k310261
44117A1321808j857687j456650j319640j288965j096535o46043q7706K64730J56508
44108C989820l14279o81261n73471j51668J33513J59647J78917K32724k1141o58286
44098B294515j094492p96217j20126J05872k63173n52875l39847j0015K9863Q0360
$$ plain form
44088 -666135 -115991 956622 1897755 2132252 1868069 1582489 1180959 280070 -886587
44079 -886587 -1589625 -1649117 -1590674 -1544975 -821461 859247 2389653 2398113 1036883 -220869
44069 -220869 -483636 -287993 -453900 -963268 -1355933 -1547788 -1705499 -1749867 -1536299 -1270239
44059 -1270239 -1257181 -1391212 -1298027 -888253 -434984 -179336 -130283 -170663 -131205 137289
44049 137289 556977 803363 671022 314523 -26433 -330368 -641141 -855394 -876242 -731709
44039 -731709 -350664 431798 1382933 1815451 1450404 960729 1132898 1806378 2235299 2219064
44029 2219064 2166915 2205779 2003671 1492822 1042750 806595 559296 328459 519309 1163737
44019 1163737 1633752 1411327 681749 -75438 -611517 -795363 -491591 127198 580715
$$ packed form
44088f66135N50144J072613R41133K34497k64183k85580m01530r00889j166657
44079h86587p03038n9492N8443M5699P23514J680708J530406Q460j361230j257752
44069b20869k62767J95643j65907n09368l92665j91855j57711m4368K13568K66060
44059a270239J3058j34031R3185M09774M53269K55648M9053m0380L9458K68494
44049A37289M19688K46386j32341l56499l40956l03935l10773k14253k0848J44533
44039g31709L81045P82462R51135M32518l65047m89675J72169O73480M28921j6235
44029B219064n2149L8864k02108n10849m50072k36155k47299k30837J90850O44428
44019A163737M70015k22425p29578p57187n36079j83846L03772O18789M53517
$$ plain form
44010 580715 706767 899342 1456954 2116119 2510232 2629173 2488542 1834865 647397
44001 647397 -456327 -825010 -526806 -89247 219320 422905 466417 319273 219573 308863
43991 308863 220921 -425944 -1260310 -1459463 -828789 -81441 48657 -403358 -802485 -570066
43981 -570066 352561 1409031 1806700 1300582 598408 652941 1507077 2173816 1784438 585060
43971 585060 -384222 -431801 152849 555689 358516 -106687 -296204 -144584 -20673 -124840
43961 -124840 -259695 -192439 111011 654549 1410377 2058591 2190136 1929475 1846490 2029465
43951 2029465 1850862 1021024 216104 78697 194505 -172030 -795527 -843150 -228829 309646
43941 309646 352361 108315 -356721 -1235920 -2204967 -2457809 -1811894 -1022311 -720393 -747484
$$ packed form
44010E80715J26052J92575N57612O59165L94113J18941j40631o53677j187468
44001F47397j103724l68683K98204M37559L08567K03585M3512j47144r9700Q9290
43991C08863q7942o46865q34366j99153O30674P47348J30098m52015l99127K32419
43981e70066R22627J056470L97669n06118p02174N4533Q54136O66739l89378j199378
43971E85060r69282m7579N84650M02840j97173m65203j89517J51620J23911j04167
43961a24840j34855O7256L03450N43538P55828O48214J31545k60661q2985J82975
43951B029465j78603q29838q04920j37407J15808l66535o23497m7623O14321N38475
43941C09646M2715k44046m65036q79199r69047k52842O45915P89583L01918k7091
$$ plain form
43931 -747484 -779106 -813176 -684187 85675 1397842 2216968 1743777 479326 -432130 -495330
43921 -495330 -13240 566001 878103 648871 71865 -191802 47350 23237 -840817 -1778027
43911 -1778027 -1620985 -646529 -388090 -1523875 -2984409 -3518723 -3249234 -3059641 -3095572
43902 -3095572 -2694982 -1590282 -443247 -39038 -371987 -767430 -730021 -431233 -329732
43893 -329732 -499525 -577786 -378488 -222733 -425731 -732891 -668300 -291943 -108953 -227223
43883 -227223 -163360 317492 700303 471723 3065 132204 994948 1829711 2033917 1933162
43873 1933162 2221388 2961560 3549391 3572426 3293619 3166458 3186163 2989498 2447665 1850578
43863 1850578 1504756 1423875 1494134 1681530 1903880 1925118 1657774 1460534 1828409 2790321
$$ packed form
43931g47484l1622l4070J28989P69862J312167Q19126m73191j264451r11456o3200
43921d95330M82090N79241L12102k29232n77006k63667K39152k4113q64054r37210
43911a778027J57042R74456K58439j135785j460534n34314K69489J89593l5931
43902c095572M00590J104700J147035M04209l32949l95443L7409K98788J01501
43893c29732j69793p8261J99298J55755k02998l07160O4591L76357J82990j18270
43883b27223O3863M80852L82811k28580m68658J29139Q62744Q34763K04206j00755
43873A933162K88226P40172N87831K3035k78807j27161J9705j96665n41833n97087
43863A850578l45822q0881P0259J87396K22350K1238k67344j97240L67875R61912
$$ plain form
43853 2790321 3886021 4756704 5426982 5883738 5770051 4866789 3646539 2858100 2592435
43844 2592435 2272096 1675631 1379657 1800949 2353534 2269758 1929267 2395991 3579532
43835 3579532 3944191 2606239 823126 467764 1575671 2502557 2280659 1616541 1417962
43826 1417962 1524515 1439407 1335269 1500564 1453710 584501 -624956 -961529 -74400 1038177
43816 1038177 1279950 618427 -193530 -580508 -552502 -439607 -469992 -508803 -158413 744532
43806 744532 1761138 2199004 1822549 992539 137988 -598904 -1153757 -1318266 -920642
43797 -920642 -72931 863725 1462224 1437326 932748 593232 994472 1884061 2344391 1929523
43787 1929523 1300611 1372971 2079941 2481826 2061203 1374056 1199035 1476651 1539029 1192084
$$ packed form
43853B790321J095700Q70683O70278M56756j13687r03262j220250p88439k65665
43844B592435l20339n96465k95974M21292N52585q3776l40491M66724J183541
43835C579532L64659j337952j783113l55362J107907R26886k21898o64118j98579
43826A417962J06553q5108j04138J65295m6854q69209j209457l36573Q87129J112577
43816A038177K41773o61523q11957l86978K8006J12895l0385l8811L50390R02945
43806G44532J016606M37866l76455q30010q54551p36892n54853j64509L97624
43797i20642Q47711R36656N98499k4898n04578l39516M01240Q89589M60330m14868
43787A929523o28912P2360P06970M01885m20623o87147j75021K77616O2378l46945
$$ plain form
43777 1192084 1004158 1397655 1951072 2010448 1735160 2000326 3211330 4652891 5238696
43768 5238696 4652588 3539723 2767533 2713446 3119722 3396852 3130819 2485652 2079109
43759 2079109 2339274 3038494 3547706 3446112 2794113 1969084 1392587 1293106 1552529 1821409
43749 1821409 1847587 1604382 1142193 593977 340740 740053 1513339 1864948 1518376 1164835
43739 1164835 1445036 1957022 1897127 1312415 955385 1122775 1475818 1915507 2697500 3542319
43729 3542319 3559583 2455526 1101662 469484 596235 1022161 1644951 2587699 3664330
43720 3664330 4521081 5011999 5062976 4579296 3894455 3809905 4629026 5577766 5785238 5419399
43710 5419399 5164234 5012172 4500036 3882636 3967459 4694368 4930538 4053113 2862180
$$ packed form
43777A192084j87926L93497N53417N9376k75288K65166J211004J441561N85805
43768E238696n86108j112865p72190n4087M06276K77130k66033o45167m06543
43759B079109K60165O99220N09212j01594o51999q25029n76497r9481K59423K68880
43749A821409K6178k43205m62189n48216k53237L99313P73286L51609l46572l53541
43739A164835K80201N11986n9895n84712l57030J67390L53043M39689P81993Q44819
43729C542319J7264j104057j353864o32178J26751M25926O22790R42748J076631
43720C664330Q56751M90918N0977m83680o84841q4550Q19121R48740K07472l65839
43710E419399k55165j52062n12136o17400Q4823P26909K36170q77425j190933
$$ plain form
43701 2862180 2372873 2383812 1932742 762960 -361359 -667248 -156808 622162 1209163
43692 1209163 1564267 1959057 2565072 3123059 3171192 2669229 2173549 2259470 2977098 3985771
43682 3985771 4938322 5563629 5711470 5606590 5761308 6294602 6624923 6256811 5594781
43673 5594781 5417631 5724757 5795084 5400115 5203064 5691501 6410710 6748717 6926928 7519994
43663 7519994 8312192 8453522 7789124 7308737 7974240 9598903 11266728 12505953 13575212
43654 13575212 14739525 15760063 16226933 16107792 15770476 15558341 15476832 15293753 14884766
43645 14884766 14437622 14299768 14670472 15520689 16762397 18302586 19890849 21176988 22134039
43636 22134039 23251476 25035255 27420003 29980639 32646172 35783934 39512268 43405240
$$ packed form
43701B862180m89307J0939m51070j169782j124319l05889N10440P78970N87001
43692A209163L55104L94790O06015N57987M8133n01963m95680Q5921P17628J008673
43682C985771R52551O25307J47841j04880J54718N33294L30321l68112o62030
43673E594781j77150L07126P0327l94969j97051M88437P19209L38007J78211N93066
43663G519994P92198J41330o64398m80387O65503J624663J667825J239225J069259
43654A3575212J164313J020538M66870j19141l37316k12135q1509j83079m08987
43645A4884766m47144j37854L70704Q50217J241708J540189J588263J286139R57051
43636B2134039J117437J783779K384748K560636K665533L137762L728334L892972
$$ plain form
43628 43405240 47172368 51262025 56342376 62386931 68820600 75607131 83680467 94052430
43620 94052430 106863585 121673342 138443306 157734633 179875997 204303184 229869281
43613 229869281 255466907 279978602 301703393 318234982 327178993 327077818 317843212
43606 317843212 300692281 277891775 252300180 226587585 202462657 180502526 160669127
43599 160669127 142891525 127158680 113314787 101119782 90590687 81998377 75259456
43592 75259456 69496748 63641856 57578720 52285126 48550877 45888944 43162940 40049841
43584 40049841 37241452 35223458 33613427 31998852 30712941 30161571 29855271 28888074
43576 28888074 27195088 25562022 24363575 23050144 21151260 19161933 17968106 17738440
$$ packed form
43628D3405240L767128M089657N080351O044555O433669O786531Q073336J0371963
43620I4052430J2811155J4809757J6769964J9291327K2141364K4427187K5566097
43613B29869281K5597626K4511695K1724791J6531589Q944011j01175r234606
43606C17843212j7150931k2800506k5591595k5712595k4124928k1960131j9833399
43599A60669127j7777602j5732845j3843893j2195005j0529095q592310o738921
43592G5259456n762708n854892o063136n293594l734249k661933k726004l113099
43584D0049841k808389k017994j610031j614575j285911n51370l06300r67197
43576B8888074j692986j633066j198447j313431j898884j989327j193827k29666
$$ plain form
43568 17738440 17822474 17574408 16921139 16192785 15685418 15428249 15242301 14964461 14559377
43559 14559377 13960619 12990135 11725961 10819602 10963221 11962758 12821483 12936262 12740570
43550 12740570 12895921 13379788 13852076 14466677 15632575 17191940 18545052 19525326 20417977
43541 20417977 21019408 20469587 18437147 15885681 14083788 13192477 12420014 11342487 10331882
43532 10331882 9616924 8703852 7230711 5903744 5835671 7009512 8094688 8034977 7277056
43523 7277056 7002663 7555028 8236395 8489117 8572147 8916454 9381123 9498279 9130642 8555478
43513 8555478 8074777 7785709 7613816 7427474 7256512 7431642 8206738 9144547 9297623
43504 9297623 8293084 6890452 6088626 5970734 5886181 5549935 5378716 5737129 6386406
$$ packed form
43568A7738440Q4034k48066o53269p28354n07367k57169j85948k77840m05084
43559A4559377n98758r70484j264174r06359J43619R99537Q58725J14779j95692
43550A2740570J55351M83867M72288O14601J165898J559365J353112R80274Q92651
43541B0417977O01431n49821k032440k551466j801893q91311p72463j077527j010605
43532A0331882p14958r13072j473141j326967o8073J173841J085176n9711p57921
43523G277056k74393N52365O81367K52722Q3030L44307M64669J17156l67637n75164
43513H555478m80701k89068j71893j86342j70962J75130P75096R37809J53076
43504I297623j004539j402632q01826j17892q4553l36246j71219L58413O49277
$$ plain form
43495 6386406 6879950 7151131 7439982 7797469 7921858 7551865 6933855 6719966 7237411
43486 7237411 7956335 7987837 7137381 6132929 5747753 6113128 7009650 8250008 9416171
43477 9416171 9804143 9236456 8522254 8455727 8705863 8462342 7913895 8137032 9497306
43468 9497306 11072085 11905498 12077673 12198398 12489144 12774632 12899747 12791609 12502401
43459 12502401 12448211 13144102 14410324 15328968 15368347 15119275 15501834 16642373 18017896
43450 18017896 19377690 20941417 22815009 24722057 26341508 27601714 28661172 29831465
43442 29831465 31436705 33496344 35587970 37233593 38438130 39789264 42092899 45860329
43434 45860329 50885541 56279736 61255610 66032867 71692264 79028055 87909790 97930794
$$ packed form
43495F386406M93544K71181K88851L57487J24389l69993o18010k13889N17445
43486G237411P18924L1502q50456j004452l85176L65375Q96522J240358J166163
43477I416171L87972n67687p14202o6527K50136k43521n48447K23137J360274
43468I497306J574779Q33413J72175J20725K90746K85488J25115j08138k89208
43459A2502401n4190O95891J266222R18644L9379k49072L82559J140539J375523
43450A8017896J359794J563727J873592J907048J619451J260206J059458J170293
43442B9831465J605240K059639K091626J645623J204537J351134K303635L767430
43434D5860329N025212N394195M975874M777257N659397P335791Q881735J0021004
$$ plain form
43426 97930794 109226583 122337695 137676488 155535466 176255463 199835674 225489218
43419 225489218 251919334 277761348 301252324 319667437 329830539 329617827 319025902
43412 319025902 300003800 275550307 248780262 222225599 197511368 175430090 156136202
43405 156136202 139298464 124397571 111090514 99189241 88395532 78532546 70071527
43398 70071527 63715186 59098886 54621831 49222538 43755317 39776556 37380205 35233695
43390 35233695 32575751 30051905 28378051 27214709 25908596 24613674 23963818 23971593 23874139
43381 23874139 23019855 21526022 20045575 19113313 18752906 18573831 18126117 17139076 15594532
43372 15594532 13871199 12780571 12954501 13954400 14468517 13782953 12600426 11934518 11758845
$$ packed form
43426I7930794J1295789J3111112J5338793J7858978K0719997K3580211K5653544
43419B25489218K6430116K5842014K3490976J8415113J0163102k12712j0591925
43412C19025902j9022102k4453493k6770045k6554663k4714231k2081278j9293888
43405A56136202j6837738j4900893j3307057j1901273j0793709r862986q461019
43398G0071527o356341m616300m477055n399293n467221l978761k396351k146510
43390C5233695k657944k523846j673854j163342j306113j294922o49856P775r7454
43381B3874139q54284j493833j480447r32262l60407j79075m47714r87041j544544
43372A5594532j723333j090628J73930R99899N14117o85564j182527o65908j75673
$$ plain form
43363 11758845 11491213 11276939 11687948 12378036 12301936 11418760 10961871 11578644 12295623
43354 12295623 12008000 11102167 10761655 11303290 12083985 12643658 13063742 13364385 13314361
43345 13314361 12876457 12322263 11847134 11389472 10813548 10075609 9329278 8976134 9327272
43336 9327272 10076978 10517145 10482767 10589375 11220138 11848985 11868805 11570303 11653127 12169801
43326 12169801 12681338 13195698 14197895 15842100 17758064 19606139 21274326 22640038
43318 22640038 23729468 25038478 27120082 29920534 33067428 36653870 41034233 45889885
43310 45889885 50217474 53263583 54767303 54329325 51541039 47073158 42746743 39915389
43302 39915389 38313090 36965179 35659628 34914762 34931801 35285397 35510392 35473960 35238236
$$ packed form
43363A1758845k67632k14274M11009O90088p6100q83176m56889O16773P16979
43354A2295623k87623r05833l40512N41635P80695N59673M20084L00643n0024
43345A3314361m37904n54194m75129m57662n75924p37939p46331l53144L51138
43336I327272P49706M40167l4378J06608O30763O28847J9820k98502Q2824N16674
43326A2169801N11537N14360J002197J644205J915964J848075J668187J365712
43318B2640038J089430J309010K081604K800452L146894L586442M380363M855652
43310D5889885M327589L046109J503720m37978k788286m467881m326415k831354
43302C9915389j602299j347911j305551p44866J7039L53596K24995l6432k35724
$$ plain form
43293 35238236 34948339 34807523 34884211 35013959 35055414 35044867 34918956 34382338 33337973 32165640
43283 32165640 31218877 30299735 29057741 27712410 26860907 26593529 26282703 25374459 24036048
43274 24036048 22835466 22000172 21189671 19937068 18207265 16493327 15334085 14749360
43266 14749360 14265221 13514816 12619636 11881066 11334696 10836588 10412028 10201742 10101348
43257 10101348 9758952 9042527 8348152 8280730 8979352 9787144 9731070 8507137 6952946
43248 6952946 6322343 7062337 8492576 9630950 9996476 9627093 8848827 8253454 8396691
43239 8396691 9126274 9592206 9314027 8827042 8790907 8918899 8516668 7761636 7515605 7885666
43229 7885666 7932972 7121947 6259815 6459731 7679665 8838303 9089372 8525375 7821029
$$ packed form
43293C5238236k89897j40816P6688J29748M1455j0547j25911n36618j044365j172333
43283C2165640r46763r19142j241994j345331q51503k67378l10826r08244j338411
43274B4036048j200582q35294q10501j252603j729803j713938j159242n84725
43266A4749360m84139p50405q95180p38570n46370m98108m24560k10286j00394
43257A0101348l42396p16425o94375o7422O98622Q07792n6074j223933j554191
43248F952946o30603P39994J430239J138374L65526l69383p78266n95373J43237
43239H396691P29583M65932k78179m86985l6135J27992m02231p55032k46031L70061
43229G885666M7306q11025q62132J99916J219934J158638K51069n63997p04346
$$ plain form
43220 7821029 7595640 8035915 8815684 9376142 9432972 9172793 8941586 8930544 9188845 9647819
43210 9647819 10034754 10076034 9907927 9941564 10190951 10187753 9818025 9738642 10496594 11633826
43200 11633826 12279111 12422279 12955680 14460795 16537374 18484567 20187358 22061142
43192 22061142 24370973 26879490 29160842 31175349 33440880 36470181 40036141 43303569
43184 43303569 45845795 48194002 51124500 54781061 58879472 63323983 67907751 71576160
43176 71576160 72766019 70648099 65627469 58741181 51207685 44489113 39818048 37156951
43168 37156951 35170820 32692732 29874475 27622379 26381216 25880407 25670614 25429293
43160 25429293 24998059 24554633 24585432 25359947 26578168 27736071 28581636 29042803 29132235
$$ packed form
43220G821029k25389M40275P79769N60458N6830k60179k31207j1042K58301M58974
43210I647819L86935M1280j68107L3637K49387l198l69728p9383P57952J137232
43200A1633826O45285J43168N33401J505115K076579J947193J702791J873784
43192B2061142K309831K508517K281352K014507K265531L029301L565960L267428
43184D3303569K542226K348207K930498L656561M098411M444511M583768L668409
43176G1576160J189859k117920n020630o886288p533496o718572m671065k661097
43168C7156951j986131k478088k818257k252096j241163n00809k09793k41321
43160B5429293m31234m43426L0799P74515J218221J157903Q45565M61167Q9432
$$ plain form
43151 29132235 29234957 30030541 31668238 33403629 34552562 35401124 36533858 37635820
43143 37635820 37850536 37257677 37091455 38238493 40190109 41815709 42660005 43106092 43645325
43134 43645325 44417398 45312118 46198407 47069577 48125249 49739991 52355681 56400125 62140075
43125 62140075 69475662 78085870 87990283 99637513 112897920 126017674 136100498
43118 136100498 140850451 139755662 133845037 124835357 114465122 103972040 93824423
43111 93824423 84130349 75332038 68200846 63196382 60252529 59187476 59852760 61865598
43103 61865598 64723675 68209833 72040049 75003522 75262777 71983682 66163742 59488809
43095 59488809 52920201 46782561 41515587 37538978 34707426 32630043 31387092 31329526
$$ packed form
43151B9132235J02722P95584J637697J735391J148933Q48562J132734J101962
43143C7635820K14716n92859j66222J147038J951616J625600Q44296M46087N39233
43134D3645325P72073Q94720Q86289Q71170J055672J614742K615690M044444N739950
43125F2140075P335587Q610208R904413J1647230J3260407J3119754J0082824
43118A36100498M749953j094789n910625r009680j0370235j0493082j0147617
43111I3824423r694074q798311p131192n004464k943853j065053O65284K012838
43103F1865598K858077L486158L830216K963473K59255l279095n819940o674933
43095E9488809o568608o137640n266974l976609k831552k077383j242951n7566
$$ plain form
43087 31329526 32246660 33252340 33501885 32705855 31090718 29215204 27642251 26393591
43079 26393591 24897977 22851855 20868803 19767114 19422897 18944532 17925355 16921188
43071 16921188 16625624 17109754 18013684 19016480 19890982 20435870 20631403 20753394 21197192
43062 21197192 22155478 23331069 23904754 23086038 20954984 18500460 16529916 14852168
43054 14852168 12925042 10934510 9614396 9205076 9243768 9289652 9225268 8912191 8237647
43045 8237647 7547367 7405616 7866931 8551549 9360513 10347691 10906705 10096175 8092952
43036 8092952 6403510 6128117 6779303 7327858 7602826 7952327 8268159 8297779 8452042
43027 8452042 9302366 10478739 10973525 10492564 9722265 9265303 9075096 9029802 9326739
$$ packed form
43087C1329526R17134J005680K49545p96030j615137j875514j572953j248660
43079B6393591j495614k046122j983052j101689l44217m78365j019177j004167
43071A6921188k95564M84130R03930J002796Q74502N44888J95533J21991M43798
43062B1197192R58286J175591N73685q18716k131054k454524j970544j677748
43054A4852168j927126j990532j320114m09320L8692M5884o4384l13077o74544
43045H237647o90280j41751M61315O84618Q08964R87178N59014q10530k003223
43036H092952j689442k75393O51186N48555K74968L49501L15832K9620J54263
43027H452042Q50324J176373M94786m80961p70299m56962j90207m5294K96937
$$ plain form
43018 9326739 10057784 10951421 11777046 12548734 13154997 13302459 13116569 13351977 14611857
43009 14611857 16621240 18608640 20201516 21612108 23077895 24496831 25681725 26739662
43001 26739662 28024816 29725263 31614186 33365450 35150476 37707649 41587056 46421946
42993 46421946 51231713 55476311 59620356 64677329 71413735 79930248 89652144 99638907
42985 99638907 109242850 118642618 128469529 138758243 148560799 156764163 162876583 166641375
42977 166641375 167303638 164005428 156940795 147542966 137382509 127342327 117932883 109641097
42969 109641097 102404994 95262911 87327199 79014503 71691740 66147729 62012043 58629341
42961 58629341 55735059 53114471 50447618 47964076 46549547 46583311 47247007 47695151 48369673
$$ packed form
43018I326739P31045Q93637Q25625P71688O06263J47462j85890K35408J259880
43009A4611857K009383J987400J592876J410592J465787J418936J184894J057937
43001B6739662J285154J700447J888923J751264J785026K557173L879407M834890
42993D6421946M809767M244598M144045N056973O736406Q516513R721896R986763
42985I9638907R603943R399768R826911J0288714R802556Q203364O112420L764792
42977A66641375O62263l298210p064633r397829j0160457j0040182r409444q291786
42969A09641097p236103p142083p935712q312696p322763n544011m135686l382702
42961E8629341k894282k620588k666853k483542j414529L3764O63696M48144O74522
$$ plain form
42952 48369673 50223784 53000040 55377802 56747473 57676772 58401409 57999687 55649922
42944 55649922 51848538 47707303 43713359 39883926 36555251 34159042 32517920 31111797
42936 31111797 29849225 28936716 28227575 27431240 26820466 26941541 27604792 27915011 27459340
42927 27459340 26809581 26650137 27049879 27873493 29225249 30930227 32061109 31728164 30255011
42918 30255011 28962376 28672026 28876873 28590549 27618598 26580243 25850420 25020436 23593969
42909 23593969 21820091 20426251 19667014 19041788 17942418 16221618 14130662 12135964
42901 12135964 10877422 10790261 11487432 11921282 11475390 10557130 9833423 9319796 8645590
42892 8645590 7808594 7117781 6687415 6551121 6995930 8124007 9275850 9622905 9289694
$$ packed form
42952D8369673J854111K776256K377762J369671R29299P24637m01722k349765
42944E5649922l801384m141235l993944l829433l328675k396209j641122j406123
42936C1111797j262572r12509p09141p96335o10774J21075O63251L10219m55671
42927B7459340o49759j59444L99742Q23614J351756J704978J130882l32945j473153
42918C0255011j292635k90350K04847k86324r71951j038355p29823q29984j426467
42909B3593969j773878j393840p59237o25226j099370j720800k090956j994698
42901A2135964j258542q7161O97171M33850m45892r18260p23707n13627o74206
42892H645590q36996o90813m30366j36294M44809J128077J151843L47055l33211
$$ plain form
42883 9289694 9186609 9715622 10366914 10693596 10904923 11207615 11271317 10798036 10083294 9527043
42873 9527043 9003117 8225428 7464741 7406891 8413181 10272624 12567474 14945169 17068400
42864 17068400 18579491 19212070 18923443 17977176 16854314 15900940 15070869 14193769 13371028
42855 13371028 12748085 12003183 10638411 8898873 7816329 8014184 8909905 9458146 9322134
42846 9322134 8960917 8911330 9391020 10328661 11362745 12008675 12191570 12411636 13048723
42837 13048723 13782182 14147657 14428717 15405963 17230452 19043159 19826530 19312504 17994226
42828 17994226 16547362 15335721 14270671 13065576 11706907 10593417 10062233 9908617
42820 9908617 9605103 8909462 8037405 7332347 6995376 7031685 7197883 7087050 6536887 5890559
$$ packed form
42883I289694j03085N29013O51292L26682K11327L02692O3702m73281p14742n56251
42873I527043n23926p77689p60687n7850J006290J859443K294850K377695K123231
42864A7068400J511091O32579k88627r46267j122862r53374q30071q77100q22741
42855A3371028o22943p44902j364772j739538j082544J97855Q95721N48241j36012
42846I322134l61217m9587M79690R37641J034084O45930J82895K20066O37087
42837A3048723P33459L65475K81060R77246J824489J812707P83371n14026j318278
42828A7994226j446864j211641j065050j205095j358669j113490n31184j53616
42820I908617l03514o95641q72057p05058l36971L6309J66198j10833n50163o46328
$$ plain form
42810 5890559 5608584 5720561 5932668 6149875 6528000 7062883 7511578 7744264 7837080 7799651
42800 7799651 7580649 7415400 7783016 8830489 10112353 11090957 11710032 12357235 13458973
42791 13458973 15201004 17388522 19405501 20508737 20359157 19185355 17413888 15407785
42783 15407785 13645532 12709152 12673018 12729157 11922082 10251594 8623516 7660051 7032830
42774 7032830 6186379 5261308 4858263 5156481 5782335 6435227 7091887 7589570 7635140 7425292
42764 7425292 7624724 8320713 8572192 7616159 6098399 5337380 5593989 5905064 5571202
42755 5571202 4906833 4358212 3795843 3129437 2882014 3534106 4758836 5838506 6455107
42746 6455107 6603546 6177159 5272734 4613552 4982487 6262940 7500464 7880384 7333445
$$ packed form
42810E890559k81975J11977K12107K17207L78125N34883M48695K32686R2816l7429
42800G799651k19002j65249L67616J047473J281864R78604O19075O47203J101738
42791A3458973J742031K187518K016979J103236j49580j173802j771467k006103
42783A5407785j762253r36380l6134N6139q07075j670488j628078r63465o27221
42774G032830q46451r25071m03045K98218O25854O52892O56660M97683M5570k09848
42764G425292J99432O95989K51479r56033j517760p61019K56609L11075l33862
42755E571202o64369n48621n62369o66406k47423O52092J224730J079670O16601
42746F455107J48439m26387r04425o59182L68935J280453J237524L79920n46939
$$ plain form
42737 7333445 6340650 5508452 5209498 5317845 5406760 5398275 5747744 6760862 8091339 9190256
42727 9190256 9819366 9824741 9017436 7783375 7155661 7551436 8008884 7521049 6561965 6242379
42717 6242379 6441362 6098801 5153147 4731762 5263704 5791555 5583521 5188263 5276573 5518487
42707 5518487 5403980 5367906 6251434 8103925 10122422 11415985 11491711 10502247 9324497
42698 9324497 8825024 8820142 8472836 7877658 8184696 9685105 10958734 10799290 9988978
42689 9988978 10076336 11188594 12281635 12979678 13818065 14899963 15586131 15585950 15377388 15444992
42679 15444992 15864891 16632214 17661487 18491653 18682078 18446939 18277711 18124038 17646973
42670 17646973 17040342 16771550 16697641 16329110 15819376 15730707 15916806 15697373 15171627 15253707
$$ packed form
42737G333445r92795q32198k98954J08347Q8915q485L49469J013118J330477J098917
42727I190256O29110N375q07305j234061o27714L95775M57448m87835r59084l19586
42717F242379J98983l42561r45654m21385N31942N27851k08034l95258Q8310K41914
42707E518487j14507l6074Q83528J852491K018497J293563P5726r89464j177750
42698I324497m99473m882l47306n95178L07038J500409J273629j59444q10312
42689I988978Q7358J112258J093041O98043Q38387J081898O86168j81k08562O7604
42679A5444992M19899P67323J029273Q30166J90425k35139j69228j53673m77065
42670A7646973o06631k68792p3909l68531n09734q8669J86099k19433n25746Q2080
$$ plain form
42660 15253707 16206817 17189919 17554207 17617228 17842022 18238671 18959587 20467568 22576001
42651 22576001 24262651 25076149 25900798 27657368 30019776 32164834 34121392 36577286
42643 36577286 39859981 43827627 48307641 53002641 57479459 61920794 67335539 74271248
42635 74271248 81871037 89094432 96401244 105202692 115931903 127719820 139877657 152626294
42627 152626294 166182249 179958760 192868282 203696589 211003854 213428883 210571735
42620 210571735 203278622 192901243 180588251 167276723 153817709 140828914 128628128
42613 128628128 117334399 106832870 96834929 87369723 79029269 72248439 66554034 61139376
42605 61139376 56012014 51825035 48633821 45688085 42617596 39988716 38331506 37299708
$$ packed form
42660A5253707R53110R83102L64288O3021K24794L96649P20916J507981K108433
42651B2576001J686650Q13498Q24649J756570K362408K145058J956558K455894
42643C6577286L282695L967646M480014M695000M476818M441335N414745O935709
42635G4271248P599789P223395P306812Q801448J0729211J1787917J2157837J2748637
42627A52626294J3555955J3776511J2909522J0828307P307265K425029k857148
42620B10571735p293113j0377379j2312992j3311528j3459014j2988795j2200786
42613A28628128j1293729j0501529r997941r465206q340454o780830n694405n414658
42605F1139376n127362m186979l191214k945736l070489k628880j657210j031798
$$ plain form
42597 37299708 36208954 34851258 33371681 31826394 30270658 28877943 27616068 26190330
42589 26190330 24614297 23412326 22926176 22844904 22758955 22729352 22922593 23138462 23160821 23174504
42579 23174504 23355774 23436991 23207614 23102420 23709045 24939142 26233790 27355491 28422586
42570 28422586 29383738 30061109 30569377 31126588 31589882 31730186 31781456 32092298 32421308
42561 32421308 32317775 32066099 32364823 33038848 33052297 32085231 31156752 31156431 31545639 31205544
42551 31205544 29989753 28675199 27753460 27033071 26241248 25307407 24098881 22493680 20768182
42542 20768182 19421485 18545138 17762982 16817292 15806463 14805794 13692005 12472836
42534 12472836 11401485 10569796 9691547 8500714 7149406 6041163 5449770 5416510 5800237
$$ packed form
42597C7299708j090754j357696j479577j545287j555736j392715j261875j425738
42589B6190330j576033j201971m86150q1272q5949k9603J93241K15869K2359J3683
42579B3174504J81270Q1217k29377j05194O06625J230097J294648J121701J067095
42570B8422586R61152O77371N08268N57211M63294J40304N1270L10842L29010
42561C2421308j03533k51676K98724O74025J3449r67066r28479l21L89208l40095
42551C1205544j215791j314554r21739p20389p91823r33841j208526j605201j725498
42542B0768182j346697q76347p82156r45690j010829j000669j113789j219169
42534A2472836j071351q31689q78249j190833j351308j108243n91393l3260L83727
$$ plain form
42525 5800237 6284410 6554919 6634150 6822009 7142499 7131938 6456404 5484034 4856246 4670198
42515 4670198 4555945 4458089 4727133 5323393 5581903 5154181 4656040 4814446 5350483 5428491
42505 5428491 5029555 5027080 5778138 6473087 6298707 5571444 5117241 5021437 4722574 4071437
42495 4071437 3518277 3286225 3070902 2685582 2398869 2412461 2493242 2370811 2103304 1829905
42485 1829905 1540425 1310733 1387306 1795609 2236578 2613092 3217552 4050585 4426995 3816430
42475 3816430 2767030 2353923 2825654 3410048 3475173 3282784 3391525 3790955 3989165
42466 3989165 3759315 3486965 3744064 4612538 5507858 5785108 5529167 5516216 6259781 7378716
42456 7378716 8199563 8736839 9648803 11335946 13525312 15712941 17562349 18811419 19235888
$$ packed form
42525E800237M84173K70509P9231J87859L20490j0561o75534r72370o27788j86048
42515D670198j14253r7856K69044N96260K58510m27722m98141J58406N36037P8008
42505E428491l98936k475P51058O94949j74380p27263m54203r5804k98863o51137
42495D071437n53160k32052k15323l85320k86713J3592Q0781j22431k67507k73399
42485A829905k89480k29692P6573M08303M40969L76514O04460Q33033L76410o10565
42475C816430j049400m13107M71731N84394O5125j92389J08741L99430J98210
42466C989165k29850k72350K57099Q68474Q95320K77250k55941j2951P43565J118935
42456G378716Q20847N37276R11964J687143K189366K187629J849408J249070M24469
$$ plain form
42447 19235888 18891686 18090835 16996141 15505401 13636001 11724986 10098823 8791598
42439 8791598 7722958 6922306 6440941 6230346 6188229 6129501 5702330 4646907 3236199
42430 3236199 2157839 1814025 1978227 2214977 2308924 2162658 1673839 984355 539926
42421 539926 580920 774340 636585 175237 -132400 109484 859882 1715291 2212999 2201618
42411 2201618 1984350 1917194 1884932 1524398 986867 945447 1614441 2304314 2368820 2137647
42401 2137647 2363089 3056158 3463783 3044891 1957202 709689 -170109 -249140 474075
42392 474075 1341203 1603355 1237820 827898 719100 754964 777112 830539 815918 466557
42382 466557 -179050 -708835 -868615 -776451 -542155 -136690 242806 190871 -279922 -571050
$$ packed form
42447A9235888l44202q00851j094694j490740j869400j911015j626163j307225
42439H791598j068640q00652m81365k10595m2117n8728m27171j055423j410708
42430C236199j078360l43814J64202K36750R3947j46266m88819o89484m44429
42421E39926M0994J93420j37755m61348l07637K41884P50398Q55409M97708j1381
42411B201618k17268o7156l2262l60534n37531m1420O68994O89873O4506k31173
42401B137647K25442O93069M07625m18892j087689j247513q79798p9031P23215
42392D74075Q67128K62152l65535m09922j08798L5864K2148N3427j4621l49361
42382D66557o45607n29785j59780R2164K34296M05465L79496n1935m70793k91128
$$ plain form
42372 -571050 -252573 368442 711482 618936 301692 -77480 -417056 -546405 -462469 -491631
42362 -491631 -818592 -996858 -376415 970680 2159436 2497956 2321028 2553820 3517299
42353 3517299 4459619 4437609 3470243 2460425 1986296 1679765 1080714 562794 740647
42344 740647 1246634 976432 -371438 -1829340 -2519024 -2692491 -2914814 -2926509 -2146661
42335 -2146661 -937310 -435925 -1063247 -1902369 -1824441 -782948 313810 752123 695419
42326 695419 738409 1034084 1096778 503409 -475317 -1216217 -1516192 -1566410 -1281122 -384831
42316 -384831 650589 608025 -907599 -2536285 -2665636 -1523156 -829649 -1489964 -2640942
42307 -2640942 -3150637 -3040012 -2894580 -2702193 -2109796 -1387366 -1227616 -1640283 -1814156
$$ packed form
42372e71050L18477O21015L43040r2546l17244l79172l39576j29349Q3936k9162
42362d91631l26961j78266O20443J347095J188756L38520j76928K32792R63479
42353C517299R42320k2010r67366j009818m74129l06531n99051n17920J77853
42344G40647N05987k70202j347870j457902o89684j73467k22323j1695P79848
42335b146661J209351N01385o27322q39122P7928J041493J096758M38313n6704
42326F95419M2990K95675O2694n93369r78726p40900k99975n0218K85288Q96291
42316c84831J035420m2564j515624j628686j29351J142480O93507o60315j150978
42307b640942n09695J10625J45432J92387N92397P22430J59750m12667j73873
$$ plain form
42298 -1814156 -1260894 -491541 -216140 -312875 -74620 729774 1564640 1919034 1923549 1986659
42288 1986659 2194811 2390351 2566627 2776436 2820710 2502716 2120354 2167900 2498642 2381038
42278 2381038 1613213 984236 1186993 1750344 1647406 685665 -339967 -770732 -741500
42269 -741500 -656522 -554236 -227157 357205 991703 1436046 1561933 1368779 889736 91188
42259 91188 -960217 -1760231 -1555264 -220331 1299401 1885067 1462383 878501 690342
42250 690342 660541 492022 416794 734531 1198631 1271907 828307 323622 327161 997883
42240 997883 1932734 2478226 2298394 1657563 1073456 793301 743545 795264 809559 621982
42230 621982 355111 562913 1585671 2883222 3561614 3514136 3442012 3740679 4053125 4056503
$$ packed form
42298a814156N53262P69353K75401r6735K38255Q04394Q34866L54394M515O3110
42288A986659K08152J95540J76276K09809M4274l17994l82362M7546L30742j17604
42278B381038p67825o28977K02757N63351j02938r61741j025632m30765K9232
42269g41500Q4978J02286L27079N84362O34498M44343J25887j93154m79043p98548
42259I1188j051405q00014K04967J334933J519732N85666m22684n83882j88159
42250F90342k9801j68519p5228L17737M64100P3276m43600n04685L539O70722
42240I97883R34851N45492j79832o40831n84107k80155m9756N1719J4295j87577
42230F21982k66871K07802J022758J297551O78392m7478p2124K98667L12446L378
$$ plain form
42220 4056503 3965888 3969880 3840307 3487379 3284635 3393383 3351717 2866949 2467101 2718127
42210 2718127 3242194 3246158 2722886 2377186 2527668 2810969 2917510 2930237 2888244 2633053
42200 2633053 2212247 1930117 1871539 1795711 1578190 1354539 1189884 1043700 1102115 1660769
42190 1660769 2576476 3306617 3611835 3725931 3687752 3104725 1922774 903645 836987
42181 836987 1611653 2529440 3220091 3688654 3697650 2837933 1312317 56143 -193768 411125
42171 411125 1246876 1896929 2134311 1690918 623285 -298446 -247358 515423 742828 -266710
42161 -266710 -1705318 -2197318 -1312664 316032 1997756 3394066 4084471 3588544 2104634
42152 2104634 631669 -15380 59435 302778 444286 439511 161812 -358348 -688536 -453709
$$ packed form
42220D056503r0615L992j29573l52928k02744J08748m1666m84768l99848K51026
42210B718127N24067L964n23272l45700J50482K83301J06541J2727m1993k55191
42200B633053m20806k82130n8578p5828k17521k23651j64655j46184N8415N58654
42190A660769R15707P30141L05218J14096l8179n83027j181951j019129o6658
42181H36987P74666R17787O90651M68563Q996q59717j525616j256174k49911O04893
42171D11125Q35751O50053K37382m43393j067633r21731N1088P62781K27405j009538
42161b66710j438608m92000Q84654J628696J681724J396310O90405m95927j483910
42152B104634j472965o47049P4815K43343J41508m775k77699n20160l30188K34827
$$ plain form
42142 -453709 172080 810946 1434263 2118616 2530536 2238468 1419188 709812 408622 317209
42132 317209 310851 504155 801698 816348 400656 -116732 -339250 -146923 364662 929991
42122 929991 1132227 812761 461986 730676 1529157 2130746 2229105 2293939 2692319 3062650
42112 3062650 2905106 2316750 1761012 1463632 1359269 1315222 1144081 742341 447818 828861
42102 828861 1833747 2633057 2683157 2441979 2546714 2810357 2719380 2497775 2783602 3406620
42092 3406620 3423442 2504642 1478730 1185761 1453965 1649328 1723899 2145094 3026155 3874581
42082 3874581 4218426 4121628 3980208 4012808 4062788 3821910 3180085 2368596 1768776 1561706
42072 1561706 1560101 1400696 927813 391865 219399 540939 997562 1081121 594198 -301320
$$ packed form
42142d53709O25789O38866O23317O84353M11920k92068q19280p09376l01190r1413
42132C17209o358J93304K97543J4650m15692n17388k22518J92327N11585N65329
42122I29991K02236l19466l50775K68690P98481O01589R8359O4834L98380L70331
42112C062650j57544n88356n55738k97380j04363m4047j71141m01740k94523L81043
42102H28861J004886P99310N0100k41178J04735K63643r0977k21605K85827O23018
42092C406620J6822r18800j025912k92969K68204J95363P4571M21195Q81061Q48426
42082C874581L43845r6798j41420L2600M9980k40878o41825q11489n99820k07070
42072A561706j605j59405m72883n35948j72466L21540M56623Q3559m86923q95518
$$ plain form
42062 -301320 -1307101 -2017932 -1922768 -866187 448266 930586 318843 -493553 -617079
42053 -617079 -211327 28751 4370 219436 865708 1540099 1862196 1835617 1549427 1018160
42043 1018160 437825 175361 340890 685708 1016765 1381520 1755395 1905118 1710537
42034 1710537 1328623 922145 516024 208579 176681 321986 237512 -295432 -1049041 -1707433
42024 -1707433 -2161229 -2322558 -2045106 -1445687 -931176 -670973 -451503 -325600 -873296
42015 -873296 -2295762 -3688586 -3932799 -3097069 -2218528 -1782219 -1258487 -309131 410342
42006 410342 189198 -574569 -838262 -303798 282310 175933 -562113 -1409337 -2057645 -2487853
41996 -2487853 -2675057 -2562689 -2251055 -1965480 -1832442 -1825605 -1887789 -1930586 -1742647 -1150064
$$ packed form
42062c01320j005781p10831R5164J056581J314453M82320o11743q12396j23526
42053f17079M05752K40078k4381K15066O46272O74391L22097k6579k86190n31267
42043A018160n80335k62464J65529L44818L31057L64755L73875J49723j94581
42034A710537l81914m06478m06121l07445l1898J45305q4474n32944p53609o58392
42024a707433m53796j61329K77452N99419N14511K60203K19470J25903n47696
42015h73296j422466j392824k44213Q35730Q78541M36309N23732R49356P19473
42006D10342k21144p63767k63693N34464N86108j06377p38046q47224o48308m30208
41996b487853j87204J12368L11634K85575J33038O837o2184m2797J87939N92583
$$ plain form
41986 -1150064 -366493 40193 -259267 -920772 -1327147 -1366543 -1522202 -2125748 -2805791 -2890310
41976 -2890310 -2213174 -1304373 -835121 -1052703 -1720064 -2390873 -2677588 -2421261 -1766627
41967 -1766627 -1076380 -697667 -747335 -1057626 -1292920 -1184428 -760374 -353470 -302300 -638396
41957 -638396 -1135416 -1618167 -2038670 -2218865 -1812038 -806115 87525 247 -985114 -1643479
41947 -1643479 -861796 1077255 2819631 3477282 3422887 3469243 3720241 3617417 2911099
41938 2911099 2116727 1894400 2222766 2387653 1794324 713835 90780 481379 1291589
41929 1291589 1381185 444179 -638439 -1017711 -941600 -1114475 -1410602 -1030310 121939
41920 121939 1070523 1065934 549818 349761 461128 283037 -244412 -486207 -113272 372414
$$ packed form
41986a150064P83571M06686k99460o61505m06375l9396j55659o03546o80043q4519
41976b890310O77136R08801M69252k17582o67361o70809k86715K56327O54634
41967a766627O90247L78713m9668l10291k35294J08492M24054M06904N1170l36096
41957f38396m97020m82751m20503j80195M06827J005923Q93640q7278r85361o58365
41947a643479P81683J939051J742376O57651n4395M6356K50998j02824p06318
41938B911099p94372k22327L28366J64887n93329j080489o23055L90599Q10210
41929A291589Q9596r37006j082618l79272P6111j72875k96127L80292J152249
41920A21939R48584m589n16116k00057J11367j78091n27449k41795L72935M85686
$$ plain form
41910 372414 371463 51789 122046 852547 1605396 1451963 206263 -1276704 -1938851 -1598600
41900 -1598600 -1011428 -881358 -1140760 -1354816 -1460125 -1693760 -1978740 -1881854 -1237764 -417948
41890 -417948 179065 607905 1132107 1697410 1913659 1535531 780875 111921 -229417 -397024
41880 -397024 -644379 -931021 -940417 -485569 259248 991393 1568694 1940787 1980236 1619314
41870 1619314 1067665 660722 526061 589581 827884 1235510 1564729 1444438 896133 469760
41860 469760 646755 1246177 1645591 1553693 1360984 1640914 2407215 3022561 2895815 2144861
41850 2144861 1403888 1041565 846119 541101 270223 314476 580378 727438 674295 610719
41840 610719 573491 406674 162979 145091 423846 653122 541966 242261 71459 67168
$$ packed form
41910C72414r51l19674P0257P30501P52849j53433j245700j482967o62147L40251
41900a598600N87172J30070k59402k14056j05309k33635k84980R6886O44090Q19816
41890d17948N97013M28840N24202N65303K16249l78128p54656o68954l41338j67607
41880c97024k47355k86642r396M54848P44817P32145N77301L72093L9449l60922
41870A619314n51649m06943j34661O3520K38303M07626L29219j20291n48305m26373
41860D69760J76995N99422L99414r1898j92709K79930P66301O15346j26746p50954
41850B144861p40973l62323j95446l05018k70878M4253K65902J47060n3143o3576
41840F10719l7228j66817k43695j7888K78755K29276j11156k99705j70802m291
$$ plain form
41830 67168 37719 -76120 -88933 212964 814547 1375726 1417920 775396 -133755 -687217
41820 -687217 -726125 -620643 -673493 -791175 -846917 -1004742 -1446177 -2055774 -2648314 -3264765
41810 -3264765 -3912636 -4190857 -3590763 -2202508 -826220 -259308 -588945 -1225003 -1531127
41801 -1531127 -1380082 -1127869 -1093927 -1179261 -1110607 -936259 -973323 -1221125 -1156431 -315640
41791 -315640 1111374 2432543 3024797 2635499 1381878 -286347 -1772190 -2733752 -3263593
41782 -3263593 -3577856 -3701408 -3601538 -3418512 -3340191 -3396911 -3564108 -3877485 -4217822 -4174320
41772 -4174320 -3437104 -2262363 -1300948 -971176 -1122502 -1254237 -1002734 -536636 -460846
41763 -460846 -1071123 -1738693 -1508549 -414162 412190 257018 -193441 52162 793766
$$ packed form
41830F7168k9449j13839j2813L01897O01583N61179M2194o42524r09151n53462
41820f87217l8908J05482n2850j17682n5742j57825m41435o09597n92540o16451
41810c264765o47871k78221O00094J388255J376288N66912l29637o36058l06124
41801a531127J51045K52213L3942q5334O8654J74348l7064k47802O4694Q40791
41791c15640J427014J321169N92254l89298j253621j668225j485843r61562n29841
41782c263593l14263j23552R9870J83026P8321n6720j67197l13377l40337M3502
41772d174320P37216J174741R61415L29772j51326j31735K51503M66098P5790
41763d60846o10277o67570K30144J094387Q26352j55172m50459K45603P41604
$$ plain form
41754 793766 1043435 579915 195229 447729 977108 1175426 909819 449753 181154 455839
41744 455839 1250514 1950239 1912445 1199839 326053 -516387 -1373710 -1922101 -1764482 -1248220
41734 -1248220 -1121063 -1387061 -1421452 -1232184 -1524973 -2336803 -2774350 -2493067 -2253734 -2450617
41724 -2450617 -2305726 -1359818 -629101 -1153782 -2258942 -2487416 -1657930 -796173 -487593
41715 -487593 -500689 -697749 -1089941 -1175824 -430174 581688 683410 -288023 -1355377 -1895893
41705 -1895893 -2170970 -2279220 -1774286 -690786 102556 112038 -31978 440934 1386100 2178366
41695 2178366 2622255 2907303 3070494 2962092 2519258 1840234 1179395 842765 756651 340951
41685 340951 -612701 -1190336 -372479 1278815 2008738 1095835 -391916 -1347561 -1946830
$$ packed form
41754G93766K49669m63520l84686K52500N29379J98318k65607m60066k68599K74685
41744D55839P94675O99725l7794p12606q73786q42440q57323n48391J57619N16262
41734a248220J27157k65998l4391J89268k92789q11830m37547K81283K39333j96883
41724b450617J44891R45908P30717n24681j105160k28474Q29486Q61757L08580
41715d87593j3096j97060l92192q5883P45650J011862J01722r71433j067354n40516
41705a895893k75077j08250N04934J083500P93342R482j44016M72912R45166P92266
41695B178366M43889K85048J63191j08402m42834o79024o60839l36630q6114m15700
41685C40951r53652n77635Q17857J651294P29923r12903j487751r55645n99269
$$ plain form
41676 -1946830 -2662711 -3104433 -2720083 -1836031 -1131374 -731916 -587074 -1030923 -2083108
41667 -2083108 -2820643 -2422729 -1388185 -799345 -788703 -662884 -198316 141190 62900 -317124
41657 -317124 -878250 -1395337 -1373770 -788298 -568468 -1385277 -2348017 -2049305 -655893 277526
41647 277526 -5366 -724721 -1065796 -1119658 -1063533 -635193 124578 637406 721741 809880
41637 809880 899111 373811 -687418 -1214453 -820605 -619811 -1483713 -2535297 -2491493 -1658808
41627 -1658808 -1320682 -1715879 -1961961 -1698530 -1490954 -1595929 -1502432 -941524 -422900 -435496
41617 -435496 -795885 -1068301 -1079637 -807855 -277177 212190 194520 -380790 -980133 -1032170
41607 -1032170 -397905 691232 1808824 2437049 2291800 1637936 990136 496299 -61845
$$ packed form
41676a946830p15881m41722L84350Q84052P04657L99458J44842m43849j052185
41667b083108p37535L97914J034544N88840J0642J25819M64568L39506p8290l80024
41657c17124n61126n17087K1567N85472K19830q16809r62740K98712J393412R33419
41647B77526k82892p19355l41075n3862N6125M28340P59771N12828Q4335Q8139
41637H09880Q9231n25300j061229n27035L93848K00794q63902j051584M3804Q32685
41627a658808L38126l95197k46082K63431K07576j04975R3497N60908N18624j2596
41617d35496l60389k72416j1336K71782N30678M89367j7670n75310n99343n2037
41607a032170O34265J089137J117592O28225j45249o53864o47800m93837n58144
$$ plain form
41598 -61845 -701604 -1095384 -1039280 -685866 -264512 62502 55360 -442491 -1108247 -1350560
41588 -1350560 -1079324 -872441 -1195466 -1816078 -2179462 -2018652 -1404138 -550663 184623
41579 184623 444476 283516 153319 235119 130354 -448929 -1019717 -854754 -13566 660289
41569 660289 589863 104333 -58619 440311 1362248 2246823 2754132 2796974 2517494 2112217
41559 2112217 1617059 914097 -14692 -929005 -1515683 -1710545 -1765449 -1968744 -2306927 -2418193
41549 -2418193 -1916986 -806782 438581 1266652 1542578 1575088 1569309 1169208 -168113
41540 -168113 -2233119 -3812292 -3783117 -2410457 -1125995 -916508 -1363856 -1510679 -1173972
41531 -1173972 -854208 -659987 -112023 883809 1553367 1137386 -111651 -1174586 -1279365
$$ packed form
41598f1845o39759l93780N6104L53414M21354L27014p142m97851o65756k42313
41588a350560K71236K06883l23025o20612l63384J60810O14514Q53475P35286
41579A84623K59853j60960j30197Q1800j04765n79283n70788J64963Q41188O73855
41569F60289p0426m85530j62952M98930R21937Q84575N07309M2842k79480m05277
41559B112217m95158p02962r28789r14313n86678j94862n4904k03295l38183j11266
41549b418193N01207J110204J245363Q28071K75926L2510n779m00101j337321
41540a68113k065006j579173K9175J372660J284462K09487m47348j46823L36707
41531a173972L19764J94221N47964R95832O69558m15981j249037j062935j04779
$$ plain form
41522 -1279365 -406361 941866 2104568 2566578 2306724 1838384 1631754 1544111 1099065
41513 1099065 248182 -540250 -991681 -1395282 -2054810 -2731335 -2981742 -2819224 -2603380
41504 -2603380 -2364797 -1752136 -788098 -191107 -545866 -1428058 -1849594 -1505165 -1070376
41495 -1070376 -1166618 -1538796 -1565168 -1182709 -851572 -830180 -986072 -1229386 -1601306 -1890818
41485 -1890818 -1708204 -1145189 -868042 -1202865 -1538080 -1135127 -278634 -13776 -756839
41476 -756839 -1747055 -2058011 -1663627 -1182577 -964357 -905178 -944390 -1154508 -1301163 -869871
41466 -869871 193078 1155359 1284788 728711 244225 242039 529309 871892 1258606 1552246
41456 1552246 1437024 940304 534960 439187 280260 -164369 -368290 222812 1209635 1672052
$$ packed form
41522a279365Q73004J348227J162702M62010k59854m68340k06630q7643m45046
41513A099065q50883p88432m51431m03601o59528o76525k50407J62518K15844
41504b603380K38583O12661R64038N96991l54759q82192m21536L44429M34789
41495a070376r6242l72178k6372L82459L31137K1392j55892k43314l71920k89512
41485a890818J82614N63015K77147l34823l35215M02953Q56493K64858p43063
41476g56839r90216l10956L94384M81050K18220N9179l9212k10118j46655M31292
41466h69871J062949R62281J29429n56077m84486k186K87270L42583L86714K93640
41456A552246j15222m96720m05344r5773j58927m44629k03921N91102R86823M62417
$$ plain form
41446 1672052 1419109 1083865 1011986 847876 389243 64620 160079 224741 -203843 -771523
41436 -771523 -836941 -498051 -387715 -568681 -346615 675440 1916321 2487745 2217895
41427 2217895 1716740 1609936 1971284 2427168 2572070 2246794 1601407 1029092 939861 1365404
41417 1365404 1739999 1333424 105229 -1089018 -1452717 -1214626 -1182900 -1465898 -1325169
41408 -1325169 -451335 356424 261567 -432500 -805996 -607998 -289965 -30475 427384 1007945
41398 1007945 1227503 1065740 1134928 1642872 1892368 1324937 488126 290316 650766 646776
41388 646776 -91242 -858983 -904701 -382616 70125 335591 932778 2194467 3677745
41379 3677745 4534942 4343622 3438015 2445459 1638466 846415 -88647 -1002951 -1628784
$$ packed form
41446A672052k52943l35244p1879j64110m58633l24623R5459O4662m28584n67680
41436g71523o5418L38890J10336j80966K22066J022055J240881N71424k69850
41427B217895n01155j06804L61348M55884J44902l25276o45387n72315q9231M25543
41417A365404L74595m06575j228195j194247l63699K38091L1726k82998J40729
41408a325169Q73834Q07759r4857o94067l73496J97998L18033K59490M57859N80561
41398A007945K19558j61763O9188N07944K49496n67431q36811j97810L60450l990
41388F46776p38018p67741m5718N22085M52741K65466N97187J261689J483278
41379C677745Q57197j91320r05607r92556q06993p92051r35062r14304o25833
$$ plain form
41370 -1628784 -1910225 -1926461 -1668178 -1156510 -684775 -574739 -638546 -271327 689382 1517174
41360 1517174 1395731 500324 -174200 -72525 289761 122570 -605286 -1236498 -1273436 -819596
41350 -819596 -324135 -194439 -548362 -1058025 -1159386 -733197 -436739 -953952 -2015607
41341 -2015607 -2645786 -2346936 -1500956 -593230 260433 821688 564373 -469732 -1279932
41332 -1279932 -1075451 -412475 -410293 -1118818 -1492284 -895615 168811 893299 981336 505885
41322 505885 -304712 -879064 -592384 363446 955467 555547 -298546 -789795 -889494 -952915
41312 -952915 -786347 17678 1036779 1226838 281203 -975151 -1786669 -2360521 -3115739
41303 -3115739 -3616074 -2982050 -1223885 501834 1145607 857788 573713 792609 1134052
$$ packed form
41370a628784k81441j6236K58283N11668M71735J10036o3807L67219R60709Q27792
41360A517174j21443q95407o74524J01675L62286j67191p27856o31212l6938M53840
41350h19596M95461J29696l53923n09663j01361M26189K96458n17213j061655
41341b015607o30179K98850Q45980R07726Q53663N61255k57315j034105q10200
41332a279932K04481O62976K182p08525l73466N96669J064426P24488Q8037m75451
41322E05885q10597n74352K86680R55830N92021l99920q54093m91249r9699o3421
41312i52915J66568Q04025J019101J90059r45635j256354q11518n73852p55218
41303c115739n00335O34024J758165J725719O43773k87819k84075K18896L41443
$$ plain form
41294 1134052 1033718 496452 -15952 -230457 -332862 -622028 -1108070 -1527714 -1632563
41285 -1632563 -1362202 -787802 10006 963836 1928346 2606730 2652020 1919916 636861
41276 636861 -689891 -1534101 -1613180 -1060241 -375324 -43824 -100998 -186408 -80935 14670
41266 14670 -142097 -428473 -571075 -578109 -669568 -918009 -1253317 -1674300 -2098361 -2132397
41256 -2132397 -1449772 -387624 275999 223513 -84835 -50373 462399 1188901 1728565 1718181
41246 1718181 1199672 860089 1356646 2286114 2469648 1531879 523344 520464 1236478 1660021
41236 1660021 1554490 1491749 1654217 1491943 644358 -495632 -1359204 -1870521 -2314203
41227 -2314203 -2836272 -3248297 -3181673 -2439301 -1348499 -636435 -704601 -1161572 -1350537 -1151529
$$ packed form
41294A134052j00334n37266n12404k14505j02405k89166m86042m19644j04849
41285a632563K70361N74400P97808R53830R64510O78384M5290p32104j283055
41276F36861j326752q44210p9079N52939O84917L31500n7174q5410J05473R5605
41266A4670j56767k86376j42602p034r1459k48441l35308m20983m24061l4036
41256b132397O82625J062148O63623n2486l08348L4462N12772P26502N39664j0384
41246A718181n18509l39583M96557R29468J83534r37769j008535k880P16014M23543
41236A660021j05531o2741J62468j62274q47585j139990q63572n11317m43682
41227b314203n22069m12025O6624P42372J090802P12064o8166m56971j88965J99008
$$ plain form
41217 -1151529 -898872 -707161 -383685 66340 368371 445812 506077 605780 548829 283820
41207 283820 18929 -107835 -110658 73868 469025 740516 521539 77360 48317 436830
41197 436830 535631 98912 -157095 314625 920778 750637 -93054 -733143 -825117 -862290
41187 -862290 -1246492 -1782900 -2217743 -2650636 -3146478 -3418932 -3260494 -2978016 -3004158 -3213971
41177 -3213971 -3024768 -2234178 -1442611 -1402360 -2081157 -2688763 -2680328 -2389677 -2420736 -2719912
41167 -2719912 -2722991 -2274126 -1781042 -1383828 -655535 516524 1365223 1167212 340602 -81240
41157 -81240 131004 262953 -84864 -399843 -169336 310073 501879 494219 698827 983371
41147 983371 762141 -91429 -1010778 -1535220 -1839645 -2216297 -2458766 -2199384 -1645755 -1474863
$$ packed form
41217a151529K52657J91711L23476M50025L02031P7441O0265R9703n6951k65009
41207B83820k64891j26764k823J84526L95157K71491k18977m44179k9043L88513
41197D36830R8801m36719k56007M71720O06153j70141q43691o40089r1974l7173
41187h62290l84202n36408m34843m32893m95842k72454J58438K82478k6142k09813
41177c213971J89203P90590P91567M0251o78797o07606Q435K90651l1059k99176
41167b719912l079M48865M93084L97214P28293J172059Q48699j98011q26610m21842
41157h1240K12244J31949l47817l14979K30507M79409J91806p660K04608K84544
41147I83371k21230q53570r19349n24442l04425l76652k42469K59382N53629J70892
$$ plain form
41137 -1474863 -1941033 -2486933 -2452158 -1936251 -1696114 -2242241 -3222995 -3735773 -3188981 -1880768
41127 -1880768 -771172 -632988 -1363623 -2139868 -2231380 -1596785 -748255 -237389 -310776 -836539
41117 -836539 -1420338 -1728960 -1794306 -1855761 -1895241 -1649051 -1199199 -1124714 -1717823 -2391172
41107 -2391172 -2348650 -1659044 -1162723 -1379512 -1961359 -2213012 -1765515 -775496 152273 309538
41097 309538 -413699 -1234127 -1339809 -954254 -974570 -1610236 -2077238 -1744708 -890855 -108199
41087 -108199 388762 599182 519351 407093 650064 1037133 802281 -213499 -1119444 -1190593
41077 -1190593 -863863 -920188 -1306856 -1504680 -1535507 -1799065 -2308985 -2863857 -3580965 -4436321
41067 -4436321 -4672667 -3656098 -2106953 -1465558 -2072576 -2891265 -3010959 -2499486 -1744722
$$ packed form
41137a474863m66170n45900L4775N15907K40137n46127r80754n12778N46792J308213
41127a880768J109596J38184p30635p76245r1512O34595Q48530N10866p3387n25763
41117h36539n83799l08622o5346o1455l9480K46190M49852P4485n93109o73349
41107b391172M2522O89606M96321k16789n81847k51653M47497R90019R27769J57265
41097C09538p23237q20428j05682L85555k0316o35666m67002L32530Q53853P82656
41087a08199M96961K10420p9831j12258K42971L87069k34852j015780r05945p1149
41077a190593L26730n6325l86668j97824l0827k63558n09920n54872p17108q55356
41067d436321k36346J016569J549145O41395o07018q18689j19694N11473P54764
$$ plain form
41058 -1744722 -945838 -442365 -616740 -1182921 -1382641 -1131803 -1133299 -1594937 -1781879 -1276949
41048 -1276949 -755483 -883159 -1247807 -1126690 -664947 -498611 -710092 -956358 -1238061
41039 -1238061 -1719889 -2056582 -1737446 -1021435 -783175 -1371994 -2210347 -2600998 -2444085
41030 -2444085 -2071805 -1791348 -1698723 -1641131 -1308689 -598857 145309 509987 539994 597246
41020 597246 773587 802148 551252 256670 165841 200116 93648 -259309 -666618 -808659
41010 -808659 -583217 -304666 -421884 -969055 -1487627 -1612482 -1511918 -1566235 -1839271 -2114108
41000 -2114108 -2257729 -2269017 -2114871 -1805932 -1516279 -1339671 -1026200 -277960 720135 1364897
40990 1364897 1296736 797420 427793 355050 149157 -660418 -1827098 -2440766 -1996656 -1158655
$$ packed form
41058a744722P98884N03473j74375n66181j99720K50838j496m61638j86942N04930
41048a276949N21466j27676l64648J21117M61743J66336k11481k46266k81703
41039a238061m81828l36693L19136P16011K38260n88819q38353l90651J56913
41030b444085L72280K80457R2625N7592L32442P09832P44166L64678L0007N7252
41020E97246J76341K8561k50896k94582r0829L4275j06468l52957m07309j42041
41010h08659K25442K78551j17218n47171n18572j24855J00564n4317k73036k74837
41000b114108j43621j1288J54146L08939K89653J76608L13471P48240R98095O44762
40990A364897o8161m99316l69627p2743k05893q09575j166680o13668M44110Q38001
$$ plain form
40980 -1158655 -940827 -1265260 -1096187 -143559 458841 -288077 -1741390 -2447334 -2015409
40971 -2015409 -1323939 -1112742 -1214970 -1147879 -745158 -140467 321687 159570 -742632 -1765849
40961 -1765849 -2231508 -2330176 -2723638 -3307332 -3182794 -2000472 -563274 200583 238502
40952 238502 43264 -98523 -160694 -135877 -72303 5879 389740 1404702 2629588 2998429
40942 2998429 2071851 699348 -8279 105293 486855 792185 919610 545461 -548007
40933 -548007 -1771512 -2098410 -1286863 -229688 86026 -398171 -977898 -1057802 -645847
40924 -645847 -162081 6783 -250301 -821734 -1476884 -1840587 -1492218 -422804 684504
40915 684504 1063233 819015 823032 1494061 2185798 2089254 1273320 411831 -99981 -241905
$$ packed form
40980a158655K17828l24433J69073R52628O02400p46918j453313p05944M31925
40971b015409O91470K11197j02228O7091M02721O04691M62154j62117r02202j023217
40961a765849m65659r8668l93462n83694J24538J182322J437198P63857L7919
40952B38502j95238j41787o2171K4817O3574P8182L83861J014962J224886L68841
40942B998429r26578j372503p07627J13572L81562L05330J27425l74149j093468
40933e48007j223505l26898Q11547J057175L15714m84197n79727p9904M11955
40924f45847M83766J68864k57084n71433o55150l63703L48369J069414J107308
40915F84504L78729k44218M017O71029O91737r6544q15934q61489n11812j41924
$$ plain form
40905 -241905 41679 693525 1192424 1029390 477476 266259 508411 602473 273015 9569
40895 9569 219133 570954 584181 371743 319570 383154 225999 -151705 -436214 -560277
40885 -560277 -747167 -972156 -850270 -242870 376315 445942 36377 -216912 154610 977548
40875 977548 1663719 1733704 1114822 123177 -740326 -1099056 -955133 -633173 -438273 -435680
40865 -435680 -576160 -845327 -1138478 -1165354 -749549 -140178 279270 570523 1172553 2174617
40855 2174617 3028147 3188399 2727613 2035796 1203968 115905 -996492 -1564736 -1321944
40846 -1321944 -595615 140719 729744 1206461 1468478 1325377 801461 194482 -183407
40837 -183407 -239994 -105964 1335 -74127 -313127 -517515 -491847 -280944 -170981 -396199
$$ packed form
40905b41905K83584O51846M98899j63034n51914k11217K42152R4062l29458k63446
40895I569K09564L51821J3227k12438n2173O3584j57155l77704k84509j24063
40885e60277j86890k24989J21886O07400O19185O9627m09565k53289L71522Q22938
40875I77548O86171O9985o18882r91645q63503l58730J43923L21960J94900K593
40865d35680j40480k69167k93151k6876M15805O09371M19448K91253O02030J002064
40855B174617Q53530J60252m60786o91817q31828j088063j112397n68244K42792
40846a321944P26329P36334N89025M76717K62017j43101n23916o06979l77889
40837a83407n6587J34030J07299p5462k39000k04388K5668K10903J09963k25218
$$ plain form
40827 -396199 -911171 -1530083 -2165162 -2728064 -2911925 -2450591 -1636013 -1119923 -992297 -576591
40817 -576591 415897 1057083 337471 -1118337 -1484141 -48463 1827648 2499055 1982056
40808 1982056 1474822 1575277 1822852 1689169 1168101 428506 -393695 -955665 -843138
40799 -843138 -133058 584140 887326 897768 877761 813140 573631 237335 61973 239480
40789 239480 755201 1395663 1873528 2027172 1890856 1559136 1130481 837535 970843 1488293
40779 1488293 1941570 2014516 1887181 1821493 1693507 1280526 716618 256421 -120615 -406137
40769 -406137 -201111 701694 1614965 1606460 792854 214195 356998 584047 244539 -392306
40759 -392306 -689499 -540874 -282171 -113905 2052 152144 430477 824604 1029873 748056
$$ packed form
40827c96199n14972o18912o35079n62902j83861M61334Q14578N16090J27626M15706
40817e76591R92488O41186p19612j455808l65804J435678J876111O71407n16999
40808A982056n07234J00455K47575j33683n21068p39595q22201n61970J12527
40799h43138P10080P17198L03186J0442k0007o4621k39509l36296j75362J77507
40789B39480N15721O40462M77865J53644j36316l31720m28655k92946J33308N17450
40779A488293M53277P2946j27335o5688j27986m12981n63908m60197l77036k85522
40769d06137K05026R02805R13271q505q13606n78659J42803K27049l39508o36845
40759c92306k97193J48625K58703J68266J15957J50092K78333L94127K05269k81817
$$ plain form
40749 748056 244055 104924 319398 196054 -563656 -1338494 -1476077 -1087116 -530925 230307
40739 230307 1152836 1567513 910011 -335511 -1172384 -1348486 -1371134 -1472891 -1370721 -1029346
40729 -1029346 -858686 -963316 -855372 -208579 595724 986760 904709 695704 596439 623126
40719 623126 783184 1088651 1396708 1459425 1198060 836580 673765 718289 653231 261899
40709 261899 -215564 -356216 -121945 129746 184276 161207 125385 -59978 -349727 -444345
40699 -444345 -318192 -323999 -458673 -82389 1104913 2265248 2282343 1184332 72128
$$ packed form
40749G48056n04001j39131K14474j23344p59710p74838j37583L88961N56191P61232
40739B30307R22529M14677o57502j245522q36873j76102k2648j01757J02170L41375
40729a029346J70660j04630J07944O46793Q04303L91036q2051k09005r9265K6687
40719F23126J60058L05467L08057O2717k61365l61480j62815M4524o5058l91332
40709B61899m77463j40652K34271K51691N4530k3069l5822j85363k89749r4618
40699d44345J26153n807j34674L76284J187302J160335J7095j098011j112204
$$ [...]
##END NTUPLES=NMR SPECTRUM
##END=
