##TITLE=31Pec_DE-96_oil
 CDCl3, 24 sc
 9.6.2025
##JCAMPDX= 6.0         $$ Bruker NMR JCAMP-DX V2.0
##DATA TYPE= NMR SPECTRUM
##DATA CLASS= NTUPLES
##ORIGIN= UXNMR, Bruker Analytische Messtechnik GmbH
##OWNER= root
$$ XWIN-NMR		Version 3.5
$$ Mon Jun  9 14:37:11 2025 Russian Standard Time (UT+4h)  she@DPX200
##.OBSERVE FREQUENCY= 81.013821
##.OBSERVE NUCLEUS= ^31P
##.ACQUISITION MODE= SIMULTANEOUS
##.ACQUISITION SCHEME= undefined
##.AVERAGES= 64
##.DIGITISER RES= 17
##SPECTROMETER/DATA SYSTEM= spect
##.PULSE SEQUENCE= zgpg30
##.SOLVENT NAME= CDCl3
##.SHIFT REFERENCE= (INTERNAL, CDCl3, 0, 198.062)
##AUDIT TRAIL= $$ (NUMBER, WHEN, WHO, WHERE, WHAT)
$$ ##TITLE= Audit trail, XWIN-NMR		Version 3.5
$$ ##JCAMPDX= 5.01
$$ ##ORIGIN= Bruker BioSpin GmbH
$$ ##OWNER= she
$$ F:/spectra/data/she/nmr/P31/2/pdata/1/auditp.txt
$$ ##AUDIT TRAIL=  $$ (NUMBER, WHEN, WHO, WHERE, WHAT)
(   1,<2025-06-09 14:35:41.92 +0400>,<she>,<DPX200>,
      <created by zg, POWCHK disabled, PULCHK disabled
       configuration hash MD5:
       00 E9 B6 7A A2 85 ED C7 34 08 36 98 17 FE 4E 26
       data hash MD5: 32K
       6F 19 7A 6D 17 C6 19 60 FD 1C 3D B4 73 70 B4 BC>)
(   2,<2025-06-09 14:35:44.73 +0400>,<she>,<DPX200>,
      <Start of raw data processing
       efp BC_mod = 2 LB = 1.5 FT_mod = 6 PKNL = 1 PHC0 = 1526.257 PHC1 = -278.9066 SI = 64K 
       data hash MD5: 64K
       99 D7 9C A9 CC 25 8A 9B 7E 25 3F 34 5D 26 34 ED>)
(   3,<2025-06-09 14:36:05.75 +0400>,<she>,<DPX200>,
      <pk PHC0 = -42.42332 PHC1 = 142.2 
       data hash MD5: 64K
       A8 B0 C4 56 81 E5 8B E5 8E 36 34 B4 52 07 42 D0>)
(   4,<2025-06-09 14:36:18.62 +0400>,<she>,<DPX200>,
      <absd ABSG = 5 
       data hash MD5: 64K
       D4 E8 F0 E4 9D 96 16 CA 32 B7 71 B9 BC 95 03 EF>)
$$ ##END=
$$ 
$$ hash MD5
$$ 78 4E 1D 04 54 8D 1D 3E F9 68 51 CE 58 86 25 E3
##$RELAX= 
##$RELAX= 
##$RELAX= 
##$RELAX= 
##$RELAX= 
##$RELAX= 
##$RELAX= 
##$RELAX= 
$$ Bruker specific parameters
$$ --------------------------
##$DU= <F:/spectra>
##$EXPNO= 2
##$NAME= <P31>
##$PROCNO= 1
##$TYPE= <nmr>
##$USER= <she>
##$AMP= (0..31)
100 100 100 100 100 100 100 100 100 100 100 100 100 100 100 100 100 100 
100 100 100 100 100 100 100 100 100 100 100 100 100 100 
##$AQSEQ= 0
##$AQ_mod= 1
##$AUNM= <au_zg>
##$AUTOPOS= <>
##$BF1= 81.014009
##$BF2= 200.13
##$BF3= 200.13
##$BF4= 200.13
##$BF5= 200.13
##$BF6= 200.13
##$BF7= 200.13
##$BF8= 200.13
##$BYTORDA= 1
##$CFDGTYP= 0
##$CFRGTYP= 5
##$CHEMSTR= <none>
##$CNST= (0..31)
1 1 145 1 1 1 1 1 1 1 1 1 1 1 1 1 1 1 1 1 1 1 1 1 1 1 1 1 1 1 1 1 
##$CPDPRG= <waltz16>
##$CPDPRG1= <>
##$CPDPRG2= <waltz16>
##$CPDPRG3= <>
##$CPDPRG4= <mlev>
##$CPDPRG5= <mlev>
##$CPDPRG6= <mlev>
##$CPDPRG7= <mlev>
##$CPDPRG8= <mlev>
##$CPDPRGB= <>
##$CPDPRGT= <>
##$D= (0..31)
0 1 0 0 0 0 0 0 0 0.06 0 0.03 2e-05 3e-06 0 0 0.0002 0 0 0 0 0 0 0 0 0 
0 0 0 0 0 0 
##$DATE= 1749465341
##$DBL= (0..7)
120 120 120 11 120 120 24 19 
##$DBP= (0..7)
150 150 150 150 150 150 150 150 
##$DBP07= 0
##$DBPNAM0= <>
##$DBPNAM1= <>
$$ [...]
##$SUBNAM3= <"">
##$SUBNAM4= <"">
##$SUBNAM5= <"">
##$SUBNAM6= <"">
##$SUBNAM7= <"">
##$SUBNAM8= <"">
##$SUBNAM9= <"">
##$SW= 400.765351723535
##$SWIBOX= (0..15)
0 1 3 0 0 0 0 0 0 0 0 0 0 0 0 0 
##$SW_h= 32467.5324675325
##$TD= 32768
##$TD0= 1
##$TE= 0
##$TE2= 300
##$TE3= 300
##$TEG= 300
##$TL= (0..7)
0 120 53 12 22 120 120 120 
##$TP= (0..7)
150 150 150 150 150 150 150 150 
##$TP07= 0
##$TPNAME0= <>
##$TPNAME1= <>
##$TPNAME2= <>
##$TPNAME3= <>
##$TPNAME4= <>
##$TPNAME5= <>
##$TPNAME6= <>
##$TPNAME7= <>
##$TPOAL= (0..7)
0.5 0.5 0.5 0.5 0.5 0.5 0.5 0.5 
##$TPOFFS= (0..7)
0 0 0 0 0 0 0 0 
##$TUNHIN= 0
##$TUNHOUT= 0
##$TUNXOUT= 0
##$USERA1= <user>
##$USERA2= <user>
##$USERA3= <user>
##$USERA4= <user>
##$USERA5= <user>
##$V9= 5
##$VALIST= <valist>
##$VCLIST= <CCCCCCCCCCCCCCC>
##$VD= 0
##$VDLIST= <DDDDDDDDDDDDDDD>
##$VPLIST= <PPPPPPPPPPPPPPP>
##$VTLIST= <TTTTTTTTTTTTTTT>
##$WBST= 1024
##$WBSW= 4
##$XGAIN= (0..3)
0 0 0 0 
##$XL= 0
##$YL= 0
##$YMAX_a= 15350
##$YMIN_a= -9661
##$ZGOPTNS= <>
##$ZL1= 120
##$ZL2= 120
##$ZL3= 120
##$ZL4= 120
##$ABSF1= 198.0616
##$ABSF2= -202.7028
##$ABSG= 5
##$ABSL= 3
##$ALPHA= 0
##$AQORDER= 0
##$ASSFAC= 0
##$ASSFACI= 0
##$ASSFACX= 0
##$ASSWID= 0
##$AUNMP= <proc_1d>
##$AZFE= 0.1
##$AZFW= 0.5
##$BCFW= 0
##$BC_mod= 2
##$BYTORDP= 0
##$COROFFS= 0
##$CY= -3
##$DATMOD= 1
##$DC= 0
##$DFILT= <>
##$DTYPP= 0
##$F1P= 0
##$F2P= 0
##$FCOR= 1
##$FTSIZE= 65536
##$FT_mod= 6
##$GAMMA= 0
##$GB= 0
##$INTBC= 1
##$INTSCL= 9.790993e-09
##$ISEN= 30
##$LB= 1.5
##$LEV0= 0
##$LPBIN= 0
##$MAXI= 10000
##$MC2= 0
##$MEAN= 0
##$ME_mod= 0
##$MI= 50
##$NCOEF= 0
##$NC_proc= -8
##$NLEV= 6
##$NOISF1= 182.463
##$NOISF2= 159.3651
##$NSP= 0
##$NTH_PI= 0
##$NZP= 0
##$OFFSET= 198.0616
##$PC= 4
##$PHC0= 1483.834
##$PHC1= -136.7066
##$PH_mod= 1
##$PKNL= yes
##$PPARMOD= 0
##$PSCAL= 0
##$PSIGN= 0
##$REVERSE= no
##$SF= 81.0140089999434
##$SI= 65536
##$SIGF1= 159.3651
##$SIGF2= -187.1042
##$SINO= 113.3802
##$SIOLD= 16384
##$SREGLST= <1H.CDCl3>
##$SSB= 0
##$STSI= 65536
##$STSR= 0
##$SW_p= 32467.5324675325
##$SYMM= 0
##$S_DEV= 0
##$TDeff= 32768
##$TDoff= 0
##$TI= <>
##$TILT= no
##$TM1= 0
##$TM2= 0
##$TOPLEV= 0
##$USERP1= <user>
##$USERP2= <user>
##$USERP3= <user>
##$USERP4= <user>
##$USERP5= <user>
##$WDW= 1
##$XDIM= 65536
##$YMAX_p= 310615549
##$YMIN_p= -265886027
$$ End of Bruker specific parameters
$$ ---------------------------------
##NTUPLES= NMR SPECTRUM
##VAR_NAME=  FREQUENCY,     SPECTRUM/REAL,   SPECTRUM/IMAG
##SYMBOL=    X,             R,               I
##VAR_TYPE=  INDEPENDENT,   DEPENDENT,       DEPENDENT
##VAR_FORM=  AFFN,          ASDF,            ASDF
##VAR_DIM=   65536,         65536,           65536
##UNITS=     HZ,            ARBITRARY UNITS, ARBITRARY UNITS
##FACTOR=    0.49542278885378, 1,            1
##FIRST=     16045.7642231865, 0,            0
##LAST=      -16421.768244346, 0,            0
##MIN=       -16421.768244346, -265886027,   0
##MAX=       16045.7642231865, 310615549,    0
$$ Real data points
##PAGE= N=1
##DATA TABLE= (X++(R..R)), XYDATA
$$ [...]
7498H271490K384446M41337j680074k332571j282067m41165j718329m030233m347590
7489d734756k043834K07507N60803K24960M63026N20946K20808J214914L273802
7480i1824K823743j557231n404874m124662K04725K217438J184831O07423J544648
7471b595783J740535O63290J13280l1279j511368l040710j376711K290804K668128
7462a079814j292087l810731o75510M510136N688713K140182k372985n020933
7454a913029n115336k574706J396487L898610L402617J740105J098073J135655
7446C068476J005479J523252K725949J955046k304358o699159o617471k209191
7438g551977K307251M151529L766029K205787j8214j915095k507192k107830j291421
$$ y = [8271490, 10655936, 11097273, 9417199, 7084628, 5802561, 5361396, 3643067, -387166, -4734756, -6778590, -6571083, -6010280, -5785320, -5322294, -4801348, -4580540, -3365626, -91824, 2731919, 1174688, -4230186, -8354848, -8150123, -5932685, -4747854, -4140431, -2595783, -855248, -191958, -78678, -109957, -1621325, -4662035, -6038746, -3747942, -1079814, -2371901, -6182632, -6858142, -2348006, 3340707, 5480889, 3107904, -1913029, -7028365, -9603071, -8206584, -4307974, -905357, 834748, 1932821, 3068476, 4073955, 5597207, 8323156, 10278202, 7973844, 1274685, -5342786, -7551977, -5244726, -1093197, 2672832, 4878619, 4860405, 2945310, 438118, -1669712, -2961133]
7429b961133L51125K497843K853035K89061k420689k173874l58984m80727k231389
7420d635732k210090O599J164636P2555n27316R52388K187350J190279k86712
7411b086043O3509J427742J789765J111746K58038j070077k845286l084992m78298
7402d913896K675742K878357K9818k731513l167140j702618L66450K042575K194963
7393b327262L66642j674132j337608J203386K750031J316655j089877j280483
7385b072648Q39256K549573K218262R86517L88667R6451q97549k021896j697916
7376C88717M0546J123102K35567j200109r21741J054523K555696K240754J026935
7367F543990K39514k96014j403984k718629l005163k119762j373386j533564j515323
$$ y = [-2961133, -2610008, -112165, 2740870, 3029931, 609242, -1564632, -1923616, -2404343, -4635732, -6845822, -6839223, -5674587, -5602032, -6129348, -5176960, -2989610, -1799331, -2086043, -2022534, -594792, 1194973, 2306719, 2564757, 1494680, -1350606, -4435598, -4913896, -2238154, 640203, 670021, -2061492, -5228632, -6931250, -6564800, -4522225, -2327262, -1960620, -3634752, -4972360, -3768974, -1018943, 297712, -792165, -2072648, -1233392, 1316181, 3534443, 4520960, 4909627, 5006078, 4108529, 2086633, 388717, 429263, 1552365, 1787932, 587823, -333918, 720605, 3276301, 5517055, 6543990, 6783504, 6487490, 5083506, 2364877, -640286, -2760048, -4133434, -5666998, -7182321]
7358g182321m5560J942776K035134k62036k258154j311521J630175L292900K453991
7349B95384J157169J287323J891444R96906j366700l409304l947380l145628j524144
7340g764930L87919J718950J792055R24211p6408q47185j226132q31415R1680
7331e831255K19874j092061k288709j452031Q09506K064085J398171J93973l94374
7322f372821p04092r27872k62252J384346K500389J986809Q61320P42682J516093
7313G24602J751959R91481M64422J402089L196706L620953J209645k498866l931137
7304F931854j521236K005505K791803P11225q40201J28153J796426J708167J69964
7295A3881660q58968o95637k50882m28991j441832k897452l657090k607253m36573
$$ y = [-7182321, -7227881, -5285105, -3249971, -3512007, -5770161, -7081682, -5451507, -2158607, 295384, 1452553, 2739876, 4631320, 5628226, 4261526, 852222, -3095158, -6240786, -7764930, -7377011, -5658061, -3866006, -2941795, -3018203, -3865388, -5091520, -5922935, -5831255, -5611381, -6703442, -8992151, -10444182, -9634676, -7570591, -6172420, -5978447, -6372821, -7076913, -8004785, -8267037, -6882691, -4382302, -2395493, -1534173, -791491, 724602, 2476561, 3468042, 3932464, 5334553, 8531259, 12152212, 13361857, 10862991, 6931854, 5410618, 7416123, 10207926, 10919151, 10078950, 10207103, 12003529, 13711696, 13881660, 13022692, 12327055, 12076173, 11647182, 10205350, 7307898, 3650808, 1043555, 606982]
7286F06982O29130q7741m44398J142254K639252J147704k226967l223068l41723
7277a58575K857207K567632k47969j505063M10945K703738J933221j657525m402790
7268B500821l440902P7226K432141J722953n0535J85059K389960L330540Q12804
7259I960067l284359n134970l416310m06060J203793J163770P69424M32644l85369
7250I02630j327176r68958J082925L185509L412723J491177j363753l480384l274820
7241c40127l38283L143675L719284Q22196j922804j272523J275914J938207R2127
7232G117666j579887j547662q33861k15495P13775J504439J092134M39049J546232
7223H236390L281619K050050k231015m991376l766964j817558k180379k437680
$$ y = [606982, 1236112, 1148371, 703973, 1846227, 4485479, 5633183, 3406216, 183148, -158575, 2698632, 5266264, 5018295, 3513232, 3924177, 6627915, 8561136, 6903611, 2500821, -940081, -862855, 1569286, 3292239, 3241704, 3426763, 5816723, 9147263, 9960067, 6675708, 1540738, -1875572, -2281632, -1077839, 85931, 855355, 1287999, 902630, -424546, -1393504, -310579, 2874930, 6287653, 7778830, 6415077, 2934693, -340127, -678410, 2465265, 6184549, 7006745, 5083941, 3811418, 5087332, 7025539, 7117666, 5537779, 3990117, 3156256, 2940761, 3654536, 5158975, 6251109, 6690158, 8236390, 11518009, 13568059, 11337044, 6345668, 2578704, 761146, -1419233, -3856913]
7215c856913M45310L736037K720933j383908k945293l61459K392212K485848J296389
7206D529156K26114j484391l410908l008087j9950K072898J199608k29568K59084
7197A33956J156033K90587q17983M01011K599690K088146j450027m305552l797225
7188c701364j184880Q33800J340426J276326J750821K809347L210726J615635
7180G950837j368953l125641k099658k5011M53046m32559j92220J817721L192716
7171F170278J883568j073587l144425l254342k178768j019539l85746m68192q97873
7162d368626q06996J40913R54174L88337j100766j350497R36065M063482M758625
7153C614711J971558j536940k162601M03436K957900K605163l03971l282483m519699
$$ y = [-3856913, -3411603, 324434, 3045367, 1661459, -1283834, -1645293, 746919, 3232767, 4529156, 4755270, 3270879, -140029, -3148116, -3168066, -1095168, 104440, -125128, 133956, 1289989, 1580576, 762593, 1163604, 3763294, 5851440, 4401413, 95861, -3701364, -4886244, -4052444, -2712018, -1435692, 315129, 3124476, 6335202, 7950837, 6581884, 3456243, 1356585, 1331574, 1784620, 1352061, 1159841, 2977562, 6170278, 8053846, 6980259, 3835834, 581492, -1597276, -2616815, -3002561, -3470753, -4368626, -5175622, -5034709, -4080535, -3692198, -4792964, -6143461, -5207396, -1143914, 3614711, 5586269, 4049329, 1886728, 2290164, 5248064, 7853227, 7549256, 4266773, -252926]
7144b52926l799389j660708R91725K763972K562965P82417j010287j667350j175207
7135b464788q15J262845J529797k16185l245104m917276l326011L03478K913867
7126h160192L081283K019757J185653M23841q31369j921422j864473j030303m12588
7117g509813K03015J592823K880985K122124m50855j903067m38915K061860K823185
7108A381342J846212R16891L60188p31445j779903r91568J523629L304220K735397
7099H564963O91740j466892l347024m202666k598607R72295L114077J408209j940364
7090A195731k742111n28226R72866o42307k992603k469192M59960J873319N0750
7081d821813j942280n57907L046128M414834J954629r47630q13821J287026J901463
$$ y = [-252926, -4052315, -5713023, -4721298, -1957326, 605639, 1388056, 377769, -1289581, -2464788, -2465603, -1202758, 327039, 110854, -3134250, -8051526, -11377537, -11074059, -8160192, -5078909, -3059152, -1873499, -1449658, -2281027, -4202449, -6066922, -7097225, -7509813, -7306798, -5713975, -2832990, -710866, -1161721, -3064788, -3503703, -1441843, 1381342, 3227554, 4144445, 4504633, 3773188, 1993285, 1001717, 2525346, 5829566, 8564963, 9256703, 7789811, 4442787, 240121, -2358486, -1386191, 1727886, 3136095, 1195731, -1546380, -2074606, -1101740, -1744047, -4736650, -7205842, -6745882, -4872563, -4821813, -6764093, -7322000, -4275872, 138962, 2093591, 1145961, 332140, 1619166, 3520629]
7072C520629L48433q32814M2650J763955K349718J215438r96292l035325l395870
7063I80522j731025J25970L20907j82990P54922K317003J438984j908504l755257
7054a639468j883624Q82083J256750J39371j04592m2155j253081k292378p60696
7045e697790J912567K079625k11655j140306Q56662L059099L266138K667444K426365
7036I218149J132594j942203m077905k635622O31059J898304O95306r3017Q63136
7027E689801J593484N56036n79087N83681L478878N179857M143397J800238K58141
7018B2704426l47754j445458l594950n527061n766747m443312k942811k126359
7010c490026j501780j57723J899962L509911L363962J280950j441484k993161
$$ y = [3520629, 3869062, 3036248, 3078898, 4842853, 7192571, 8408009, 7411717, 4376392, 980522, -750503, -624533, -303626, -486616, 268306, 2585309, 4024293, 2115789, -1639468, -3523092, -2641009, -1384259, -1244888, -1349480, -1391635, -2644716, -4937094, -5697790, -3785223, -1705598, -1917253, -3057559, -2200897, 858202, 4124340, 6791784, 9218149, 10350743, 8408540, 4330635, 1695013, 2326072, 4224376, 4919682, 4826665, 5689801, 7283285, 7839321, 7260234, 7843915, 11322793, 16502650, 20646047, 22446285, 22704426, 22356672, 20911214, 17316264, 11789203, 6022456, 1579144, -1363667, -3490026, -4991806, -5149529, -3249567, 260344, 3624306, 4905256, 3463772, 470611]
7002D70611k449250l40803J826432K484273J005107j575651l154865k537224n35149
6993d806519J433290L057739M392692M417479K290540m78833j461955q26881q46338
6984G171214j773932j406952M29690O42777j937499l677120j478882J942373J891656
6975A803325j334592l424201k604821r53177J32150J408448K674527K298008N54218
6966E53885j62698O64241P85421p43010j824626r11887O25418J137082J054445
6957A178271J178786R95392P7609r46005j852904k983657l183025m81936L933333
6948b084136N538074K179091k689971m483999k700469L34516L180477N095469
6940D369052M539451J090310k556608l360553j736565k79159J42864O01474J361348
$$ y = [470611, -1978639, -2319442, -493010, 1991263, 2996370, 1420719, -1734146, -4271370, -4806519, -3373229, -315490, 4077202, 8494681, 10785221, 10306388, 8844433, 8017552, 7171214, 5397282, 3990330, 4420020, 5062797, 3125298, -551822, -2030704, -88331, 1803325, 468733, -2955468, -5560289, -6513466, -6381316, -4972868, -2298341, -333, 553885, 391187, 1055428, 1840849, 1097839, -726787, -1638674, -1013256, 123826, 1178271, 2357057, 3352449, 3430058, 2484053, 631149, -2352508, -5535533, -6017469, -2084136, 3453938, 5633029, 2943058, -1540941, -4241410, -3906894, -726417, 4369052, 8908503, 9998813, 7442205, 4081652, 2345087, 2065928, 2208792, 2810266, 4171614]
6931D171614J336939m6923k088663l462230k820266m7675K386542J499684j740515
6922h11493k891661o03559Q43896j675890m578677l016992J224115K599389N97528
6913h313344j94621J905490L514058K467417P76740M1474j100721l095165l521148
6904g519820j385977M11709n17515k337017k209521m84510R16316J887840L181958
6895h056537L890614K572087j80972k316255k584567r53892J860195M032266L452841
6886A715780L87962k217158k420911j551701j448075j541094o01875N85897P02238
6877f388937M81860J207022J741624p3562l446826m739708j980995K550185M813992
6868e835345L042642q81462l304818k125046J192738L137334J922079q77996k498095
$$ y = [4171614, 5508553, 5461630, 3372967, -89263, -2909529, -2957204, -570662, 929022, -811493, -3703154, -4306713, -3462817, -5138707, -9717384, -12734376, -11510261, -8910872, -8313344, -8507965, -6602475, -3088417, -621000, 155740, 197214, -903507, -3998672, -7519820, -8905797, -8494088, -9011603, -11348620, -13558141, -14042651, -13126335, -11238495, -8056537, -4165923, -1593836, -1774808, -4091063, -6675630, -7629522, -5769327, -1737061, 1715780, 2103742, -113416, -2534327, -4086028, -5534103, -7075197, -7677072, -7091175, -6388937, -5907077, -4700055, -2958431, -3031993, -6478819, -11218527, -13199522, -10649337, -5835345, -2792703, -3674165, -6978983, -9104029, -7911291, -4773957, -2851878, -3729874, -6227969]
6859f227969j637390J158239M076522M592900J509364k717644l876753j306490
6851d429221J181107J054995O24870K412434M177480K427398j393028k815492
6843C240543j259256k24888q75176m26906K165776L670419J773294j050505j520864
6834E492437m35870o11455k019114k066375K39674K947067L663377J726140j752205
6825G183676m728117n526614m202850k093998K89796L507508O703347P038010
6817H170758L393615j070276k453319j140810p48257k668128m492339l996184
6809e004940j939434n4189J342166K337976K045262J66368j357382m60186J777409
6800a146950K072932o68951l734568m054294j830703L50006J005075R25382J182732
$$ y = [-6227969, -7865359, -6707120, -2630598, 1962302, 3471666, 754022, -3122731, -4429221, -3248114, -2193119, -1568249, 844185, 5021665, 7449063, 6056035, 3240543, 1981287, 1756399, 881223, 454317, 2620093, 6290512, 8063806, 7013301, 5492437, 5056567, 4445112, 2425998, 359623, 599297, 3546364, 7209741, 8935881, 7183676, 2455559, -3071055, -7273905, -9367903, -9078107, -5570599, 1132748, 8170758, 11564373, 10494097, 8040778, 6899968, 6151711, 3483583, -1008756, -5004940, -6944374, -6998563, -5656397, -3318421, -1273159, -1106791, -2464173, -2924359, -1146950, 925982, 257031, -3477537, -7531831, -9362534, -9012528, -8007453, -7082071, -5899339]
6791e899339J391874M58586j626203l293470k660073O61547M813926P008770O031560
6782F887178L242817P08289j098381k857490m283790m093790k256723o12623m80912
6773d845425r84187o76632L75972J251787J772439K088572J650441K51985n56854
6764C28098R93327L993939N194388K651986k029291n347698n016820j592263K049798
6755A225464L025782J180665p56719n94338N58017L54374r44042j033515L84437
6746C400125R39265m67213j761553j029477N27233O64891o55833j940375k625866
6737b948803k899966k224521k57755J422992Q12162j403438k322561p81828J055829
6728i547889Q89496m78325m69487J439536K791218J358842j803663l496527k203896
$$ y = [-5899339, -4507465, -4048879, -5675082, -8968552, -11628625, -10967078, -6153152, 855618, 6887178, 10129995, 10838284, 9739903, 6882413, 2598623, -1495167, -3751890, -4364513, -4845425, -5829612, -6506244, -6130272, -4878485, -3106046, -1017474, 632967, 884952, 328098, 1321425, 5315364, 10509752, 13161738, 11132447, 5784749, 767929, -824334, 1225464, 4251246, 5431911, 4675192, 4080854, 4638871, 4993245, 4049203, 3015688, 3400125, 4339390, 3872177, 2110624, 1081147, 1608380, 2273271, 1617438, -322937, -2948803, -5848769, -8073290, -8331045, -6908053, -6095891, -7499329, -9821890, -10603718, -9547889, -8658393, -9136718, -9606205, -8166669, -5375451, -4016609, -5820272, -9316799, -11520695]
6719a1520695M25684K194113L022418L872978M261789K912871M62816q36710m24704
6710D370560j73679j104774j659490m94917J179160J769341J820278K241868J809865
6701I758212q39895l933270m323978k046166j16550J40194M78201J933900K785952
6692C836600J728120M52713J011643K446139K343689O45168m28937J58493J039476
6683A3233104Q87884K14815m7078l21909j498401l012163l282758k053520r43105
6674C176869j124099j641109j082780M8464K16499m84686n86127j10776p47001
6665b334746k429433k338815R62795M581689M866850K362577N04561N01467N67940
6656G244885k36304o68912j59488l5077r64419j641263j139479m69336n75520
$$ y = [-11520695, -11095011, -8900898, -5878480, -2005502, 2256287, 5169158, 5631974, 4795264, 4370560, 4196881, 3092107, 1432617, 937700, 2116860, 3886201, 5706479, 7948347, 9758212, 8918317, 4985047, 661069, -1385097, -1501647, -1361453, -883252, 1050648, 3836600, 5564720, 6017433, 7029076, 9475215, 11818904, 12464072, 12035135, 12193628, 13233104, 14120988, 14335803, 14288725, 13966816, 12468415, 9456252, 6173494, 4119974, 3176869, 2052770, 411661, -671119, -622655, -406156, -890842, -1476969, -1587745, -2334746, -4764179, -7102994, -6140199, -1558510, 3308340, 5670917, 6175478, 6676945, 7244885, 7008581, 6339669, 6180181, 6145104, 5180685, 3539422, 2399943, 1930607, 1355087]
6647A355087o74341M2724O34128j65706j846270k750359k057655k56547J617030
6638d101909K575553K275368J400178O84227l11003k143311l509339k359783Q24404
6629d665615L106761K950437J714863P37032l84156j554732j150841J052515K514957
6620D321221J482015m51251j297624j661487k500910k616451j199317k74648j291920
6611e490372j790544O27036L311572K246911j018620j475399J175311K257436
6603a56669K64143o89500J868164M490041L412165m0206k572476l626901l893327
6594i44566k588549K54777J603370o82352l774980l368126J79518K662568K037664
6585d620676L28264j9846J220918K953897L903657K929432J83350k174658k101135
$$ y = [1355087, 680746, 723470, 1357598, 1191892, -654378, -3404737, -5462392, -5718939, -4101909, -1526356, 749012, 2149190, 2833417, 2522414, 379103, -3130236, -5490019, -4665615, -1558854, 1391583, 3106446, 3843478, 3459322, 1904590, 753749, 1806264, 4321221, 5803236, 5351985, 4054361, 2392874, -108036, -2724487, -3923804, -4198452, -5490372, -7280916, -6653880, -3342308, -1095397, -2114017, -3589416, -2414105, -156669, 107474, -582026, 1286138, 5776179, 9188344, 9148138, 6575662, 2948761, -944566, -3533115, -3278338, -1674968, -2357320, -6132300, -9500426, -9320908, -6658340, -4620676, -4292412, -4312258, -3091340, -137443, 3766214, 6695646, 6878996, 4704338, 2603203]
6576B603203k47610R71046L14079j538822l189553l096453l59576L267878L769872
6567B494064l09041m836707m714544m09579L196831L502164K140957P73919r81572
6558H56492k913465l378206k311205j762110k116746j038037K170309M346746
6550f146222K896417k48525j621560r19139k1065P12888K081465L256568K503638
6541B494465K07784j449968j569534j014269k02198J175366K350685J841265o2415
6532C771181j288603r04615j48771j20408l76461m74581j012468k119442k507988
6523e182156j266644N17271J054547m729j536589k274246j544191M32405K335934
6514g468398K736641J812685J068912R95030N37428m78802m43076J167244K122097
$$ y = [2603203, 2355593, 3326639, 3640718, 2101896, -1087657, -4184110, -4543686, -1275808, 2494064, 2185023, -2651684, -7366228, -7775807, -4578976, -1076812, 1064145, 1838064, 856492, -2056973, -5435179, -7746384, -9508494, -11625240, -12663277, -10492968, -6146222, -3249805, -3498330, -5119890, -6039029, -6060094, -5347206, -3265741, -9173, 2494465, 2702249, 1252281, -317253, -1331522, -1533720, -358354, 1992331, 3833596, 3771181, 2482578, 1577963, 1429192, 1308784, 932323, 457742, -554726, -2674168, -5182156, -6448800, -5931529, -4876982, -4881711, -6418300, -8692546, -10236737, -9804332, -7468398, -4731757, -2919072, -1850160, -855130, -317702, -796504, -1239580, -72336, 2049761]
6505B049761Q27738m59676J224012M411879M769968J498902j587470j970384j634046
6496I130684k786166l834609k274698Q48636K330068J250626n33954j329379q02963
6487A998245P52081K225609J790527o79807k426867j306090Q22226Q39233q60004
6478C155153j579532j140465j561151k517600j550989R77087J732168J65271k19785
6469b539843J933133K977525K37696l346609l873450k199339j297972j015931
6461i124790L71528J835554J265556k21643N8882J621760J867268Q62244Q73544
6452e90097J817714J425591l33813j149494o81469q88588j828476j276307Q52999
6443b651940J769578M88592o00259o2003M04535l72646p37047N74881K023978
$$ y = [2049761, 2877499, 2417823, 3641835, 8053714, 12823682, 14322584, 12735114, 10764730, 9130684, 6344518, 2509909, 235211, 1083847, 3413915, 4664541, 4130587, 2801208, 1998245, 2750326, 4975935, 6766462, 6086655, 3659788, 2353698, 3175924, 4015157, 3155153, 1575621, 435156, -1125995, -3643595, -5194584, -4217497, -2485329, -2320058, -2539843, -606710, 2370815, 2608511, -738098, -4611548, -6810887, -8108859, -9124790, -8753262, -6917708, -5652152, -5873795, -5814913, -4193153, -2325885, -1463641, -590097, 1227617, 2653208, 2319395, 1169901, 488432, -400156, -2228632, -3504939, -2651940, -882362, -393770, -994029, -1056032, -651497, -1024143, -1761190, -1186309, 837669]
6434H37669K033547J451638J434689J408754Q39444N61665P30686n7685k004964
6425G235443l020605k048710r15325j148127j576770r09532r315L55193J264781
6416g72967K966661L198244O87339k220342k997119k512835k547503k331789o23980
6407g154291J128819J048690L04173J046291K576619K733598J479429J12518j295251
6398A980595k656054k188375O06504K512928J034064r51329N23238L557836L052284
6389G471691q67251k905474j020808R30446l4902j787202j433062K92003J087192
6380A732633M87380m56020o13443Q02844L013595L101889m45404m286909m041012
6371g04447q87199K13503j477182j758317P40275K198379P62465m7451J982299
$$ y = [837669, 2871216, 4322854, 5757543, 7166297, 8005741, 8567406, 9298092, 9240407, 7235443, 4214838, 2166128, 1250803, 102676, -1474094, -2383626, -2392941, -2037748, -772967, 2193694, 5391938, 6079277, 3858935, 861816, -1651019, -4198522, -6530311, -7154291, -6025472, -4976782, -4672609, -3626318, -1049699, 1683899, 3163328, 3275846, 1980595, -675459, -2863834, -2257330, 255598, 1289662, 338333, 861571, 4419407, 7471691, 6604440, 3698966, 2678158, 3608604, 3573702, 1786500, 353438, 645441, 1732633, 2220013, 1763993, 1150550, 1953394, 4966989, 8068878, 7623474, 3336565, -704447, -1591646, -1378143, -2855325, -4613642, -3873367, -1674988, -912523, -959974, 1022325]
6362A022325L325992Q43702k563901k898860j556204k035597l472416k517193
6354i852152O57625L007775L557926L394341K350198m1618j696192l84612K020922
6345C014213J841978o96071k120141j365257n30081l37156P31345K464962K399108
6336E402900K14740j215251n13455L2643j258719k303844q28808J417626J063340
6327B011172j576072k676879m53604K039652R71832k782471m289689r27464L820116
6318c863407M595730J047393k078176j579913M72724O96186p96729j588676q04601
6309c899469N99975J833975K251325P05651k651832m984975l601029N12636L965245
6300e268498M860545L500452N46608k965270m771303l324957j74956J889619K401529
$$ y = [1022325, 4348317, 5192019, 2628118, -270742, -1826946, -3862543, -7334959, -9852152, -9194527, -6186752, -2628826, 765515, 3115713, 3074095, 1377903, 993291, 3014213, 4856191, 4160120, 2039979, 674722, 144641, -192515, 538830, 3003792, 5402900, 5617640, 4402389, 3888934, 3921577, 2662858, 359014, -469794, 947832, 2011172, 435100, -2241779, -2695383, -655731, 316101, -2466370, -6756059, -7683523, -3863407, 732323, 1779716, -298460, -1878373, -1405649, -709463, -1506192, -3094868, -3899469, -3299494, -1465519, 785806, 1491457, -1160375, -6145350, -9746379, -9233743, -5268498, -407953, 3092499, 3639107, 673837, -4097466, -7422423, -7597379, -5707760, -3306231]
6291c306231K674538K789268J981949J184939J886875K822698J247058k313720
6283H967374l963410j816939J487319K586591J103355j347688l335768l687288
6275f454j697942J351111K685791J336818m40078n9047K276810M171831L734342
6266A3353182J062364k118432l887479l739734k716633j646641k10907J536803
6258A632523K281768J470845N31622L09615o63932k983217l884405j402650J237251
6249a470580j29765l615555l781590k56135J981507R75991K16079J516062J836933
6240b727053k96416j142519J828813M842923L465342n79279k673665k271650k099758
6231a653262k726326k353466o83807P16994J052893N85493m86856j231906R0511
$$ y = [-3306231, -631693, 2157575, 4139524, 5324463, 7211338, 10034036, 11281094, 8967374, 5003964, 3187025, 4674344, 7260935, 8364290, 7016602, 3680834, -6454, -1704396, -353285, 2332506, 3669324, 3229246, 3170199, 5447009, 9618840, 13353182, 14415546, 12297114, 8409635, 4669901, 1953268, 306627, 95720, 1632523, 3914291, 5385136, 5916758, 6226373, 5562441, 2579224, -1305181, -2707831, -1470580, -1600345, -5215900, -8997490, -9253625, -7272118, -6296127, -6080048, -4563986, -2727053, -3023469, -4165988, -2337175, 2505748, 5971090, 5391811, 2718146, 446496, -1653262, -4379588, -6733054, -7416861, -6699867, -5646974, -5061481, -5548337, -6780243, -6689732]
6222f689732L020501M069129J487207j585965j678890q5815R1400n35985O47503
6213a260647K877267K945884O03294j260426j357456j007740p28091L77665J813520
6204C003270J759995J73918j118802j402023j426083j174122j22333P64094K41698
6195F99612o07638m7917Q45051j37759j962549j609419O99758J714755N42053
6186A35947n00254o08453j474133k884155k164800O35262J752525j71145j556398
6177f835604L4485J680863K02631k357110k190412K31913J478755M34529j294071
6168h614021k468235k390547K22704M947685P687804M925734p44831l108513k77382
6159A80398L295679L113170k35443l152432l609531k280022p96601j41781J9868
$$ y = [-6689732, -3669231, 399898, 1887105, 301140, -1377750, -1463565, -1372165, -1908150, -1260647, 1616620, 4562504, 5165798, 3905372, 2547916, 1540176, 812085, 1189750, 3003270, 4763265, 4937183, 3818381, 2416358, 990275, -183847, -306180, 457914, 699612, 91974, 44057, 889108, 751349, -1211200, -2820619, -2120861, -406106, 135947, -364307, -972760, -2446893, -5331048, -7495848, -6860586, -5108061, -5279206, -6835604, -6801119, -5120256, -4917625, -7274735, -9465147, -9233234, -7754479, -7319950, -8614021, -11082256, -13472803, -13250099, -8302414, -614610, 4311124, 3566293, 457780, 180398, 3476077, 6589247, 6353804, 3201372, -408159, -2688181, -3484782, -3626563, -3606695]
6150c606695Q71465K674133L789281K639020J78196j263650j346175j882953l484643
6141a432021m304997l001781r07550J72747O92930K014370L399831K705022O5568
6132e95881j321712P98401M296473M797432R59566l786754n162919k685585M07790
6123b293189J268187L17017j15574R79307K297462K268597J193690P12671J427924
6114H056092J988015R93036r38256j963395j465425m63183K81836R45683J094375
6105H528778n79179l730508n277086k841030J632692L791006K056493j031851
6097B549315k537623k188170j365328q31162l03222P76223K652195M712156N416227
6088H880611L746084Q21629j016751r35282l83953r82417k691769m303228m701398
$$ y = [-3606695, -2735230, -61097, 3728184, 6367204, 6545400, 5281750, 3935575, 2052622, -1432021, -5737018, -8738799, -9646349, -9473602, -8780672, -6766302, -3366471, -661449, -595881, -1917593, -1119192, 3177281, 7974713, 8934279, 5147525, -15394, -2700979, -2293189, -1025002, -707985, -823559, 155748, 2453210, 4721807, 5915497, 6628168, 8056092, 10044107, 11037143, 10098887, 8135492, 6670067, 6206884, 6488720, 7434403, 8528778, 7949599, 4219091, -1057995, -3899025, -2266333, 1524673, 3581166, 2549315, 11692, -2176478, -3541806, -4372968, -4676190, -3899967, -1247772, 3464384, 8880611, 12626695, 13448324, 12431573, 11496291, 11112338, 10129921, 7438152, 3134924, -1566474]
6079a566474l387861p52385J845398L070224K904254K321702J830208J188825
6071G453891L27596n27325j489775k681594l437990k987721j758298q44883l68360
6062f314459M67475J881782L177737L621941K795991Q00477r90435p31941J007977
6053E716545J051827j671023l523836j427149J591388O23687k980509l379321
6045c998391K79197K538877R03163j95004K446388M741315J917460l423252n028568
6036A81185j820036J838395K661316R45946j782998l693777k636441J177465L854476
6027G25531K486604n29076j234681j19950k82766j461981q37057J185797J147513
6018A079934j445818l026341j567107Q64083J989358J972372J284469m49323k331503
$$ y = [-1566474, -4954335, -5706720, -3861322, -791098, 2113156, 4434858, 6265066, 7453891, 7781487, 7254162, 5764387, 3082793, -355197, -3342918, -5101216, -5946099, -6314459, -5846984, -3965202, -787465, 2834476, 5630467, 6430944, 5440509, 4708568, 5716545, 6768372, 5097349, 1573513, 146364, 1737752, 2361439, -619070, -3998391, -3719194, -1180317, -277154, -472158, 1974230, 6715545, 8633005, 5209753, 181185, -1638851, 199544, 2860860, 3806806, 2023808, -1669969, -4306410, -3128945, 725531, 3212135, 2683059, 1448378, 1328428, 1045662, -416319, -1253376, -67579, 1079934, -365884, -3392225, -4959332, -4095249, -2105891, -133519, 1150950, 701627, -1629876]
6009a629876k231265k02304J067971L48842m03897N23820K207272L208709L418884
6000F308156K701227M32962k354983l025829r41298J331730J649630P39471j01660
5991F739406j046399k011491j640322J07081Q67894n06383j594917q3909K272959
5982C103919K150315l65981k133161j450436L98213J703167K114246J839739R04296
5973H264317m63131j766989k621522k618822j394327M54297J335424N18188p46029
5964I61406r57952m20250m08913j032960j262979o93409n903K46801L53466Q78918
5954b341775J942136K990167L025555J452162r71093k486007k041775l14468J157771
5945B412673J433530O99037j35391l16800j12260n03163j587884k102885j413387
$$ y = [-1629876, -3861141, -4063445, -2995474, -2646632, -3050529, -2526709, -319437, 2889272, 6308156, 9009383, 9442345, 7087362, 4061533, 3120235, 4451965, 6101595, 6841066, 6739406, 5693007, 3681516, 2041194, 2148275, 3016169, 2509786, 914869, 830960, 3103919, 5254234, 4888253, 2755092, 1304656, 1702869, 3406036, 5520282, 7360021, 8264317, 7801186, 6034197, 3412675, 793853, -600474, -146177, 1189247, 1707435, 961406, 3454, -416796, -825709, -1858669, -3121648, -3815057, -3820960, -3574159, -3220693, -2341775, -399639, 2590528, 5616083, 7068245, 6097152, 3611145, 1569370, 1254902, 2412673, 3846203, 4545240, 4409849, 4093049, 3980789, 3477626, 1889742, -213143, -1626530]
5936a626530q04141j226309j084865J257266L827714L277500M41836l28922J942306
5927E675855K967796Q2354l153479k423961O39858J304596r59468k483690j660562
5918a0701p50918j308166j747407n41218J208658J813997J409901R48782M57502
5909A480430l74882j076353j080238p57806p80695r75332o24100L63451J192515
5900b633010J083184J70064n43787j91418R32530J552560Q10082p19911j660326
5891a200032j381765p08837r46076k087854k297322J5593L547684M949541L092026
5882B982958Q08504Q36002J863868J220755j31718Q81325L585492L743078K29629
5873A6019893l009541l228003k621686l379255l398364n54261K452195J946470
$$ y = [-1626530, -2430671, -3656980, -4741845, -3484579, 343135, 3620635, 4062471, 3733549, 5675855, 8643651, 8726005, 5572526, 3148565, 3788423, 5093019, 4133551, 1649861, -10701, -761619, -2069785, -3817192, -4358410, -3149752, -1335755, 74146, 1022928, 1480430, 1105548, 29195, -1051043, -1808849, -2589544, -3564876, -4188976, -3825525, -2633010, -1549826, -1379762, -1923549, -2114967, -1182437, 370123, 1180205, 460294, -1200032, -2581797, -3290634, -4236710, -6324564, -8621886, -8606293, -5058609, -109068, 2982958, 3791462, 4627464, 6491332, 7712087, 7580369, 8461694, 12047186, 15790264, 16019893, 13010352, 9782349, 7160663, 3781408, 383044, -171217, 2280978, 4227448]
5865D227448o70599j324800K06813Q45627p1006m18605M9599o08791k240307k466174
5855b470795j148279p23660j515393r52578J550724L077157K006292M67354K52426
5846E43248m181j384141j914458j6247K133911J755789j92036q80253j13619J75815
5836A03828k20223L36646J964906K670591J422395m44867j427375j627788j644544
5827A133569j222628j03700O95357k19128k479335l793158k559236l3896J175619
5818g406536O14017M82445K112212L604881K455338o20493k312278o37610L293867
5809A585843O817366P474770M147253j504453n355062m769393j788389k72326
5801F335609p75229j055668p43398j594387l125639k393154P37373K329700M18703
$$ y = [4227448, 3556849, 2232049, 2438862, 3284489, 3213483, 2794878, 2844477, 2235686, -4621, -2470795, -3619074, -4342734, -5858127, -6810705, -5259981, -2182824, -176532, 290822, 543248, 539067, -845074, -2759532, -2775779, -641868, 1113921, 921885, 41632, -71987, 103828, -116395, 220251, 2185157, 4855748, 6278143, 5833276, 4405901, 2778113, 1133569, -89059, -192759, 502598, 283470, -2195865, -5989023, -8548259, -8582155, -7406536, -6792519, -6310074, -4197862, -592981, 1862357, 1241864, -1070414, -1708024, 1585843, 8403209, 15877979, 20025232, 18520779, 13165717, 8396324, 6607935, 6335609, 5560380, 4504712, 3761314, 2166927, -958712, -3351866, -2614493, -284793, 133910]
5792A33910j511412J48957L529842M248960J591514j581880l318654l727845k957590
5783c444198j162730K50469J6691r34416r69792l51318j70916P1302J274751K318997
5773c101160J735211P55978J380527K147197j96336m630814n708235j028284M634140
5764d011776N143337N64947l764511m236880k212350o70763k53000M40475K026877
5755f973644L212684K554358O52341j44775J487019L865701L876573N81720l447883
5746E664094m832175l031248p11595m50435j755719k088153n32793R42574N22858
5737f272592o24283j69560J683854K549768J649501Q25646J369230K172127J898821
5728E082512Q98252p5522j092220j958104j883584j245752j472998k137024r05239
$$ y = [133910, -1377502, -1228545, 2301297, 6550257, 8141771, 6559891, 3241237, -486608, -3444198, -4606928, -4356459, -4339768, -5274184, -6243976, -6595294, -6766210, -6694908, -5420157, -3101160, -1365949, -609971, 770556, 2917753, 2721417, -1909397, -7617632, -8645916, -4011776, 1131561, 1696508, -2068003, -6304883, -8517233, -9187996, -9440996, -9000521, -6973644, -3760960, -1206602, -554261, -699036, 787983, 4653684, 8530257, 9111977, 5664094, 831919, -2199329, -2910924, -3361359, -5117078, -7205231, -7738024, -6795450, -6272592, -6896875, -7066435, -5382581, -2832813, -1183312, -357666, 1011564, 3183691, 5082512, 5980764, 5905242, 4813022, 2854918, 971334, -274418, -1747416, -3884440, -4789679]
5719d789679K127696L306773R65629j252719K9572K179242P98857k761809l473213
5710b869651q30449P86962k28971n83930J343049K408983M76721j513052l27951
5701a338289K376396K927037R34905j288388k325927j884871L86110L390488L836272
5692G013733J74988m127565m455121j198908J152505N28105n07685N89092K536240
5683A705384K451114m4118k533897k839453j180864N58220J062132P29731O11928
5674E20177P90942N77130l8662l66386l96308o95484p82011N19191K548241K785942
5664E462772N08185j602277j084295R58069J994749J675178R92090m12314l158973
5655E333184n485115m896722k029312J63709Q32356J657329K807641K080524r19569
$$ y = [-4789679, -2661983, 644790, 1610419, 357700, 387272, 2566514, 3365371, 603562, -2869651, -3700100, -2913138, -3142109, -3726039, -2382990, 25993, 502714, -1010338, -1338289, 1038107, 3965144, 4900049, 3611661, 1285734, -599137, -213027, 3177461, 7013733, 7188721, 3061156, -1393965, -2592873, -1440368, -912263, -1419948, -830856, 1705384, 4156498, 4112380, 1578483, -1260970, -2441834, -1883614, -821482, -91751, 520177, 1311119, 1888249, 1849587, 1483201, 1086893, 391409, -390602, 128589, 2676830, 5462772, 5970957, 4368680, 3284385, 4242454, 6237203, 7912381, 8904471, 8492157, 5333184, -151931, -5048653, -7077965, -6914256, -6081900, -4424571, -1616930, 463594, -455975]
5646d55975l117453k244488Q993J146090J612849K839861L669067J966224j315798
5637D109370k948470k035868q44593q26813p03847O28793J899953J673230P35538
5628A687293M63670L31234q99588k535332k780201j788318j560811k552446k561975
5619a2196474M3386L602245M909646K795771r90677l716759l702286j264846J445828
5610i074166K191480R93180O9292Q41462K095136K046096R53259K08810p2758
5601B51791p09294j470804j476595j106048j408221j855630r08370J172895K363547
5592e146729J981598J453287J526090J134290j67751j039034p19320k93746l47920
5583a619235K98695J933140K381654K39565k323672k454115p74956q8900j085046
$$ y = [-455975, -3573428, -5817916, -5808923, -4662833, -3049984, -210123, 3458944, 5425168, 4109370, 1160900, -874968, -1719561, -2546374, -3250221, -2621428, -721475, 951755, 1687293, 2150963, 2482197, 1582609, -952723, -3732924, -5521242, -7082053, -9634499, -12196474, -12153088, -8550843, -3641197, -845426, -1836103, -5552862, -9255148, -10519994, -9074166, -6882686, -5889506, -5820214, -4978752, -2883616, -837520, 115739, 324549, 251791, -457503, -1928307, -3404902, -4510950, -5919171, -7774801, -8683171, -7510276, -5146729, -3165131, -1711844, -185754, 948536, 780785, -258249, -977569, -1271315, -1619235, -1320540, 612600, 2994254, 3233819, 910147, -1543968, -2318924, -2407824, -3492870]
5574c492870k001113j847808j369880j072126o04110q2407p0776k45739K58056
5565a0528773J284106J884652J783081J260486K54478r23554r04009Q50924K435973
5556b602636J930802M64434L41455J039609J53774k160259l112262j772806k33535
5547e951424K74026J016758K536803L140638K095617J248385J621515J251049
5539G233367j354444m060876l959644j551818L47773M87350k15493o98021l74624
5530d146430J117181K969478L195238J275898n56153m52666K50263n02857j890845
5521A259107j769719n24593l38892j349114j587618n13119L23201K28763K38695
5512d033289P02103O01871j52484k13115O29726O69497q18335j926841p80642
$$ y = [-3492870, -5493983, -7341791, -8711671, -9783797, -10387907, -10470314, -10541090, -10786829, -10528773, -9244667, -7360015, -5576934, -4316448, -4061970, -4985524, -5889533, -5038609, -2602636, -671834, -207400, 134055, 1173664, 1327438, -832821, -3945083, -5717889, -5951424, -5677398, -4660640, -2123837, 1016801, 3112418, 4360803, 5982318, 7233367, 5878923, 1818047, -2141597, -3693415, -3345642, -2858292, -3073785, -3771806, -4146430, -3029249, -59771, 3135467, 4411365, 3855212, 3402546, 3652809, 3149952, 1259107, -510612, -1035205, -1374097, -2723211, -4310829, -4823948, -4500747, -4271984, -4033289, -3331186, -2729315, -2881799, -3094914, -2465188, -1795691, -2614026, -4540867, -5321509]
5503e321509J621808K655574J287452j006167j963489n93099J913755L092559
5495A686884J734032n43150j196000K0439J108539R16826L72637M17350O03985
5486E121542L52761j06744p31597j940015l170156k936804j263954k76953j194845
5477f146765k469077k294947j215894m81775M93587K690611M650288L796491L78458
5468e99023k265615j709825J037843L276058L324881J256353j554170l137738
5460c71236k469888p99290l87454j583412k333609j107760R12180J496200M17920
5451f226349k59092J170942L819065M892829K701559j049327k604255m84572K202275
5442D163075J239206l092480n856669l606228J303423M083754L483784J951899
$$ y = [-5321509, -3699701, -1044127, 243325, -762842, -2726331, -3319430, -1405675, 1686884, 3420916, 2877766, 1681766, 1702205, 2810744, 3727570, 4100207, 4517557, 5121542, 5474303, 5367559, 4635962, 2695947, -474209, -3411013, -4674967, -4951920, -6146765, -8615842, -10910789, -12126683, -12608458, -12114871, -9424260, -4773972, -977481, -599023, -2864638, -4574463, -3536620, -260562, 3064319, 4320672, 2766502, -371236, -2841124, -3640414, -4027868, -5611280, -7944889, -9052649, -8140469, -6644269, -6226349, -6485441, -5314499, -1495434, 3397395, 6098954, 5049627, 2445372, 1960800, 4163075, 5402281, 2309801, -3546868, -7153096, -5849673, -1765919, 1717865, 3669764]
5434C669764Q57089j080942m030344n040181k024099K354380L612863J298030
5426c83440r36985p84999K27786K44256K6195Q54466J988738K350833K733863
5417F320713L789636L471992k83283n156669o322552k985196L27755j0967k309213
5408c157784l000041j732846n78524j05874Q15418K058019J790620p06527l501506
5399h119045l839404q16726L714258O438769N308081J604126j286807j552195
5391A451057m04755M80290J133456J729423R68487j641101l352980j079608L659271
5382B943540N656518K385208k960964n591909m264582j311437P43232J251256
5374a149138J127648J625367L024357M086052L336680R98927j176614k073434
$$ y = [3669764, 4526853, 3445911, -584433, -5624614, -7648713, -5294333, -1681470, -383440, -1320425, -2105424, -1877638, -1633382, -1607187, -752721, 1236017, 3586850, 6320713, 10110349, 13582341, 13299058, 8142389, 1819837, -1165359, -837604, -848571, -3157784, -6157825, -7890671, -8469195, -8575069, -7759651, -5701632, -3911012, -4617539, -8119045, -11958449, -12775175, -9060917, -2622148, 2685933, 4290059, 3003252, 1451057, 1046302, 1526592, 2660048, 4389471, 5357958, 3716857, 363877, -715731, 2943540, 8600058, 10985266, 8024302, 2432393, -1832189, -3143626, -2400394, -1149138, -21490, 1603877, 4628234, 8714286, 12050966, 13049893, 11873279, 9799845]
5366I799845k150019k042212j490657k92275O66962K26190j570119l383421l907775
5357d143481l108095k073757j458913l80237K146018M763670M679322J838348
5349B262875o1946J361922L248555J553856k588086m352639k352253o8750J01794
5340h94672o5838J223200K510866K050119P86244Q5015o85561j958846k101220
5331I49307m15230N23081j390412l831729l212692j65421J686093J302349Q70783
5322c683871J355123J113532o32015k097484j681372j56788P84877N65702k91485
5313d723781r34056o74183K55922O36233j0104k81947J083925K851495K761950
5304I65454P92678r65246j226875m19413Q14064J951639J845265j78086k642385
$$ y = [9799845, 7649826, 5607614, 4116957, 3824682, 4491644, 4717834, 3147715, -235706, -4143481, -7251576, -9325333, -10784246, -11164483, -9018465, -4254795, 424527, 2262875, 2200929, 3562851, 6811406, 8365262, 5777176, 1424537, -927716, -996466, -894672, -960510, 262690, 2773556, 4823675, 5609919, 5694934, 5009373, 3050527, 949307, 534077, 1057158, -333254, -4164983, -7377675, -7543096, -5857003, -4554654, -3683871, -2328748, -1215216, -1847231, -3944715, -5626087, -5782875, -4997998, -4432296, -4723781, -5657837, -6332020, -6076098, -5439865, -5449969, -5731916, -4647991, -1796496, 965454, 1758132, 792886, -433989, -853402, -39338, 1912301, 3757566, 3579480, 937095]
5295I37095l359456k318107j267349r77300j046891j664811k902019k893454J24161
5286a5368131M183127N342077L212677J280551J329001J312355k66117j733619
5278g08079j644006j222551j428514r41112O81609J203597k15005m77100K458220
5269b292941N035526K906986j837696l221295l05545J574639q98291m235633l706146
5260f980396j42271J784074J80413k189958k233690k73187J242155J249942R11506
5251f451412J325901J961565K034928K093453K636432K057704j576023o580456
5243b497908q212319m424067J133934L564336K383724P72212P24100J449255J854354
5234c252379K100096K550065K940811K866097J975859j10607k927447m558619
$$ y = [937095, -2422361, -4740468, -6007817, -6985117, -8032008, -9696819, -12598838, -15492292, -15368131, -11185004, -5842927, -2630250, -1349699, -20698, 1291657, 1025540, -708079, -2352085, -3574636, -5003150, -5944262, -5262653, -4059056, -4274061, -4751161, -2292941, 2742585, 5649571, 3811875, 590580, 285035, 1859674, 961383, -3274250, -6980396, -7122667, -5338593, -5158180, -7348138, -9581828, -9855015, -8612860, -7362918, -6451412, -5125511, -3163946, -1129018, 964435, 3600867, 5658571, 4082548, -2497908, -10710227, -15134294, -14000360, -10436024, -8052300, -7280088, -6555988, -5106733, -3252379, -1152283, 1397782, 4338593, 7204690, 9180549, 9069942, 6142495, 1583876]
5226A583876l356886k90876J661616P45991j704373k807355j105669K007518L719369
5217D53211K844011J083246M93144M27586j163633l798165m600574k855409j242014
5208h358597j156648k05121L161652N693670L650849j183169l869844l261756
5200e528964k317290k278126j168794J540812L139111J954934L7904j36017R76702
5191c779728J573007J373274J292877J643395J869569J231797n87705k626618
5183A989868k852628p76063J009131K29394j070641P35295M576041N331375J414739
5174A0586511k621885k741634o26663K12739j62825J46274O89685p6782j311690
5165D093730j172669l51082q36546k114057j906603j70949Q30395L39246M9339
$$ y = [1583876, -1773010, -2063886, -402270, 343721, -1360652, -4168007, -5273676, -3266158, 453211, 3297222, 4380468, 4873612, 5301198, 4137565, 339400, -4261174, -7116583, -8358597, -9515245, -9720366, -6558714, -865044, 2785805, 1602636, -2267208, -5528964, -7846254, -10124380, -11293174, -9752362, -6613251, -4658317, -4620413, -4756430, -3779728, -2206721, -833447, 459430, 2102825, 3972394, 5204191, 4616486, 1989868, -862760, -1638823, -629692, -400298, -1470939, -735644, 3840397, 9171772, 10586511, 7964626, 5222992, 4596329, 4809068, 4646243, 4792517, 5482202, 5405420, 4093730, 2921061, 2569979, 1733433, -380624, -2287227, -2458176, -1627781, -1288535, -1239196]
5156a239196R83917K025220K137009J928250K275434K915408K925243J535194
5148A5486479j469646m968033o515063m683806j119645J296863J914664K131827
5140B073640K261111J033441j585826l550786l526815k542358j939275j457290
5132i234158m23768O90314J081862Q08812K00942p92259j766594j538780L30469
5123a0643160K618541L819991L463010J625483j211721l066681j449950K794976
5115b049511M739506J108064m682287o335478k702711J457847K512375J794548
5107d157647J608613J512326P83593J033926L101549L996580Q81807l572745m170923
5098A017079q86484J018720r05435k697746m42690L644564M763888K433558J32658
$$ y = [-1239196, -255279, 1769941, 3906950, 5835200, 8110634, 11026042, 13951285, 15486479, 14016833, 9048800, 2533737, -2150069, -3269714, -1972851, -58187, 2073640, 4334751, 5368192, 3782366, 231580, -3295235, -5837593, -7776868, -9234158, -9657926, -8967612, -7885750, -7076938, -6875996, -7668255, -9434849, -10973629, -10643160, -8024619, -4204628, -741618, 883865, -327856, -3394537, -4844487, -2049511, 2689995, 3798059, -884228, -7219706, -9922417, -8464570, -5952195, -4157647, -2549034, -1036708, -253115, 780811, 3882360, 7878940, 8760747, 5188002, 1017079, 130595, 1149315, 243880, -2453866, -2896556, 748008, 5511896, 7945454, 8078112]
5089H078112m98737j243836l199912m499076l217477l27516J574651J233976n16932
5080b616747k000365j869645J06331K476035K825189J27407l558444m597150j548388
5071a0655777K945813M756462K689107n34026j837494j051469J53151J069133
5063b465100J921305K062773N93639j475187k063407j148159p16633j392946j679081
5054f362796r58863l91822j20462J197818K940731K190113j280255l329351j356184
5045g471071J614407J913829Q32508J267965J964454P2169k814750k629255L80113
5036d869631K150891J483824J006711J640838J360179p3020j82631J437000K021047
5027E975208M75023r46336r09283p93334j180202q24513k10823j625065m363481
$$ y = [8078112, 7579375, 6335539, 3135627, -1363449, -4580926, -4908442, -3333791, -2099815, -2616747, -4617112, -6486757, -6380426, -3904391, -1079202, -951795, -4510239, -9107389, -10655777, -7709964, -2953502, -264395, -798421, -2635915, -3687384, -3534233, -2465100, -543795, 1518978, 2112617, 637430, -1425977, -2574136, -3290769, -4683715, -6362796, -7321659, -7713481, -7833943, -6636125, -3695394, -1505281, -2785536, -6114887, -7471071, -5856664, -3942835, -3110327, -1842362, 122092, 194261, -2620489, -5249744, -4869631, -2718740, -1234916, -228205, 1412633, 2772812, 2699792, 2517161, 3954161, 5975208, 6450231, 5503895, 4594612, 3801278, 2621076, 1796563, 1585740, -39325, -4402806]
5018d402806m593875j625834O16160L76616R93473M192578N864926K609649k136226
5009A894661l203550j171524J10040K53350J350903K654918J653460q26772j539714
5000A175772k17058L05671r69901k073585j812205j124498n36824O45912K233212
4991b373504K699513J223350j457015l937210m541015j976677K487099M797017
4983c078442K501774j578895k584619J71215K781978K232003k20125j485242n29275
4974a789628J016625J271875L84805M3173P09145O74667q10840j234021J437732
4965A703533M157160K354386k408440l782192l67913J950975m11885l064936j332985
4956a202297K009050J790035j210851k565827j547771o30511j28425J314192K665956
$$ y = [-4402806, -8996681, -10622515, -10006355, -9629739, -8636266, -4443688, 1421238, 4030887, 1894661, -1308889, -2480413, -2370373, -2117023, -766120, 1888798, 3542258, 2715486, 1175772, 958714, 1264385, 294484, -1779101, -3591306, -4715804, -5252628, -4606716, -2373504, 326009, 1549359, 92344, -3844866, -8385881, -10362558, -7875459, -3078442, -576668, -2155563, -4740182, -4568967, -1786989, 445014, 224889, -1260353, -1789628, -773003, 498872, 883677, 926850, 1635995, 2310662, 1499822, 265801, 1703533, 5860693, 8215079, 5806639, 2024447, 1656534, 3607509, 3195624, 130688, -1202297, 806753, 2596788, 1385937, -1179890, -2727661, -3358172, -3486597, -2172405, 493551]
4947D93551J840733k23965r83895m08501o7709J78235J166135K025306J825745
4938E845635J304573M30064k293522n412642m208162J469538M557696J003574
4930B696754l157050j354982K635539J469913l007817l254060R78976K995075
4922B348Q24282q91977j6885P88046O24521J166831J224230j781568n364538m614986
4912h039696o84532R46662j94905J76748K449449K831085J019035J98718K75046
4903a022390j124232k451266j028689M02019j438682k353378K473612P570647
4895A027641M845659j773103k640478N27556r91678m985315k011586N270036N400387
4886D669119m10200m20403M519382K348750n243316m183769L881221K898832m889941
$$ y = [493551, 2334284, 2110319, 1126424, 717923, 650214, 828449, 1994584, 4019890, 5845635, 7150208, 7580272, 5286750, -125892, -4334054, -2864516, 1693180, 2696754, -460296, -1815278, 820261, 2290174, -717643, -3971703, -2992727, 2348, 826630, -65347, -82232, 705814, 1330335, 2497166, 3721396, 1939828, -3424710, -8039696, -8724228, -7777566, -7972471, -7795723, -5346274, -2515189, -1496154, -1297436, -1022390, -2146622, -4597888, -5626577, -5224558, -6663240, -9016618, -6543006, 1027641, 5873300, 4100197, 1459719, 1987275, 995597, -3989718, -6001304, -731268, 4669119, 4258919, 3838516, 8357898, 10706648, 5463332, 1279563, 5160784, 8059616, 3169675]
4877C169675k61336J3045579R831243j819756K3990945R0288511J20243177N2127511
4869C10615549o1892151j12739769p3416234j8180148p329225j9593450j4067822
4862C396750K214263K571943p146879m546844P145287Q521544l70660l868085
4854G917319M33595J897456j530170l020219k273820l581578m137413L56897M372349
4845D34416R85611m536456l128823K310490K944061k22149j57974J911355j68941
4836C71590m010425k132491L842466N250270J020999j473938O76158K805938K158813
4827H509380J138681J086749O16115k31558n98523k022050n154280o132082k418835
4818e206403J408494N31431j598840O63213M672289L803384r92708k990896q17796
$$ y = [3169675, 2908339, 15953918, 25785161, 23965405, 47956350, 138244861, 258488038, 310615549, 248723398, 135983629, 62567395, 44387247, 37058022, 17464572, 3396750, 5611013, 8182956, 1036077, -3510767, 3634520, 12156064, 11785404, 7917319, 8350914, 10248370, 8718200, 5697981, 3424161, -157417, -4294830, -3937933, 434416, 1420027, -3116429, -6245252, -3934762, -990701, -1212850, -1370824, 540531, 371590, -3638835, -5771326, -1928860, 3321410, 4342409, 2868471, 3544629, 6350567, 8509380, 9648061, 10734810, 11350925, 11119367, 10520844, 8498794, 3344514, -2787568, -5206403, -3797909, -3266478, -4865318, -4202105, 470184, 4273568, 3280860, 289964, -527832]
4809e27832Q67162J23435q77510j591701k749094k268128J167895L100054l78018
4800c133737m349548j816756M256489N402699J827588J296944M764099M511880
4792A2759658k146375p903499o913921k248700J087352K746955L651056K947865
4784C980391J269785J131113J970509M35609l013944l817588r39968J412460J063465
4775C491832N17726Q45953m96833l663183m540974j439405J936860K525174J674504
4766H51654R45339m53375k049808j343687J257485J965727j3124r90408M62304
4757F32107R98026j034761k413467j074185K62725m49471q46411Q10092J914135
4748a201210L78728j438410j216630o42859j318463j051710J836092M413707L434659
$$ y = [-527832, 339330, 462765, -414745, -2006446, -4755540, -7023668, -5855773, -2755719, -3133737, -7483285, -9300041, -5043552, 359147, 2186735, 3483679, 8247778, 12759658, 10613283, 2709784, -4204137, -6452837, -5365485, -2618530, 1032526, 3980391, 5250176, 6381289, 8351798, 8787407, 5773463, 1955875, 1015907, 2428367, 3491832, 4009558, 4855511, 4358678, 695495, -3845479, -5284884, -3348024, -822850, 851654, 1796993, 1343618, -706190, -2049877, -792392, 1173335, 1160211, 169803, 632107, 1630133, 595372, -1818095, -2892280, -2629555, -3079026, -3925437, -3115345, -1201210, -822482, -2260892, -3477522, -4120381, -5438844, -6490554, -4654462, -240755, 3193904]
4739C193904M46814j184324j309982j425098j014621P43992K072543J019430j085592
4730A457066j667071o82378J59318J82014l79168j421339k196826j569012k50076
4721f367472j57232o57354R48551L981564L899911n08598m030572k320846J844513
4712c367535L295784J714489J04933o19434j097792l92825J957128L002741K19285
4703D816774l433837l055496P36031K679750P76632j399603p94525R94171J158571
4694B478468j3065l71907M76352R17192N2829r93122q77851j27611k18777p90399
4684E32109K53842K884422L553576J45218l697750k926794J406825L483824J315282
4675F950554r19773L0500J994346J866349K33857r26106j556321k095877j844318
$$ y = [3193904, 3640718, 2456394, 1146412, -278686, -1293307, -549315, 1523228, 2542658, 1457066, -210005, -892383, -733065, -551051, -930219, -2351558, -4548384, -6117396, -6367472, -6524704, -7182058, -6233507, -2251943, 1647968, 1139370, -2891202, -5212048, -3367535, -71751, 1642738, 1747671, 1128237, 30445, -362380, 1594748, 4597489, 4816774, 1382937, -1672559, -936528, 1743222, 2519854, 1120251, 325726, 1319897, 2478468, 2465403, 2093496, 2569848, 3487040, 3539869, 2546747, 1668896, 1541285, 1322508, 532109, 785951, 3670373, 7223949, 7369167, 3671417, 744623, 2151448, 5635272, 6950554, 6030781, 6061281, 8055627, 9921976, 10155833, 9229727, 7673406, 5577529, 3733211]
4666C733211q38520m57725o08896M15095K032293J375412j304332j929427O16922
4657C034033K101803J72642j390118N36849K613913Q34133k510524l070575j646126
4648F76030j395524j377083Q80653L220831J888338j254674j174454J878814K884426
4639F227357N11900j292325m36990N52464j46922q55982k78901K83974O342J6205
4629D587122O25405M97735m20631l12718J245227K260966J324988p84381k760095
4620F263618l696574k617814K83276K338782J192578j569203k525960j453423
4612a784720q77425j329223j036189j33114q99581l251404m018132j763074J183730
4603a3909132K610963L113386L712713L786004K772173J539865Q40365L11135
$$ y = [3733211, 2894691, 2436966, 1828070, 2243165, 4275458, 5650870, 4346538, 2417111, 3034033, 5135836, 5308478, 3918360, 4455209, 7069122, 7903255, 5392731, 2322156, 676030, -719494, -2096577, -1215924, 2004907, 3893245, 2638571, 1464117, 3342931, 6227357, 6739257, 5446932, 5009942, 5562406, 5415484, 4559502, 4280601, 4564575, 4570917, 4587122, 5212527, 5710262, 5289631, 4976913, 6222140, 8483106, 9808094, 9023713, 6263618, 2567044, -50770, 232506, 2571288, 3763866, 2194663, -331297, -1784720, -2662145, -3991368, -5027557, -5160671, -6060252, -9311656, -13329788, -15092862, -13909132, -11298169, -8184783, -4472070, -686066, 2086107, 3625972, 4466337, 4777472]
4595D777472k76565n63219o25566o62031L1124J666782K311725L67067k098695
4586D928094j869010J18160r0682k988094m429058j747880K740709N488436N550832
4577G701507L570396K99434k508212k808910j264254p98938k153399k825163j439920
4568b227459P7413O3174l57910L9365L86008M9417L22878J769794K469635J096446
4558C688761m73933J31610K197964L039656J401451j701751m244531m307627j499117
4549a767517J915702K983256J702299P07639J009565P00910j411523l806734m963348
4540b929751n220143m772784k837030j41854R89097O52198J920850N290925O430287
4531f18205K607415k185209k620461K25125J248856l77049n45954K454109N013817
$$ y = [4777472, 4500907, 3937688, 3312122, 2650091, 2681215, 4347997, 6659722, 7026789, 4928094, 3059084, 3177244, 3086562, 98468, -4330590, -6078470, -3337761, 2150675, 7701507, 11271903, 11571337, 9063125, 6254215, 4989961, 4191023, 2037624, -787539, -2227459, -2150046, -2086872, -2444782, -2405417, -2019409, -1969992, -1647114, 122680, 2592315, 3688761, 3214828, 3346438, 5544402, 8584058, 9985509, 8283758, 4039227, -268400, -1767517, 148185, 3131441, 4833740, 5541379, 6550944, 7251854, 5840331, 2033597, -2929751, -8149894, -12922678, -15759708, -15901562, -14912465, -14260267, -12339417, -7048492, -618205, 1989210, -195999, -2816460, -2591335, -1342479, -1719528, -2265482, 188627, 5202444]
4522E202444L816236L85762j942729k666399l316911l911266k951623m87452J256422
4513d615516J019960N83595K204724M840610N044848J848967j547748k208899
4505G170541j402701j919532l229927k403445R70112L980218M376414K515795
4497A0057475m32689l213137l674659p44516K671895K453154p71046k417437j113922
4488B815118k47282j219583p49377K434196L714622l19985n375149n211153p22556
4479d881149K102650J078310p33340j113253q85824m82924P77920J854823Q45817
4470a436970r76381k94152K413915K551060j504669m956579k830062L099746O531480
4461B597388M373426k86862k514438q79975J895426K629536J155927j88397o7337
$$ y = [5202444, 9018680, 9404442, 7461713, 4795314, 1478403, -2432863, -5384486, -5871938, -4615516, -3595556, -3011961, -807237, 4033373, 9078221, 10927188, 9379440, 7170541, 5767840, 3848308, 618381, -1785064, -814952, 3165266, 7541680, 10057475, 9624786, 6411649, 2736990, 1992474, 4664369, 7117523, 6346477, 3929040, 2815118, 2567836, 1348253, 598876, 3033072, 6747694, 6427709, 1052560, -4158593, -4881149, -2778499, -1700189, -2433529, -3546782, -4432606, -4915530, -4137610, -2282787, -1436970, -2413351, -2707503, -293588, 2257472, 752803, -4203776, -7033838, -3934092, 2597388, 6970814, 6683952, 4169514, 3289539, 5184965, 7814501, 8970428, 8782031, 8714694]
4452H714694J79259j053968k923256l238846j469785Q23568K008197J479262o17043
4443C902082l215952m374456l086681p74333M70269O74868J387015K739579L159375
4434H81766K038197O19057k97688j587021l684252m802635k912933J093725L811033
4425d840751L159897P37784m07744L49037Q80400j51196j170578k69202J571368
4416a40985J921585P96509N35733J755755K099453j10456l222168m451207k971021
4407c786802J61667L348725M733602L128676o3749j659157o24074O96445M25532
4398F360865j69058M19455Q20897q83044l521175m249077k479838q1202J315602
4389b466575J157470n82027k575130k131218J436235M616583L655784k09107k420530
$$ y = [8714694, 8893953, 7839985, 4916729, 1677883, 208098, 1031666, 3039863, 4519125, 3902082, 686130, -3688326, -6775007, -7549340, -7079071, -6404203, -5017188, -2277609, 881766, 2919963, 3539020, 3241332, 1654311, -2029941, -6832576, -9745509, -8651784, -4840751, -1680854, -943070, -1350814, -1001777, -121377, -272573, -1443151, -1712353, -140985, 1780600, 2577109, 3112842, 4868597, 6968050, 6857594, 3635426, -815781, -3786802, -3625135, -276410, 4457192, 7585868, 7522119, 5862962, 5238888, 5935333, 6360865, 6191807, 6611262, 7432159, 6549115, 3027940, -1221137, -3700975, -3782177, -2466575, -1309105, -1891132, -4466262, -6597480, -5161245, -544662, 3111122, 2902015, 481485]
4380D81485j393357P1137l29021j331180q40255Q57260K042013K094216J704699
4371C356997J424361J102252N51937J38951L59351P17178l59659l388796n947745
4362b045173m791609k82051L307343K889601J13353j355475k54907J943628L328573
4353B853283K634486k77253l459005m003516j559182R80539J477469R83496Q38228
4344D68545K41342j178021j390361N85829K001414M17509k046999k108113o65277
4335c674132p14723j854446j374670M45038Q13696l05606P6657K740392M651469
4326H03675L257494n54375m089588n025555k354627K314740N058766L769541R77131
4317D157202M4250L55471m13052j346949l8938K254179K144739l2296q65757J47737
$$ y = [481485, -911872, -840735, -1169756, -2500936, -3341191, -2483931, -441918, 1652298, 3356997, 4781358, 5883610, 6435547, 6574498, 6933849, 7651027, 7291368, 3902572, -2045173, -6836782, -7118833, -3811490, -921889, -808536, -2164011, -2418918, -475290, 2853283, 5487769, 5210516, 1751511, -2252005, -3811187, -2830648, -1353179, -369683, 468545, 709887, -468134, -1858495, -1272666, 728748, 1146257, -900742, -3008855, -3674132, -4388855, -6243301, -7617971, -7172933, -6359237, -6664843, -6588186, -3847794, 803675, 4061169, 3506794, -582794, -5608349, -7962976, -5648236, -589470, 3180071, 4157202, 4201452, 4556923, 4143871, 2796922, 2757984, 5012163, 7156902, 7124606, 6258849, 6406586]
4307F406586L47075o25854m35480O90510k00505k960024l763285j534547L05618
4298a769906k0849m227J747723K575969P38860j274961j127477k71892n68048
4289B5192j027677n16081j38618m63043J44419K005575K487587L56658j715781
4280A158231j533353p58659j271955j689659m37668J067646J320793J516481K391790
4271A763647J775130j205208k944128n84636K599309J783182j723003k434290
4263i69997R61839M184948L923770J309074j430209l660560m722453l153202O71864
4254b884926L443761K468393p70310k276216n47384J521758N55731k379844k764202
4245c633239J020849M796906M046339R3688k282539j767724j002946j041887n9676
$$ y = [6406586, 6753661, 6127807, 5692327, 6382837, 6182332, 3222308, -540977, -2075524, -1769906, -1790755, -1794982, -47259, 2528710, 3267570, 1992609, 865132, 593240, 25192, -1002485, -1518566, -1657184, -2120227, -1975808, 29767, 2517354, 2874012, 1158231, -375122, -1133781, -2405736, -4095395, -4533063, -3465417, -2144624, -628143, 1763647, 3538777, 2333569, -610559, -1195195, 1404114, 3187296, 1464293, -969997, -8158, 4176790, 8100560, 9409634, 7979425, 4318865, -403588, -3556790, -2884926, 558835, 3027228, 2256918, -19298, -566682, 955076, 1510807, -869037, -3633239, -2612390, 2184516, 6230855, 6324543, 4042004, 2274280, 1271334, 229447, 169771]
4236A69771K102515K773392R66968j073428k011544k983276l867394k520746N99119
4227e844623J715725j52305r90172J595308M137852L057967M33874Q7023J406101
4218E446750J206971r75183l275447m834236n318179l432111P50224M075298L980697
4209b375216J876106L52799m35543j030004l35179J799787K532992J02685k496009
4200g582j496948K020364L959232K962651J147346M04039O46895P35574n73495
4191I798076l271857m911603l014196R21171K923558K236187J405448O64564k206654
4182D544694n677636m801335K72947L043863O67917j913101j156951n31629k569299
4173h120530l152774O62181M339213L426670P41481J33382l0388j304066o07029
$$ y = [169771, 2272286, 5045678, 6012646, 4939218, 2927674, -55602, -3922996, -6443742, -5844623, -4128898, -4281203, -5271375, -3676067, 461785, 3519752, 3953626, 4040649, 5446750, 6653721, 5678538, 2403091, -2431145, -7749324, -11181435, -10431211, -6355913, -2375216, -499110, -146311, -581854, -1611858, -1947037, -147250, 2385742, 2488427, -7582, -1504530, 515834, 4475066, 7437717, 8585063, 8989102, 9635997, 10371571, 9798076, 6526219, 1614616, -1399580, -478409, 2445149, 4681336, 6086784, 6751348, 4544694, -1132942, -5934277, -5661330, -2617467, -1949550, -3862651, -5019602, -5551231, -8120530, -11273304, -10611123, -6271910, -2845240, -2103759, -1970377, -2000765, -3304831, -3911860]
4164c911860K555944K484478k359221m365229K64322L511607n19708m330053m90503
4155g160223M500047K456559j186274J372940M442072K56377m394348p52255L620765
4146C155660r28304n432249P96312N346421o262279j7754480q174857j057030
4138c0310806l7186925r4784032r4581791r022473Q4635952R9214080M6217918
4131c5818077L416831M043892J3895093N081087n999865j094409P356353L900144
4123e218951l167510j385656L661792K407288j053094O8198J753621p69293k476316
4114f179921R00785L404649p5592l924957k237593Q21551j05879j683040M85696
4105h594301K966877J755319M89219L036767N180843K121076k233463j845084
$$ y = [-3911860, -1355916, 1128562, -1230659, -5595888, -5331566, -1819959, -2339667, -6669720, -7160223, -2660176, -203617, -1389891, -16951, 4425121, 4681498, 287150, -465105, 3155660, 2227356, -3204893, -2408581, 2937840, -3324439, -21078919, -29253776, -30310806, -67497731, -162281763, -256863554, -265886027, -181250075, -82035995, -35818077, -32401246, -28357354, -14462261, -9381174, -15381039, -16475448, -9119095, -5218951, -8386461, -9772117, -6110325, -3703037, -4756131, -4687933, -2934312, -3703605, -6179921, -5279136, -1874487, -1950079, -5875036, -8112629, -7291078, -7396957, -9079997, -8594301, -5627424, -3872105, -3382886, -346119, 4834724, 6955800, 4722337, 2877253]
4097B877253J200957J163976j433551k205218j270852j829878l433800l220795
4089h151908j316674M08606K142723L918164L098646r40559l306985j83519M470751
4080A39245M477122O76831j322731k47783J46653j812437l600856l175895j209262
4071e929113J179635L234636L493671J137411j985376l239822k376269q05233
4063e290460Q02945K011427J559124o63862k282420j516301J31584N23678J66197
4054d558088M13435O43388k3918l75986N73109J055664m60493j823246l59009
4045d915144K192778J888064j203606k931730j151999J496183J441613j576068
4037d759909m626201m474651m43548M495051O150273L677297N59915j2528J073562
$$ y = [2877253, 4078210, 5242186, 3808635, 1603417, 332565, -1497313, -4931113, -8151908, -9468582, -9059976, -6917253, -2999089, 99557, -841002, -4147987, -4331506, 139245, 4616367, 5293198, 3970467, 3722684, 3869337, 2056900, -1543956, -4719851, -5929113, -4749478, -1514842, 1978829, 3116240, 1130864, -2108958, -4485227, -5290460, -4487515, -2476088, -916964, -1580826, -3863246, -5379547, -5247963, -4724285, -4558088, -4144653, -3501265, -3525183, -3901169, -3328060, -2272396, -2732889, -4556135, -4915144, -2722366, -834302, -2037908, -4969638, -6121637, -4625454, -3183841, -4759909, -9386110, -13860761, -14304309, -9809258, -3658985, 18312, 578227, 565699, 1639261]
4028A639261J286200N34099L79370Q24082O82242J30440K46849P31528N22779
4019F976850N7722N30644J360966P57811j342417l006095l003528k008229j036465
4010g12741k54341M48043Q75516P95827K04161n97183r36476l33209O73085J028701
4000A191383N63094j16184q65357j620228j244968R03645K590158J080819j886918
3991E95444j500168K606255M675277J140506l689518l972070p16858Q51198l22337
3982c32271p36908Q93641J862987O45846p76708p51802m01856r68458j674733
3973b240262j569752j161542r82670m40802P68559J645247J321427L80626q9214
3964b368383N9005J40878l21953j002630j004348J63988J733196K363943J827740
$$ y = [1639261, 2925461, 3459560, 3838930, 4663012, 5345254, 5475694, 5722543, 6454071, 6976850, 7034572, 7565216, 8926182, 9683993, 8341576, 5335481, 2331953, 323724, -712741, -967082, -519039, 356477, 1152304, 1356465, 759282, -177194, -510403, 162682, 1191383, 1754477, 1638293, 772936, -847292, -2092260, -1188615, 1401543, 2482362, 595444, -904724, 1701531, 6376808, 7517314, 3827796, -144274, -861132, -9934, -332271, -1069179, -175538, 1687449, 2333295, 1556587, 804785, 402929, -565529, -2240262, -3810014, -4971556, -5954226, -6395028, -5626469, -3981222, -2659795, -2279169, -2368383, -2309378, -2168500, -2490453, -3493083, -4497431, -4333443, -2600247, -236304, 1591436]
3955A591436J090597O17838q544n42348n2577R40330N50391j241968j952656o23326
3945C69173L36193n72009q41547J741174M390753K981143j314236l443433j784722
3936A862489K43198j36832j742630k370192j591682K33305K775573M627233L910348
3927G810810R09149j943244l168405l307996k833690j499529q7075j51765j352077
3918e623822j451297K65491J837532J614570K19148j102074j814854j188646J372693
3909e871259M153300L947996M85480k407726j754041P29329J714560J061508R47866
3900C007013J722473J658973L94531k44794O51856J416826L68372j481218j787084
3891E706948k80688P61792l56345k505944l444844k780396j876559j384827o35155
$$ y = [1591436, 2682033, 3299871, 3291327, 2748979, 2696402, 3636732, 4187123, 2945155, 992499, 369173, 705366, 133357, -708190, 1032984, 5423737, 8404880, 7090644, 3647211, 1862489, 2105687, 1968855, 226225, -2143967, -3735649, -3502344, -726771, 3900462, 7810810, 8719959, 6776715, 3608310, 300314, -2533376, -4032905, -4119980, -4271745, -5623822, -7075119, -6809628, -4972096, -3357526, -3138378, -4240452, -6055306, -7243952, -5871259, -1717959, 2230037, 2715517, 307791, -1446250, -716921, 997639, 2059147, 3007013, 4729486, 6388459, 6782990, 6538196, 7190052, 8606878, 8975250, 7494032, 5706948, 5426260, 6188052, 5831707, 3325763, -119081, -2899477, -4776036, -6160863, -6796018]
3882f796018N45397J352092J741883K589423L367898K029940j420561l643099
3874b33045k343982J53735K96101j514126k106232o12093Q98257J099830N42841
3865c818714m64944j968687k581055p36948K226442L283981K119866J219912J421705
3856G01558Q00380j353876k878887k265052q22313k4889M95828R73898L63638
3847d009715j197428j434548O53177K742207K544942J187750J106572K207856
3839C800813K331200N74360j621850k213956m43455K363377L591872K033396l52208
3830A0063549j055683q97502k520167n200546n032548j262529J667839N27530
3822c710057k003657j874246M46160K058746K762633M016561M781616K779555
$$ y = [-6796018, -6250621, -4898529, -3156646, -567223, 2800675, 4830615, 3410054, -233045, -2577027, -2423292, -2127191, -3641317, -5747549, -6359642, -5461385, -4361555, -3818714, -4283658, -6252345, -8833400, -9570348, -7343906, -4059925, -1940059, -720147, 701558, 1501938, 148062, -2730825, -4995877, -5818190, -5843079, -5347251, -4373353, -4009715, -5207143, -6641691, -5988514, -3246307, -701365, 486385, 1592957, 3800813, 6132013, 6706373, 5084523, 2870567, 2427112, 4790489, 8382361, 10415757, 10063549, 9007866, 8110364, 5590197, 389651, -4642897, -5905426, -4237587, -3710057, -5713714, -7587960, -7141800, -5083054, -2320421, 1696140, 6477756, 9257311]
3814I257311j005722l075084k392912j208645j063915j199208j000578r83798
3806b672551r98361j69427R66586P86945n29014q62358N75978K193990K857452
3797B149240L366572M117862L628931R82516j987209k789458j572490o32236j088874
3788F174854j616760o74370J163530J908438Q65053l33663K1899J115313N93150
3779I217444j833688l474429k245210K79842R06319r91393k970817k791007o43199
3770d546138J753829K905606K304253N99324p47214p60424k4121J21744o27933
3761I78926j137101j89975K052490L817025L037196l76840l683716l991270j919653
3752a412918q24094j871330k294513k7545K447686J606545j541379k827147j149536
$$ y = [9257311, 8251589, 5176505, 2783593, 1574948, 511033, -688175, -1688753, -2672551, -3670912, -3840339, -2873753, -2086808, -2615822, -3478180, -2902202, -708212, 2149240, 5515812, 9633674, 13262605, 14245121, 12257912, 9468454, 7895964, 7263728, 6174854, 4558094, 3883724, 5047254, 6955692, 7820745, 7487082, 7508981, 8624294, 9217444, 7383756, 3909327, 1664117, 1943959, 2850278, 1858885, -1111932, -3902939, -4546138, -2792309, 113297, 2417550, 3016874, 2269660, 1509236, 1485115, 1606859, 978926, -158175, -348150, 1704340, 5521365, 8558561, 8181721, 4498005, 506735, -1412918, -2237012, -4108342, -6402855, -6430400, -3982714, -2376169, -3917548, -6744695, -7894231]
3743g894231L28849m38133j279590M44757L633932N057014L644343J202906l27713
3734D372134n49336J83794J562804K833257K616158L25453k399073k837805m52695
3725E654691J875832J143374j792527l294788j855348L94369J532638K361549
3717F019790L504757K824402j338843o125234o761389k634104K156971M064548
3709A710898L203090J293656o86385k261751l075178l305786k923575q50121L032707
3700c862445N637351L546824j676349m413437k189267J260935J639674l14620
3692c71334j183841k29788N99425M51769K90551M45882J37010n55588m35709P31144
3682a20479J585590J146393J28606l16614k04172k94931o43224m58794N51933
$$ y = [-7894231, -7565382, -8003515, -9283105, -8838348, -5204416, -147402, 3496941, 4699847, 4372134, 3822798, 4006592, 5569396, 8402653, 11018811, 11344264, 8945191, 6107386, 5654691, 7530523, 8673897, 6881370, 3586582, 1731234, 2125603, 3658241, 6019790, 9524547, 12348949, 11010106, 4884872, -1876517, -4510621, -2353650, 1710898, 4913988, 6207644, 5521259, 3259508, 184330, -3121456, -6045031, -6895152, -3862445, 1774906, 5321730, 3645381, -768056, -2957323, -1696388, -56714, -371334, -1555175, -1784963, -1185538, -733769, -443218, 2664, 139674, -415914, -851623, -120479, 1465111, 2611504, 2740110, 2423496, 2219324, 1924393, 1281169, 822375, 1374308]
3673A374308J440458J136692q3140j031109j297292j360541j016368N41998K395505
3664B100511J829562j654263m241253k426500J626390K650959m15783l306231
3656c836608k756379k89132J228868J306473O09776q03740k154579j649258M69712
3647g874867J232474n69937j962615m45143J669587R45862j365029j214980J786145
3638g798503L897593K923861O51504o68357j031580j223699j322279j382612j519374
3629g473446r60700R36948K689332K043325n14474k070510j364230O968P53723
3620e953064J357863J743065O72989j302044j482980O29252J719538k88384k545130
3611e448895j703276N64021L55364j905043k151197O76803L158321L079424K405618
$$ y = [1374308, 2814766, 3951458, 3868318, 2837209, 1539917, 179376, -836992, -294994, 2100511, 3930073, 2275810, -1965443, -4391943, -2765553, -114594, -530377, -3836608, -6592987, -6882119, -5653251, -4346778, -3737002, -4540742, -6695321, -8344579, -7874867, -6642393, -7212330, -9174945, -9620088, -7950501, -7004639, -8369668, -9584648, -7798503, -3900910, -977049, -325545, -993902, -2025482, -3249181, -4571460, -5954072, -7473446, -8434146, -7497198, -4807866, -2764541, -3279015, -5349525, -6713755, -6706787, -5953064, -4595201, -2852136, -2179147, -3481191, -4964171, -4334919, -2615381, -2903765, -5448895, -7152171, -6588150, -6232786, -8137829, -10289026, -9612223, -6453902, -3374478, -968860]
3602i68860L094653L572373J696556j436316l192906l048613k150956p97009J154242
3593b076836K530156K145555J170539J622576K883650K392793j53702k025538
3585H489193j498375j76146k17741j361239j993233j460023j10457J360177J571787
3576D603943o03371l480464l230394Q88222M214836K418524k263144l966626j211327
3567b629801J970614K530283J732628J306511N05604j162873j865200n63933O26888
3558B450721j58749j241706l83087J106461O01106j111612j066929P89036J630926
3549B616167P50405N85741K000101K288571l31004l307456l303691j052418L5397
3540B81813j085937k133703j254041O33661J681580J557499J203105J159060J014276
$$ y = [-968860, 2125793, 5698166, 7394722, 5958406, 2765500, -283113, -2434069, -3231078, -2076836, 453320, 2598875, 3769414, 5391990, 8275640, 10668433, 10514731, 8489193, 6990818, 6814672, 6596931, 5235692, 3242459, 1782436, 1671979, 3032156, 4603943, 4000572, 520108, -2710286, -1822064, 2392772, 4811296, 2548152, -1418474, -2629801, -659187, 1871096, 3603724, 4910235, 5415839, 4252966, 2387766, 1823833, 2450721, 2291972, 1050266, 667179, 1773640, 2374746, 1263134, 196205, 985241, 2616167, 3366572, 3952313, 5952414, 8240985, 7909981, 4602525, 1298834, 246416, 281813, -804124, -2937827, -4191868, -3558207, -1876627, -319128, 883977, 2043037, 3057313]
3531C057313J97433j202828k353143k277956p03390J591313L330716L650854K485549
3522G775861L99256j605236k360632j337546N40297J449066O53844l69811L17892
3513E462991K264633K735993L68817k447598k287488Q30083L464112L160192Q54236
3504A4405971j477059l237447m092420k793428N67868K791402J039318k654927
3496D549278l532329p72197J408955K80027j304117L16664L569539L992076J211259
3487I719155n20919R84414K496341M95415l240072m053225j014558J915669J225753
3478H007973k209830n122931n624188l888304q89586J876026K586967R35203p42446
3469e071116L2325K445116L264807J255550j199685j513840j62162O07870l3639
$$ y = [3057313, 3254746, 2051918, -301225, -2579181, -3282571, -1691258, 1639458, 5290312, 7775861, 8175117, 6569881, 4209249, 2871703, 3412000, 4861066, 5514910, 5145099, 5462991, 7727624, 10463617, 10832434, 8384836, 6097348, 6927431, 10391543, 13551735, 14405971, 12928912, 9691465, 5599045, 2805617, 3373485, 6164887, 7204205, 4549278, 1016949, 244752, 1653707, 1933734, 629617, 946281, 4515820, 8507896, 9719155, 9198236, 10182650, 12678991, 13174406, 9934334, 5881109, 4866551, 6782220, 8007973, 5798143, 675212, -4948976, -8837280, -9726866, -7850840, -5263873, -4328670, -5071116, -5038791, -2593675, 671132, 1926682, 726997, -786843, -949005, -341135, -374774]
3460c74774j059794j519429j402173q26795L75551K074006L515364L794931K542106
3451G118993L88278j225217j283780l40622K63558K41261L09535L66672n58758
3442E279920k125786k499924j335547p52460j771515k046051M97863L768239M313622
3433C328361K505770J319206R40478j086285m304931m664421r28688K422534J313894
3424H45918k185276l362371j592291k6717j81244o07945m07937n05124j085932
3415i108919q31293L86269O04627j033992k201393l76649L239534M864441L013152
3406a444223M37799N09351K873639M029824J933591j451463k813898j546774R8217
3397B626063K53537p59034j780639k273016j930316l67363J851755K989463K019153
$$ y = [-374774, -1434568, -2953997, -4356170, -5182965, -4807414, -2733408, 781956, 4576887, 7118993, 7507271, 6282054, 4998274, 4657652, 4921210, 5162471, 5472006, 5838678, 5279920, 3154134, 654210, -681337, -1433797, -3205312, -5251363, -4753500, -985261, 3328361, 5834131, 7153337, 8093815, 7007530, 2702599, -1961822, -2890510, -467976, 845918, -1339358, -4701729, -6294020, -6320737, -6501981, -7109926, -7517863, -8022987, -9108919, -9940212, -9553943, -8949316, -9983308, -12184701, -12561350, -9321816, -4457375, -1444223, -1006424, -497073, 2376566, 6406390, 8339981, 6888518, 4074620, 2527846, 2626063, 2879600, 2120566, 339927, -1933089, -3863405, -4230768, -2379013, 610450, 2629603]
3388B629603K6317j155593j062019n38530k43153j68258k24780l85826l84029
3379a506268J24240J106955K024827J984321L20128k315676l896038l220026j734510
3370g112047j521053j953077q14322J395429J676871r8844P00L536846N967163
3361A077666L058102k112470l372613o16831P86932j030787k039971K58892K680380
3352a310700K004028J52344N50248K758101M043645L695854K570830N06907k521057
3343A2450200m327697k910969J25113J495000O69665m24336j133297k259389l115349
3334E68941k009714J02048J1290k653540l968225j237090K544920K355100j979342
3325f265612n166596k808309L355533P326034N379518J8862k907158p57451L191621
$$ y = [2629603, 2655920, 1500327, 438308, -100222, -343375, -511633, -736413, -1122239, -1506268, -1382028, -275073, 1749754, 3734075, 4054203, 1738527, -2157511, -5377537, -7112047, -8633100, -10586177, -11400499, -10005070, -8328199, -8427043, -8426343, -4889497, 1077666, 4135768, 2023298, -1349315, -1966146, -1179214, -2210001, -4249972, -3991080, -1310700, 693328, 845672, 1395920, 4154021, 8197666, 11893520, 14464350, 14971257, 12450200, 8122503, 5211534, 5336647, 6831647, 7501312, 7076976, 5943679, 3684290, 568941, -1440773, -1338725, -1327435, -3980975, -7949200, -9186290, -6641370, -4286270, -6265612, -11432208, -14240517, -10884984, -3558950, 1820568, 1839430, -1067728, -1825179, 1366442]
3316A366442M092282J349451j456783j718127n68952k42670r20966j372339j076653
3307e48315k85163Q75222J925279J598646n49724k711732k615041m71651J377887
3298a404592J633217J216435J121867Q66433j16112j044034j022076o70281j045319
3289d64462j590170q41587J005093K036031J469422Q01452J226152J551376J82886
3280E376193k040356k921318k136774j299579j055503m52216N00411J59587j731736
3271e601291k602763m72126K796863L772221J985367R5237J38813J665083L268997
3262E046401L916149K732239n08671m226400n963109n010546k941982j352248
3254h308167l81134L99338J137148K041856L149260L503888K093548j95292j295076
$$ y = [1366442, 5458724, 6808175, 5351392, 3633265, 3064313, 2821643, 1900677, 528338, -548315, -833478, 41744, 1967023, 3565669, 3015945, 304213, -2310828, -2782479, -1404592, 228625, 1445060, 2566927, 3433360, 3317248, 2273214, 1251138, 580857, -464462, -2054632, -2896219, -1891126, 144905, 1614327, 2415779, 3641931, 5193307, 5376193, 3335837, 414519, -1722255, -3021834, -4077337, -4529553, -4029142, -3869555, -5601291, -8204054, -8676180, -5879317, -2107096, -121729, -26492, 112321, 1777404, 5046401, 8962550, 11694789, 11186118, 6959718, 996609, -4013937, -6955919, -8308167, -8689301, -8289963, -7152815, -5110959, -1961699, 1542189, 3635737, 3440445, 2145369]
3245B145369q98884o52949r96267l80748J261829J126794k183281n322603m134614
3236a0035354M90588L852199L820628K701453K659022K594507Q19108j678284
3228E223867k537647j314974J83076L17169p74784j783598j739003r10793l71794
3219c708481n97381q58034n15637l41082j374780k765978k373186J12999K246416
3210a0175144J986307N03558M06231J932995K725345J507113K14009J244745L559136
3201C904295L406954o81021n267839n778449k043897J732272K354247Q65757j79005
3192a686686m21634r63635j509869o57148J376981K463526J316928r28189k237882
3183c247608j676806L17019K617698M045955M010795K741569O87432j774807l603111
$$ y = [2145369, 1246485, 593536, -402731, -783479, 478350, 1605144, -578137, -5900740, -10035354, -9544766, -5692567, -1871939, 829514, 3488536, 6083043, 6902151, 5223867, 2686220, 1371246, 1554322, 1871491, 1096707, -686891, -2425894, -3336687, -3708481, -4305862, -5163896, -5679533, -6020615, -7395395, -10161373, -12534559, -12421560, -10175144, -8188837, -7685279, -7279048, -5346053, -2620708, -1113595, -899586, 345159, 3904295, 7311249, 6630228, 1362389, -4416060, -6459957, -4727685, -2373438, -1507681, -1686686, -2108320, -3071955, -4581824, -5238972, -3861991, -1398465, -81537, -1009726, -3247608, -4924414, -4607395, -1989697, 2056258, 6067053, 8808622, 9496054, 7721247, 4118136]
3174D118136l204325n38680J812764J332362j254379l114789k998570j877981
3166e725462m82366J359210K893279K480351J38450j965416k305648j599316j073965
3157f280883q09702l41838O05852K261931M137476M425763K178253k68959O6063
3148E973956J793839M38320m500933p825514n798699j198965J319600J361539
3140h436857J113249P53567n43191j404145j63688J679542J759585J079965K018380
3131b143593L525900K680520Q0598r15448P3075J77977j141508j076460J134347
3122B395408K415386R58788j031000j443647j239112j354103l86730K229921M096970
3113F641881L465842J944443J046260p50651m399154o810717m865320o03230J668272
$$ y = [4118136, 913811, 375131, 2187895, 3520257, 2265878, -848911, -3847481, -5725462, -6207828, -4848618, -1955339, 525012, 663462, -1301954, -3607602, -5206918, -6280883, -7090585, -7432423, -6826571, -4564640, -427164, 3998599, 6176852, 5907893, 5973956, 7767795, 8206115, 3705182, -4120332, -9919031, -11117996, -9798396, -8436857, -7323608, -6570041, -7113232, -8517377, -8681065, -7001523, -5241938, -4161973, -2143593, 1382307, 4062827, 4143425, 3227977, 3301052, 3479029, 2337521, 1261061, 2395408, 4810794, 5769582, 4738582, 3294935, 2055823, 701720, 314990, 2544911, 6641881, 10107723, 12052166, 13098426, 12347775, 7948621, 1137904, -3727416, -4330646, -2662374]
3104b662374J702427K425169L950764L307041R9698k181933j555486l18411q83545
3095C883350k213931k394303j919008k001456j786503J1335K074448J932689r6188
3086b509567j088170K19793J784103J689725J083722K007988L662258L102179
3078I952031m43393m029047m601351k682581j168530j385275j937027j193474
3070g488647O66859K378070L062008K455885P15296j291302k233002j639121n84456
3061c958410m64383j340050j964642j333406J05611Q57086N6977j311960j381125
3052a0734302K36328J877761K194644J932228K157118J972021J03559k010662
3044b271305j500786J452611L268375J933345m00875j167711j077690j892546
$$ y = [-2662374, -959947, 1465222, 5415986, 8723027, 8822725, 6640792, 5085306, 4766895, 3883350, 1669419, -724884, -2643892, -4645348, -6431851, -6420516, -4346068, -2413379, -2509567, -3597737, -3377944, -1593841, 95884, 1179606, 3187594, 6849852, 9952031, 9508638, 5479591, 878240, -1804341, -2972871, -4358146, -6295173, -7488647, -6821788, -4443718, -1381710, 1074175, 1789471, 498169, -1734833, -3373954, -3958410, -4422793, -5762843, -7727485, -9060891, -8955280, -8098194, -8041217, -9353177, -10734302, -10497974, -8620213, -6425569, -4493341, -2336223, -364202, -260643, -2271305, -3772091, -2319480, 948895, 2882240, 2481365, 1313654, 235964, -1656582]
3036a656582k674307j164343K128759M033039K795467p0724k121276k446142j601876
3027b777985n14441J31053K31380K01768K37961M5477l31152k71510K01490P2629
3017b773330q57325j043902O01872K708325L167856J857107L7985j786961l413171
3008a501544l489310j196084J251330P68738j883378k572005L70243L700828L932174
2999f19008J814399L27930L30868M45018j81189j312508k897218m623994m766644
2990a1482346j841825K555035M796356L629792J609757J338249K148909J853632
2982D607559J86444j386628k264006k904117k851372r89436J905815L151613J595314
2973A051186q53292k081460k104242j335193R31367M114038M853940J226943l204958
$$ y = [-1656582, -4330889, -5495232, -3366473, 666566, 3462033, 3391309, 1270033, -1176109, -2777985, -3292426, -3161373, -2929993, -2728225, -2490264, -2444787, -2775939, -3047449, -2845959, -2773330, -3630655, -4674557, -4072685, -1364360, 1803496, 3660603, 3698588, 1911627, -1501544, -4990854, -6186938, -4935608, -4166870, -6050248, -8622253, -8252010, -4551182, -619008, 1195391, 1523321, 1854189, 2299207, 2118018, 805510, -2091708, -6715702, -11482346, -13324171, -10769136, -5972780, -2342988, -733231, 605018, 2753927, 4607559, 4794003, 3407375, 1143369, -1760748, -4612120, -5601556, -3695741, -544128, 1051186, 197894, -1883566, -3987808, -5323001, -4391634, -277596, 4576344, 5803287, 2598329]
2964B598329l399817J0513J768767k9667j630932j25469K354315K858179J989856
2955F394074J505920R50233m83950j559100j261167r57816j676745j837671m13698
2946F60080M70543p54621j657720K34311K703560K315126K96661J84765J411216
2937E863921M64152k562877l905711k395419p82627n93449l77375M73938O73620
2928c141827L87934J315489K875363K653167J109874J187864K641833J914106
2920A0943803j261327k649083p20836N58934j169468k290124L84942L735308L276135
2911A0808284N6113j969145k254288k731880l154621k019975l27348j48985q12019
2902b553864k34600J265464J927795J862691K042589J529991p64515k963595k476331
$$ y = [2598329, -801488, -790975, 977792, 948125, -682807, -808276, 1546039, 4404218, 6394074, 7899994, 8850227, 8366277, 6807177, 5546010, 4588194, 2911449, 1073778, 660080, 1130623, 376002, -1281718, -1047407, 1656153, 3971279, 4267940, 4452705, 5863921, 6328073, 3765196, -140515, -2535934, -3318561, -3912010, -4289385, -3815447, -3141827, -2753893, -1438404, 1436959, 4090126, 5200000, 6387864, 9029697, 10943803, 9682476, 7033393, 6312557, 6871491, 5702023, 3411899, 3796841, 7532149, 10808284, 10864397, 8895252, 6640964, 3909084, 754463, -1265512, -1592860, -1741845, -2553864, -2788464, -1523000, 404795, 2267486, 4310075, 5840066, 5075551, 2111956, -364375]
2893c64375k33506P71435M9562o63220j031163j872658k372546j242392K41959
2884f716904P1884n38200J018502L694536L827448R34859j781147k689475l126120
2875e304617l272979j313369K227560L777795K145674P22494K100603L985801
2867E068962L096610L28246r05644L24336J801164J526032k91343k062932k347107
2858F538324j036069L40664K50578o92117m31078J459368K893584J895094j225067
2849I993281m546757o050090m522979p21080K319068K019946n37614k042804j483279
2840e572308q43964j171440q93926R61429K596119K063711M9341j473910j746732
2831f031680j126574j2603R63212J015237M25925M33526J298333J930657J832914
$$ y = [-364375, -597881, 173554, 223116, -440104, -1471267, -3343925, -5716471, -6958863, -6716904, -6645020, -7183220, -6164718, -2470182, 1357266, 2292125, 510978, -2178497, -5304617, -8577596, -9890965, -7663405, -3885610, -1739936, -1017442, 1083161, 5068962, 8165572, 8493818, 7588174, 7912510, 9713674, 11239706, 10948363, 8885431, 6538324, 5502255, 5842919, 6093497, 5401380, 4970302, 6429670, 9323254, 11218348, 9993281, 5446524, -603566, -5126545, -5847625, -3528557, -1508611, -2046225, -4089029, -5572308, -6416272, -7587712, -8481638, -7520209, -4924090, -2860379, -2811038, -4284948, -6031680, -7158254, -7170857, -6207645, -5192408, -4766483, -4332957, -3034624, -1103967, 728947]
2822G28947J610956J167440m25311k621827l380902k371165j686654k168745j736909
2813a0884170Q29307L072240K302674j46089r04096M74354J333430J87967j319478
2804e053861j026220P83599J648589j77931l202087l616756K28039M979349N933734
2795D96455L126237R19678J405849J867523n430k252590k355221j414678j582465
2786B05358k114047j331191j86847l74493r04842j79921M33089r49187k447002
2777g849083j055522J762409K111163N64137J438593M839890N384387P70643l850955
2768D115662l322347J33799J027763j156202k414807j041447O26529P92758M93760
2759g44532Q11003J011898N00216J97990P53242J169693N29933k27766L62555
$$ y = [728947, 2339903, 3507343, 3082032, 460205, -2920697, -5291862, -6978516, -9147261, -10884170, -10054863, -6982623, -4679949, -4826038, -5730134, -5255780, -3922350, -3734383, -5053861, -6080081, -5296482, -3647893, -3825824, -7027911, -10644667, -10416628, -5437279, 496455, 3622692, 4542370, 5948219, 7815742, 7810312, 5557722, 3202501, 1787823, 205358, -1908689, -3239880, -3426727, -3801220, -4706062, -4885983, -4452894, -5402081, -7849083, -8904605, -7142196, -5031033, -4466896, -3028303, 1811587, 7195974, 7966617, 4115662, 793315, 927114, 1954877, 798675, -1616132, -2657579, -2031050, -1238292, -744532, 66471, 1078369, 1578585, 1776575, 2529817, 3699510, 4229443, 4001677, 4364232]
2750D364232J994362K951054K398060J094715j33540j437917l023967m107917
2742D099082l634458j702125L94699J364182O76169j394847l555954l655513m89809
2733g898574M148829O450231M415020l8352l371992l950473k563595n21648J381464
2724a949090K441611K052850N19487q43513p88562P80940K676611L308970K088157
2715A0287461O4936j253204j651308k017067k505835k132081n13073J239711J944897
2706C464437J568339N75150o36209j182108j58542J644466K200501J228276P25762
2697I430072J490943J554395k04109j461539l9210K157114J934095k23625j491446
2688A3146690j615166k539360l948295l461648j275693m05380j694136k557998
$$ y = [4364232, 6358594, 9309648, 11707708, 12802423, 12668883, 11230966, 8206999, 4099082, 464624, -1237501, -842802, 521380, 1197549, -197298, -3753252, -7408765, -7898574, -3749745, 2700486, 7115506, 7077154, 3705162, -245311, -2808906, -3330554, -1949090, 492521, 2545371, 3064858, 2221345, 1432783, 2213723, 4890334, 8199304, 10287461, 10352397, 9099193, 7447885, 5430818, 2924983, 792902, 279829, 1519540, 3464437, 5032776, 5607926, 4971717, 3789609, 3631067, 5275533, 7476034, 8704310, 9430072, 10921015, 12475410, 12271301, 10809762, 10770552, 12927666, 14861761, 14638136, 13146690, 11531524, 8992164, 5043869, 1582221, 306528, -98852, -1792988, -4350986]
2680d350986j624097o59927n89983L18662K348864K480378n25676k821895q94551
2671f319211K578532K512950q30463k428225j33430K666578K486530R6464j746141
2662a116416j965171j006783P58892K685661L325833J946830j83911j301244j333030
2653A810661j456549j989906k058452j284683m54803j8278R11990L001261M851423
2644C312664M238206J210763j568158k107194j251777p15348n95059l98676r79646
2635A145775l012666m475409k657842J330284L126049R55702j950220k119302
2627g657629l46542N35347J52055K57011J271560J842599J374319P83575Q09353
2618i78352J239858J709219J876606J082753p97014k444057k416381j119631j16567
$$ y = [-4350986, -5975083, -6635010, -7224993, -6906331, -4557467, -2077089, -2602765, -5424660, -6319211, -3740679, -1227729, -2058192, -4486417, -4619847, -1953269, 533261, 629725, -1116416, -3081587, -4088370, -3329478, -643817, 2682016, 4628846, 4444935, 3143691, 1810661, 354112, -1635794, -3694246, -4978929, -5433732, -5452010, -4540020, -1538759, 3312664, 7550870, 8761633, 7193475, 5086281, 3834504, 3119156, 2524097, 2125421, 1145775, -1866891, -6342300, -9000142, -7669858, -4543809, -3588107, -5538327, -7657629, -8004171, -7468824, -7316769, -7059758, -5788198, -3945599, -2571280, -1787705, -978352, 261506, 1970725, 3847331, 4930084, 4133070, 1689013, -727368, -1846999, -1963566]
2609a963566J84835N83254J015404K65569j881446l759120l780992k173186j69849
2600a1679097J465188K411520K250793R86195l37079m82829N49296J612216J917563
2591a306234J743845J430583N36539j114689k102345o64412K428244L934355K185220
2582G071106m24694p32695O71210P07573j117023k041532p41154N73345k244j063102
2572B900790o70051L18032M5647j070026j329378n96987J59636Q55211J478590
2563B091464O91473k080135m340637l314306k31854J287282N62780J84842J210563
2554c938528J717348P09316j14535K92054M25753o85195j347789j38300J393927
2545a685949J141652k57595o61830M22839J813937K516573J889740o86206m333751
$$ y = [-1963566, -1778731, -1195477, -180073, 85496, -1795950, -5555070, -9336062, -11509248, -11679097, -10213909, -7802389, -5551596, -4565401, -4902480, -5385309, -4836013, -3223797, -1306234, 437611, 1868194, 2404733, 1290044, -812301, -1476713, 951531, 4885886, 7071106, 6646412, 5913717, 6584927, 7292500, 6175477, 4133945, 3392791, 3966136, 3963892, 2900790, 2230739, 2548771, 2594418, 1524392, 195014, -401973, -242337, 612874, 2091464, 2782937, 702802, -3637835, -6952141, -7183995, -5896713, -5333933, -5149091, -3938528, -2221180, -1511864, -1626399, -1334345, -908592, -1593787, -2941576, -3079876, -1685949, -544297, -801892, -1463722, -1040883, 773054, 3289627, 5179367, 4493161, 159410]
2536A59410o028953l662006Q46140L504591L001801J641176J653483K426898J930183
2527E472723l03288k388764k098473N20186K805874K348846o6661j581166j207918
2518C501359p79596j489388j812337k98470J610154J581990k40848j895032k356857
2509b179025j690516J73260K521125L048110O31697k145485k090458m8550P19548
2500a060294q1771J13466J567413J573894m08505j412719k30999L00940j456868
2491a095443k549360m05513K373563K078744o7742k54011J536252K038615M68825
2482D123930p51139n97963m48981m53242Q02368K450516J474597k023903l722966
2473H53217j246104K063967K014881o83181k312685j518822J75022J596002K659916
$$ y = [159410, -5869543, -9531549, -8685409, -5180818, -2179017, -537841, 1115642, 3542540, 5472723, 5169435, 2780671, 682198, 1202384, 4008258, 6357104, 6290443, 4709277, 3501359, 2721763, 1232375, -579962, -878432, 731722, 2313712, 2072864, 177832, -2179025, -3869541, -3696281, -1175156, 1872954, 2504651, 359166, -1731292, -1779842, -1060294, -1142065, -1028599, 538814, 2112708, 1704203, 291484, 60485, 361425, -1095443, -3644803, -4050316, -1676753, 401991, 334249, 80238, 1616490, 3655105, 4123930, 3372791, 2774828, 2325847, 1872605, 2674973, 5125489, 6600086, 4576183, 853217, -392887, 1671080, 3685961, 3002780, 690095, -828727, -653705, 942297, 3602213]
2464C602213K768356J224650r52734j724234n49807J140352J668277K62045k691286
2455D747832n326496n217419k049481J507679K898707K474150J780108P78286
2447A593366r67160j898266l63185J890737J497364j319440k706087r35632J120505
2438b087798O31727j041535r30873R91013K315399K011854J327744J240752J006357
2429E464640m08416k624231m106823l732375j874050R119Q11284N93003p5605
2420e943454q89762j454769j080181Q0881N82169k79524q88637M35746K434102
2411g003429K495872Q05582J53788J492418K558492J591553l60120j824726k829083
2402b919653l159962j581996J359872K489197L77503j767033m47474K767157L510905
$$ y = [3602213, 6370569, 7595219, 6642485, 4918251, 4368444, 5508796, 7177073, 7439118, 4747832, -578664, -5796083, -7845564, -6337885, -3439178, -965028, 815080, 1593366, 626206, -1272060, -1635245, 255492, 1752856, 433416, -2272671, -3208303, -2087798, -1456071, -2497606, -3428479, -2437466, -122067, 1889787, 3217531, 4458283, 5464640, 5056224, 2431993, -1674830, -5407205, -7281255, -7272136, -6460852, -5867849, -5943454, -6833216, -8287985, -9368166, -9287285, -8705116, -8984640, -9873277, -9437531, -7003429, -4507557, -3701975, -3548187, -2055769, 502723, 2094276, 1734156, -90570, -2919653, -6079615, -7661611, -6301739, -3812542, -3435039, -5202072, -5649546, -2882389, 628516]
2393F28516J068799r54798k15823J391337J107893p90191j810431p10509J036660
2384G51453J059394j051382l048750k681938n77727Q63568J087646J611706K461424
2375D75394J543700j142277k095063M42382K987799J902936p90148q18217J293372
2366C799878J498930o50681j520430K4085Q24295p86843k247520j522799l14566
2357h95651l95668n66649K73408M55061j248989k660853j488484P66977J243856
2348d516992J22856m62540l05959p20463j358763o55108J048254J763927J192225
2339c892563J166309K463579L412215K319064l02300k477973k656832p00081J927609
2330A259027K919446J177564j787048l397691k893071j729753j216770r13193
$$ y = [628516, 1697315, 742517, 526694, 1918031, 3025924, 2235733, 425302, -285207, 751453, 1810847, 759465, -2289285, -4971223, -5548950, -4685382, -3597736, -1986030, 475394, 2019094, 876817, -1218246, -775864, 2211935, 4114871, 3324723, 2506506, 3799878, 5298808, 4648127, 3127697, 3151782, 3976077, 3189234, 941714, -581085, -895651, -1291319, -1857968, -1584560, -1129499, -2378488, -5039341, -6527825, -5760848, -4516992, -4394136, -4856676, -5162635, -5883098, -7241861, -7896969, -6848715, -5084788, -3892563, -2726254, -262675, 3149540, 5468604, 5166304, 2688331, 31499, -668582, 1259027, 4178473, 5356037, 3568989, 171298, -2721773, -4451526, -5668296, -6581489]
2322f581489K52282K078392K978001J789003n09801j408161J91823K075908J125551
2313A991509k302294m234422k191141J388681K469788P15948p90869l57950M31835
2304b878915p2513q92790k09975J638810K606195J908450J059949J552598K484750
2295G196559J523835j850732n104732n312096k444780Q69862K418693K088548
2287f14843P70839q67321k156127k299839j189824M27266J860787K685686K155100
2278G71724q1115k480736k671973o43690R87618P48856K57980J060384J709998
2269c40954J62113k576757l717786k572540o80776J147119L182142M490639L274039
2260B367239J24931j562617L04572L658656M725670K216569j933670n054532n848328
$$ y = [-6581489, -6329207, -4250815, -1272814, 516189, 6388, -1401773, -1209950, 865958, 1991509, -310785, -4545207, -6736348, -5347667, -2877879, -2161931, -2952800, -3310750, -2878915, -2951428, -3844218, -4054193, -2415383, 190812, 2099262, 3159211, 4711809, 7196559, 8720394, 6869662, 1764930, -3547166, -5991946, -5122084, -2703391, -614843, 155996, -711325, -2867452, -5167291, -6357115, -5929849, -4069062, -1383376, 771724, 690609, -1790127, -4462100, -5105790, -4118172, -3369316, -3111336, -2050952, -340954, -178841, -2755598, -6473384, -9045924, -9726700, -8579581, -5397439, -906800, 2367239, 2492170, 929553, 1234125, 4892781, 9618451, 11835020, 9901350, 4846818, -1001510]
2251a001510m517808j913629J111764L745956N001123M110355J563425p87699
2243G311977j426323p40302k29619m58782o52893k04453L40460N9388j089643
2234B909810k040314j600764J63306J571087R54103j215636k652029k039262m73204
$$ y = [-1001510, -5519318, -7432947, -6321183, -2575227, 2425896, 6536251, 8099676, 7311977, 5885654, 5145352, 4915733, 4456951, 3804058, 3599605, 3940065, 3999453, 2909810, 869496, -731268, -567962, 1003125, 1957228, 741592, -1910437, -3949699, -4422903]
$$ [...]
##END NTUPLES=NMR SPECTRUM
##END=
