##TITLE=31Pdec_DE-95_0il2_TFA
CDCl3, 24 sc
 5.8.2025
##JCAMPDX= 6.0         $$ Bruker NMR JCAMP-DX V2.0
##DATA TYPE= NMR SPECTRUM
##DATA CLASS= NTUPLES
##ORIGIN= UXNMR, Bruker Analytische Messtechnik GmbH
##OWNER= root
$$ XWIN-NMR		Version 3.5
$$ Tue Aug  5 14:41:03 2025 Russian Standard Time (UT+4h)  she@DPX200
##.OBSERVE FREQUENCY= 81.013821
##.OBSERVE NUCLEUS= ^31P
##.ACQUISITION MODE= SIMULTANEOUS
##.ACQUISITION SCHEME= undefined
##.AVERAGES= 64
##.DIGITISER RES= 17
##SPECTROMETER/DATA SYSTEM= spect
##.PULSE SEQUENCE= zgpg30
##.SOLVENT NAME= CDCl3
##.SHIFT REFERENCE= (INTERNAL, CDCl3, 0, 198.062)
##AUDIT TRAIL= $$ (NUMBER, WHEN, WHO, WHERE, WHAT)
$$ ##TITLE= Audit trail, XWIN-NMR		Version 3.5
$$ ##JCAMPDX= 5.01
$$ ##ORIGIN= Bruker BioSpin GmbH
$$ ##OWNER= she
$$ F:/spectra/data/she/nmr/P31/2/pdata/1/auditp.txt
$$ ##AUDIT TRAIL=  $$ (NUMBER, WHEN, WHO, WHERE, WHAT)
(   1,<2025-08-05 14:38:04.14 +0400>,<she>,<DPX200>,
      <created by zg, POWCHK disabled, PULCHK disabled
       configuration hash MD5:
       00 E9 B6 7A A2 85 ED C7 34 08 36 98 17 FE 4E 26
       data hash MD5: 32K
       E8 86 C8 15 30 92 42 D1 3B 01 43 8A F7 29 7F 01>)
(   2,<2025-08-05 14:38:06.31 +0400>,<she>,<DPX200>,
      <Start of raw data processing
       efp BC_mod = 2 LB = 1.5 FT_mod = 6 PKNL = 1 PHC0 = 1451.45 PHC1 = -44.50122 SI = 64K 
       data hash MD5: 64K
       8A C5 2C D3 C5 9F 54 1D 32 97 21 28 C2 95 F0 F8>)
(   3,<2025-08-05 14:39:10.56 +0400>,<she>,<DPX200>,
      <pk PHC0 = 1.343216 PHC1 = 0 
       data hash MD5: 64K
       FD D2 83 5E F3 2A 36 05 7D 74 51 AB EC 30 14 32>)
(   4,<2025-08-05 14:39:17.42 +0400>,<she>,<DPX200>,
      <abs ABSG = 5 
       data hash MD5: 64K
       17 91 99 DF 05 5F 77 D1 F5 55 AC 56 DD 74 0D EA>)
(   5,<2025-08-05 14:40:28.23 +0400>,<she>,<DPX200>,
      <abs ABSG = 5 
       data hash MD5: 64K
       8E 45 A5 06 0A E9 0D F5 05 E9 21 95 F4 93 A3 DB>)
$$ ##END=
$$ 
$$ hash MD5
$$ FA 35 4B 68 5D 53 77 D9 F9 DF 70 FE 63 FC DE 3F
##$RELAX= 
##$RELAX= 
##$RELAX= 
##$RELAX= 
##$RELAX= 
##$RELAX= 
##$RELAX= 
##$RELAX= 
$$ Bruker specific parameters
$$ --------------------------
##$DU= <F:/spectra>
##$EXPNO= 2
##$NAME= <P31>
##$PROCNO= 1
##$TYPE= <nmr>
##$USER= <she>
##$AMP= (0..31)
100 100 100 100 100 100 100 100 100 100 100 100 100 100 100 100 100 100 
100 100 100 100 100 100 100 100 100 100 100 100 100 100 
##$AQSEQ= 0
##$AQ_mod= 1
##$AUNM= <au_zg>
##$AUTOPOS= <>
##$BF1= 81.014009
##$BF2= 200.13
##$BF3= 200.13
##$BF4= 200.13
##$BF5= 200.13
##$BF6= 200.13
##$BF7= 200.13
##$BF8= 200.13
##$BYTORDA= 1
##$CFDGTYP= 0
##$CFRGTYP= 5
##$CHEMSTR= <none>
##$CNST= (0..31)
1 1 145 1 1 1 1 1 1 1 1 1 1 1 1 1 1 1 1 1 1 1 1 1 1 1 1 1 1 1 1 1 
##$CPDPRG= <waltz16>
##$CPDPRG1= <>
##$CPDPRG2= <waltz16>
##$CPDPRG3= <>
##$CPDPRG4= <mlev>
##$CPDPRG5= <mlev>
##$CPDPRG6= <mlev>
##$CPDPRG7= <mlev>
##$CPDPRG8= <mlev>
##$CPDPRGB= <>
##$CPDPRGT= <>
##$D= (0..31)
0 1 0 0 0 0 0 0 0 0.06 0 0.03 2e-05 3e-06 0 0 0.0002 0 0 0 0 0 0 0 0 0 
0 0 0 0 0 0 
$$ [...]
##$SUBNAM3= <"">
##$SUBNAM4= <"">
##$SUBNAM5= <"">
##$SUBNAM6= <"">
##$SUBNAM7= <"">
##$SUBNAM8= <"">
##$SUBNAM9= <"">
##$SW= 400.765351723535
##$SWIBOX= (0..15)
0 1 3 0 0 0 0 0 0 0 0 0 0 0 0 0 
##$SW_h= 32467.5324675325
##$TD= 32768
##$TD0= 1
##$TE= 0
##$TE2= 300
##$TE3= 300
##$TEG= 300
##$TL= (0..7)
0 120 53 12 22 120 120 120 
##$TP= (0..7)
150 150 150 150 150 150 150 150 
##$TP07= 0
##$TPNAME0= <>
##$TPNAME1= <>
##$TPNAME2= <>
##$TPNAME3= <>
##$TPNAME4= <>
##$TPNAME5= <>
##$TPNAME6= <>
##$TPNAME7= <>
##$TPOAL= (0..7)
0.5 0.5 0.5 0.5 0.5 0.5 0.5 0.5 
##$TPOFFS= (0..7)
0 0 0 0 0 0 0 0 
##$TUNHIN= 0
##$TUNHOUT= 0
##$TUNXOUT= 0
##$USERA1= <user>
##$USERA2= <user>
##$USERA3= <user>
##$USERA4= <user>
##$USERA5= <user>
##$V9= 5
##$VALIST= <valist>
##$VCLIST= <CCCCCCCCCCCCCCC>
##$VD= 0
##$VDLIST= <DDDDDDDDDDDDDDD>
##$VPLIST= <PPPPPPPPPPPPPPP>
##$VTLIST= <TTTTTTTTTTTTTTT>
##$WBST= 1024
##$WBSW= 4
##$XGAIN= (0..3)
0 0 0 0 
##$XL= 0
##$YL= 0
##$YMAX_a= 5273
##$YMIN_a= -13098
##$ZGOPTNS= <>
##$ZL1= 120
##$ZL2= 120
##$ZL3= 120
##$ZL4= 120
##$ABSF1= 198.0616
##$ABSF2= -202.7028
##$ABSG= 5
##$ABSL= 3
##$ALPHA= 0
##$AQORDER= 0
##$ASSFAC= 0
##$ASSFACI= 0
##$ASSFACX= 0
##$ASSWID= 0
##$AUNMP= <proc_1d>
##$AZFE= 0.1
##$AZFW= 0.5
##$BCFW= 0
##$BC_mod= 2
##$BYTORDP= 0
##$COROFFS= 0
##$CY= -3
##$DATMOD= 1
##$DC= 0
##$DFILT= <>
##$DTYPP= 0
##$F1P= 0
##$F2P= 0
##$FCOR= 1
##$FTSIZE= 65536
##$FT_mod= 6
##$GAMMA= 0
##$GB= 0
##$INTBC= 1
##$INTSCL= 9.790993e-09
##$ISEN= 30
##$LB= 1.5
##$LEV0= 0
##$LPBIN= 0
##$MAXI= 10000
##$MC2= 0
##$MEAN= 0
##$ME_mod= 0
##$MI= 50
##$NCOEF= 0
##$NC_proc= -9
##$NLEV= 6
##$NOISF1= 182.463
##$NOISF2= 159.3651
##$NSP= 0
##$NTH_PI= 0
##$NZP= 0
##$OFFSET= 198.0616
##$PC= 4
##$PHC0= 1452.793
##$PHC1= -44.50122
##$PH_mod= 1
##$PKNL= yes
##$PPARMOD= 0
##$PSCAL= 0
##$PSIGN= 0
##$REVERSE= no
##$SF= 81.0140089999434
##$SI= 65536
##$SIGF1= 159.3651
##$SIGF2= -187.1042
##$SINO= 113.3802
##$SIOLD= 16384
##$SREGLST= <1H.CDCl3>
##$SSB= 0
##$STSI= 65536
##$STSR= 0
##$SW_p= 32467.5324675325
##$SYMM= 0
##$S_DEV= 0
##$TDeff= 32768
##$TDoff= 0
##$TI= <>
##$TILT= no
##$TM1= 0
##$TM2= 0
##$TOPLEV= 0
##$USERP1= <user>
##$USERP2= <user>
##$USERP3= <user>
##$USERP4= <user>
##$USERP5= <user>
##$WDW= 1
##$XDIM= 65536
##$YMAX_p= 316041171
##$YMIN_p= -234431951
$$ End of Bruker specific parameters
$$ ---------------------------------
##NTUPLES= NMR SPECTRUM
##VAR_NAME=  FREQUENCY,     SPECTRUM/REAL,   SPECTRUM/IMAG
##SYMBOL=    X,             R,               I
##VAR_TYPE=  INDEPENDENT,   DEPENDENT,       DEPENDENT
##VAR_FORM=  AFFN,          ASDF,            ASDF
##VAR_DIM=   65536,         65536,           65536
##UNITS=     HZ,            ARBITRARY UNITS, ARBITRARY UNITS
##FACTOR=    0.49542278885378, 1,            1
##FIRST=     16045.7642231865, 0,            0
##LAST=      -16421.768244346, 0,            0
##MIN=       -16421.768244346, -234431951,   0
##MAX=       16045.7642231865, 316041171,    0
$$ Real data points
##PAGE= N=1
##DATA TABLE= (X++(R..R)), XYDATA
$$ [...]
##PAGE= N=2
##DATA TABLE= (X++(I..I)), XYDATA
7385e172248J134377M577168K093334m164747q455443p236988j235571N918041
7377a2542077R588536O892189j94925n688348n455780j420297J485024J389718
7369e945960O55329J696927L723018M060565J739946q87914o27569K077577K567508
7360I059427j850466o319162l386990N845399J0870114N063719n054832q661400
7352E565809m718819q63959q43831q55466J739251L788961K511536n6659j477012
7343D789811k279031k127991J638949P723327Q567783j45226j1610305j5474831
7335h917514j0678861m746466k144356q9156M049688P725766P774189N254754
7327a771956K868539O93356k498619n474143n069720m17168N131865O990964L826031
$$ y = [-5172248, -4037871, 539297, 2632631, -1532116, -9987559, -17224547, -18460118, -12542077, -2953541, 3938648, 3743723, -1944625, -7400405, -8820702, -7335678, -5945960, -5290631, -3593704, 129314, 4189879, 5929825, 5041911, 4414342, 6491919, 9059427, 7208961, 889799, -2497191, 3348208, 14218322, 19282041, 14227209, 5565809, 846990, -16969, -860800, -1716266, 22985, 3811946, 6323482, 6266823, 4789811, 2510780, 382789, 2021738, 9745065, 18312848, 18167622, 6557317, -8917514, -19596375, -24342841, -26487197, -26576353, -22526665, -14800899, -7026710, -1771956, 1096583, 1789939, -708680, -6182823, -11252543, -11669711, -6537846, 453118, 4279149]
7318D279149j398990m827493n344008m127748j840991J566813M802074N923226
7310i67968N372840N193519M759743J276754m221154o215629k896004k60542l661425
7301a619866r160877q703941j292713O420090Q864099N840677L6327m356781k436526
7292f409511N850499J2197223Q454213k026434q181205n788867p70812K009865
7284E334971M289138O635517M463006l165888q329211m462768L364345M993382
7276A3122492j490587r066773j1852720r886133n232026Q82386O463506Q274716
7268h785139M575219k649791q290863p474223n79349N270336L470825k698791
7260a7161776k851334O421275J5618562J4204353L764716n380678p018976l366844
$$ y = [4279149, 2880159, -1947334, -7291342, -11419090, -13260081, -11693268, -6891194, -967968, 4404872, 9598391, 14358134, 15634888, 11413734, 5198105, 2302101, 2041559, -1619866, -10780743, -19484684, -20777397, -14357307, -5493208, 347469, 383796, -3972985, -6409511, -559012, 11638211, 20092424, 18065990, 9884785, 4095918, 3325106, 5334971, 9624109, 16259626, 20722632, 17556744, 9227533, 4764765, 8129110, 13122492, 11631905, 2565132, -9287588, -19173721, -24405747, -23523361, -17059855, -8785139, -4209920, -6859711, -15150574, -22624797, -23204146, -17933810, -14462985, -17161776, -20013110, -13591835, 2026727, 16231080, 19995796, 14615118, 7596142, 4229298]
7252D229298O66475K172206O70097j628444r74713L098583N770020K957969k911843
7243A4049648o669093p224624o481806m249859N40790N439027O673357M704651
7235F782091K727177P98864l288487p914716p965298k053390M878906P252123
7227A217270M324705j57584j478221K100797O759843O277083O1820m977184l769719
7218A0358810l17240q91494m234595n011585l399640l289384l414005P58483P219904
7209b220746Q741533M443424J095644J647867J513855j480182k617984M73491
7201A1596902K524476n21079m486506m086724r70137O40096Q93983J572106J255149
7192H418266j364692l472624k534240r93898j834401l144540j889791M46519Q87879
$$ y = [4229298, 4895773, 7067979, 7738076, 6109632, 5134919, 8233502, 14003522, 16961491, 14049648, 7380555, 155931, -6325875, -10575734, -10034944, -4595917, 2077440, 6782091, 9509268, 10308132, 7019645, -895071, -8860369, -10913759, -6034853, 1217270, 5541975, 5384391, 3906170, 6006967, 12766810, 19043893, 19105713, 14128529, 10358810, 10041570, 9150076, 4915481, -96104, -3495744, -6785128, -10199133, -9440650, -2220746, 6520787, 10964211, 12059855, 13707722, 15221577, 13741395, 11123411, 11596902, 14121378, 13600299, 9113793, 5027069, 4056932, 4697028, 5591011, 7163117, 8418266, 7053574, 3580950, 1046710, 52812, -1781589, -4926129, -6815920, -6369401, -5481522]
7183e481522M01922J406751K722041J874281m407j54185J106479J695194J390416
7174D956970L53003k995337q242621j0035971l922415O726255J4094088J4504543
7166A5438515R777425K577875m756061q664706o929743k384971j69176j666850
7158C222308l903170l683366Q1111O047435R904256O987673j515594p946370o946316
7149B247967j626143K160823L506837M345508M227592K500919J705960L090999
7141B2160462K546401k850952q009364o485757q10144J218169j884298m689462
7133A195055l764528j23871M991451R656320R198793K293317l663356j620287
7125A8162894L774350L406841j006057n20068M257711L578920l896545q011570
$$ y = [-5481522, -5079600, -3672849, -950808, 923473, 919066, 764881, 1871360, 3566554, 4956970, 5309973, 2314636, -5927985, -15963956, -19886371, -13160116, 933972, 15438515, 25215940, 27793815, 23037754, 14373048, 7443305, 5058334, 4889158, 3222308, -680862, -4364228, -4283117, 1764318, 11668574, 18656247, 17140653, 9194283, 2247967, 621824, 2782647, 6289484, 10634992, 14862584, 17363503, 19069463, 22160462, 24706863, 21855911, 13846547, 7360790, 6550646, 7768815, 5884517, 1195055, -2569473, -2693344, 2298107, 11954427, 21153220, 23446537, 19783181, 18162894, 21937244, 25344085, 24338028, 23817960, 28075671, 31654591, 27758046, 19746476]
7117A9746476m225409j46342p17767l92312L790800M336715l197161j0154465
7109I040535p718489m54228K593046J694675J353482n57717p354966j3375469
7101a4779131j0643639j589125M960301O569288O421033M144205k010183p234114
7093a4161365n319848M80993K144155J86711J384795N110702M218476o02054k20364
7084f777799P027628J1126916O212271n97799j885157j413411n465329j0668480
7076b441160r261569j770588L742893K813650j489637m386153l859169o3762N258992
7067a1456503Q596054P026834J497603l610062m422193r72075K761379K728706
7059B149743k25530p73262L454159P242779M629417j788054m199248j243500P46007
$$ y = [19746476, 15521067, 15374725, 14656958, 14264646, 18055446, 22392161, 19195000, 9040535, 1322046, 867818, 3460864, 5155539, 6509021, 5951304, -1403662, -14779131, -25422770, -27011895, -22051594, -15482306, -9061273, -4917068, -6927251, -14161365, -19481213, -19000220, -16856065, -16669354, -15284559, -10173857, -5955381, -6557435, -6777799, 249829, 11376745, 17589016, 16991217, 15106060, 13692649, 8227320, -2441160, -11702729, -13473317, -9730424, -6916774, -8406411, -12792564, -16651733, -16715495, -11456503, -2860449, 4166385, 5663988, 2053926, -2368267, -3340342, -578963, 2149743, 1924213, 1150951, 4605110, 11847889, 16477306, 14689252, 10490004, 9246504, 9992511]
7050I992511j255406k576811k09355J106179k875574p744818o729888q48982L529619
7041g612525M209667L946864L707090J498232k551167n376291n459978l785362
7033a1423470m36898N179226J0294351R659024K315427n844417q339498m753660
7025c349915L49322L105400L169016K227481J626611J377560O55638q60596k274209
7016F026308k518390j836407j420560j730323k102557k039762j845258j629880
7008i096829o63902J392061L050169K047473j595618m488271l194757J502677
7000a1046997N219997N189419L067131J682197J144769K7835j492534k245350
6992A546467k414751k516853j374278J593060L280322K79067n109458o827745
$$ y = [9992511, 8737105, 6160294, 5950939, 7057118, 4181544, -3563274, -10293162, -11142144, -7612525, -3402858, 544006, 4251096, 5749328, 3198161, -2178130, -7638108, -11423470, -11860368, -6681142, 3613209, 13272233, 15587660, 9743243, 1403745, -3349915, -3000593, 104807, 3273823, 5501304, 7127915, 8505475, 9161113, 8300517, 6026308, 3507918, 1671511, 250951, -1479372, -3581929, -5621691, -7466949, -9096829, -9760731, -8368670, -5318501, -3271028, -4866646, -9354917, -12549674, -11046997, -5827000, -637581, 2429550, 4111747, 5256516, 5284351, 3791817, 1546467, -868284, -3385137, -4759415, -3166355, 113967, 393034, -4716424, -11544169]
6984a1544169l334565Q07607K387555L260751M728672L818293j155906n824379
6976f856141n011211M27759O046497R890211J1685632R194572J286035o972179
6968A9691175q430195l158933J503699P41318k687473m245069l785384l589799
6960c960661l714086k370469N84244K926179K577598j40956k708169k899747j232299
6951a0938366P1381Q90450L588061P902323Q632564K468098m960722m411687M615182
6942G857284J2365171J1124403L960102j406852k834754l767554o110018p933238
6934A3254544p335915m641383p98708L245277N317030L116543k317010o304471
6926C535907n227959n43932L120767L264138J588878Q57928J234470R59967j99625
$$ y = [-11544169, -14878734, -14071127, -11683572, -8422821, -3694149, 124144, -1031762, -6856141, -11867352, -11439593, -5393096, 4497115, 16182747, 25377319, 26663354, 19691175, 11260980, 8102047, 9605746, 10347064, 7659591, 3414522, -370862, -3960661, -7674747, -10045216, -9460972, -6534793, -3957195, -4098151, -6806320, -9706067, -10938366, -10866985, -9976535, -6388474, 1513849, 10146413, 12614511, 7653789, 3242102, 7857284, 20222455, 31346858, 35306960, 33900108, 31065354, 27297800, 21187782, 13254544, 5918629, 1277246, 478538, 3723815, 9040845, 12157388, 9840378, 3535907, -1692052, -2235984, 884783, 4148921, 5737799, 6595727, 7830197, 8790164, 8590539]
6917H590539m02226Q01176P15210k769904p149048p776741l937616M80911K649479
6908h798220L952858O191748P679063N718433J059337l068426n374740o951595
6900D08458p591772n017305R91861O255065O261558J622701k534756k483245L81458
6891a705977K016699N82821k028801k782090o29683K811797N023761M875593L407420
6882A1571540K328040J826487N11125k244171m929570n807176n305003n040238
6874g088966m954850l261425N86951M511153N920606M103465L91494k766702k981353
6865e539627O5247L560141M250633K290820M29244m57542k129979m930669o382341
6856h844073n000863k205256Q40072M457818O871567M164605l040894p618208
$$ y = [8590539, 8188313, 8989489, 9704699, 6934795, -214253, -7990994, -11928610, -11447699, -8798220, -4845362, 1346386, 9025449, 14743882, 15803219, 12734793, 7360053, 408458, -7183314, -12200619, -11208758, -4953693, 1307865, 2930566, 395810, -2087435, -1705977, 310722, 893543, -1135258, -3917348, -4547031, -1735234, 3288527, 8164120, 11571540, 13899580, 15726067, 16237192, 13993021, 9063451, 3256275, -2048728, -7088966, -12043816, -15305241, -14718290, -10207137, -4286531, -183066, 208428, -2558274, -5539627, -5474380, -1914239, 2336394, 4627214, 5056458, 4598916, 2468937, -2461732, -8844073, -13844936, -16050192, -15210120, -10752302, -3880735, 283870, -2757024, -10375232]
6848a0375232n041575n0021J117328O56584M152449R132195P879496O63482l456088
6839D678618l64080L558563K503505m58286m80095Q78111k3268k174156l088709
6830E030203l779555m913826k681995M945830J1530862R017334o94350p852248
6822A0602255p506814l682976j412380j065333j317765j924496j937816Q7961
6814h157364K500493J489143k590548m043450M23337O265681O714684J614158
6806D216134k872791k622987k90615o98547l703012m240890K98605N433202M966140
6797D85239l21163l392632p66111K963946K436736j188185l724946m509011m582077
6788a2598204j928262N058222J1312912R397495R1755p628229p967997l826669
$$ y = [-10375232, -15416807, -15466828, -14349500, -13692916, -9540467, -408272, 7471224, 8134706, 4678618, 4314538, 7873101, 10376606, 9918320, 9438225, 10316336, 10293068, 8118912, 5030203, 1250648, -3663178, -6345173, -1399343, 10131519, 19148853, 18454503, 10602255, 3095441, -587535, -1999915, -3065248, -4383013, -6307509, -8245325, -8157364, -5656871, -4167728, -6758276, -10801726, -10378389, -4112708, 2601976, 4216134, 1343343, -1279644, -1570259, -2268806, -5971818, -10212708, -9914103, -4480901, 485239, 164076, -3228556, -3994667, -1030721, 1406015, 217830, -3507116, -8016127, -12598204, -14526466, -9468244, 1844668, 11242163, 11333918, 3705689, -4262308, -8088977]
6780h088977J6286K876168N049744M743338J847949K47200K366383M749333K750709
6771A6558133k944704p647128q235642m837101M98181M168253K749698k656942
6763b347252o067536l398857K544324O357772O630422N277251L146709K01886
6755A2344719k008123k179990k200934m445141p310265p274328m443993k108717
6747a9626772j341092o9247K443381M022033L186178J291299K81085N56236J402786
6738g854113J650702K46898j874801j570828K226016N340695L060827k922160
6730a696764o384581m855987j452429J395191M520444P241678N911201J67388
6722D846141m324819l231632K47992O25685j806324k757298j133889O19864J648866
$$ y = [-8088977, -8072691, -5196523, -146779, 4596559, 6444508, 6691708, 9058091, 13807424, 16558133, 13613429, 5966301, -2269341, -7106442, -6608261, -2440008, 309690, -2347252, -8414788, -11813645, -9269321, -2911549, 3718873, 8996124, 12142833, 12344719, 10336596, 8156606, 5955672, 1510531, -5799734, -13074062, -17518055, -19626772, -20967864, -21037111, -18593730, -14571697, -11385519, -10094220, -9813135, -9256899, -7854113, -6203411, -5956513, -7831314, -9402142, -7176126, -1835431, 1225396, -1696764, -8081345, -12937332, -14389761, -12994570, -8474126, -1232448, 4678753, 4846141, 521322, -2710310, -2462318, -1836633, -3642957, -6400255, -7534144, -6914280, -5265414]
6713e265414K899423L115295J03018l855730l325682K177160O293324M221368
6705F362762j201198m411902m209934k715388q29652J164583J287072j172510
6697e726167k440801Q46517N076582M005189r43358j842208L189529O477857L250601
6688A1893741l68655J903905M768071l84018r809257j1228290k493496M881365
6680h36634L077535j812447j709654R42410j1091k597774q56000L733591M286436
6671D216372j28591l629971l131965j037793J339711N155752Q040969M644878
6663A5469362m246651r916083o763647K0338J779808k518348o463238m901780
6655a7540239Q99533N379573L993684k258352o820929m089584L789811R241920
$$ y = [-5265414, -2365991, 749304, 852322, -3003408, -6329090, -4151930, 2141394, 6362762, 5161564, 749662, -3460272, -6175660, -7005312, -5840729, -4553657, -5726167, -8166968, -7320451, -2243869, 1761320, 817962, -1024246, 2165283, 8643140, 11893741, 11525086, 13428991, 18197062, 17813044, 8003787, -3224503, -5717999, -836634, 2240901, 428454, -1281200, -338790, -349881, -2947655, -3803655, -70064, 4216372, 4087781, 457810, -2674155, -3711948, -2372237, 2783515, 10824484, 15469362, 11222711, 1306628, -5457019, -5436681, -3656873, -6175221, -12638459, -17540239, -16640706, -11261133, -7267449, -9525801, -16346730, -20436314, -16646503, -7404583]
6647g404583Q312065L952713L81479j310537j264243M47812J751139K280k955550
6638A912575k341267J274205J398668l866612p471126m039871J504159J834343
6630i794926j687728k644626q411K310490L158077M055382L785275L09371l542846
6621d059942l179312L62838K664370L641333N759688O567123J747362n184309
6613H319151n743782K32062L668104N17595k668722p53576J871154K59820k428880
6604C272926j591045M66550l94995k486615k467174j963882l033727j987908M288409
6595e897461R911731O842885k197062o726368l587440r1899j435636l665171j801827
6586h648248K395675M681079M829926M803544M389095K465291k08473k440126
$$ y = [-7404583, 907482, 4860195, 5241674, 3931137, 2666894, 3114706, 4865845, 4868125, 1912575, -428692, 845513, 2244181, -1622431, -9093557, -13133428, -11629269, -9794926, -11482654, -14127280, -14135691, -11825201, -8667124, -4611742, -826467, -517096, -4059942, -7239254, -6876416, -4212046, -570713, 5188975, 11756098, 13503460, 8319151, 2575369, 2807431, 6475535, 6993130, 4324408, 3570832, 5441986, 5701806, 3272926, 1681881, 2148431, 1753436, -733179, -3200353, -5164235, -8197962, -10185870, -5897461, 4014270, 10857155, 8660093, 1933725, -1653715, -1745614, -3181250, -6846421, -8648248, -6252573, -1571494, 3258432, 8061976, 12451071, 14916362, 14707889, 12267763]
6578A2267763m249808m674200j136408N786591R931078O195793j952168o060513
6570A6108128l380181L88613k02464l199076l404257o22128L35219k853341o498208
6561c327695o067801j970324J817013K813177J343010j566313m550449n045378
6553a6554760j528723L240823M480144J526652j303233p34080J920036M316100
6545d637041O279443P244040M475089k371547p732298n779334J503205N970702
6537D952259K914201m233065q768356p329641j384784N015362P883359N609098
6529D658433J23516m540327n379502k609719M81808J87185l611974o309884l622991
6520b0623455K440110N785623M522793K776388L211184L017053l9151k976586
$$ y = [12267763, 8017955, 3343755, 2207347, 7993938, 17925016, 24120809, 22168641, 16108128, 12727947, 13116560, 12914096, 9715020, 6310763, 5688635, 6023854, 3170513, -3327695, -9395496, -11365820, -9548807, -6735630, -5392620, -6958933, -11509382, -16554760, -18083483, -14842660, -10362516, -8835864, -10139097, -10873177, -8953141, -4637041, 1642402, 8886442, 13361531, 10989984, 3257686, -2521648, -1018443, 4952259, 7866460, 3633395, -5134961, -12464602, -13849386, -8834024, -950665, 4658433, 4781949, 241622, -5137880, -7747599, -7265791, -7078606, -10690580, -17000464, -20623455, -18183345, -12397722, -7874929, -5098541, -1887357, 1129696, 1090545, -1886041]
6512a886041l080157k949828m977665n654853j761124K195975N91315k667071
6504b0189449O36762Q746456J0927710L509466m639776n277121r66744J601738
6496e650958J176212L46904J39024N14281J765078K166740j169637o461106p576415
6487a4749877l073137R08407K30662j029072J535450M810412M075918J418883
6479e872354J552958L428057K916592O30734J51991Q97891m77197l300408l917679
6470c989415k143669n89096J035769M544013P270325M348753k935707p517510
6462B3463n939555j539738K258160N561739P629599N339424j103045o118586n725488
6453C85973k538593p91583j86941J682105L792642K861625j153286m403825m145127
$$ y = [-1886041, -4966198, -7916026, -12893691, -18548544, -20309668, -18113693, -17522378, -20189449, -19552687, -10806231, 121479, 3630945, -1008831, -6285952, -7252696, -5650958, -4474746, -4127842, -3988818, -3474537, -1709459, 457281, -712356, -7173462, -14749877, -17823014, -16914607, -16683945, -17713017, -16177567, -11367155, -7291237, -5872354, -4319396, -891339, 2025253, 2655987, 2807978, 3705869, 3228672, -71736, -3989415, -6133084, -6722180, -5686411, -1142398, 6127927, 10476680, 7540973, 23463, -5916092, -7455830, -5197670, 364069, 7993668, 13333092, 12230047, 6111461, 385973, -2152620, -2944203, -3131144, -1449039, 2343603, 5205228, 4051942, -351883, -4497010]
6444d497010j874928p33577j323859j508534q0793J163735M66257j97064K432875
6435f152898O969451Q049598M174541L30569K20387O66434k195269n746005n433191
6426H83617k614740j318808l86788L482986P141353M367754k649559m510862J378995
6417E773948O886584N808567J859045J74549r20527m125637o079265k819952K491481
6408I048793L871001J177085j306231k089686k736999l143389j827996M73941
6400C466519J803622K064907J530294j388620o629170q975812l184493Q134945
6392c177808J6016306J4414779N279544m460357q332987m655230J432195K144759
6384A8661201l751758q527526n768203L56686J353461k897635m536197J08432
$$ y = [-4497010, -6371938, -7105515, -8429374, -9937908, -10018701, -8854966, -8388709, -8585773, -6152898, 816553, 8866151, 13040692, 13371261, 13591648, 14258082, 12062813, 6316808, 883617, -1731123, -3049931, -3436719, 46267, 7187620, 11555374, 8905815, 4394953, 5773948, 12660532, 18469099, 20328144, 20502693, 19582166, 15456529, 9377264, 6557312, 9048793, 12919794, 14096879, 12790648, 10700962, 7963963, 4820574, 2992578, 3466519, 5270141, 7335048, 8865342, 7476722, 847552, -8128260, -11312753, -3177808, 12838498, 27253277, 32532821, 28072464, 19739477, 15084247, 16516442, 18661201, 14909443, 6381917, 613714, 970400, 2323861, -573774, -5109971, -5001539]
6376e001539N800788O877205M293793J939423P15019p82255k708834l672908k588834
6367D871858O8245J774275l44917n080462o183973J80819Q405697R194152K088493
6358A4974187l857057k981022P1445n99392k527085J21328N996646P643800K063394
6349B0906244n323817p873976m934400p68881Q70755l31649k080013j946202K88165
6340a193774K229236J316719k152922m990399m315615n06063L190303L939169
6332b483346K167981Q41050J656692K607328L67237n018001r151790p748936j480906
6323a8242691M481248N836384L473512J768052K733684L402428L25303m719251
6315i41331o366932k905021J492122K867405K420869L133082M524717M027722
$$ y = [-5001539, 799249, 7676454, 11970247, 13909670, 14624689, 13842434, 11133600, 7460692, 4871858, 4940103, 6714378, 6369461, 1288999, -4894974, -4714155, 3691542, 12885694, 14974187, 11117130, 8136108, 8207553, 7608161, 5081076, 5202404, 11199050, 18842850, 20906244, 15582427, 7708451, 2774051, 2005170, 2875925, 2544276, 464263, -1481939, -1193774, 1035462, 2352181, 199259, -4791140, -9106755, -9612818, -6422515, -2483346, -315365, 525685, 2182377, 4789705, 5156942, 138941, -9012849, -16761785, -18242691, -13761443, -7925059, -4451547, -2683495, 50189, 3452617, 3777920, -941331, -7308263, -10213284, -8721162, -5853757, -3432888, -299806, 4224911, 8252633]
6307H252633J480907j121945k880555l877667l419688j667266j244549l401450
6299g879580m399260m66979N009436M953719r83218n505833m079007k14681J636413
6290a1928990K520678M789270O423593M225162m00998l275262l229819k393762
6282c270128k065570j627575q21416l46177l84229k73960N74929K200885L728897
6273b284344L350152L14658k996494l300711q34433J296943K203635L742654N351304
6264F843364L215245l282300q814883q732427m490409L29679M927994Q529003
6256a474734P463648M47909o541765o583081j132569K325622N85633k502734k801546
6247a0213617o29182J183440L43747l297391o362426l934662L814665R569306
$$ y = [8252633, 9733540, 8611595, 5731040, 1853373, -1566315, -3233581, -4478130, -7879580, -12278840, -12745819, -7736383, -2782664, -3765882, -9271715, -13350722, -13565403, -11928990, -9408312, -4619042, 1804551, 6029713, 5628715, 2353453, -876366, -3270128, -5335698, -6963273, -7784689, -8130866, -8515095, -8789055, -8214126, -6013241, -2284344, 1065808, 1380466, -1616028, -4916739, -5751172, -4454229, -2250594, 1492060, 6843364, 10058609, 6776309, -2038574, -10771001, -15261410, -14931731, -10003737, -1474734, 5988914, 6436823, -104942, -6688023, -7820592, -5494970, -4909337, -7412071, -10213617, -10842799, -9659359, -9315612, -12613003, -18975429, -22910091, -19095426, -9526120]
6239i526120P602885J697973p59026M92469L38176j693456j150400K375895M101947
6230C480343K370943N18040l66015k705241n200503k724041M110616P694136N189632
6221A2367910L132485N693287O849403P33814p675608j0105588p440556o247130
6213b691983p219268n766490j343672K153104L794224N933416Q112370P415172
6205A0386873M048756M48895l698900r101008j1533992o705562P74783K004331
6197a3375824k639085l771304J774856N680158J634465m826089n366622m91482
6189b1380927L983195O261604P848387P949364N205053K044763J434045J668074
6181A5013558k97410k770092k111076M48735O25633j547817k045581j13834N61335
$$ y = [-9526120, -1923235, -225262, -984288, -491819, -153643, -1847099, -2997499, -621604, 3480343, 5851286, 6369326, 6003311, 3298070, -1902433, -4626474, -515858, 7178278, 12367910, 15500395, 21193682, 28043085, 28776899, 21101291, 10995703, 3555147, -2691983, -9911251, -15677741, -17021413, -14868309, -11074085, -5140669, 2971701, 10386873, 14435629, 14884524, 11185624, 2084616, -9449376, -16154938, -15380155, -13375824, -16014909, -19786213, -18011357, -12331199, -10696734, -15522823, -20889445, -21380927, -17397732, -11136128, -3287741, 4661623, 9866676, 11911439, 13345484, 15013558, 14716148, 11946056, 9834980, 10283715, 10909348, 9361531, 7315950, 7202116, 7763451]
6172G763451j422965k519671O7873M034244N328567L233500N04228L9605K118753
6163A9147585L882281K015113k855758n975435m590313j974189k224450l572840
6155C851994j585357K695466L598891m63626m898345o100806n072195k883973
6147a0857951J340772N804190N536340M301m082917j691169L416855M896391K817874
6138G184686J279312P80743r58216l050548k566516l72755o0692j649924j763851
6129a177761K18245J446905R50230L84283o55383m265723q361773p401584j136823
6120a9999384L276468J226593k542256j327675L704436O229846M242203J315870
6112c873899K5034n55659j113531o33961O26640N23322j365012k275577K16962
$$ y = [7763451, 6340486, 3820815, 3888688, 7922932, 13251499, 16484999, 16989227, 17028832, 19147585, 23029866, 25044979, 22189221, 16213786, 11623473, 9649284, 7424834, 3851994, 2266637, 4962103, 8560994, 8097368, 3199023, -2901783, -7973978, -10857951, -9517179, -3712989, 1823351, 1827652, -2255265, -3946434, -529579, 4366812, 7184686, 8463998, 9244741, 8286525, 5235977, 2669461, 2296706, 2236014, 586090, -1177761, -959516, 487389, 1437619, 1821902, 1166519, -3099204, -11460977, -18862561, -19999384, -16722916, -15496323, -18038579, -19366254, -15661818, -9431972, -5189769, -3873899, -3848865, -4404524, -5518055, -6152016, -5525376, -5002054, -6367066, -8642643, -8425681]
6103h425681M929730Q195632P185297K121785l545815n603743l263591k27057
6095A366557K04426k59893J777048M593386K637669m517604r509763o477183P83146
6086i402211M022814J350568j875953j668381K55029J084072R72088P39646l91305
6077d913633k235952k178446O68881K642126N09311k904616k296993K305295N893212
6068b510815N861134L959935R92940m286289r396276p935918O85800O981498K926400
6059b721591o080296p918406m57018O150855M165276k193438m399622p59385L980285
6050a0233340N960149M980868K466474K61451m724J085653Q28677j554056k940888
6041H50264p08845K785242K908869j183911n670043o587644l449581Q89169K601878
$$ y = [-8425681, -3495951, 4699681, 11884978, 14006763, 10460948, 4857205, 1593614, 1366557, 1570983, 1311090, 3088138, 7681524, 10319193, 5801589, -3708174, -10185357, -9402211, -5379397, -4028829, -5904782, -7573163, -7318134, -6234062, -5261974, -4522328, -4913633, -7149585, -9328031, -8659150, -6017024, -5507713, -8412329, -10709322, -8404027, -2510815, 3350319, 7310254, 8303194, 4016905, -5379371, -13315289, -12629489, -5647991, -2721591, -8801887, -16720293, -17177311, -11026456, -6861180, -9054618, -13454240, -14213625, -10233340, -4273191, 707677, 3174151, 3435602, 3430878, 4516531, 5345208, 3791152, 850264, 141419, 2926661, 5835530, 4651619, -1018424, -7606068, -11055649, -10166480, -7564602]
6032g564602K36550l182192k987028J148560M400407L476911J132658J433131
6024a905605L458481L415213Q19839j666348l181710m968921o311789m653169
6016a4994009j80182L520410M147114K929691J732756R54875P55853J350929J552792
6007A770229r5149k337097k307335J52991K521964M011604N889881O828493K947293
5998A9382874n269305j0759865q224549j338987K250189O18714j848444j779857
5990f969230j83479J205406K838742N456013P784398P568038M034455j100407
5982B0633936m727515m927114k992144k041509l132458m167953l423613k139035
5974f917405j982668j895819R1884L165433M519429L304052J340147M9066j119612
$$ y = [-7564602, -7328052, -10510244, -13497272, -12348712, -7948305, -4471394, -3338736, -1905605, 1552876, 4968089, 5787928, 4121580, 939870, -4029051, -10340840, -14994009, -15174191, -11653781, -7506667, -4576976, -2844220, -1889345, -1133492, 217437, 1770229, 1675080, -662017, -2969352, -2816361, -294397, 3717207, 9607088, 16435581, 19382874, 14113569, 3353704, -4870845, -6209832, -3959643, -3340929, -5189373, -6969230, -7152709, -5947303, -3108561, 2347452, 10131850, 17699888, 21734343, 20633936, 15906421, 10979307, 7987163, 5945654, 2813196, -1354757, -4778370, -6917405, -8900073, -10795892, -10704008, -7538575, -3019146, 284906, 1625053, 1674119, 554507]
5965E54507k902449m494905m112779p70495M022839O157531K485894m213208o323851
5956i596916j53712Q404256J0476464M973404j422880l981477m327706m784887
5948d13454m221092j986447q61894k272024k577125J281221N507539M219935j232657
5939b555998l584567k46501L070506R23792m372254o533087l276762K391119O590347
5930g593405P453494N072240J133066j988069l302801l649775l423328j760046
5922h058624J027132K874045L551533N642386R168251Q830169J233552p914256
5914A6354188r893183m944564j381492k668590k967512K111127P627382O838158
5906A1075514J070492l408108m368276l850075k478942O08772M056333N862294
$$ y = [554507, -2347942, -6842847, -10955626, -11726121, -7703282, -1545751, 940143, -3273065, -9596916, -9750628, -1346372, 9130092, 14103496, 12680616, 8699139, 4371433, -413454, -4634546, -6620993, -7482887, -9754911, -12332036, -11050815, -5543276, -1323341, -2555998, -6140565, -6387066, -3316560, -2392768, -6765022, -13298109, -16574871, -14183752, -7593405, -139911, 4932329, 6065395, 4077326, 774525, -2875250, -6298578, -8058624, -7031492, -4157447, -605914, 5036472, 14204723, 23034892, 24268444, 16354188, 6461005, 1516441, 134949, -2533641, -5501153, -3390026, 4237356, 11075514, 12146006, 8737898, 4369622, 519547, -1959395, -1350623, 2705710, 8568004]
5898H568004P137375R202246Q721520J775198q007706j1772414o540184J498636
5890A0582675N630397N296747L015023k3880l110293m951057n460130n398043
5882E581439l562440J598520P169570P735361L295675l05615m54461j097730m441037
5873A5519282o015110k391131K110336J890247j542763l386690l500957m303261
5865a620047m323251p77860L849217M780109K966153L219926N149420L165906
5857A6409573l831342r426770q271978k561534K045169K810757N54629k341482
5849d612978k866714N46775N402790P075082M168198l43341l310790l953071k530877
5840d24926P2198J457058m5239k169582j399781J246317J307138k040979m584622
$$ y = [8568004, 15705379, 24907625, 33629145, 35404343, 27396637, 15624223, 9084039, 10582675, 16213072, 21509819, 24524842, 24500962, 21390669, 16439612, 10979482, 5581439, 2018999, 3617519, 10787089, 18522450, 21818125, 21512510, 21058049, 19960319, 15519282, 9504172, 7113041, 9223377, 11113624, 9570861, 6184171, 2683214, -1620047, -5943298, -6721158, -2871941, 1908168, 4874321, 8094247, 13243667, 16409573, 12578231, 3151461, -5120517, -7682051, -5636882, -2826125, -2271496, -4612978, -7479692, -6932917, -1530127, 5544955, 9713153, 9369812, 6059022, 2105951, -424926, -352728, 1104330, 1059091, -1110491, -2510272, -1263955, 43183, -1997796, -6582418]
5831f582418l504567n62833K170806M821519O334578L855820j797302m815013
5823g9410j985384K414804K931708M14229r25461o78007j585398l696647m087544
5814g277110j843560P25672J859203K048518J757914L59920j853803k763310q71774
5805g858330K179745K850756O1131k355331L27828O401183P611823k38641r458571
5796d78407r060678Q7357O167180L249452j357489j51268K944066R34268l368433
5787a033952k289346L147477N036768K389082K432240P060026Q299611J229033
5779B6270939p265191q585977m821898m007740p217732q142261m040389L34943
5771a7475306R13506L94340K988858O888423O284495l6124n892107m813266K114346
$$ y = [-6582418, -10086985, -10649818, -8479012, -3657493, 2677085, 6532905, 4735603, -79410, -2064794, 350010, 3281718, 3695947, 2770486, 2092479, 507081, -3189566, -7277110, -9120670, -8394998, -6535795, -4487277, -2729363, -2369443, -4223246, -6986556, -7858330, -5678585, -2827829, -2766698, -5122029, -4794201, 1606982, 9218805, 8980164, -478407, -9539085, -9451728, -3284548, -35096, -1392585, -1543853, 1400213, 2334481, -1033952, -3323298, -175821, 4860947, 7250029, 9682269, 16742295, 25041906, 26270939, 19005748, 10419771, 5597873, 1590133, -5627599, -13769860, -17810249, -17475306, -16561800, -16167460, -13178602, -6290179, -5684, -41808, -5933915, -10747181, -8632835]
5762h632835P581652O589542J411485k429833k865559k101975k112237j996996
5754d556756j29840L037240N330571N183106K954750L14083j376583k094881k461480
5745F200210k366695j417023o99111j989654m248053l476042J567751N815642
5737f12975L769777k332258m809790j115740K858168J842896j266672p40385K621510
5728B14531K795846j928346o180674n349237j672834J8095o91651o31923R38172
5719a2488021J246017j054821l405395k948118k5657L200917N311586N415052
5711d748440K896912o45268j737110J47559P47142k589389n516183k742888K739517
5702a1448148L250099j403252l325890M04846K795586p05009l365313J868001
$$ y = [-8632835, -1051183, 5538359, 6949844, 4520011, 1654452, -447523, -2559760, -4556756, -4686596, -1649356, 3681215, 8864321, 11819071, 12133154, 10756571, 8661690, 6200210, 3833515, 2416492, 1717381, -272273, -4520326, -7996368, -6428617, -612975, 3156802, 824544, -3985246, -5100986, -2242818, -399922, -1666594, -2406979, 214531, 3010377, 1082031, -5098643, -10447880, -12120714, -12102619, -12794270, -13426193, -12488021, -11242004, -12296825, -15702220, -18650338, -18675995, -15475078, -10163492, -4748440, -1851528, -2496796, -4233906, -4086347, -3339205, -5928594, -11444777, -14187665, -11448148, -8198049, -9601301, -12927191, -12522345, -9726759, -10431768, -13797081, -11929080]
5694a1929080R062203O813999m062889j0726589o313798J530009K582674k906499
5686a5949970o843500l929397L823810J0038057R394964K883233j835631J122984
5678a295450P368776P393909K16382n083085l039813R15902P67981k91304L133026
5669A0086324P925077O812673j04774n978350p292321o126607l925291m23160
5661I73571J885975k01573l589401j338557O209696R815340L806155n883080r930605
5652A747521p053124l101878k445199m430022o065443m860302o67087L245554
5644b3629980L194330N11083N64536M736798P871878O349170L530263L116489
5636F244567K508261j315251m232398j141078L808875K359841m106124n956157
$$ y = [-11929080, -2866877, 3947122, -115767, -10842356, -17156154, -15626145, -13043471, -15949970, -22793470, -26722867, -22899057, -12861000, -3466036, -582803, -2418434, -1295450, 6073326, 13467235, 13683617, 8600532, 5560719, 6476621, 7244602, 6953298, 10086324, 18011401, 24824074, 24719300, 18740950, 11448629, 5322022, 1396731, 973571, 2859546, 2657973, -931428, -2269985, 3939711, 13755051, 17561206, 11678126, 1747521, -5305603, -8407481, -10852680, -15282702, -21348145, -26208447, -26875534, -23629980, -20435650, -19924567, -19360031, -14623233, -6751355, -402185, 3128078, 6244567, 8752828, 7437577, 3205179, 2064101, 5872976, 8232817, 4126693, -1829464]
5628a829464p09548L502659K306108J990734O711068R015442J782968q006673
5620A4763294p901499J927938R578073Q355362K924450j088188l947630o549318
5612A8062482o740307m116846k128716k361197k038650K91842J922519J443532
5604D334659J716899M289044N779859L286434j036557m086216o017676o937159
5596A329287m274507K140035O761909N124259M02157j690297j078521j163011
5588G551311j836458p31461R41903n588k784091l957240l407322l433060l293331
5579a0955337n69907L044454L431542R46945m23177l09977j895607m633549l916366
5570a5280979J053551N571318O837653O730437O033043K898877j023311l76203
$$ y = [-1829464, -2539012, 963647, 3269755, 5260489, 11971557, 20986999, 22769967, 14763294, 6861795, 8789733, 18367806, 26723168, 29647618, 28559430, 24611800, 18062482, 11322175, 7205329, 5076613, 2715416, 676766, 968608, 2891127, 4334659, 6051558, 10340602, 16120461, 19406895, 18370338, 14284122, 8266446, 1329287, -2945220, -805185, 5956724, 11080983, 11483140, 9792843, 8714322, 7551311, 5714853, 4983392, 5925295, 5919707, 3135616, -821624, -4228946, -7662006, -10955337, -11525244, -8480790, -5049248, -4102303, -4525480, -4835457, -6731064, -11364613, -15280979, -14227428, -8656110, -1818457, 4911980, 10945023, 13843900, 12820589, 12444386]
5562A2444386M812110O923384J754777m870146o248449m177971l429838k784127
5554D424126J114577N281093L917599j631654m055053q00601K940450K617690
5546A3808227J62452j87533J999972L439267J530407k429909m168113j239739
5538A2915031L170529L632147l7761k435170q61524J015386L07960j7730K390655
5529B0079523L382558q82144o057512o133607l939981o189158j0590068q297058
5521a8627447R20886O709545L759202o89748M27039K897218q4708n067164l193622
5512a2948799N261049R971465M547671n051052q214571j946963O934886J0073884
5504H627570N972237Q4863k286537j487814j127799k297466l040319k509572j790233
$$ y = [12444386, 17256496, 24179880, 25934657, 21064511, 14816062, 10638091, 7208253, 4424126, 5538703, 10819796, 14737395, 13105741, 9050688, 8250087, 11190537, 13808227, 13970679, 13783146, 15783118, 19222385, 20752792, 18322883, 14154770, 12915031, 16085560, 19717707, 19679946, 17244776, 16383252, 17398638, 17706598, 17688868, 20079523, 23462081, 22579937, 16522425, 10388818, 6448837, 259679, -10330389, -18627447, -17706561, -10997016, -7237814, -7927562, -7500523, -4603305, -4688013, -9755177, -12948799, -7687750, 2283715, 6831386, 1780334, -6434237, -8381200, -1446314, 8627570, 14599807, 14684670, 12398133, 10910319, 9782520, 7485054, 4444735, 1935163, 144930]
5495A44930n78952K621285N983319M657287k079321q121748q157253m390321j903943
5486a1824717o26615L026655Q393528J0130576N823147n64704m038730l798529
5478F520611j696102J197354L991091M151890l37342o968773r456418m157267
5470f754956M978536R576495N495411k837301p672963o302406k356867L09817
5462e564234J910845M105499O024372N285723J680543k342929m511483m565528
5454B022808l497596k098819l19410K302319N292072O548724M280546j88630l217775
5445A1124239l080273j681134j284444j621511j565220j423030j492357l71619
5437a395349K483151L986638O48361n752249q994326n594854J260179N732780
$$ y = [144930, -434022, 2187263, 8170582, 12827869, 10748548, 2626800, -5530453, -9920774, -11824717, -12451332, -9424677, -1031149, 9099427, 14922574, 14357870, 10319140, 6520611, 4824509, 6021863, 10012954, 14164844, 13827502, 6858729, -2597689, -6754956, -1776420, 7800075, 13295486, 10458185, 2785222, -3517184, -5874051, -5564234, -3653389, 452110, 6476482, 11762205, 13442748, 11099819, 6588336, 2022808, -1474788, -3573607, -3893017, -1590698, 3701374, 10250098, 14530644, 14342014, 11124239, 8043966, 6362832, 5078388, 3456877, 1891657, 468627, -1023730, -1395349, 1087802, 5074440, 5722801, -29448, -9023774, -14618628, -13358449, -7625669]
5429g625669N320389K110437j62307N77235L067297L731726N60797l795956m382503
5420e98554J60030N644557O958745L220117k209112n274788m202849o41201J446150
5411D503095k46064l039632k322245J531787K960978k21019k525679Q64773N429960
5402F935954L353081l914695o846998j886830L588982K837852j055759j823090
5394A188497N06802K256681K944317L288711R76024m664090p850425m061593J117511
5385d297565J2110l471255L97661R156544R611892n40954p024428j088775O299563
5376I054793K310316p163061p757409N67396N478657K556820r24846j026214k000920
5367A095532n104226n214282j338042P30618m01670J423071P541635R336143J664700
$$ y = [-7625669, -2305280, -194843, -357150, 220085, 3287382, 7019108, 7579905, 3783949, -598554, -438524, 5206033, 12164778, 15384895, 13175783, 7900995, 3698146, 3056945, 4503095, 4257031, 1217399, -1104846, 426941, 3387919, 3166900, 641221, 1505994, 6935954, 10289035, 6374340, -472658, -2359488, 1229494, 4067346, 3011587, 1188497, 1695299, 3951980, 6896297, 10185008, 11161032, 6496942, -1353483, -5415076, -4297565, -4285455, -7756710, -7359049, 1797495, 11409387, 10868433, 3844005, 2755230, 9054793, 11365109, 4202048, -3555361, -2987965, 2490692, 5047512, 4122666, 3096452, 1095532, -4008694, -9222976, -10561018, -9830400, -10232070, -8808999, -1267364, 8068779, 9733479]
5358I733479p428138p794571j203493L074846J421130k417244m577623l527424
5350a2719038J325298P597173R616178N402512O01588L74718J503100j260001
5342A2441528n065069l082255L597925O510792J965765m789053q210340q478428
5334e109135p354920m220675R47814N141831N820074L973572J660738r25859m002168
5325d068728n940572m667285n64640L332284M106201J858694l24982j37866O27364
5316e779530j286066m697020m458022P90876N640203N483190K787175J914530
5308C95336K013545L76950j010099R53153L187613N37419m292385l480287K948545
5299A629790N701091N4264o937442o879938r16118M287577N644717L904615j22073
$$ y = [9733479, 2305341, -5489230, -6692723, -3617877, -2196747, -4613991, -9191614, -12719038, -11393740, -3796567, 5819611, 11222123, 11823711, 12198429, 13701529, 12441528, 7376459, 4294204, 7892129, 14402921, 16368686, 11579633, 3369293, -5109135, -12464055, -16684730, -15736916, -10595085, -4775011, -801439, 859299, -66560, -4068728, -10009300, -14676585, -15241225, -11908941, -7802740, -5944046, -6269028, -6406894, -5779530, -7065596, -11762616, -16220638, -15429762, -9789559, -4306369, -1519194, 395336, 2408881, 2785831, 1775732, 2728885, 5916498, 6453917, 2161532, -1318755, 1629790, 7330881, 7385145, 447703, -6432235, -7348353, -3060776, 2583941, 6488556, 6366483]
5290F366483m303880m425724j70182J979743k212887o385842j676791Q952224
5282a876856J3053699N850251l279357m449258j47400Q67301k577969l481720
5274C958691J587880O870705N123894l282765j1224309j2380265o255269K370440
5266a3230998P302841N790060J129963p67386J564681L528928J300847k622415
5258C996521l640996k040444j286335j299342P32026L370896J581537m133490
5250b719627o053339j80950P043752P679794K962157n28610j180827k153942l639251
5241A229157k662795K16137R01623j019884j109160K514138N776402M686785P61684
5232A1294087j729762j148554N92508P23254j516962l631157k325489J460294
$$ y = [6366483, 2062603, -2363121, -2533303, -553560, -2766447, -9152289, -10829080, -1876856, 11176843, 17027094, 13747737, 9298479, 9151079, 10018380, 7440411, 3958691, 5546571, 12417276, 17541170, 14258405, 3034096, -9346169, -15601438, -13230998, -5928157, -138097, 991866, 224480, 1789161, 5318089, 6618936, 3996521, 355525, -1684919, -2971254, -4270596, -3538570, -167674, 1413863, -2719627, -8772966, -8953916, -1910164, 5769630, 8731787, 8203177, 7022350, 4868408, 1229157, -1433638, -1217501, -315878, -1335762, -2444922, 69216, 5845618, 10532403, 11294087, 9564325, 8415771, 9008279, 9731533, 8214571, 4583414, 2257925, 3718219]
5224C718219K503002j035793l439117K66470N337336L745541k606388l994631
5216D494639J711427N370988J112409m551716l515446J304739J183419n152128
5208A958331j0555194r607120l870556K108082N410916N400056K939934n16206
5200f731757l931305o078244m554854J449118P407104P103807J297577k356895
5192f395449k57661J899646j439071o422497n465883J576253P711476Q006617
5184g86569L457377k326158n551518l273218L203039P506422N369099R49630J172541
5175I720645N422957O571878J662226m258456n642025k717486R73822L002775
5167A4736336K451468n04628l654092m114220k065439q38739k218182l975703
$$ y = [3718219, 6221221, 5185428, 1746311, 2012781, 7350117, 11095658, 8489270, 4494639, 6206066, 11577054, 12689463, 8137747, 4622301, 5927040, 7110459, 1958331, -8596863, -18203983, -22074539, -19966457, -14555541, -9155485, -6215551, -6731757, -10663062, -16741306, -21296160, -19847042, -12439938, -5336131, -4038554, -6395449, -6653110, -4753464, -6192535, -12615032, -18080915, -16504662, -8793186, -786569, 2670808, 344650, -5206868, -8480086, -5277047, 2229375, 7598474, 8548104, 9720645, 15143602, 21715480, 23377706, 19119250, 13477225, 10759739, 11733561, 14736336, 17187804, 16683176, 13029084, 8914864, 6849425, 6010686, 3792504, -183199]
5159a83199l362710j039574J38010q61813k023835j106271J137892J535690j104327
5150f870137l411653j587652K511094L212445l14283j937347K239665P200398
5142A042530O156902P85100j719119R1466L97996l800152p461491m850922K376306
5133f981384P603834P172655L183420k7439L1196K623329M691059L231665k083447
5124A9444888q151927j0566792p334486j243655K124336J99722l259228k705182
5116a1492324J867342N271377M882229L901320N431317P461680O383855K140282
5108B5847078k788925o421891o971188l258158J853318K704698j108111k655075
5100G201746K046294O769497L999410l411232o640533l503617R71869L767074
$$ y = [-183199, -3545909, -4585483, -4447473, -5309286, -7333121, -8439392, -7301500, -5765810, -6870137, -10281790, -11869442, -9358348, -6145903, -6460186, -8397533, -6157868, 1042530, 7199432, 7984532, 6265413, 6356879, 6754875, 2954723, -4506768, -9357690, -6981384, 622450, 7795105, 10978525, 10951086, 10982282, 13605611, 18296670, 21528335, 19444888, 11292961, 726169, -6608317, -7851972, -5727636, -5527914, -8787142, -11492324, -9624982, -4353605, 528624, 4429944, 9861261, 17322941, 23706796, 25847078, 23058153, 16636262, 9665074, 6406916, 8260234, 10964932, 9856821, 7201746, 9248040, 16017537, 20016947, 16605715, 9965182, 6461565, 7433434, 11200508]
5092A1200508N306563L696522l078765r535518o908657L427810R612690N119283
5084A8840436l029926n325035j733588J789922K561789J815063M88676r28414
5076A4478923j298702r08370j853577m134882m833236l191646k348988l498241
5068g588719k784794K417629P845877P090943j37668p703801r552639m664518
5060a5077690K603744N865063K652808k267808k311784K227978N024611L325032
5052B041954R83111N57684r74230n289827p762050m350846J543624M599094N774730
5043b876756Q825239J1699406Q464835q74946q619937q477046k375309K856763
5035H622249K833201j170418m471835l846290p51302P66888o04493k151481j630828
$$ y = [11200508, 16507071, 20203593, 17124828, 7589310, 680653, 4108463, 13721153, 18840436, 15810510, 10485475, 8751887, 10541809, 13103598, 14918661, 15407337, 14478923, 13180221, 12271851, 10418274, 6283392, 1450156, -1741490, -4090478, -7588719, -10373513, -7955884, -110007, 6980936, 6843268, -860533, -10413172, -15077690, -12473946, -6608883, -3956075, -6223883, -8535667, -6307689, -1283078, 2041954, 3025065, 3582749, 2608519, -2681308, -10443358, -14794204, -13250580, -8651486, -2876756, 5948483, 17647889, 26112724, 25237778, 16617841, 8140795, 5765486, 8622249, 11455450, 10285032, 5813197, 1966907, 1215605, 1982493, 1378000, -773481, -2404309]
5026b404309j43385R71999K905536O291031P891491L989791l831799r301710p914880
5017a546235j142491N554450P711938N104708Q68213k201426l711507l911418
5009F726232k227346M84611P90894k751397o023906m584603l68715J988308L180752
5000b785170O666272R755647O110454k562163o818804l583056l55070j899836
4992D528274k849045P60934K477808l596231j0755686q740033L96415N778469
4984a1999095M021360J984705M183100O728489N098588Q02256j954790j650032
4976G214581K57173J590372J267951L75183P78507J857857R87827j693568k701557
4967I934326j093663l99783k210388k952667l64392K193839J915768J506763L301699
$$ y = [-2404309, -2547694, -1575695, 1329841, 7620872, 15512363, 19502154, 15670355, 6368645, -1546235, -2688726, 2865724, 10577662, 15682370, 16550583, 14349157, 10637650, 6726232, 4498886, 4983497, 5774391, 3022994, -3000912, -7585515, -7954230, -5965922, -2785170, 3881102, 13636749, 19747203, 17185040, 10366236, 6783180, 6428110, 4528274, 1679229, 2440163, 4917971, 1321740, -9433946, -18173979, -17777564, -11999095, -7977735, -5993030, -1809930, 4918559, 10017147, 10819403, 8864613, 7214581, 7471754, 9062126, 10330077, 10705260, 11483767, 13341624, 14329451, 12635883, 9934326, 8840663, 8440880, 6230492, 3277825, 2913433, 5107272, 7023040, 8529803, 11831502]
4958A1831502M146860J648954j83815K031958L811266r7619o131418p378750m675926
4949E003012l901588n242173l802905P35165L237373J590502n31203N60340M672241
4940B320764Q759435Q631660K291986n587480p068326k014395O19898l251351
4932D702191n833171p95020N311834L948414j289985k036055N09565J20757j763867
4923B874663M8656L197449K358082O3034J036739J400496l766893q233640m045129
4914e066543K949203K397719j768933R44392O650570L358640n615473n673898
4906a824323L038114N404737j958150n442664J106300P435486O637684M309665
4898A8706849L511845m47002n867694m132635K720315K953134l150507k848907
$$ y = [11831502, 15978362, 17627316, 17443501, 19475459, 23286725, 23189106, 17057688, 9678938, 5003012, 1101424, -4140749, -7943654, -7208489, -3971116, -2380614, -2911817, -2351477, 2320764, 11080199, 19711859, 22003845, 16416365, 9348039, 7333644, 7953542, 4702191, -1130980, -1926000, 3385834, 7334248, 6044263, 4008208, 4517773, 4638530, 2874663, 2923319, 6120768, 8478850, 8541884, 9578623, 10979119, 7212226, -1021414, -5066543, -2117340, 280379, -1488554, -544162, 6106408, 9465048, 3849575, -1824323, 1213791, 6618528, 4660378, -782286, 324014, 7759500, 14397184, 18706849, 22218694, 21771692, 15903998, 11771363, 14491678, 17444812, 14294305, 11445398]
4890A1445398M782011O121905j962722p431216o676746q098564r670685r94956
4882a2485575J0012395M946756q148507m256959Q966462n55904k3891853j6595841
4874d2009026R064170k5733256j33195172j90974053r2121338Q7148151J70317928
4867b17502596J08333423K0045408O065962L1713386K6197877j024302l634068
4860b9804910J2187924J0994700k517048l77162J0668387M142862j2866938j2219268
4852a9791453L114522N936516n359742p379022L062623N444462l565849m054159
4844b2592102Q789026J4881448M914830m450415n29835O202114L902180j445815
4836I671431o64844K118511m28271n299461o265020m683922m540537m428197j601052
$$ y = [11445398, 16227409, 22349314, 20386592, 12955376, 6278630, -1819934, -11490619, -12485575, -2473180, 2473576, -5674931, -9931890, -965428, -1521332, -25413185, -42009026, -32944856, -58678112, -191873284, -382847337, -474968675, -387820524, -217502596, -109169173, -89123765, -83057803, -51344417, -25146540, -26170842, -29804910, -17616986, -6622286, -9139334, -9516496, 1151891, 5294753, -7572185, -19791453, -16676931, -10740415, -16100157, -23479179, -20416556, -14972094, -18537943, -22592102, -13803076, 1078372, 5993202, 1542787, 1012952, 7215066, 11117246, 9671431, 9006587, 11125098, 10696827, 5397366, -867654, -5551576, -10092113, -14520310, -16121362]
4827a6121362J843941K289219J419j951645j075111K982475P198484O848882J789178
4818C805480k021518j205792k93857l214060n723687l279818K73049L16862P13113
4809a0630228N515194Q736693M297800p78334K840805Q732409L660593r245161
4801A3129771j3965491p199852k321055n913117q268935k250677M656155M475111
4793a7658090J316794J699874L575215L113246K908529N602176P408498N081509
4785A3047751K014676J063299j295513p101102j0486435o485099j17282R91598
4777h368107j808178j678124K154740L921910Q91730k894096k609394J586670
4769h802849N210431M263057k67951k895266m77221K698225N81051n144778p094966
$$ y = [-16121362, -14277421, -11988202, -11986783, -13938428, -15013539, -12031064, -4832580, 2016302, 3805480, 1783962, 578170, 284313, -2929747, -8653434, -11933252, -11660203, -11343341, -10630228, -5115034, 3621659, 7919459, 7141125, 9981930, 18714339, 22374932, 13129771, -835720, -8035572, -10356627, -16269744, -24538679, -26789356, -22133201, -17658090, -16341296, -14641422, -11066207, -7952961, -5044432, 557744, 7966242, 13047751, 15062427, 16125726, 14830213, 7729111, -2757324, -9242423, -9359705, -8368107, -10176285, -11854409, -9699669, -5777759, -4886029, -7780125, -10389519, -8802849, -3592418, 670639, 402688, -2492578, -2969799, -271574, 309477, -4835301, -11930267]
4760a1930267l548617o70008j857004k363303J895055O740945N991998P81588
4752d959613k378619j51992M776972P499307N209355l20945l602218j424769J933343
4743F580821n09209q303199j3279206j0257455k755159L211479N456295M215874
4735a5639759L62276k656659p00426M667870O877745L600953l44772j440716k188304
4726g461792m248878l816828J424518O626478O384915K403958l03779n80424J99953
4717F28121K426298O175555Q124644N198625j013872o566009q988235o882880
4709h97753j88599O813052Q056170L948223J107846J187023k120943j0386935
4701G518084j3899889n726819N422143O479048j229864n309406r83017M564559
$$ y = [-11930267, -15478884, -16148892, -18005896, -20369199, -18474144, -11733199, -5741201, -4959613, -7338232, -7490224, -2713252, 4786055, 9995410, 9674465, 6072247, 4647478, 6580821, 6071612, -2231587, -15510793, -25768248, -28523407, -25311928, -19855633, -15639759, -15277483, -17934142, -18634568, -13966698, -7088953, -3488000, -3832772, -5273488, -7461792, -11710670, -15527498, -14102980, -7476502, -1091587, 1312371, 1008592, 428168, 628121, 3054419, 9229974, 17354618, 22553243, 21539371, 14973362, 5985127, -897753, -1086352, 5726700, 13782870, 17731093, 18838939, 20025962, 17905019, 7518084, -6381805, -12108624, -6686481, -207433, -1437297, -6746703, -7729720, -3165161]
4693c165161N224063K858821O74252j147015j814578K70342K715316J183748k646385
4684D153403k276835L001973N938110K227765l090375l561595l9529K392851J843770
4675A0589538L769j692909k570411j361512K534141P226171R420541O878898q4808
4666C0943418p915132j1123911p102146P1288L325867O64583k941107k291154
4658C631706J861907M327888J440450n158420r592364o909734J433159P982314
4650i83094O911052L59773m624207m138247j78814L106590L067814l37532m169832
4641i86497m304955k51782L353190K795279M81416N18997J994404J770469J400625
4632F771146M508866Q554826O951059r1142m672569l202108j591542m819873q569643
$$ y = [-3165161, 2058902, 4917723, 5591975, 4444960, 2630382, 2900724, 5616040, 6799788, 4153403, 1876568, 4878541, 10816651, 13044416, 9954041, 6392446, 6352917, 8745768, 10589538, 10593307, 8900398, 6329987, 4968475, 7502616, 14728787, 24149328, 31028226, 30943418, 23028286, 11904375, 4802229, 4873517, 8199384, 8863967, 5922860, 3631706, 5493613, 9821501, 11261951, 6103531, -3488833, -10398567, -8965408, -983094, 5927958, 6287731, 1663524, -2474723, -2653537, 453053, 3520867, 3183335, -986497, -5291452, -5543234, -2190044, 605235, 1086651, 1605648, 3600052, 5370521, 6771146, 11280012, 19834838, 26785897, 26694755, 22022186, 18820078, 17228536, 12408663, 3839020]
4623C839020o910280k543453k215027n373735n125772L57075M553353K262439
4615a1156380k917107l833599P61697N458385N654246K644145P05340J267478
4607a415795J855143L00124k130334k793412j450461l97089j373204l717317n309096
4598a6431441m274297k11630N136269Q785337Q954776O173178J756410l173903
4590F714699o545514n937416k321439n05188k775522m482512q5767P968884J1359173
4581C389398O746226k61044l022343j545901l40558j808066m260816m916716k974991
4572h994811j37997J378981J462690J787138K339606O56956l435181n244005j236481
4563a1423104M589012N326413Q73944k510347j833111k98497L8730J760136N610138
$$ y = [3839020, -3071260, -5614713, -7829740, -13203475, -18329247, -17972172, -13418819, -11156380, -14073487, -17907086, -17145389, -11687004, -6032758, -3388613, -2683273, -1415795, 439348, 739472, -1390862, -4184274, -5634735, -6031824, -7405028, -11122345, -16431441, -20705738, -20917368, -15781099, -6995762, 1959014, 8132192, 9888602, 6714699, 169185, -5768231, -8089670, -8594858, -11370380, -15852892, -15938659, -7969775, 3389398, 10135624, 9874580, 6852237, 5306336, 4965778, 3157712, -1103104, -6019820, -8994811, -9132808, -7753827, -6291137, -4503999, -2164393, -1507437, -4942618, -10186623, -11423104, -6834092, -1507679, -633735, -3144082, -4977193, -5275690, -5236960, -3476824, 2133314]
4554B133314O701549J580841n258649o778159k679408J136728P89064j974948
4546d349668l774633l614633k290658j28525L184119O798798P871060M152103
4538G847963k099936n096433k455721J062066k9053l844392l982402P36669M804136
4529c057103M331364J321403j312245l603598n615558n523429k890932M4129J953123
4520a4352846L378374L377253L41430k769748k84624O816633R967900M947883
4512A1422255j598013k006498J980128L858147K028274r46601l891490n728631
4504E117571l188084L578085P251923K423445n172375o138618j002204K049378
4496D919121N79102l37240J063993L68798l815941o553836m865378j826998Q6717
$$ y = [2133314, 8834863, 10415704, 5157055, -1621104, -4300512, -3163784, -2374720, -4349668, -8124301, -11738934, -14029592, -14158117, -10973998, -4175200, 3695860, 7847963, 5748027, 651594, -1804127, -742061, -771114, -4615506, -8597908, -7861239, -3057103, 1274261, 2595664, 1283419, -2320179, -7935737, -13459166, -16350098, -16305969, -14352846, -10974472, -7597219, -7255789, -10025537, -10310161, -3493528, 6474372, 11422255, 9824242, 7817744, 9797872, 13656019, 15684293, 14737692, 10846202, 5117571, 1929487, 5507572, 12759495, 15182940, 10010565, 3871947, 2869743, 4919121, 5498223, 5160983, 6224976, 6593774, 2777833, -3776003, -8641381, -10468379, -10381662]
4487a0381662K572698N548472M808164m28436m090925k114390Q77210r49457n244322
4478i402648n619848j777068R27183L17426k08015K105797N700961P812688P474185
4469G330661M769300J79756m538075p216148p631960p120124n786726k464466
4461b2477782K153696M896721L894328J072448n73632o22687l80434L42038L100545
4452h594759P482826J0143890Q160121K174202m432217q378809q114163m378714
4444e937623k81535Q45875p49872j147043J683837M075697J343072n051839q607367
4435a3826798n664684J234427P528953J0334416Q086297J225792n603999o527651
4427c213247j519980L258332L752602K358962K148565J808521m75565k802389
$$ y = [-10381662, -7808964, -2260492, 2547672, 2119236, -1971689, -4086079, -3208869, -4158326, -9402648, -15022496, -16799564, -15872381, -15554955, -15762970, -13657173, -7956212, -143524, 7330661, 12099961, 12279717, 7741642, 525494, -7106466, -14226590, -20013316, -22477782, -20324086, -15427365, -11533037, -10460589, -11034221, -11656908, -12037342, -11695304, -8594759, -1111933, 9031957, 17192078, 19366280, 14934063, 6555254, -1558909, -5937623, -6219158, -5373283, -6123155, -7270198, -5586361, -1510664, -167592, -5219431, -13826798, -19491482, -18257055, -10728102, -393686, 7692611, 8918403, 3314404, -3213247, -4733227, -1474895, 2277707, 4636669, 6785234, 8593755, 8118190, 5315801]
4419E315801l302113m076411o944984q782662n876848m4576M264452O296878P814281
4410e336182Q312246O372026L417145J304571j298703n199837o430558j729895
4402e89187M400701M913097O02478j677282L12173K659464L422095M360923M635132
4393B3039594R05621n105534o753168k087758L258735M460465K490488m20860
4385A9787583l526309m520946j077787K986192Q89469n746473p282814q26513
4377F82402M584014K112965k818545k954463r50671k466828m809923k141997L076094
4368e686952L804835M57452l04309K907249M837747L218039J529045J657155J069449
4359A3489710j444981l308845k893224j794238j267045o42048K3449l48284j178175
$$ y = [5315801, 2013688, -2062723, -9007707, -17790369, -23667217, -23711793, -19447341, -13150463, -5336182, 2976064, 9348090, 12765235, 14069806, 12771103, 7571266, 1140708, -589187, 3811514, 8724611, 9327089, 7649807, 7961980, 10621444, 14043539, 18404462, 23039594, 23945215, 18839681, 12086513, 9998755, 13257490, 17717955, 20208443, 19787583, 16261274, 11740328, 10662541, 13648733, 14538202, 8791729, 1508915, 682402, 5266416, 7379381, 4560836, 1606373, 655702, -1811126, -6621049, -8763046, -5686952, -1882117, -1424665, -1728974, 1178275, 6016022, 9234061, 10763106, 12420261, 13489710, 12044729, 8735884, 5842660, 4048422, 2781377, 2139329, 2162778, 1814494, 636319]
4350F36319j006165p75363k296822l748072j369961L948661O400916K823205l154347
4341A458371n784132l245924J565914L810309N13048n587490o970533J42924R228617
4332d868896J0341596L244912k204660J32688M793207L801636j839016m868851
4324H532616k671828L65933O20091J00529K114271N650654O847619M601729J793646
4315B7955260O23512n72099l865442p110195o407053k766073j772076n101989
4307I83845o961865k398281M600252O158419J349215l459572m124982k895801
4299f748770k485572j410137K335787O647865P324953L089425l141734o908145
4291a296328n484933o6898M704265M844014J167010j757524o95823L369360O784842
$$ y = [636319, -369846, -1145209, -3442031, -7190103, -8560064, -4611403, 1789513, 4612718, 1458371, -4325761, -7571685, -6005771, -2195462, -1682414, -7269904, -14240437, -14097513, -4868896, 5472700, 8717612, 6512952, 6645640, 11438847, 15240483, 13401467, 8532616, 5860788, 6226721, 6846812, 6947341, 9061612, 14712266, 21559885, 26161614, 27955260, 28578772, 28006673, 24141231, 17031036, 10623983, 7857910, 6085834, 983845, -5978020, -8376301, -3776049, 2382370, 3731585, 272013, -3852969, -6748770, -9234342, -10644479, -8308692, -1660827, 5664126, 8753551, 5611817, -1296328, -6781261, -6848159, -2143894, 2700120, 3867130, 2109606, 1413783, 4783143, 11567985]
4282A1567985O094440L94905p000700j0280487p149915k186984j191253l313889
4274a3065898k902255J279659L807150R55253l385864l106762J915624O249377
4266h253716N916817K291131l26659P16691L951492N227150K274118k355497m450473
4257D991054l810641l950309n752695n061136J150148Q967782J1270478O267013
4249A4071694o78773l702268k347284p4063R67350J606240K611827K346948r58597
4240A3843074n518891o826617k815275L381359O812566N684235K038491j230617
4232A5368325k682411k518243j869637j741905k156035k604892k915239k580593
4224c700630k96744L540993N141477J973969j721869L75759O096435N918841k756736
$$ y = [11567985, 17662425, 18057330, 11056630, 776143, -6373772, -8560756, -9752009, -13065898, -15968153, -14688494, -10881344, -9926091, -13311955, -16418717, -14503093, -8253716, -2336899, -45768, -372427, 344264, 4295756, 9522906, 11797024, 9441527, 4991054, 1180413, -2769896, -8522591, -13583727, -12433579, -3465797, 7804681, 14071694, 13392921, 9690653, 7343369, 7269306, 8236656, 9842896, 12454723, 14801671, 13843074, 8324183, 1497566, -1317709, 2063650, 8876216, 14560451, 16598942, 15368325, 12685914, 10167671, 8298034, 6556129, 4400094, 1795202, -1120037, -3700630, -3997374, -456381, 4685096, 6659065, 4937196, 5312955, 11409390, 17328231, 14571495]
4215A4571495j0022287p244748L95204K311255j905172l918661m23583L413836
4207b822661L167364M6952l087142m165020j248449M465910O709215J854249l751262
4198A169156k009370L754494L434894l316554o179967o84008N347270M741225
4190F257140N16219j362009k59000J874963L938720L337217k153478p801028n682858
4181a334114K562378O220847J673600k365118K42592M111538L806533K855847
4173A7774103M110287K163825n729532j1170702p003390M18259J518831j676511
4165D05170j346885K481263M563965M719732N623794N857679L920903L070667
4157B9296288M305935K266781m047371o345784j559309Q77345l349425l495733
$$ y = [14571495, 4549208, -2695540, -2300336, 10919, -1894253, -5812914, -6236497, -2822661, 344703, 391655, -2695487, -6860507, -8108956, -3643046, 3066169, 4920418, 1169156, -840214, 2914280, 6349174, 3032620, -3147347, -3831355, 1515915, 6257140, 6773359, 5411350, 5152350, 7027313, 10966033, 14303250, 12149772, 4348744, -1334114, 1228264, 7449111, 9122711, 6757593, 7000185, 11111723, 14918256, 17774103, 21884390, 24048215, 18318683, 7147981, 144591, 562850, 2081681, 405170, -941715, 1539548, 6103513, 10823245, 16447039, 22304718, 26225621, 29296288, 33602223, 35869004, 31821633, 25475849, 23916540, 24793885, 21444460, 17948727]
4149A7948727M982101P183543m286576r720461K232010l35200n0273123j13816044
4141a46085023j15838824m0364528M1446177O2705076L7821445K0795430K5039130
4134a14481117K4843566J1749437L983462P742220Q339233Q66041j802066M509869
4126e4249355P192313Q21997l187812K507463R561969R979342P531043O670494
4118a3172546M430580k57467j842678J288490K734074m33161k727892j057292
4110a1037892L18345k48331J907314O656017N590609m120369j2609540j0928723
4102b4472570k945515K943132N490323P089745O544252K900151O280K50574l37547
4093b531175m338886o534256k190226L975036M517051L02127k200654n59882L174073
$$ y = [17948727, 22930828, 30114371, 25827795, 16107334, 18339344, 18004144, -32268979, -146085023, -261923847, -302288375, -260842198, -198137122, -160315677, -139520247, -114481117, -89637551, -77888114, -73904652, -66162432, -57823199, -56957158, -58759224, -54249355, -47057042, -46235045, -49422857, -46915394, -37353425, -27374083, -19843040, -13172546, -8741966, -8999433, -10842111, -9553621, -6819547, -7252708, -9980600, -11037892, -10719547, -10967878, -9060564, -2404547, 3186062, -934307, -13543847, -24472570, -27418085, -24474953, -18984630, -11894885, -5350633, -2450482, -2444202, -2193628, -2531175, -6870061, -13404317, -15594543, -11619507, -7102456, -6800329, -9000983, -9560865, -6386792]
4084f386792P495415J0465104P989636o8930o088024m180593K86558j569687q232335
4075b89648j0317763n088680N40711J299739m30499r65869n20528k55408J42420
4066a5885525K36695j096418k299383k88732M206709O807084N663667L256175
4058F00272J590238J36080q04554N55697L498220M488500K346842j08022q02647
4049A1500626r02976j365907j132655l87944j555927m926673o921546n017661
4041a0710663j233485J393838K616238L073944J904183r49631k763020j310675
4033g979271J874603L912773M190202L401314J412548j301908k350097n01658
4025B658506J702612J242676j125086k620554k609639j957983r7206L431788N736977
$$ y = [-6386792, 1108623, 11573727, 19563363, 19494433, 13406409, 9225816, 9512374, 7942687, -289648, -10607411, -15696091, -15155380, -13855641, -14286140, -15252009, -15772537, -16027945, -15885525, -15648830, -16745248, -19044631, -19333363, -15126654, -8319570, -2655903, 600272, 2190510, 2326590, 1522036, 2077733, 5575953, 10064453, 12411295, 12303273, 11500626, 10597650, 9231743, 8099088, 7711144, 6155217, 1228544, -5693002, -10710663, -11944148, -10550310, -7934072, -4860128, -2955945, -3905576, -6668596, -7979271, -6104668, -2191895, 1998307, 5399621, 6812169, 5510261, 3160164, 2658506, 4361118, 5603794, 4478708, 1858154, -751485, -2709468, -2806674, 625114, 6362091]
4016F362091L211201k653786o062094m198832l58296J129373J9788j148012q90147
4007d588714M25817J905932K667967K031183J72583j991920l684096m108247k016522
3998i186017K595012O591705O126804J602352k182734j744449J543620M576609
3990I922902O344285O719024M172920k048364q822185j1549692r489580o060612
3982a0811302l851186k070792M00852K201009J658992J56787P73325L645667M948442
3973b948206J783892l268815m687198j044020K959525K731777l75272k101050
3965f949367k161820l800734o844838o420184n04449N817539O984760M241673
3957i637420K276971J732784K60294j051808J346169O120134O942034J515764
$$ y = [6362091, 9573292, 6919506, 857412, -3341420, -3699716, -2570343, -2550555, -3698567, -4588714, -4162897, -2256965, 411002, 2442185, 2614768, 622848, -3061248, -7169495, -9186017, -6591005, 700, 6127504, 7729856, 5547122, 3802673, 5346293, 9922902, 16267187, 22986211, 27159131, 25110767, 16288582, 4738890, -4750690, -10811302, -14662488, -16733280, -16332428, -14131419, -12472427, -12315640, -11542315, -7896648, -2948206, -1164314, -4433129, -9120327, -10164347, -7204822, -4473045, -4848317, -6949367, -9111187, -12911921, -19756759, -26176943, -26681392, -20863853, -13879093, -9637420, -7360449, -5627665, -5367371, -6419179, -5073010, 1047124, 7989158, 9504922]
3949I504922m492986n200623j831617Q89143J902568L278199M980017M566945
3941A3596568J268150l118472o943251r357956q722726l697389L431811P279097
3933f264168M863109o29640k959665N00326N985411P542795L689864j155600k424242
3924I148190r41313o54236k162834k195861L96243K418144J613897l9078r02037
3915F681115l313339q570187j1803136p432455J991325Q139366P731620N505819
3907a069872N728926O220382L171072k281931n586049m663858j537851R18276
3899H99095K001546L161051N464712P022350M210440l043459q995360q251697
3891B468678l137711r68411m219098p777877o619656j804978K568333M232391
$$ y = [9504922, 5011936, -188687, -2020304, -1131161, 771407, 4049606, 9029623, 13596568, 14864718, 11746246, 4802995, -4554961, -13277687, -16975076, -13543265, -6264168, -1401059, -2030699, -4990364, -4490038, 1495373, 9038168, 12728032, 11572432, 9148190, 8206877, 7552641, 5389807, 3193946, 3590189, 6008333, 7622230, 7583152, 6681115, 3367776, -5202411, -17005547, -24438002, -22446677, -14307311, -6575691, -1069872, 4659054, 10879436, 14050508, 11768577, 6182528, 1518670, -19181, 899095, 2900641, 6061692, 11526404, 18548754, 22759194, 19715735, 10720375, 2468678, -669033, -1637444, -5856542, -13634419, -20254075, -22059053, -19490720, -15258329]
3883a5258329K767901j126735m052291j578959N514864J0180364P590663J582407
3875E619885r26692R87915K893587K339366Q56333k17975j445658k910446l633533
3866C562782l512082l239996k564677r42462O93639J138396J081852J766005K478927
3857D62384J786350J20060j302201k651206l820636k486163K446571O945374N835014
3848G335547J32410l925475l148123m97362L96027l10766o54966J26426J551769
3839A005487K259139M34370l329660m602550n10434M634255M476943O59951P63384
3830E790885N567168O701627L35755n080328j065347P292091Q102421o38338r445652
3821A7560282j0852299o520338p71359N176923J0033462R731080K314145p407485
$$ y = [-15258329, -12490428, -13617163, -17669454, -19248413, -13733549, -3553185, 4037478, 5619885, 4693193, 5681108, 8574695, 10914061, 11770394, 11552419, 10106761, 7196315, 3562782, 50700, -3189296, -5753973, -6696435, -6002796, -4864400, -3782548, -2016543, 462384, 2248734, 2368794, 1066593, -1584613, -5405249, -7891412, -5444841, 1500533, 7335547, 7467957, 3542482, 394359, -103003, 293024, -17742, -672708, -546282, 1005487, 3264626, 3698996, 369336, -4233214, -4743648, -109393, 4367550, 5027501, 5790885, 11358053, 18059680, 18395435, 13315107, 12249760, 19541851, 27644272, 27005934, 17560282, 6707983, 187645, -583714, 4593209, 14626671, 24357751, 26671896, 19264411]
3813A9264411j1729934p716768O42555O837518P244206L236875q57760k066582
3805A4854521j153042n24063p65780n89552M83635J186824K73537j973432l846508
3796G946140l078754J405956P232485R086090L533318o698405j4469502j4180289
3788i222961n892085M813509J0379684P260952K39367j778362L361646P446877
3780A6608627K760673o652136j0191156n299717P8982j06753k437184j515644
3772f754308J320712J593373j99464K93042L649756N144859J160175o083543j1012684
3763a0888082j0173136m746002J288510M904284N929276N361034L175045m82869
3755e631940l053389j718715K008563L275723N58776k080962j267949N79736n39402
$$ y = [19264411, 7534477, -182291, 460264, 7297782, 14541988, 17778863, 16921103, 14854521, 13701479, 13177416, 12411636, 11822084, 12305719, 13492543, 13766080, 11792648, 7946140, 4867386, 6273342, 13505827, 22591917, 26125235, 19426830, 4957328, -9222961, -15115046, -10301537, 78147, 7339099, 7578466, 5800104, 9161750, 16608627, 19369300, 12717164, 2526008, -2773709, -2694727, -2801480, -5238664, -6754308, -5433596, -3840223, -4039687, -3746645, -96889, 5047970, 6208145, 124602, -10888082, -21061218, -25807220, -24518710, -19614426, -13685150, -8324116, -5149071, -5631940, -8685329, -10404044, -8395481, -5119758, -4560982, -6641944, -7909893, -7330157, -7869559]
3746g869559l503987l519711P27800N058613N278380K042459o63902m17626J263610
3737a603923J156862j542493m088151l808254j743484q25173j359569j180951
3729a4995136J68357J103965J939046M550825P034463M206963l627259p901536
3721g520312k704885N818125P113296M63666n076375l643375J384152M452633
3713B86925M362502K059855k337507p273006q604793m200673K436284N617728
3705g652685L287398j920038n988374o759725m898690k343868L16808L813670
3697b2145504O872165N809502K68340l633695o62355N090773N152906q59044m718392
3688h825304k177034J458824R60943p57857J293850N785111Q053360P237092N119796
$$ y = [-7869559, -11373546, -14893257, -14165457, -9106844, -3828464, -1786005, -2449907, -2867533, -1603923, -447061, -1989554, -6077705, -9885959, -11629443, -12454616, -13814185, -14995136, -14826779, -13722814, -11783768, -7232943, -198480, 4008483, 381224, -7520312, -10225197, -4407072, 2706224, 3169890, -1906485, -5549860, -4165708, 286925, 4649427, 6709282, 4371775, -2901231, -11506024, -15706697, -13270413, -7652685, -4365287, -6285325, -12273699, -19033424, -23932114, -26275982, -25959174, -22145504, -15273339, -9463837, -9195497, -12829192, -13491547, -8400774, -3247868, -4106912, -8825304, -11002338, -9543514, -8582571, -9340428, -8046578, -2261467, 5791893, 13028985, 18148781]
3679A8148781J340571m772603j0169614j1115046q327177m565266L46471O833594
3671a2280289J0498755O469835k072440o441979l883789j67728K45748R9904K829031
3662d702952O005481N465474K022499l04122k91765K10176L22963O55068N94643
3653I977465j387698m616157o236625n006025k855466j749639q39573J672213
3645a1041505M892062N621339K745583n84483o28494K117397L788923K493513
3637I404335K65769p97012j437062k534590k221718J199593N030820M559548m80638
3628A2989045n132911n573143l453932k625503l697283l784525q36507L375481
3620h739278M963683K356135j412010j727370K064134N535348M490099j11071
$$ y = [18148781, 19489352, 14716749, 4547135, -6567911, -14895088, -19460354, -19113883, -12280289, -1781534, 4688301, 2615861, -3826118, -7709907, -7877635, -7631887, -7531983, -4702952, 1302529, 6768003, 8790502, 8486380, 8194615, 8404791, 8727754, 9382822, 9977465, 8589767, 3973610, -2263015, -7269040, -10124506, -11874145, -12713718, -11041505, -6149443, -528104, 2217479, 1632996, 1004502, 3121899, 6910822, 9404335, 9670104, 8873092, 7436030, 4901440, 2679722, 3879315, 8910135, 13469683, 12989045, 7856134, 2282991, -1170941, -3796444, -7493727, -11278252, -12114759, -8739278, -3775595, -1419460, -2831470, -4558840, -2494706, 3040642, 7530741, 7419670]
3612G419670l946444m501623k537367J01247J684964P91020j975177l339598j216581
3603g519889J771755J778689l53129o63537J094056J087237j695325l421255j962908
3594i884306l57470r34260p97260K714156N963816L717447k299244n078625k025978
3585h981724K110856K687614R71041M62782R00522p31733m470126n926457j564896
3576a4542121O195565J0846188Q641929K157648l385387n501238m779800k044331
3568b411547J570930K734652j548119q685497j1703440p455616l04136M203704
3560b3599069N577215N677809L940167j89105l054769o97929M258321N232662
3552b854698J185413j942203l35994K441385J775974r10956j119516J638264L817101
$$ y = [7419670, 3473226, -1028397, -3565764, -3464517, -1779553, -988533, -2963710, -6303308, -7519889, -5748134, -3969445, -4322574, -4986111, -3892055, -2804818, -4500143, -7921398, -9884306, -10241776, -11176036, -11973296, -9259140, -3295324, 422123, -1877121, -6955746, -8981724, -6870868, -4183254, -3212213, -2749431, -1848909, -2580642, -7050768, -12977225, -14542121, -8346556, 2499632, 11141561, 13299209, 9913822, 4412584, -367216, -2411547, -840617, 1894035, 345916, -8339581, -20043021, -27498637, -27802773, -23599069, -18021854, -12344045, -8403878, -8592983, -11647752, -12345681, -8087360, -2854698, -1669285, -3611488, -3947482, -1506097, 269877, -641079, -1760595, -122331, 3694770]
3543C694770L454692J921969M08665j745817m412971n273052k828626Q59727K430454
3534a490189J493858P44198J845571L128720K221012n73611k965302l697309l115957
3525b409009j522139O97985J528062j169995n751308p214568l273679K347619
3517a6767032M820741M171214L510203L315644J509171j425908j896809J118514
3509a644262L615618K064328j281942j473722K082281M645845K233999l680187
3501F561958q403931r281197p234388l965413J31319M513125O863487N188988
3493e626052J106840j332979n25090J287637K285815L860454O922312Q056784
3485A6035721L319743m894603q995968n338760R67815K440939j612228m841913
$$ y = [3694770, 7149462, 9071431, 9480096, 7734279, 3321308, -1951744, -4780370, -3920643, -1490189, 3669, 747867, 2593438, 5722158, 7943170, 7369559, 4404257, 706948, -2409009, -3931148, -3233163, -1705101, -2875096, -8626404, -15840972, -19114651, -16767032, -11946291, -7775077, -4264874, -949230, 559941, -865967, -2762776, -1644262, 1971356, 4035684, 2753742, 1280020, 3362301, 8008146, 10242145, 6561958, -1841973, -11123170, -18357558, -22322971, -22191652, -17678527, -10815040, -5626052, -4519212, -5852191, -6377281, -5089644, -2803829, 1056625, 7978937, 16035721, 19355464, 14460861, 5464893, 126133, 1093948, 3534887, 1922659, -2919254]
3477b919254k202026L753766N959655J401809m956976n788834j35093N520900
3469F33947N311699O85193k621462k068071R4591J306503J197165j31154k711890
3460A696521m924381m315189j391694K90770p13716j362216J016066M076713L644899
3451a982227n568k269141l02518L619702N245784L058193p25988k812536k016181
3442A809520r3914P04679O89527J968740M248043L663275k137636r314638j1183078
3433i645482n951072J552514N996041O588551N279568K988778j41632k651891
3425D015375k695397o16770J411521K129335J905916J029058p08610k407817j934762
3416B127849J588429O145682Q400024O406946R02165m986424p543882n744608
$$ y = [-2919254, -5121280, -1367514, 4592141, 5993950, 1036974, -4751860, -4886953, 633947, 5945646, 6630839, 4009377, 1941306, 2035897, 3342400, 4539565, 4408411, 1696521, -3227860, -7543049, -8934743, -8643973, -9357689, -10719905, -9703839, -5627126, -1982227, -1987795, -4256936, -4559454, -939752, 4306032, 7364225, 6638237, 3825701, 1809520, 1715606, 2420285, 3109812, 5078552, 9326595, 12989870, 10852234, 1537596, -9645482, -15596554, -14044040, -8047999, -1459448, 3820120, 6808898, 6667266, 4015375, 1319978, 703208, 2114729, 4244064, 6149980, 7179038, 6470428, 4062611, 2127849, 3716278, 9861960, 18261984, 24668930, 25571095, 20584671, 13040789, 7296181]
3408G296181k826072k586112m088414l037512R38353K542556j161884n145042
3400h067946l270731K344852M514476J686770j032525j079518j455812l268830
3392i629264k578493K017720N169615K793756j167229j435448k8505j657411m291048
3383a0806307k118018L856878O231601K490426j478780q59746J505882Q58675
3375c19389k249956l924918k518612R72058N331377Q811012Q388513K602323n342567
3366A1749841r545852p012886p80603K834900P35256l191914k630749K236582
3358e605425L916631j560427p201143m164722M518019P245606O47825n496365
3350g700001k759181M363014O343824K110503j588225o28758K843939N474352
$$ y = [7296181, 4470109, 1883997, -2204417, -5241929, -4303576, -1761020, -2922904, -8067946, -11338677, -8993825, -4479349, -2792579, -3825104, -4904622, -6360434, -9629264, -12207757, -10190037, -5020422, -2226666, -3393895, -4829343, -4857848, -6515259, -10806307, -12924325, -9067447, -2835846, -345420, -1824200, -2683946, -1178064, -319389, -2569345, -6494263, -9012875, -8040817, -2709440, 6101572, 14490085, 17092408, 11749841, 2203989, -4808897, -5589500, -2754600, -2019344, -5211258, -7842007, -5605425, -1688794, -3249221, -10450364, -14615086, -10097067, -2851461, -2203636, -7700001, -10459182, -6096168, 247656, 2358159, 769934, 141176, 2985115, 8459467]
3342H459467O132637M831094K168828k17761j157127j319019j550576j534002
3334A5813541j568706k942982m535198k653441K609409M815631l31103p278380
3326C928771p333374q56701L985229L678302K994202N103317N769072J254114
3318A8522932m045057l574296J200006K623131k185460p637512p744789l542349
3310f383394l17620l61265j422714j099658K44049J142701J296659J262467J396743
3301d242032J944139K802859K526214n51795n058706o776546m078829p44445m56253
3292a4635394r93136J837851O397347O996652L063965L35264J731114L180224
3284G913887J164738j180752N35613M776646O610074M355570j07197m826520p861914
$$ y = [8459467, 14592104, 19423198, 21592026, 21374265, 20217138, 18898119, 17347543, 15813541, 14244835, 11301853, 6766655, 4113214, 6722623, 11538254, 11207151, 3928771, -3404603, -4261304, -276075, 3402227, 6396429, 11499746, 17268818, 18522932, 14477875, 10903579, 12103585, 14726716, 12541256, 4903744, -2841045, -6383394, -6701014, -7062279, -8484993, -9584651, -9340602, -8197901, -6901242, -5638775, -4242032, -2297893, 504966, 3031180, 2479385, -2579321, -9355867, -13434696, -14179141, -14635394, -15628530, -13790679, -7393332, -396680, 2667285, 3002549, 4733663, 7913887, 9078625, 7897873, 8433486, 13210132, 19820206, 24175776, 24068579, 19242059, 11380145]
3275A1380145o637897j231694L744907M058325P06441k867526n341697o000804
3267b189800k623142M053210P065673Q51098r493881j3023754o637747K062705
3259a9935638N897561N949931O472662P339679N279546N4534m016591k776146
3251D265538K684990O398967L880682k312160n705155m479975k837470k802598
3243i07181n40264N529529Q956830L941559m576335o974919k326825J945011J856526
3234F903931J62186j235566l616631n646216l555806J121309J605259l853953
3226h115487q633265p495406l285282p04288N24683K425773L968473L782087L687182
3217a3845530N588335P806924P543434M494163J55802l584308m055522K40061
$$ y = [11380145, 4742248, 3510554, 7255461, 11313786, 12020227, 9152701, 3811004, -2189800, -4812942, -759732, 6305941, 7157039, -2336842, -15360596, -21998343, -19935638, -14038077, -8088146, -1615484, 5724195, 11003741, 11058275, 7041684, 4265538, 6950528, 13349495, 17230177, 14918017, 9212862, 4732887, 1895417, -907181, -1447445, 4082084, 13038914, 16980473, 12404138, 5429219, 3102394, 5047405, 6903931, 7066117, 5830551, 2213920, -3432296, -6988102, -5866793, -4261534, -8115487, -16748752, -24244158, -27529440, -28233728, -27709045, -25283272, -21314799, -17532712, -13845530, -8257195, -450271, 7093163, 11587326, 11743128, 8158820, 4103298, 4343359]
3209D343359O041308P691214M221895r4872k813284n527795q022651o659830j108045
3200a928701L302951K984763M47461j333841k887647l705789o14428N149668O091970
3191G506407q35445p772750o388477M77408M113970K221475j018320l221201m819813
3182i736746m490675n54319M607709P194739P210218O198407K842387l419637
3174I852083p592372m819942J375097L585538J531888J208263L998519M551630
3166A3690704K98185m138050m351595k480710l241626p054876r509967o251633
3158b3039568K175278R662915J0133138M782128Q00049J391507J848720j419842
3150F334325m106129j858027J077399j003948m366550j697672M539242N473597
$$ y = [4343359, 10384667, 18075881, 22297776, 22202904, 19389620, 13861825, 5839174, -820656, -1928701, 1374250, 4359013, 4806474, 3472633, 584986, -3120803, -3735231, 1414437, 7506407, 6670962, -1101788, -7490265, -7012857, -2898887, -677412, -1695732, -4916933, -9736746, -14227421, -14781740, -10174031, -2979292, 4230926, 10429333, 13271720, 9852083, 2259711, -2560231, -1185134, 2400404, 3932292, 5140555, 9139074, 13690704, 13988889, 9850839, 5499244, 3018534, -223092, -7277968, -16787935, -23039568, -20864290, -11201375, -1068237, 3713891, 4513940, 5905447, 7754167, 6334325, 2228196, 370169, 1447568, 443620, -3922930, -5620602, -1081360, 4392237]
3142D392237R13135o72006K301387J280055o789180j2026643n957148N583265
3134a0974898J0935669P560423J687562j978098l412303l312332j995560p50025
3126b239562k86816O19833K406267L159730K133904J721527L366666M800257M079952
3117A9761758K899256K700498R87784m441701j0168978j0406368m425965K694753
3109c98963O096637N279278K713363N14285j165041l008186m030560j732654L467212
3100G735371O012389J389714o500152r075223m133442K053835M096311K928462
3092D507265O17987l517760q528984r701004m996870J212471M569558N819873
3084a0017464N807571J741323n799565q223526M96061J2404379J3768913L368184
$$ y = [4392237, 5305372, 4633366, 6934753, 8214808, 1425628, -10601015, -16558163, -10974898, -39229, 7521194, 9208756, 7230658, 3818355, 506023, -1489537, -2239562, -2526378, -1906545, 499722, 3659452, 5793356, 7514883, 10881549, 15681806, 19761758, 22661014, 25361512, 26349296, 21907595, 11738617, 1332249, -3093716, -398963, 5697674, 10976952, 13690315, 14204600, 13039559, 10031373, 6000813, 4268159, 7735371, 13747760, 15137474, 8637322, -437901, -4571343, -2517508, 1578803, 4507265, 5125252, 1607492, -6921492, -16622496, -21619366, -20406895, -15837337, -10017464, -4209893, -2468570, -8268135, -16491661, -15995600, -3591221, 10177692, 13545876]
3076A3545876o039418m992816J930488M927009J735500k441977l452392k164092
3068C048178j490363k542296l779349k986666j00113K372122K459051J189179
3060a830257N50461L79293m92022j204101L4670K313828K684999Q00978j08284
3051C129565J994678M652897M128700M66328k559576k188957J78933J068550p98938
3042A0072180l414904m416508l578550j848231K71353J932003J405840j349360
3034i26177l288989k380714j251219k729414l704892N78770O882846O374594j677698
3025b122893o825480k278140M858277M715524m52098j252385L263027N204114
3017E109946J698041j281313n16626j216494o633598j0048128m101714O709618
$$ y = [13545876, 7506458, 2513642, 4444130, 9371139, 11106639, 8664662, 5212270, 3048178, 1557815, -984481, -4763830, -7750496, -7850609, -5478487, -3019436, -1830257, -1279796, -900503, -1392525, -2596626, -2561956, -248128, 2436871, 3237849, 3129565, 5124243, 9777140, 13905840, 14372168, 11812592, 9623635, 9802568, 10871118, 10072180, 6657276, 2240768, -1337782, -3186013, -2914660, -982657, 423183, -926177, -4215166, -6595880, -7847099, -10576513, -14281405, -13702635, -6819789, -445195, -2122893, -8948373, -11226513, -6368236, -1652712, -2104810, -3357195, -94168, 5109946, 6807987, 5526674, 5010048, 3793554, -2840044, -12888172, -16989886, -10280268]
3009a0280268J0656419M259140l939877n620071k295826k7048R7803J079744K587537
3000c482447R65632l172928l747793J575654O266260L726601k603146l885139
2992d357306J517299O582127O199621K709365K15115m29109N52530L151721M580459
2983B0721822N84304p590732j2644587j0309666m088428J322716N478410Q175514
2975A649353O664252J301489k188695j233518j210814n958986r633718n363700
2967a5974337L095848O569347L549988m3981j052219p51242J031370M929527O975590
2958H329891K947464l541515n452820l294648k931186l880682l0785P689409R921541
2949I756669K606900o975002j0737781q248910k281710N483749J1173907R718290
$$ y = [-10280268, 376151, 4635291, 695414, -4924657, -7220483, -7247531, -7149728, -6069984, -3482447, -2516815, -5689743, -9437536, -7861882, -1595622, 2130979, -472167, -4357306, -2840007, 3742120, 9941741, 12651106, 12866221, 12437112, 12989642, 16141363, 20721822, 21306126, 13715394, 1070807, -9238859, -13327287, -12004571, -6526161, 1649353, 8313605, 9615094, 7426399, 6192881, 4982067, -976919, -10610637, -15974337, -12878489, -6309142, -2759154, -2803135, -3855354, -4606596, -3575226, 1354301, 8329891, 11277355, 7735840, 2283020, -1011628, -3942814, -7823496, -7854281, -164872, 9756669, 12363569, 5388567, -5349214, -13598124, -15879834, -10396085, 777822, 10496112]
2941A0496112L220895M50994L828705N071660j232270q118011o929973q6951M504772
2932A1205933N447195N718322L799751l234817j0673809j0166825k357175L211488
2924B950063J672036j570274q88451J152386m95174m427096m879240m73614M029609
2915b929755M642239K879122K109071K156377O46281j635467r84631K821842M673117
2906A4378196J239559l893728n887131n717731o491257o100184o25935O754789
2898f343422Q345837L451673o93309n66969o16966l592585n208120k565184m533
2889g793578j116025j809636K282629P278393O919570K560710K93299J407773
2881A0023135K378751J728759N78621j431617m642193n714120j639458L922602
$$ y = [10496112, 13717007, 14168001, 17996706, 23068366, 21836096, 13718085, 6788112, 6701161, 11205933, 16653128, 22371450, 26171201, 22936384, 12262575, 2095750, -261425, 2950063, 4622099, 3051825, 2163374, 3315760, 2820586, -1606510, -6485750, -6959364, -2929755, 1712484, 4591606, 6700677, 8857054, 9503335, 7867868, 6883237, 9705079, 14378196, 15617755, 11724027, 5836896, 119165, -6372092, -12472276, -13098211, -6343422, 2002415, 5454088, 4760779, 4193810, 3576844, -15741, -5223861, -7789045, -7793578, -8909603, -10719239, -8436610, -1158217, 5761353, 8322063, 8615362, 10023135, 12401886, 14130645, 14709266, 13277649, 8635456, 2921336, 1281878, 5204480]
2873E204480M342026o31318m795985m482651k324170j732050k294541j751190
2865h465399O21613L388253M062261J508164j571680q63605L129463M422534J29216
2856F360820m422939l290964J367413L279885J185865j630748l509390l972756
2848d632814o76496N946797Q297642O19206r770114j0102666l69964O657574M600321
2839E69486J214438L236973M892745q70624q350675o344513M783216J2730788
2831A1861834R118206j503672r050861q966873m587303j889018l282801n397813
2823a3698301l252896K755322O175424K705282l511097n207626j773850P95994
2815a5011748o57939k120144O74763N193363N723659J835915j166770k141K641151
$$ y = [5204480, 9546506, 8915188, 4119203, -363448, -2687618, -4419668, -6714209, -8465399, -7843786, -4455533, -393272, 1114892, -456788, -1320393, 1809070, 6231604, 6360820, 1937881, -1353083, 14330, 3294215, 4480080, 2849332, -660058, -4632814, -5309310, 637487, 8935129, 9554335, -215779, -10318445, -10688409, -4030835, 569486, 1783924, 5020897, 9913642, 9043018, 692343, -5652170, -868954, 11861834, 20980040, 19476368, 10425507, 1458634, -3128669, -5017687, -8300488, -13698301, -16951197, -14195875, -8020451, -5315169, -8826266, -14033892, -15807742, -15011748, -15669687, -17789831, -17115068, -11921705, -6198046, -4362131, -5528901, -5531042, -2889891]
2806b889891L169557K163013J714154J091777q63893j469533K405148P691815
2798A3012147P658222J417469m815214o929247p181107p395030m874029J079791
2790h026998N009960K906593j332824k463896j771717k432789k334442J165552
2782i280561M045525J625664k085690l67410L847782J957345n378229q222737
2774a3858311k773311L739694N358759M677897N089849N072659L670434L138285
2766A4115955K607800k388115j0230670j1907101m356655L391003L402465J88778
2758e176540J829795O813254P862810L737158p11173k640926k675897j527402
2750G511079p37051k939596o422852m700822K812344O314128l74961p947158m202134
$$ y = [-2889891, 279666, 2442679, 4156833, 5248610, 4384717, 2915184, 5320332, 13012147, 20670369, 22087838, 17272624, 10343377, 3162270, -4232760, -9106789, -8026998, -3017038, -110445, -1443269, -3907165, -5678882, -8111671, -10446113, -9280561, -5235036, -3609372, -5695062, -6062472, -2214690, -257345, -5635574, -13858311, -16631622, -12891928, -7533169, -2855272, 2234577, 7307236, 10977670, 14115955, 16723755, 14335640, 4104970, -7802131, -12158786, -8767783, -5365318, -5176540, -3346745, 3466509, 11329319, 15066477, 14355304, 11714378, 9038481, 7511079, 6774028, 3834432, -2588420, -7289242, -4476898, 1837230, 1462269, -6484889, -10687023]
2741a0687023O577225R350403J027253n977692l636446J457875J726825P37422
2733E75842M694992J0296985R345207Q90781q129107j1764354r399962l550916
2725g040532K031346L655541J086148j391730k87489K217682J895469n20259q9755
2716A556421M508863P916442M819519k685561p259146n192551k92374J844572
2708E216185O44018p63362j455555l106745n018635l891749k3991J240969k717164
2699i876029o925055n695243n49941L491536N961807R194230J1235554P997574
2691A4834433J697540o78803J632752J397458m637792r209673m937119M180803
2683D279599P942023L617281j875447k529196o9965R24326O2598L41041K527068
$$ y = [-10687023, -4109798, 5240605, 6267858, 290166, -3346280, -1888405, -161580, 575842, 5270834, 15567819, 24913026, 25803807, 17674700, 5910346, -3489616, -7040532, -5009186, -1353645, -267497, -1659227, -1946716, 270966, 2166435, 1646176, 1556421, 6065284, 13981726, 18801245, 16115684, 8856538, 3663987, 3371613, 5216185, 5860203, 5096841, 3641286, 534541, -4484094, -8375843, -8399834, -7158865, -9876029, -16801084, -22496327, -23046268, -19554732, -13592925, -4398695, 6836859, 14834433, 16531973, 15853170, 17485922, 18883380, 14245588, 5035915, 98796, 4279599, 12221622, 15838903, 13963456, 11434260, 11364295, 12288621, 12351219, 12692260, 15219328]
2674A5219328L585204Q61057m257633q027734q581323o843434l839830L92907
2666a1491458M643177O115807M140071K000051K492678L632186J966425j506720
2658A1992217k771596j274246m19413j395398j180554J847842M448515L001196
2650A4248563j585686n714609p269428n846999j579216L428794M688000o2729
2642C06690o602638p798748j730071O001714Q588926M916092n84803l563826l744691
2633d211355l413215l406001k158207J150167M199196L816840P7532l420381l423846
2624a0789270j75931L205751L688643R82684k004368j918396J182657L776487
2616b051743L464934J823160J132874N08862j885377m504015m082142j004813
$$ y = [15219328, 18804532, 19665589, 15407956, 7380222, -1201101, -8044535, -11884365, -11491458, -6848281, -732474, 3407597, 5407648, 7900326, 11532512, 13498937, 11992217, 9220621, 7946375, 7526962, 6131564, 4951010, 6798852, 11247367, 14248563, 12662877, 6948268, -321160, -6168159, -7747375, -4318581, 369419, 306690, -6295948, -14094696, -15824767, -9823053, -1234127, 3681965, 3097162, -466664, -4211355, -7624570, -11030571, -13188778, -12038611, -7839415, -4022575, -3945043, -7365424, -10789270, -10965201, -7759450, -4070807, -3088123, -5092491, -7010887, -5828230, -2051743, 1413191, 3236351, 4369225, 4878087, 2992710, -1511305, -5593447, -6598260]
2608f598260P72544o96286l228304m196995l035339O3469M199346O134590K966514
2599c618721k332229k641810L664815R097903O492635j470221o371395n011785
2591b190808j351434J098918L265866O056935O746001K775436l352561o313388
2583F734965m539782j791287j575469k531039j418208J054247J005934j958833
2575e019472l105166K51228L711987J888133l057187l962479J196938O761982
2567a334036P226555L118689j664921m237640l498478m83590J032112j928905
2559a770214o634483p355403l542828l18765J30052J601846O094576R289825P448002
2550D942608L031810o98569m760981r037706q080276N12227Q654461P259830k75864
$$ y = [-6598260, -5825716, -6522002, -9750306, -13947301, -16982640, -16919171, -12719825, -6585235, -3618721, -5950950, -8592760, -4927945, 4169958, 10662593, 9192372, 2820977, -2190808, -3542242, -2443324, 822542, 6879477, 13625478, 16400914, 13048353, 6734965, 2195183, 403896, -1171573, -3702612, -5120820, -4066573, -3060639, -5019472, -8124638, -7873410, -4161423, -2273290, -5330477, -9292956, -8096018, -1334036, 5892519, 9011208, 7346287, 3108647, -389831, -873421, 158691, -1770214, -8404697, -15760100, -19302928, -19621693, -19491641, -17889795, -11795219, -2505394, 4942608, 7974418, 7275849, 2514868, -6522838, -14603114, -14090887, -5436426, 1823404, 1547540]
2541A547540l061255J098919M211115K117004k41134P93451J608197o53900k336115
2532E083822k53386K365945K058283J413554L578262N396754K315059l381042
2524A8577251n613918l642553k095290l014888l611636j984629j14948j91880
2516a692491j601047k556126k097213j4039K885331M344091K818072L857j109144
2507I81291m22793l04038j173153o89609K114194M949437N655102M794455L482930
2498A9387816J171335k403080n055312m484941j898711j040775l613497p154991
2490e092156p720283l899474J914334N886048O391813N136355M158959K552589
2482I328185j918244q019673j0688432o969513j23342M193886L990359R43209
$$ y = [1547540, -1513715, -414796, 3796319, 5913323, 5672189, 6465640, 8073837, 7419937, 5083822, 4830436, 7196381, 9254664, 10668218, 14246480, 19643234, 21958293, 18577251, 12963333, 9320780, 7225490, 4210602, 598966, -1385663, -1500611, -1692491, -3293538, -5849664, -7946877, -7960916, -5075585, -731494, 2086578, 2090435, 981291, 558498, 254460, -918693, -1608302, 505892, 5455329, 11110431, 15904886, 19387816, 20559151, 18156071, 13100759, 8615818, 6717107, 5676332, 2062835, -5092156, -12812439, -16711913, -14797579, -8911531, -2519718, 2616637, 6775596, 9328185, 7409941, -609732, -11298164, -18267677, -18391019, -14197133, -10206774, -9263565]
2474i263565l407295p714800q389105k149961P962804J3513758J0065325K619479
2466C236640r17889Q69914L144373K412244k3745j704960k390752k846795k745058
2457i66028j209640J552953L916485L798200L25175m662250p371205n437356j19534
2448a0173200N547916R488843J0354263O743232n83087p127835q729033o626071
2440a104972n025965m202597n93934N592931Q184672L444918l389995m304620
2432a399562R72050N131378L307087j353537l098643j199807K27483j366491l473529
2423b253571k324549J437017L236151R94916j571494j73412L613705M604234J766369
2414I329366n54275K84655J304501q34198m171024m058225N61190N991307P651242
$$ y = [-9263565, -12670860, -20385660, -28774765, -30924726, -22961922, -9448164, 617161, 3236640, 2318751, 3188665, 6333038, 8745282, 8721537, 7016577, 4625825, 1779030, -966028, -2175668, -622715, 3293770, 7091970, 7417145, 2754895, -4616310, -10053666, -10173200, -4625284, 4863559, 15217822, 21961054, 21377967, 14250132, 5521099, -1104972, -6130937, -10333534, -10927468, -5334537, 2850135, 6295053, 2905058, -1399562, -427512, 4703866, 8010953, 6657416, 3558773, 2358966, 2586449, 1219958, -2253571, -4578120, -3141103, 95048, 1089964, -481530, -654942, 2958763, 7562997, 9329366, 8775091, 9059746, 10364247, 9530049, 5359025, 1300800, 1861990, 7853297, 15504539]
2405A5504539L732305l164119p013924l767131K760370L805504l219749j0294691
2397a656896q966682j343492L861133L364251J386158J139717R95966j21176L16951
2388a024070L555645O148002M549872J02708l397376m742379n086690m500124
2380d394412k045236J155286J955493p12492l631101k872337J082231L753668
2372e708900K611477M26258R19235L082063L136576J019398M13480K085745K260341
2363A0245673p37623l340881k967183k301997l651910m123534j309105J117404
2355g069156m93017k663283j013013P78013k708708o692533j755795R533289J3720306
2346A636103O224053j875463j258149K651436J033544l809975m487618j780333
$$ y = [15504539, 19236844, 16072725, 9058801, 5291670, 8052040, 11857544, 8637795, -1656896, -10623578, -11967070, -8105937, -4741686, -3355528, -2215811, -1219845, -1341021, -1024070, 2531575, 8679577, 13229449, 13332157, 9934781, 5192402, 105712, -4394412, -6439648, -5284362, -3328869, -4041361, -7672462, -10544799, -9462568, -5708900, -3097423, -2671165, -1751930, 1330133, 4466709, 5486107, 5899587, 7985332, 10245673, 9508050, 6167169, 3199986, 897989, -2753921, -6877455, -8186560, -7069156, -7562173, -10225456, -11238469, -10460456, -13169164, -19861697, -21617492, -12084203, 1636103, 7860156, 5984693, 4726544, 7377980, 8411524, 4601549, 113931, -1666402]
$$ [...]
##END NTUPLES=NMR SPECTRUM
##END=
