##TITLE=31Pdec_DE-95_0il2
CDCl3, 24 sc
 5.8.2025
##JCAMPDX= 6.0         $$ Bruker NMR JCAMP-DX V2.0
##DATA TYPE= NMR SPECTRUM
##DATA CLASS= NTUPLES
##ORIGIN= UXNMR, Bruker Analytische Messtechnik GmbH
##OWNER= root
$$ XWIN-NMR		Version 3.5
$$ Tue Aug  5 14:05:31 2025 Russian Standard Time (UT+4h)  she@DPX200
##.OBSERVE FREQUENCY= 81.013821
##.OBSERVE NUCLEUS= ^31P
##.ACQUISITION MODE= SIMULTANEOUS
##.ACQUISITION SCHEME= undefined
##.AVERAGES= 64
##.DIGITISER RES= 17
##SPECTROMETER/DATA SYSTEM= spect
##.PULSE SEQUENCE= zgpg30
##.SOLVENT NAME= CDCl3
##.SHIFT REFERENCE= (INTERNAL, CDCl3, 0, 198.062)
##AUDIT TRAIL= $$ (NUMBER, WHEN, WHO, WHERE, WHAT)
$$ ##TITLE= Audit trail, XWIN-NMR		Version 3.5
$$ ##JCAMPDX= 5.01
$$ ##ORIGIN= Bruker BioSpin GmbH
$$ ##OWNER= she
$$ F:/spectra/data/she/nmr/P31/2/pdata/1/auditp.txt
$$ ##AUDIT TRAIL=  $$ (NUMBER, WHEN, WHO, WHERE, WHAT)
(   1,<2025-08-05 14:04:40.20 +0400>,<she>,<DPX200>,
      <created by zg, POWCHK disabled, PULCHK disabled
       configuration hash MD5:
       00 E9 B6 7A A2 85 ED C7 34 08 36 98 17 FE 4E 26
       data hash MD5: 32K
       F3 55 25 58 04 4D 21 6D 11 EB 9D 0E 34 CB 96 9C>)
(   2,<2025-08-05 14:04:42.70 +0400>,<she>,<DPX200>,
      <Start of raw data processing
       efp BC_mod = 2 LB = 1.5 FT_mod = 6 PKNL = 1 PHC0 = 1456.651 PHC1 = -44.50122 SI = 64K 
       data hash MD5: 64K
       1B C7 0D E9 D0 24 0E C1 D3 47 ED 70 DE A6 6D 32>)
(   3,<2025-08-05 14:04:58.32 +0400>,<she>,<DPX200>,
      <pk PHC0 = -5.200748 PHC1 = 0 
       data hash MD5: 64K
       21 6D 01 72 A4 1B 62 D2 E2 4A ED AF 5F 04 5B A7>)
(   4,<2025-08-05 14:05:04.34 +0400>,<she>,<DPX200>,
      <abs ABSG = 5 
       data hash MD5: 64K
       22 BB 06 BC FB 13 D6 80 89 5F 14 15 AF 04 D9 BF>)
$$ ##END=
$$ 
$$ hash MD5
$$ 8C DB A1 43 EE 58 16 E2 E6 8C 58 11 A7 03 F1 CE
##$RELAX= 
##$RELAX= 
##$RELAX= 
##$RELAX= 
##$RELAX= 
##$RELAX= 
##$RELAX= 
##$RELAX= 
$$ Bruker specific parameters
$$ --------------------------
##$DU= <F:/spectra>
##$EXPNO= 2
##$NAME= <P31>
##$PROCNO= 1
##$TYPE= <nmr>
##$USER= <she>
##$AMP= (0..31)
100 100 100 100 100 100 100 100 100 100 100 100 100 100 100 100 100 100 
100 100 100 100 100 100 100 100 100 100 100 100 100 100 
##$AQSEQ= 0
##$AQ_mod= 1
##$AUNM= <au_zg>
##$AUTOPOS= <>
##$BF1= 81.014009
##$BF2= 200.13
##$BF3= 200.13
##$BF4= 200.13
##$BF5= 200.13
##$BF6= 200.13
##$BF7= 200.13
##$BF8= 200.13
##$BYTORDA= 1
##$CFDGTYP= 0
##$CFRGTYP= 5
##$CHEMSTR= <none>
##$CNST= (0..31)
1 1 145 1 1 1 1 1 1 1 1 1 1 1 1 1 1 1 1 1 1 1 1 1 1 1 1 1 1 1 1 1 
##$CPDPRG= <waltz16>
##$CPDPRG1= <>
##$CPDPRG2= <waltz16>
##$CPDPRG3= <>
##$CPDPRG4= <mlev>
##$CPDPRG5= <mlev>
##$CPDPRG6= <mlev>
##$CPDPRG7= <mlev>
##$CPDPRG8= <mlev>
##$CPDPRGB= <>
##$CPDPRGT= <>
##$D= (0..31)
0 1 0 0 0 0 0 0 0 0.06 0 0.03 2e-05 3e-06 0 0 0.0002 0 0 0 0 0 0 0 0 0 
0 0 0 0 0 0 
##$DATE= 1754388279
##$DBL= (0..7)
120 120 120 11 120 120 24 19 
##$DBP= (0..7)
150 150 150 150 150 150 150 150 
##$DBP07= 0
##$DBPNAM0= <>
##$DBPNAM1= <>
$$ [...]
##$SUBNAM3= <"">
##$SUBNAM4= <"">
##$SUBNAM5= <"">
##$SUBNAM6= <"">
##$SUBNAM7= <"">
##$SUBNAM8= <"">
##$SUBNAM9= <"">
##$SW= 400.765351723535
##$SWIBOX= (0..15)
0 1 3 0 0 0 0 0 0 0 0 0 0 0 0 0 
##$SW_h= 32467.5324675325
##$TD= 32768
##$TD0= 1
##$TE= 0
##$TE2= 300
##$TE3= 300
##$TEG= 300
##$TL= (0..7)
0 120 53 12 22 120 120 120 
##$TP= (0..7)
150 150 150 150 150 150 150 150 
##$TP07= 0
##$TPNAME0= <>
##$TPNAME1= <>
##$TPNAME2= <>
##$TPNAME3= <>
##$TPNAME4= <>
##$TPNAME5= <>
##$TPNAME6= <>
##$TPNAME7= <>
##$TPOAL= (0..7)
0.5 0.5 0.5 0.5 0.5 0.5 0.5 0.5 
##$TPOFFS= (0..7)
0 0 0 0 0 0 0 0 
##$TUNHIN= 0
##$TUNHOUT= 0
##$TUNXOUT= 0
##$USERA1= <user>
##$USERA2= <user>
##$USERA3= <user>
##$USERA4= <user>
##$USERA5= <user>
##$V9= 5
##$VALIST= <valist>
##$VCLIST= <CCCCCCCCCCCCCCC>
##$VD= 0
##$VDLIST= <DDDDDDDDDDDDDDD>
##$VPLIST= <PPPPPPPPPPPPPPP>
##$VTLIST= <TTTTTTTTTTTTTTT>
##$WBST= 1024
##$WBSW= 4
##$XGAIN= (0..3)
0 0 0 0 
##$XL= 0
##$YL= 0
##$YMAX_a= 6104
##$YMIN_a= -17121
##$ZGOPTNS= <>
##$ZL1= 120
##$ZL2= 120
##$ZL3= 120
##$ZL4= 120
##$ABSF1= 198.0616
##$ABSF2= -202.7028
##$ABSG= 5
##$ABSL= 3
##$ALPHA= 0
##$AQORDER= 0
##$ASSFAC= 0
##$ASSFACI= 0
##$ASSFACX= 0
##$ASSWID= 0
##$AUNMP= <proc_1d>
##$AZFE= 0.1
##$AZFW= 0.5
##$BCFW= 0
##$BC_mod= 2
##$BYTORDP= 0
##$COROFFS= 0
##$CY= -3
##$DATMOD= 1
##$DC= 0
##$DFILT= <>
##$DTYPP= 0
##$F1P= 0
##$F2P= 0
##$FCOR= 1
##$FTSIZE= 65536
##$FT_mod= 6
##$GAMMA= 0
##$GB= 0
##$INTBC= 1
##$INTSCL= 9.790993e-09
##$ISEN= 30
##$LB= 1.5
##$LEV0= 0
##$LPBIN= 0
##$MAXI= 10000
##$MC2= 0
##$MEAN= 0
##$ME_mod= 0
##$MI= 50
##$NCOEF= 0
##$NC_proc= -9
##$NLEV= 6
##$NOISF1= 182.463
##$NOISF2= 159.3651
##$NSP= 0
##$NTH_PI= 0
##$NZP= 0
##$OFFSET= 198.0616
##$PC= 4
##$PHC0= 1451.45
##$PHC1= -44.50122
##$PH_mod= 1
##$PKNL= yes
##$PPARMOD= 0
##$PSCAL= 0
##$PSIGN= 0
##$REVERSE= no
##$SF= 81.0140089999434
##$SI= 65536
##$SIGF1= 159.3651
##$SIGF2= -187.1042
##$SINO= 113.3802
##$SIOLD= 16384
##$SREGLST= <1H.CDCl3>
##$SSB= 0
##$STSI= 65536
##$STSR= 0
##$SW_p= 32467.5324675325
##$SYMM= 0
##$S_DEV= 0
##$TDeff= 32768
##$TDoff= 0
##$TI= <>
##$TILT= no
##$TM1= 0
##$TM2= 0
##$TOPLEV= 0
##$USERP1= <user>
##$USERP2= <user>
##$USERP3= <user>
##$USERP4= <user>
##$USERP5= <user>
##$WDW= 1
##$XDIM= 65536
##$YMAX_p= 522618624
##$YMIN_p= -167904487
$$ End of Bruker specific parameters
$$ ---------------------------------
##NTUPLES= NMR SPECTRUM
##VAR_NAME=  FREQUENCY,     SPECTRUM/REAL,   SPECTRUM/IMAG
##SYMBOL=    X,             R,               I
##VAR_TYPE=  INDEPENDENT,   DEPENDENT,       DEPENDENT
##VAR_FORM=  AFFN,          ASDF,            ASDF
##VAR_DIM=   65536,         65536,           65536
##UNITS=     HZ,            ARBITRARY UNITS, ARBITRARY UNITS
##FACTOR=    0.49542278885378, 1,            1
##FIRST=     16045.7642231865, 0,            0
##LAST=      -16421.768244346, 0,            0
##MIN=       -16421.768244346, -167904487,   0
##MAX=       16045.7642231865, 522618624,    0
$$ Real data points
##PAGE= N=1
##DATA TABLE= (X++(R..R)), XYDATA
$$ [...]
46171 7463031 4362364 -1807997 -5762474 -4848790 -371198 4954094 8415673 7542249
46163 7542249 2091643 -4467578 -7985441 -7862879 -6142444 -3402004 1373974 7319112
46155 7319112 11521634 12681571 12016916 10297219 7085668 3434366 2135898 4356334
46147 4356334 8796727 14641504 21736930 26921864 24707678 14422322 3169563 -1825167
46139 -1825167 -1379039 -1496409 -4545585 -7222101 -6093895 -1289693 4941569 9883477
46131 9883477 10622754 5931660 -1738488 -8809717 -15022356 -22121360 -28130512 -27480585
46123 -27480585 -18862010 -8939709 -4716446 -4989745 -3750983 -306340 -324887 -6085988
46115 -6085988 -11332753 -9442818 -3118144 -1025289 -6043510 -11765509 -11254825 -4977259
46107 -4977259 1722302 5295697 5282099 1830052 -4057083 -8812495 -8530552 -3291041 2955259
46098 2955259 6739217 7415045 5949881 4091411 4263512 6994588 8165206 2247118
46090 2247118 -10529011 -23109440 -29091621 -28693880 -25967169 -23062775 -19586661 -15295699
46082 -15295699 -10598904 -5616492 -1019104 1207903 -148642 -3432576 -5579757 -4754462
46074 -4754462 -669435 5654844 10834348 10345737 3686154 -3481060 -5620418 -4538475
46066 -4538475 -6723927 -14063489 -21065342 -21886819 -16896299 -11112169 -8421746 -8319515
46058 -8319515 -6757324 -54232 10206291 16649632 13391746 3843102 -2384743 -1234455
46050 -1234455 1167110 -2256287 -9692102 -13747590 -11921987 -8829065 -8643643 -10105220
46042 -10105220 -9981156 -7494054 -3316399 2628935 9398143 13061930 10082459 2358027
46034 2358027 -4074505 -5794821 -4885080 -4345423 -3598337 -792423 2491031 2025374 -3965507
46025 -3965507 -12957458 -21118141 -25733626 -25009199 -18815582 -10554835 -5151718 -3394475
46017 -3394475 -780091 6035689 14101173 18074177 17210517 15267424 14686161 14215740 11928565
46008 11928565 7638126 2349206 -2155877 -3316389 -16559 5024220 7427654 5798210
46000 5798210 2015639 -2604653 -8347546 -14238932 -17649994 -17744603 -16339014 -14381283
45992 -14381283 -10804635 -6201819 -4028494 -5715258 -7634292 -5990070 -2343495 -821177
45984 -821177 -1578849 -1025616 1930227 3676018 820449 -5206983 -9623965 -9032089 -4255387
45975 -4255387 337067 176446 -5531418 -12768403 -16401030 -14853579 -10400539 -5603582
45967 -5603582 -1277340 2026240 2730105 -73090 -4470961 -6782239 -5043511 -738036
45959 -738036 3341275 6307690 9188122 11787105 11320507 5621370 -3324535 -10896304
45951 -10896304 -14293168 -13573619 -9280023 -2354391 3641240 4465485 1026947 -607358
45943 -607358 2330227 4610440 800591 -5327966 -4861722 3722713 11848005 11619647 4507739
45934 4507739 -2539835 -5387519 -4327140 -834794 3388646 5653850 4194838 816328
45926 816328 -901056 -327211 -623286 -4039051 -7926755 -7087903 -84266 8007485 10251885
45917 10251885 5242756 -1228856 -2462270 2164273 7443108 8576006 5532880 1657792
45909 1657792 -136420 517938 1653222 894787 -1713130 -2832818 713418 7442023
45901 7442023 11845241 10100118 3723418 -2911351 -6968158 -8174548 -7234450 -5023826
45893 -5023826 -2803169 -1787947 -2212933 -3103994 -3033550 -1576222 -519544 -2617481 -7680902
45884 -7680902 -10958441 -8016784 -978995 3235458 1540869 -1685857 -1045334 3040575
45876 3040575 6334948 6910919 6073040 4899579 3194940 1063223 -1289301 -4602834
45868 -4602834 -8761768 -10806490 -7883851 -1878835 2134977 2413023 2526678 6027447
45860 6027447 11744340 15658913 15607269 12983393 11003983 11820975 14216617 14229169 9524417
45851 9524417 2648887 -2107111 -4288809 -6599873 -9103995 -8553426 -4711988 -2766782
45843 -2766782 -6439434 -12157415 -13846659 -11180737 -9029563 -10080356 -12188183 -12906978
45835 -12906978 -12934311 -14115247 -16482760 -18320001 -17834027 -14427110 -9339587 -4924767
45827 -4924767 -2474754 -1312287 -450476 534692 3036293 8819165 15677302 17126857
45819 17126857 10508440 2649532 2117893 7663531 10689892 8331995 6427110 8418386
45811 8418386 9610149 6218673 2732074 4443257 8247178 7477098 1822800 -4317973
45803 -4317973 -10014660 -16869790 -22092620 -20498559 -12963600 -5535696 -181366 5928796
45795 5928796 11430885 10059584 1986644 -2625982 3133327 12729455 15566664 11313017
45787 11313017 7593581 7127900 5475612 551777 -3399975 -2663068 891072 3451956
45779 3451956 3677957 1841393 -1574062 -4447582 -3308485 2695942 10051042 14674782
45771 14674782 15880111 15500274 14802418 13436925 10161305 3950469 -4148847 -9881642
45763 -9881642 -8589703 -379787 8859106 12580739 8816577 375512 -7920672 -11331988
45755 -11331988 -7073594 3423250 14743593 21523080 22042400 17477393 9251755 -1146859
45747 -1146859 -10684592 -15496881 -13979426 -8575412 -4089764 -4072451 -8222134 -12828452
45739 -12828452 -14059814 -11193765 -6554547 -2594487 147915 2302139 4083926 4866555
45731 4866555 3451976 -1374999 -9293258 -17082059 -20443649 -18254079 -13699101 -10001020
45723 -10001020 -6540882 -1267690 4154362 4802978 -1055364 -8448263 -10678557 -6832317
45715 -6832317 -2339710 -2228295 -5709232 -8096599 -6584128 -2873723 -914946 -3258841
45707 -3258841 -8936767 -13532715 -12112052 -4216403 4179195 6077686 1235030 -3974540
45699 -3974540 -5102712 -4729797 -7104410 -11065684 -11913844 -8238480 -2871573 1729253
45691 1729253 4839039 4881070 278303 -6376357 -9295678 -6201195 -637520 3711717
45683 3711717 7263560 11080791 12880058 9763450 2776014 -4107199 -8022635 -8121457
45675 -8121457 -4387696 1799919 7229652 9442833 9132825 8628060 9251102 11051585 12746934
45666 12746934 10623723 1027129 -13208490 -22329546 -20121196 -12448590 -10307209 -15778210
45658 -15778210 -20476574 -17595099 -9319019 -814747 7239367 16462160 25014245 28451865
45650 28451865 25032758 17326285 9498980 5007938 5618952 10151416 14538349 15032319
45642 15032319 11474019 6612932 2905253 951007 185005 -169172 -227552 1392238 6353746
45633 6353746 13072282 15842191 10350440 -32101 -6480039 -4345017 2032702 5893341
45625 5893341 6614130 8122854 10629019 9588779 4042358 311444 3363915 8611557
45617 8611557 8106375 2719353 1234054 7100198 13065339 11527360 4337032 -1486672
45609 -1486672 -2874346 -874287 4172162 11810944 18182705 19262488 16357869 13586556
45601 13586556 11103424 5999443 -955966 -5304672 -5905277 -6329056 -8217970 -8713152
45593 -8713152 -6379761 -4478040 -5373363 -6057917 -2989336 1713901 2907782 -376819
45585 -376819 -3802419 -3287259 627259 3908854 3369465 -6398 -2014970 -205930 2947584
45576 2947584 3647825 2393961 2935506 6312263 9864583 12131294 14218769 15642415
45568 15642415 13879896 9821391 8549289 11834345 14477193 11584471 5301402 496634
45560 496634 -2112031 -3943301 -3546941 628430 5057560 4836700 1295956 194871 2914932
45551 2914932 5055724 3988035 2401170 3178842 5417436 7297571 9175230 11890946
45543 11890946 14817978 17193003 19121827 20196582 19418616 17423507 16375616 16539392
45535 16539392 15247065 10650943 4614053 488797 -399648 1282918 4922766 10047746
45527 10047746 14805927 16153683 12621790 6674105 3138129 4230041 6854293 6598753
45519 6598753 3799113 2620025 3865673 2880226 -3238281 -10240100 -12056598 -8520861
45511 -8520861 -3839321 -65377 3304935 5488349 5529907 5903982 9428572 13300870 12015638
45502 12015638 6135009 2028003 2123161 1753933 -2381623 -6757580 -7275305 -5951801 -7361846
45493 -7361846 -11792952 -15437489 -15050156 -10168322 -3275150 795182 -976155 -4887542
45485 -4887542 -4090860 1308029 3202534 -2567561 -9290325 -9162223 -4377940 -2073432
45477 -2073432 -2850304 -2250881 -731181 -3196093 -9016275 -11174908 -7138478 -3167761
45469 -3167761 -4759195 -8921274 -9797595 -7012843 -3919020 -1202055 2713440 6761501
45461 6761501 7472454 3830479 -1634212 -6650050 -10923578 -13421444 -11019851 -2122278
45453 -2122278 9633603 17638007 18619574 15316122 12276627 10365489 6891511 405728
45445 405728 -6820377 -11538884 -12986721 -12807137 -12961795 -14474364 -16642567 -16574774 -11446691
45436 -11446691 -2758413 3522626 3206121 -1152923 -3809838 -2999461 -1703730 -2147443
45428 -2147443 -3051668 -2877792 -2803574 -4980902 -9494837 -14180775 -16349749 -14151241 -7748948
45419 -7748948 -327035 3013448 -993404 -10441558 -18958011 -20663300 -15389849 -8754702
45411 -8754702 -5981636 -6037048 -3738699 2585755 8661252 10469984 9388789 8699464 8084009
45402 8084009 5171828 441010 -3344882 -5282808 -6222739 -5762980 -3262082 -681558
45394 -681558 -66345 762352 4845359 8982545 6308720 -2872322 -9180794 -5991502 2137385
45385 2137385 6476715 4940648 1523174 -1286556 -4274914 -7704176 -10539221 -12628138
45377 -12628138 -13922755 -12369109 -6113113 2608027 8770582 9523826 5749218 -156522
45369 -156522 -5473898 -7433823 -5433090 -2315154 -858591 -239016 1035113 487285 -5453555
45360 -5453555 -14594847 -20142857 -19582828 -17694718 -18976464 -21404723 -20487648 -16030963
45352 -16030963 -11399428 -8308885 -5921890 -3998457 -3657950 -5027796 -6452299 -6377690
45344 -6377690 -4715159 -2396492 -562600 171310 534729 2111815 5119353 7375009
45336 7375009 6491129 2416150 -3121951 -8689515 -13328667 -15596514 -14215655 -9458461
45328 -9458461 -2653143 5089537 12274233 16175200 15042928 11038298 8442556 8408779
45320 8408779 7871696 4565806 486848 -1605865 -2951101 -6954474 -13274885 -16884709
45312 -16884709 -13929925 -6577863 -794593 -241764 -3255313 -5259990 -3411877 1003791
45304 1003791 4430940 5058038 4332369 4130686 3736468 1281480 -2663829 -5419395 -6041629
45295 -6041629 -5972047 -5270657 -1799316 3743509 5632456 126356 -7549253 -8570152 -2582447
45286 -2582447 1215243 -3248953 -10393319 -10936318 -4745037 -638629 -4574947 -12806918
45278 -12806918 -17398667 -14949706 -8467166 -3035032 -1201668 -1356132 199403 4552250
45270 4552250 7583338 4092885 -5000948 -12125532 -11304380 -4912721 -164805 -685668
45262 -685668 -4388998 -8414298 -12096287 -14362336 -12169615 -4498188 4004518 6710331
45254 6710331 2348547 -3660307 -5633684 -3469635 -1233975 -1576741 -3165209 -3149062 -816165
45245 -816165 1467412 506633 -4499062 -10781951 -14412735 -14093156 -11930737 -10135213 -8047104
45236 -8047104 -3536307 3459666 10360246 14638825 15498341 12897776 6943066 -867173
45228 -867173 -7514284 -11147041 -12896505 -14388270 -14245432 -9366118 -28262 8408157
45220 8408157 10390523 5795703 -700671 -5126562 -7247165 -8249926 -7937445 -5918218
45212 -5918218 -4077177 -5245299 -9326305 -12882923 -13232471 -11114143 -8363583 -4932703
45204 -4932703 -22548 5258823 8649620 9512080 8819871 6888572 3344498 -830109
45196 -830109 -3562916 -4297601 -4362340 -4644501 -5033613 -6043642 -8082202 -8867148 -5352549
45187 -5352549 379816 1219434 -6137529 -15934361 -20632242 -20324032 -20051003 -20293775 -16902782
45178 -16902782 -10348178 -7691791 -12358155 -17627370 -14934377 -5064828 3792603 6905482
45170 6905482 6785947 7049563 7779587 7916187 7837942 7500534 5282761 1216528 -1122248
45161 -1122248 974527 4554092 4148869 -386652 -2552520 2906874 13086124 19888670
45153 19888670 18625862 11475247 3013980 -4786691 -11885700 -16726815 -16512021 -11343950
45145 -11343950 -5859287 -4795900 -7424333 -8186912 -3374862 4160533 7933395 4527842
45137 4527842 -3844769 -12649507 -18867631 -21530921 -20861613 -18362105 -16343919 -15709347
45129 -15709347 -14981798 -12802953 -10196168 -8505188 -6306950 -1279687 5075790 7857704
45121 7857704 5009555 538708 -144232 3808232 8912720 11677177 10887010 7425296
45113 7425296 4277425 5464397 12090957 19615089 21353150 14964095 4075150 -5895269
45105 -5895269 -11542807 -11883571 -8099051 -3633237 -2080548 -3645019 -5181474 -4510541
45097 -4510541 -2979724 -2854850 -4079498 -5135409 -5666724 -6463869 -7640217 -8335724 -7676739
45088 -7676739 -4933583 207806 5828842 7217043 876213 -10360606 -18534092 -18431786
45080 -18431786 -13058727 -9750011 -11740248 -15590050 -16792501 -15400761 -14652473 -15766000
45072 -15766000 -16597138 -15130918 -11854597 -8098432 -4344176 -1596946 -2398567 -7964489
45064 -7964489 -15038770 -17985461 -14141158 -5460845 4824771 14840696 22953382 26672536
45056 26672536 24687596 19009791 13382454 9717905 7082347 3979009 631522 -1288087
45048 -1288087 -740576 1329542 2968988 3434002 3836253 5255419 6881651 6671579 3308455
45039 3308455 -2898039 -9827622 -13370436 -9467966 1046487 10792044 12413489 6781136
45031 6781136 1329943 69661 -462679 -3778558 -6818625 -4828721 247318 1367658
45023 1367658 -4560247 -13756264 -21503843 -26405169 -27766155 -23403153 -13170553 -2032088
45015 -2032088 3920094 3913919 2649689 4364059 8781674 13014220 15428616 16493206 16870932
45006 16870932 16399719 15431763 15958711 19643068 24417886 24889607 17987877 7540376
44998 7540376 1007032 1285831 3654645 1689183 -5477975 -12986295 -15654953 -11726336
44990 -11726336 -2652758 7863935 14601166 13791810 7373652 2677249 5543044 13949441
44982 13949441 20168382 19367976 14538856 12319870 15286136 19574079 19512429 13254484
44974 13254484 3740268 -4707761 -9829036 -11862299 -11758006 -9918652 -6682657 -3097682
44966 -3097682 -372490 1173549 1834772 1424424 -380787 -2408144 -2147145 1342157 5482084
44957 5482084 6518129 3758404 490029 473892 4111816 8237969 9337163 6824996
44949 6824996 3187387 931779 26874 -791954 -898084 1831021 6913979 9937387 7199304
44940 7199304 206945 -6394176 -10058936 -11210407 -9986662 -5192204 3236886 12932976
44932 12932976 20765373 24628305 24152882 21293773 19349862 19429512 19071989 16704955 15403011
44923 15403011 18167222 21168978 17568655 8162169 1885844 3986641 9779109 12822317
44915 12822317 12889951 11551088 6226501 -4600871 -14752820 -16856409 -13247766 -12630271
44907 -12630271 -16749595 -18307355 -12939909 -5714896 -3186460 -5437032 -9558276 -15480542
44899 -15480542 -23404842 -29094367 -27303458 -18998324 -11156721 -9262669 -12380205 -15450043
44891 -15450043 -14403968 -9042852 -2754112 -135084 -3895900 -12740737 -21506205 -23979461
44883 -23979461 -17605602 -6463295 2087697 5122570 6536771 9799151 11299540 5186845
44875 5186845 -6934573 -16635707 -19006339 -17012579 -14643561 -11488481 -6775641 -3687970
44867 -3687970 -5411092 -9945801 -12673125 -11919299 -8837649 -4154028 1245650 4107171
44859 4107171 1146082 -6508196 -13730548 -16158010 -13130830 -6948895 -827318 3424796
44851 3424796 6960424 11881931 17020548 18176129 13808207 7518710 3033266 58527
44843 58527 -2383472 -2395180 1024154 3888568 1830916 -3350311 -6618068 -7183550 -7556673
44834 -7556673 -6624819 -348753 10181856 17595790 17000792 11053425 4542138 -1340270
44826 -1340270 -6954904 -10835762 -11725842 -11209484 -11415778 -12067676 -11969308 -11555729 -12116927
44817 -12116927 -14045905 -16913229 -19332922 -18278890 -11574757 -2009577 4630474 7087200
44809 7087200 9878966 14529472 14610625 4653884 -9531211 -16127746 -11898230 -5031292
44801 -5031292 -2863247 -3478795 -2675141 -3356781 -11331168 -23506230 -27473766 -15825333
44793 -15825333 3158355 13565244 9425746 -26995 -3038271 1354969 5452347 4501632
44785 4501632 1027027 -1226240 -2135599 -2891078 -3450328 -4613717 -9026800 -17007467 -23751409
44776 -23751409 -23992560 -18374387 -12595621 -10798348 -11710096 -10881651 -5480184 2482343
44768 2482343 7083122 4192259 -3000163 -6407689 -2340002 4122272 5814449 1591118
44760 1591118 -4975957 -11852459 -19081496 -24865848 -26114596 -22777296 -17483842 -10915660
44752 -10915660 -1961296 6994032 9991937 5163633 -1461676 -3239505 -1433645 -2614099
44744 -2614099 -8747977 -14016659 -12388552 -5419398 -493282 -2703404 -10641523 -19619729
44736 -19619729 -26145440 -28261097 -24756988 -17491445 -12592557 -14418325 -18252437 -14379400
44728 -14379400 -1264803 10594715 11319788 3343650 -3927003 -6419268 -6254574 -4273754
44720 -4273754 177290 3633930 1171107 -4951931 -7065553 -3494873 -315468 -61033
44712 -61033 2558079 10004847 15640766 13995032 10019661 10914222 14652898 14796265 12119819
44703 12119819 12254501 14307053 11288639 1643731 -8040444 -12852519 -14930568 -17618111
44695 -17618111 -20651636 -22843678 -23798297 -21473623 -13973220 -5554427 -4454348 -11671083
44687 -11671083 -17777954 -14820221 -6150344 162424 2878602 6536713 12058469 15279269
44679 15279269 14456614 13592862 16913485 23482058 28654403 28883292 24300681 17881803
44671 17881803 12589234 8868064 5121270 500213 -4129328 -8047118 -11317900 -12996805
44663 -12996805 -11331720 -6916413 -2896257 -611399 1879752 5237046 6687874 5227182
44655 5227182 4747439 7716312 9674710 5872216 412583 1589362 9370521 15219522
44647 15219522 14666954 12110311 11293877 9398493 4895916 3585315 9837818 17154282
44639 17154282 15629662 6049760 -1618442 -2656284 -2005769 -3404329 -2906061 2710394
44631 2710394 8232189 7097597 1787841 87485 3158957 4713444 2043052 475686
44623 475686 4275368 9381205 9806287 6825105 6067410 8093704 8335156 5849162 5483093
44614 5483093 9543232 12977841 10292398 3180450 -2744857 -5871829 -8758895 -12156581
44606 -12156581 -13693259 -12480312 -11003361 -11457388 -12864335 -12540323 -8363590 476411
44598 476411 12400375 22597965 25843980 21419308 13786051 7901369 5396708 5320415
44590 5320415 6197176 6588465 5804990 5162385 6828147 10532555 13051153 11776198 7353597
44581 7353597 2350740 -944056 -1146354 1473848 4222750 4337064 2828502 3405361 6897218
44572 6897218 10080928 11284376 13050259 16584183 17623596 12093008 2954638 -3504213
44564 -3504213 -6295550 -9264068 -12991955 -13269914 -8575146 -3471269 -2106726 -2795235
44556 -2795235 -2279495 -1823395 -4905681 -10779239 -14643781 -14093356 -11923500 -11567198 -12118109
44547 -12118109 -9499519 -1627721 8867328 16842130 18664239 14084310 5440021 -3590398
44539 -3590398 -8820153 -7428148 -572042 6951032 11283959 13021243 14632307 15693514
44531 15693514 13581989 8544132 4468391 3492746 3141633 1055266 -138132 3961429
44523 3961429 12573458 19296313 18833289 11948281 3556409 -2048473 -3607964 -2452636
44515 -2452636 -682160 1082404 4458574 10899215 18713951 24157019 25704604 25222931
44507 25222931 24115471 20738907 13751607 6299348 3743276 7259324 12284088 14046880
44499 14046880 12647259 11572353 12780234 14809517 15095120 12909655 10087145 9298054
44491 9298054 11315276 13953758 14493100 13072092 12279383 13170875 13694448 12102382 9925507
44482 9925507 9705243 11132967 11382497 8400830 2509003 -3775011 -6073181 -924462
44474 -924462 8842829 14073220 9038315 -454984 -4011081 -716074 405606 -5273741
44466 -5273741 -10822391 -8530472 -1155508 3431380 4089276 5975677 10826779 14668214
44458 14668214 14700586 12406620 9368883 5346728 1602981 1245895 4168681 5386392
44450 5386392 922811 -6965702 -12422562 -12233280 -8028936 -3581380 -1166708 -152227
44442 -152227 1125897 2091438 -63894 -5968163 -11594658 -12478511 -8713559 -3066238 3731044
44433 3731044 11695496 17178818 15182965 6521919 -1979886 -5382853 -4752832 -2985806
44425 -2985806 -1319514 -1209570 -4663346 -10419907 -14148694 -14932363 -17328889 -24061740
44417 -24061740 -30734965 -31514465 -26811359 -21453458 -17778631 -14373415 -9786980 -4008509
44409 -4008509 2341274 7438491 8351732 4214758 -2168262 -7737438 -12049276 -15126811
44401 -15126811 -15745244 -14358904 -14114828 -15651588 -14613009 -8483395 -2228195 -1907268
44393 -1907268 -5691408 -7168251 -5339573 -4871227 -7734655 -11339392 -14591376 -18969159
44385 -18969159 -22931782 -21942481 -15864112 -10509112 -9598339 -10298543 -9004450 -6565247
44377 -6565247 -5033279 -3770428 -1952111 -1173254 -2501194 -4162835 -4799630 -5740977 -7528135
44368 -7528135 -7812286 -5759167 -5046221 -8815217 -14390842 -16559185 -13752394 -7900364
44360 -7900364 -1024584 4372688 4497395 -1503473 -8477710 -10982336 -10299214 -10960183 -12143645
44351 -12143645 -8813612 -1144409 4125744 3838184 3840932 10282748 19725391 22980468 16961049
44342 16961049 8058914 3866104 5325078 7984202 7884528 4056320 -2816222 -10831196
44334 -10831196 -15751912 -12843877 -2553321 7241773 8283208 1377618 -4738294 -4904953
44326 -4904953 -3674912 -7155620 -12909662 -13440397 -7814943 -3387330 -5252318 -9738847
44318 -9738847 -10741647 -7781466 -4368694 -2053447 -339139 -125330 -2573363 -5359467
44310 -5359467 -4321282 818810 5730139 7067057 5795874 4029727 1435918 -3386215
44302 -3386215 -9802468 -15302371 -17847789 -16872930 -12966256 -7868839 -4062831 -2937312
44294 -2937312 -3311154 -2449926 1308597 6847123 10869897 10701729 7355925 5101077 6426588
44285 6426588 8253426 5734018 -535356 -4686533 -3675777 -1114072 -1067027 -2309714
44277 -2309714 -2036038 -1044440 -311228 3914494 14754353 26346852 28687635 21144340
44269 21144340 13581026 12393131 13016574 9338030 2839322 -2602075 -7887217 -13675712
44261 -13675712 -14020310 -4006634 9404969 13634118 6974930 129483 444403 3047545
44253 3047545 391665 -6801806 -12502976 -13856808 -12075386 -8705516 -5276172 -3728872
44245 -3728872 -3452800 -645430 5691454 9980207 6779581 -826419 -4626050 -2221217
44237 -2221217 524118 -1698121 -7317734 -12021100 -14734643 -16301667 -15447658 -10581822
44229 -10581822 -4495996 -2494195 -4761875 -4626156 2831579 13210284 17646476 13884950
44221 13884950 8119046 5726079 4938452 1693552 -3336177 -6034160 -4781111 -1876590
44213 -1876590 -573282 -3131489 -9759577 -16811869 -18477743 -13613293 -8515737 -9107645
44205 -9107645 -12968471 -13852681 -11471887 -10513115 -11576651 -10528877 -6998072 -5967338
44197 -5967338 -9198640 -11982590 -10994619 -9065352 -9111306 -9373356 -8240577 -7959246 -9365182
44188 -9365182 -8529014 -3578969 313397 -1455611 -4660391 -1986622 6088265 12467621
44180 12467621 13182499 9848754 4237898 -3192929 -9976796 -12602058 -10937159 -7283102
44172 -7283102 -1826882 5999491 12336828 10964443 1656282 -8128768 -11357874 -7862927
44164 -7862927 -1982930 2694432 5088614 5880156 6144754 5297261 914143 -7382033 -15033925
44155 -15033925 -16437111 -11004917 -2874041 3991409 7480039 6268713 1391166 -2557349
44147 -2557349 -2427787 -1578181 -4847862 -9567894 -8082734 133520 5598048 850724
44139 850724 -9724156 -15515513 -11547469 -1614202 7511738 11567315 9953958 4450423
44131 4450423 -2616204 -9320691 -13673637 -14168910 -12368563 -12468298 -15141183 -14345459 -5117954
44122 -5117954 7152085 11308487 4056019 -7145587 -15200939 -20421003 -24455752 -24431204
44114 -24431204 -17852915 -8501699 -2379039 -643117 -647749 -1548378 -4761627 -9999758 -13995182
44105 -13995182 -13069564 -6132778 3512486 9268345 6955565 58168 -3816343 -2227310
44097 -2227310 65362 -1137137 -4527277 -7559470 -10229449 -11775373 -8817305 -844517
44089 -844517 6622631 8680849 7369322 7076329 7043646 3534185 -2892736 -7598229 -8484703
44080 -8484703 -8042982 -9000955 -11193683 -12699081 -11953000 -9181488 -6817911 -6972279 -7816556
44071 -7816556 -5394554 -168849 2161839 -1463436 -6972376 -9522825 -10119211 -12087326
44063 -12087326 -15002786 -16664781 -17562301 -18501579 -17049226 -11641608 -6421174 -6384222 -9994657
44054 -9994657 -12193567 -12582756 -14633051 -18445951 -20583240 -20193185 -19325221 -17775924 -13482167
44045 -13482167 -7623010 -3510098 -656381 4154461 9933890 11714332 8181090 3275304
44037 3275304 -252046 -2823820 -3071613 2107891 10506095 14145304 9008789 79532
44029 79532 -5937516 -7634229 -5899062 138745 9550296 16499998 16039617 10611858 6501514
44020 6501514 5562407 4089397 -1346459 -9901219 -17500057 -20087314 -16995084 -12130118
44012 -12130118 -10076861 -10498833 -9124155 -4804809 -1603499 -2207448 -3636860 -2554374
44004 -2554374 -1046069 -3101331 -8017149 -11534761 -11910772 -10985190 -10312105 -9858477 -9909294
43995 -9909294 -10888293 -11513473 -10258881 -8822097 -11148662 -18002240 -24688875 -25648370 -20209141
43986 -20209141 -12518367 -6436785 -2298719 641240 589352 -4759945 -12385330 -14192347
43978 -14192347 -6164824 5361916 10567303 7674466 3238153 2178633 3083641 3561737
43970 3561737 4155293 4853673 3008373 -2090020 -6524539 -6766938 -4166959 -1850062 -594248
43961 -594248 -491203 -2813176 -6541594 -6496121 552182 10175850 15031833 13674754 10560785
43952 10560785 8612946 6164063 1155462 -5229515 -9811598 -10449962 -8039529 -6570143
43944 -6570143 -9620281 -15188959 -16249196 -8918609 2010933 8573306 8671851 6376621
43936 6376621 5128781 4822367 4860669 5905929 7956352 9467079 9005917 6282450 2071904
43927 2071904 -1418375 -1564077 1167060 2329231 -1293942 -7071783 -9728293 -7411350
43919 -7411350 -1750230 5646872 12510584 13841029 6363957 -4907548 -9914099 -4706927
43911 -4706927 4650965 10401929 11224180 10391776 9721189 8407764 6064541 4319741 5306816
43902 5306816 8891812 11328605 8274474 781311 -3878085 -556903 6482686 8991678
43894 8991678 5996861 3931308 5708768 6358595 1495996 -6059864 -11478463 -14368819
43886 -14368819 -15884856 -14186678 -8106228 -1796975 122621 -295533 1880366 5089108
43878 5089108 2721771 -5451612 -10190184 -4355034 7213895 13529738 10357366 3226509
43870 3226509 -862771 -510772 1372820 2101181 489869 -4303556 -12405009 -21319327
43862 -21319327 -26048119 -22718950 -12521332 -1405256 4891158 5509478 3717954 1908574
43854 1908574 -1126178 -7155495 -14257775 -17722830 -15059345 -8157012 -212841 7177708
43846 7177708 12800366 14349758 10954000 5817984 3174391 2888274 1077757 -3799193
43838 -3799193 -8681108 -10420338 -9230698 -6259864 -1301787 4455825 6575267 2228045
43830 2228045 -4782235 -8012335 -6795588 -6563788 -10487020 -15019921 -15522276 -12809026
43822 -12809026 -11157094 -11959253 -12847819 -12354034 -11755161 -11505566 -9250333 -3895896 694489
43813 694489 -46560 -4066678 -4158026 1885190 6960832 3761819 -5269089 -11546419 -11455713
43804 -11455713 -8545022 -6162702 -4247515 -3368230 -5060577 -6506927 -1636309 9367758
43796 9367758 17816141 17784784 13903609 13021605 13709065 10580726 4623304 1360809 1068803
43787 1068803 -1311231 -7011305 -11236497 -10748374 -7840577 -5871972 -5671210 -6889337
43779 -6889337 -8341495 -6759093 51772 8369828 11511104 8182994 3505616 1441120
43771 1441120 1031777 739228 1321905 2825857 3152369 1406458 -772171 -2128170 -2594552
43762 -2594552 -1099828 3152451 7084189 6276002 1552421 -2000976 -2952767 -4649015
43754 -4649015 -7682435 -8032545 -4932469 -3953594 -8782466 -15535315 -18824280 -18298298 -15641510
43745 -15641510 -10442923 -3296351 1792348 2593973 2141316 3040097 2815389 -615376 -3416485
43736 -3416485 -1168932 3901202 6432246 5703444 4734990 4192740 2238998 -1415873 -5404956
43727 -5404956 -8522497 -8489713 -2528960 6872357 11027126 5085537 -4747769 -9488016
43719 -9488016 -8834818 -7970748 -7008457 -1999868 5643964 9410991 7273858 3718070 2102784
43710 2102784 1796047 2941068 6917076 11159499 10300138 4020500 -2101945 -4672483
43702 -4672483 -5307167 -4377285 864700 9099628 12627338 6886705 -2346377 -6075790
43694 -6075790 -3517629 -2147477 -7762508 -17760832 -24083046 -21371697 -12389249 -5300051
43686 -5300051 -4954543 -8177269 -9052590 -6155496 -1361441 5332513 14300123 21629000
43678 21629000 22669621 19752840 19550554 22418732 21577798 14287382 6423803 3210056
43670 3210056 2399701 483757 -725038 1417078 4413196 4269191 1343756 -1812739
43662 -1812739 -4804140 -7270233 -5975667 1275430 11387219 19561494 24458760 26287000
43654 26287000 23297977 14835122 5043349 -1387994 -5127943 -9279951 -12631204 -10911164
43646 -10911164 -3728895 4370975 9261974 9849801 6327297 9557 -5438326 -6456961
43638 -6456961 -3535115 -143954 1487019 820871 -3210959 -10860122 -18393149 -20171151
43630 -20171151 -14595508 -5573616 1851774 5100180 3994012 -39558 -4695736 -8705374
43622 -8705374 -12575495 -16113555 -17257648 -15823728 -15886565 -20432494 -25385467 -23733365
43614 -23733365 -15008797 -5991041 -1946163 -1741635 -2116699 -2002523 -1115719 1422601 4792935
43605 4792935 6124737 4633708 3207604 3608100 2812264 -2988460 -12434543 -19769347
43597 -19769347 -20746047 -15723146 -7633219 910517 8241441 12893630 13400149 9380260
43589 9380260 2954490 -1866450 -2506542 -271624 1752722 2750173 4257624 6366465
43581 6366465 6338817 2028070 -5252884 -12711069 -19435253 -25937014 -31212605 -32711643
43573 -32711643 -29984596 -26579618 -26265097 -27627587 -24877169 -15420975 -4510546 569972
43565 569972 -210946 -161348 4234582 8884942 9625594 9171819 12073872 16181825 14870082
43556 14870082 6523742 -3426828 -9636118 -11237275 -9125867 -3888843 2495467 7274789
43548 7274789 10589289 14610471 18039003 16231673 8850737 2457955 1964623 3568665
43540 3568665 653550 -6285654 -10722714 -9494618 -5844911 -3162730 -579739 3720014
43532 3720014 8471577 10889445 10128889 7192447 2901931 -1876701 -4722179 -2826353
43524 -2826353 3432757 9426983 10329745 6197222 1826142 1221150 3542637 5482589
43516 5482589 5983247 6089015 4794152 -1189100 -11663775 -19709510 -17814521 -7030410
43508 -7030410 2983433 4196357 -1488594 -5774343 -4214849 -55176 2052867 2498889
43500 2498889 4395793 7446640 8552864 8064252 10343862 16308137 20029956 16408937
43492 16408937 8806920 4400564 4124112 2503333 -3343607 -9908758 -12881957 -11667953
43484 -11667953 -7402190 -1186111 4171463 5248617 3089140 3051128 7072511 10223853
43476 10223853 8121920 3665748 2059825 2446197 -175847 -6445598 -11400466 -11368355
43468 -11368355 -7503859 -2340190 2763724 5855661 4250229 -1618130 -6769912 -6359324
43460 -6359324 -626218 6040837 9833552 10261837 9190084 8489832 8687899 9353109 10194838
43451 10194838 11064213 11023440 8886387 5384036 3297805 4143309 5854991 5150101 1373156
43442 1373156 -2934935 -4083774 772347 11325362 22214781 26031388 20734271 11937200
43434 11937200 5469081 803766 -4510824 -7709489 -4497509 2031059 3768224 -649819
43426 -649819 -3774244 -929099 3282369 3467939 1724749 2321060 3654418 1935081 -937968
43417 -937968 -111455 3752254 5494723 4089178 3883538 7096935 10896711 12684271 12887705
43408 12887705 11463347 7141043 1948004 922066 4307903 5038318 -1913854 -11704171
43400 -11704171 -15918604 -13622398 -10595898 -9424117 -6772574 -939091 4072709 4906307
43392 4906307 4816215 8921616 15642827 17656342 11735617 3703788 1467018 5635972
43384 5635972 10130929 10830449 9549791 8715878 6430632 158828 -7394381 -10651330
43376 -10651330 -8725278 -6419160 -7510543 -11020304 -14624672 -17341514 -17590178 -13399158
43368 -13399158 -6924624 -4075359 -6437153 -8319700 -5982298 -4546438 -9335141 -14823600
43360 -14823600 -11157164 117207 6615600 2442298 -4312407 -4506082 102001 2804021
43352 2804021 2610587 2398845 1749987 -1061468 -3333577 -1374275 2371037 2475804 -375297
43343 -375297 -316096 3818914 6426455 4292041 1540423 2677921 5683419 5642580 1824113
43334 1824113 -2678308 -6354294 -10595414 -15882685 -19356916 -17368481 -10068671 -2756795
43326 -2756795 -1408488 -6022187 -9722969 -6198042 3042504 10844805 12584178 9441762
43318 9441762 4814281 1425826 1800805 7062201 13813175 15887289 11211789 4197443
43310 4197443 -290636 -2355119 -4437074 -6287448 -5736507 -2876683 -428002 -179608
43302 -179608 -803047 891357 6925445 15252554 19788945 15688934 5524493 -2351428
43294 -2351428 -3155014 -865534 -2091918 -7398015 -11738514 -11637391 -8400550 -4994787
43286 -4994787 -3108880 -3354776 -5448586 -7468223 -7049618 -4132149 -974422 1222548
43278 1222548 4220619 10067570 17217825 20850775 17879066 11156251 7275263 9478444
43270 9478444 14056059 15178269 11920437 8042489 5771004 3416878 -353921 -3416322
43262 -3416322 -2953287 1138910 6780031 11181050 11176613 5751464 -210717 1168740 11195849
43253 11195849 21454205 23620118 19121488 14926649 12858168 8657993 280031 -8542392
43245 -8542392 -13354070 -13314415 -10001369 -5467229 -1900278 -132224 1647007 4917630
43237 4917630 7275169 5454506 1317229 324513 3655250 6502221 5631364 4291132
43229 4291132 7119482 13395695 18132153 17930716 13661566 8765417 6215202 5656772
43221 5656772 2874204 -5723471 -17223884 -23469880 -19847783 -10621860 -3638342 -1597408
43213 -1597408 -783663 2766684 8258066 11427822 9568330 4552750 501413 -1353671
43205 -1353671 -3756647 -8316957 -11856554 -11017667 -8595736 -10501328 -16741133 -20629161
43197 -20629161 -18010498 -12177431 -7633768 -4093890 45360 2880307 2188777 138647
43189 138647 -43344 231467 -2431185 -6636145 -7555637 -4858881 -3918671 -7667493 -11592394
43180 -11592394 -9470141 -1470967 6227813 8823113 7513864 6523863 7069267 5927400
43172 5927400 536686 -5992813 -7411422 -1838785 6198310 12201138 16624202 20790932
43164 20790932 21479831 14660567 3353119 -3876846 -3474935 -1478393 -5120777 -13091287
43156 -13091287 -17457108 -13793326 -6122407 -1566154 -2470198 -5253475 -6112001 -5774138
43148 -5774138 -7425342 -11216311 -13692008 -13412735 -14128969 -19691818 -27748216 -32133051
43140 -32133051 -30791685 -27286947 -24157537 -19418052 -11835271 -5478386 -4787276 -7330335
43132 -7330335 -6278641 258630 6944575 9274675 9610340 12439131 16830069 17695479
43124 17695479 13298991 7335679 3295297 523192 -2808561 -6079196 -7783589 -8372944
43116 -8372944 -9234919 -10863374 -14337994 -21967277 -32619184 -38469283 -31980547 -16461300
43108 -16461300 -4455102 -3814290 -9820342 -13544066 -13409191 -14090538 -17139811 -18562774
43100 -18562774 -15490248 -10457821 -7657943 -8074670 -9965792 -11889828 -13167563 -12497939
43092 -12497939 -8532467 -2501144 1201035 -993215 -6949816 -9983610 -6569456 -1173683
43084 -1173683 -461990 -3923294 -4743557 -300174 3705809 2272714 -824348 1115875
43076 1115875 7152685 10083334 7288297 4186249 5925157 10483743 12189369 8937353
43068 8937353 3767333 1134240 3076547 7748336 10877043 9681632 5492606 1556902
43060 1556902 -786025 -1828848 -822296 2880544 6328056 4863171 -1130459 -4919280
43052 -4919280 -1135358 7510215 13319935 11733932 4692456 -2436883 -5451291 -4066234
43044 -4066234 -1844435 -2849186 -7549793 -12836447 -16158309 -17732064 -18183348 -16750844
43036 -16750844 -13631435 -11815054 -13902473 -18195246 -20370823 -18532491 -14572589 -10911026
43028 -10911026 -7975044 -5145384 -2485271 -678379 69111 431145 1206227 2224331
43020 2224331 2445930 1692394 1568539 3181459 4390040 1783541 -4007475 -7684348 -5699020
43011 -5699020 -1022448 1005643 -124657 -309205 2421759 5039908 4340219 1639028
43003 1639028 503839 1288758 283462 -5637831 -14925732 -22506651 -24669766 -22543516
42995 -22543516 -20603593 -21496893 -22531187 -18291767 -7493939 3631139 6688100 420240
42987 420240 -7150066 -7704246 -2603883 -957886 -7493102 -15865846 -16434715 -8156563 1028352
42978 1028352 4797814 5158040 7395120 11874586 13878966 10447075 4659538 2402177
42970 2402177 5824579 10921119 12129033 9063063 7055063 9863942 13796469 12168904
42962 12168904 4965548 1013 3164412 11116342 16384745 17052972 17588869 21046895
42954 21046895 24489098 23273959 17290317 11023638 8444429 9473265 11412624 12466792
42946 12466792 12923155 13500562 14091223 14572391 15369444 16125519 15262364 12514556 10356013
42937 10356013 10402112 9884567 5502738 59267 173696 6313051 10440248 6527026 -1314429
42928 -1314429 -5418293 -5191702 -5507524 -7400685 -7446537 -5666746 -6527731 -10376876 -10761172
42919 -10761172 -4006660 4017577 5769429 2802763 2798151 8018534 13135355 14355527
42911 14355527 14325633 15983930 16967584 13884784 8507208 5327687 5032725 4750220 3577598
42902 3577598 3209221 3196575 456088 -5190548 -9321112 -8976883 -6732695 -6077924 -6308457
42893 -6308457 -5457798 -4942201 -6639228 -7851503 -4785667 181319 804959 -3263090 -5087680
42884 -5087680 -394610 6640032 10007514 9207478 6736096 2950629 -2092192 -5153540
42876 -5153540 -3266822 1104155 2770400 533210 -2637791 -4996412 -7557629 -10777245
42868 -10777245 -13593890 -15963209 -19063931 -22518238 -23987039 -21797798 -15899924 -6678652
42860 -6678652 4587756 14518731 19953017 21742755 23591244 26929462 29641388 30084648
42852 30084648 29274093 28115404 25329449 19857173 13525656 9751137 10484671 14977714
42844 14977714 20330984 23007026 21471675 17947275 16201865 17289722 18890942 18794393
42836 18794393 16960298 13926896 9876689 6548597 7618770 14839415 24929133 32425111
42828 32425111 35227804 35608546 35957605 35634465 33102581 29762422 29314387 32720532 35768805
42819 35768805 33669658 27132104 21257343 18623685 16835753 13927475 12487916 15722523
42811 15722523 22170020 27671222 30670072 32117312 31765218 28603764 24174930 21315888
42803 21315888 19566668 15566796 8457666 1555556 -1945672 -2034712 -334912 1600590
42795 1600590 2395847 2548561 6128297 16850543 31458961 40724318 38757095 28730955
42787 28730955 18485474 13397551 14196377 17960925 19596285 15624410 8368442 3771185
42779 3771185 4162645 6530602 8529242 11315133 14584217 14312339 9127130 4163607
42771 4163607 3859548 4849483 1546945 -4191898 -5337898 -328675 4783804 5112218 2542864
42762 2542864 1408528 2943481 5792990 8687789 10596217 10465657 8718622 7881089
42754 7881089 10473483 16541415 23203042 26125976 22433430 13685413 5450677 2368937
42746 2368937 3898381 6020452 6325118 5960629 7248379 10854957 14970395 16545338
42738 16545338 14301303 10931162 10349536 11996866 10759055 4280410 -2869164 -5088640
42730 -5088640 -2690558 594112 3923951 8301628 11561631 10359102 6516414 5701143
42722 5701143 9477019 13807089 15866833 16944586 17662289 16175389 13257530 13558156
42714 13558156 18521233 22906634 22278768 19694171 20292369 22784901 21932438 17419299
42706 17419299 14330309 15086474 16186773 13903511 8994071 4400262 1852160 2435741
42698 2435741 7215258 14655303 19586455 17647945 9928420 1133818 -5791543 -10718316
42690 -10718316 -12878428 -10086963 -2632273 5043373 8912490 9695217 10023321 9068513
42682 9068513 4032885 -3229746 -5746328 292955 10069678 15761337 15325504 12660734
42674 12660734 10926902 9662766 8199535 8105832 10858719 15218353 18349423 18738411
42666 18738411 17363404 16324759 16297237 15328065 11136650 4805926 322206 -436535 82327
42657 82327 -530931 -843100 1123233 3325751 2255368 -1530063 -4385011 -5024238 -5085864
42648 -5085864 -5292810 -5322287 -6577583 -10191478 -12772072 -9722365 -3126279 -314480 -3188242
42639 -3188242 -5059577 -617935 6722426 10725983 10083316 6125542 -1794232 -12708910
42631 -12708910 -19588947 -15372733 -2468004 8995799 12008223 7896353 1946004 -1722472
42623 -1722472 -1462861 1367655 2893278 860630 -2139685 -2651862 -2210867 -4713216 -8504121
42614 -8504121 -6704152 2942753 13336206 16171620 11653839 6766782 5854780 6504793
42606 6504793 4383896 -935415 -5991476 -7422065 -4416180 1885400 9265268 14202362
42598 14202362 13066526 5878912 -2141700 -5600320 -5267346 -6369718 -10439167 -12747546
42590 -12747546 -9215244 -1966270 4351017 8170827 9981829 9251861 6309865 4402650
42582 4402650 5474655 6207833 2823191 -2371045 -4394747 -3743081 -5254220 -9861164
42574 -9861164 -13718693 -15276769 -16627445 -17318734 -13957909 -7786135 -5489794 -9230468
42566 -9230468 -12474825 -9975094 -5689339 -5352864 -6773830 -4448624 329787 1943843
42558 1943843 734960 2421780 7475429 9368862 5515740 2796144 8201868 19029992
42550 19029992 26862152 27914303 25012142 21633423 18753221 16886237 16908445 18046402
42542 18046402 18021069 16171401 14169916 12765057 10197265 5423917 820260 -826864
42534 -826864 -846663 -3179261 -8296804 -11663509 -9540219 -3854268 758149 2852873 4367953
42525 4367953 6043589 6083147 3772288 1433738 1364894 2904754 4196471 5347872 7856528
42516 7856528 11535761 13943678 13307836 11003228 10274042 12353877 14369379 12145138
42508 12145138 5465817 -782499 -1971795 968138 3540511 3966208 4677577 7719740
42500 7719740 11779933 14471293 14629733 11336548 3917470 -5122001 -10148334 -8315989
42492 -8315989 -3577016 -2111869 -5409754 -10601928 -15840639 -21568468 -27070333 -29609103
42484 -29609103 -27710195 -22662341 -16220843 -9223593 -3039699 64169 -774772 -3793112
42476 -3793112 -6337996 -6645586 -4087916 229991 2932752 1099340 -3357202 -4492391
42468 -4492391 583514 7184620 7838699 565123 -9806044 -17884276 -22623665 -25526565
42460 -25526565 -26537405 -23989784 -18010951 -11698663 -7926401 -6244615 -4375359 -1950565
42452 -1950565 -616847 -434366 1083323 4943053 8125217 7519697 4684509 3654386
42444 3654386 5145006 6511080 6961560 8493193 10862602 10177118 4888685 -604396
42436 -604396 -1760247 -495438 -2007386 -6819239 -10314847 -9469308 -5810943 -1674667
42428 -1674667 2184661 4245236 1653103 -5601118 -12710380 -14710245 -11332794 -5584346
42420 -5584346 88892 3954734 3925396 450 -3458888 -1680455 4436812 9417450
42412 9417450 10327881 9294849 8513711 6888227 3576535 1186848 2146178 4227011 3228715
42403 3228715 -1308998 -6528128 -11173840 -15860877 -18626843 -15175494 -5544666 3274980
42395 3274980 4301861 -2353865 -11918063 -21405783 -29436543 -31830843 -23797313 -7889748
42387 -7889748 5505143 9123216 7056404 8292307 14491276 19067446 17596703 13495165
42379 13495165 11656964 11358222 9225217 5968836 5178215 6599037 5835828 1594014
42371 1594014 -1343566 1286054 7021847 10152002 9207927 7699019 8606368 11435257
42363 11435257 14343030 16155819 16089412 14160766 12414461 13408867 16819594 19609857
42355 19609857 20120679 19745949 19758578 18872295 15349468 9613790 3410901 -1816501 -4468653
42346 -4468653 -2955677 1737903 5650869 6326818 5942365 7322947 8595057 5499134
42338 5499134 -1605125 -6995976 -6513813 -1963801 2460933 5069118 6191917 5440095
42330 5440095 2190040 -2256364 -5211673 -4903232 -851638 7034709 17477953 26070591
42322 26070591 27114266 19019589 7195979 16915 1369779 7575372 11791781 10851323
42314 10851323 7242840 5038435 5410384 6723030 7696242 8833029 10774486 12523016
42306 12523016 11936363 7688708 607433 -6722844 -11764993 -13672876 -13141167 -10962792
42298 -10962792 -7553692 -3779609 -759120 1735024 5116033 9273411 11829734 11653297
42290 11653297 11114904 12337295 12957234 9233664 2601192 -1014402 1144757 5572495
42282 5572495 7998344 7952348 6156298 1671369 -5134942 -10219257 -10537339 -8766640 -9148564
42273 -9148564 -10439051 -7847735 -1191484 4115841 4794417 3589924 3972221 5393187
42265 5393187 6101576 6648091 7470235 6386394 2297957 -1290793 -761944 1738984 2019420
42256 2019420 1978415 7396494 16873848 20363606 12819302 3360951 4397149 15242406
42248 15242406 24243896 25800829 26372323 31658547 36659388 34315531 27604533 24835106
42240 24835106 26166005 23920740 16268527 11711492 16883983 26994214 33128285 33618787
42232 33618787 32290436 29255191 20626228 6566220 -6604591 -13360109 -13751230 -10580400
42224 -10580400 -5976150 -1931621 -275775 -110868 1710201 5671627 7955758 5833407
42216 5833407 2152184 1824522 5561434 9564101 10187754 6757542 1005043 -4008061
42208 -4008061 -5333492 -2675463 1162248 3967025 6846448 11087937 14049459 11749846
42200 11749846 4982021 -907781 -2675125 -2033391 -1030059 1535726 6770326 11669057
42192 11669057 11542752 5327748 -3449301 -9723564 -9495051 -1790171 9076592 14888695
42184 14888695 10948879 1998020 -2348002 1764710 9165263 13100485 12408479 10040598
42176 10040598 7876766 5728464 3514177 1538252 -666641 -3584962 -6221051 -7085513
42168 -7085513 -6266036 -4973648 -3513275 -1313678 1449959 3995218 6452873 9459364
42160 9459364 12246493 12972307 11316349 9177372 8343932 8826371 9800828 10710527 11016170
42151 11016170 10405716 9742900 10060925 9875416 5568740 -3898806 -14105664 -18961718
42143 -18961718 -16759564 -10904126 -5175164 65591 6826292 15634383 23092452 23771414
42135 23771414 15919010 5214658 184187 2572518 5200523 1862981 -3930124 -4670061
42127 -4670061 -918136 -826339 -7112691 -11790949 -7591994 1123820 4562988 1000217
42119 1000217 -2495003 -1377920 1203255 1538668 1578005 4846122 10014878 12308795 9665501
42110 9665501 4704331 1344879 1308249 3375328 4956120 5038545 5938602 10572297 17501351
42101 17501351 21073597 18004467 11739089 8369944 10033377 14343303 18294956 19876137
42093 19876137 17396849 10825782 3585432 128783 1571704 5707587 10550890 15137394
42085 15137394 17518441 15489106 9756396 3587143 -1038261 -4459792 -6888633 -8122312
42077 -8122312 -9453529 -12120546 -13923820 -11743199 -7577134 -6746035 -9225167 -9190073 -5471411
42068 -5471411 -5191968 -12380716 -19889662 -19483252 -14282587 -12618045 -13585396 -8883637 2329603
42059 2329603 10779696 10578369 6322986 4115158 3543770 2155054 856397 694232 182973
42050 182973 -146870 3699482 11770652 17093475 15307138 12285886 16069074 25173041
42042 25173041 31253919 30435870 25830212 21108438 17636141 16338071 16669149 14912791
42034 14912791 8606988 1228917 -2385497 -3083255 -4277525 -4542253 -752181 3100582
42026 3100582 -858625 -11715544 -18921397 -16299332 -9039517 -3757742 485926 6430540
42018 6430540 10812969 9025374 3383455 299079 1400409 2705321 1136376 -2590960
42010 -2590960 -6483794 -8793792 -7703016 -2744399 3648073 8099831 9383503 8515604
42002 8515604 7195293 7060732 8500142 9457855 8065497 6860864 10194322 16133502
41994 16133502 16321431 7161057 -3836134 -7334039 -3562421 546336 1591197 1106788
41986 1106788 25255 -1404918 -127629 6386068 14324086 17697222 17600265 20307844
41978 20307844 26253762 28655718 24562799 19591855 18499841 17841867 12625995 5084324
41970 5084324 1456592 3147434 5946503 6432987 5341149 5359050 8186866 13159126 17246193
41961 17246193 17312155 13208765 7532708 2475982 -1043778 -1843437 394703 2529471
41953 2529471 642704 -4226120 -7384687 -7859020 -9035630 -11167729 -10160114 -6245976
41945 -6245976 -6097945 -11465288 -13134974 -3420170 11141428 17991400 15178158 10581379
41937 10581379 7586819 2283729 -5268113 -7916380 -2791596 2822420 1570421 -4363689
41929 -4363689 -8193205 -7751568 -4992930 -578550 5577684 10627756 10578835 5389396 -735208
41920 -735208 -4022299 -4516994 -5205643 -8377734 -12183232 -11578153 -4760081 2664620 3810438
41911 3810438 -7277 -1276335 1993640 3352505 -837834 -4301269 -92452 8683068
41903 8683068 13993803 14928849 17331102 23224131 27792000 26958106 21897080 15124868
41895 15124868 7276534 -783525 -6801503 -9660227 -10097565 -8348256 -4290406 -137121
41887 -137121 977449 -49071 1287242 6343698 10820217 10840026 7875057 5168369 2685599
41878 2685599 -908062 -3611010 -1517871 5646387 13724174 19291919 23174573 27615758
41870 27615758 31449636 30325687 22662474 13985753 12483588 19348151 26465901 26238054
41862 26238054 21026826 18712842 20866568 21418607 17310260 13718502 15669595 19949505
41854 19949505 20011109 15315205 10767948 8936999 7644152 4528545 28687 -4003574
41846 -4003574 -5699486 -3616758 1695971 7373252 11727374 16435423 22299309 24972683
41838 24972683 19630782 9261345 3323323 7190915 16705897 24045548 25380887 21911287
41830 21911287 17398387 16476639 21754712 30035752 34057692 30412025 23597252 20047293
41822 20047293 20348665 20048923 16573887 12293386 10912324 12863818 14748675 12976900
41814 12976900 8316754 6223642 10688858 18055361 20247094 15071907 9506782 10399243
41806 10399243 15577541 18041415 16263354 15336195 18805668 24257169 27549729 27306501
41798 27306501 23935618 17767889 10397932 5641120 6748262 13238783 21463860 27553095
41790 27553095 29422804 27267595 23141773 19508845 17657316 17689243 19423001 22071451
41782 22071451 23466989 21524530 17012639 13607300 14673044 20672685 29456368 37881258
41774 37881258 43491542 46206096 48282195 51276830 53769038 54168974 54892548 60402008
41766 60402008 70894466 81445039 88348210 92765804 96659616 99111941 99438372 100393757
41758 100393757 104486529 109753328 113429751 117802600 127556199 142257163 156498344 167588443
41750 167588443 178265829 190934809 203863322 214763889 224039510 232537509 240017709
41743 240017709 247992500 259723429 274210686 284583305 287192328 288785311 298714401
41736 298714401 316233533 332277094 343056822 354349143 371016852 390099639 408323212
41729 408323212 429661657 458664799 490099382 512634663 521759027 522618624 520251156
41722 520251156 513775870 501861637 487243421 471553272 450442718 419558655 383155412
41715 383155412 351080127 327431262 307250849 285469777 264300656 248746668 238132479
41708 238132479 226583054 211158171 195325604 183185357 173566841 162653400 150726678
41701 150726678 142453648 139717698 137310642 128329119 112576212 96950340 87742530 85134065
41693 85134065 85742790 87591531 90258409 91843596 89119692 81392305 72287554 66374891
41685 66374891 64554462 63586008 59972677 53669843 47811503 45262985 46074417 48283895
41677 48283895 50165642 50801980 49258286 44918599 38875672 33654450 31092497 31396265
41669 31396265 34160120 38714315 43365235 46385520 48280136 50633379 51857990 47427628
41661 47427628 36708986 26416640 23399557 25952903 26654187 22647895 18134985 16755303
41653 16755303 17002457 16801634 17530153 20359676 22548731 21310390 18746409 18859608 21290491
41644 21290491 22153254 20483885 19881930 23165615 28444981 31557747 30348028 25795268
41636 25795268 20880232 19350147 23844029 33416112 43204459 47766234 45398893 39448375
41628 39448375 35466255 36698833 41825330 46863738 48931265 47814330 44802042 41768772
41620 41768772 41310592 45331711 52259435 57577334 58869744 59054136 62971675 71871281
41612 71871281 82722072 91602486 96021073 95423724 91834572 89056618 88895117 88924950
41604 88924950 86122696 81500889 78399202 77345539 76162059 74676446 75319573 78506782
41596 78506782 81154242 80928538 78695344 75510365 70532224 63707371 57422263 53211972
41588 53211972 49437969 44699158 41266523 42284034 47020192 51492326 52966417 52034765
41580 52034765 51238278 52874093 56492584 57430102 50622582 38101683 29637520 32353175
41572 32353175 42014032 48654544 48667482 46130390 43627524 38700452 30727301 24790273
41564 24790273 24877460 27647606 27384094 24291012 23204428 25480724 26796759 23324328
41556 23324328 16650207 11499895 10583523 12353602 12489870 7627690 -773451 -6436591
41548 -6436591 -4058646 4929712 14441674 21245853 27104765 32742553 34175033 28613908
41540 28613908 20924130 18883783 22721959 24777892 20549942 14731625 13479890 15516325
41532 15516325 15631487 13673557 14008250 17301700 19106284 17250261 14968855 14944824 15357558
41523 15357558 14407963 14059608 15912860 17544431 16985441 17117654 20792602 24579185 22880269
41514 22880269 16367414 10825948 8998614 9190568 10703009 14085343 16352926 13326377
41506 13326377 7871155 8292662 15957912 21917430 19831107 15068037 15264026 18397057
41498 18397057 17996655 15318972 16936142 22404748 24132956 20138214 17893357 22424654
41490 22424654 27862227 25430960 14982092 3944711 -2057298 -3399752 -3332073 -4348659
41482 -4348659 -6858283 -9127140 -9219634 -8056870 -8841081 -12350492 -15197779 -14435485 -11372650
41473 -11372650 -8602941 -5778637 -1429437 2887354 3954090 1857160 384944 2243739
41465 2243739 6172501 9008486 8792380 5774842 1951742 -325598 -383702 495015 1611934
41456 1611934 4247357 8861049 12521978 11804473 7280923 2237984 -2335905 -8015400
41448 -8015400 -14313841 -17772434 -16849938 -14230229 -12334717 -9498816 -3214711 4904761
41440 4904761 10313679 10794952 8305680 6165206 6216847 8237242 10465798 11011898 10047293
41431 10047293 10248380 14026600 20855748 28069507 33051575 33523110 27671695 16779404
41423 16779404 6885689 4641074 10875857 20311183 27799327 32434457 35038429 34684913
41415 34684913 29972362 22176556 14837893 10533576 9287812 9609797 10008673 10113551
41407 10113551 11326355 15546249 22003047 26352286 24929738 19642800 16489982 18712378
41399 18712378 23186164 24454499 20810228 15219742 11519363 11287737 13627386 16056656
41391 16056656 15693557 11537389 6316357 4553039 7584059 11436609 11007581 5873683
41383 5873683 539167 -989863 676198 2161146 1916353 1570499 3022756 5565017
41375 5565017 6652679 5179377 3145016 3501933 6598020 9694346 10333698 8969685
41367 8969685 7084483 3972865 -1977111 -8811424 -11058141 -6092841 1848394 6493120
41359 6493120 6711015 6096870 6956564 8628887 11237712 16265508 22031575 23121432 17266663
41350 17266663 9450910 5766334 5954981 5970058 5423054 7276537 11374801 14233486 15689957
41341 15689957 19746993 26803392 30765757 27495047 21318220 18422663 17714270 14202806
41333 14202806 8903377 8236608 13663616 18580989 17286714 11693728 6888548 4824481
41325 4824481 5242491 8362931 12830860 14446672 11087574 6284913 3938770 2157220
41317 2157220 -2896762 -9290354 -11340607 -8540284 -6300980 -7125950 -7008712 -2659065
41309 -2659065 3036706 5979246 7063138 9724489 14389369 18951641 22220404 23400727
41301 23400727 20658238 14270775 9279401 10500159 15908858 19305921 18799121 17873457
41293 17873457 18151256 16639796 11949099 8292245 9924701 14922375 18191359 18503556
41285 18503556 18652012 19632504 18675318 13738325 7077423 2918520 3160324 6589689 11093917
41276 11093917 14994313 16691181 15135657 11757404 10469900 13521115 17554648 16543004
41268 16543004 9804082 4321519 6348985 12726181 14632267 9549984 4937999 8533820
41260 8533820 18819269 27710740 29924890 26599331 21620632 17957046 16853733 17219507
41252 17219507 15587106 9509948 1542405 -2839054 -2354028 -2298849 -7543949 -14955508
41244 -14955508 -16274882 -8830113 -49206 1058595 -4982221 -8922811 -4452543 4695355
41236 4695355 10543698 9949353 4984708 -2214115 -9934079 -14024257 -10761439 -3210190
41228 -3210190 876682 -754034 -1982064 1981140 7554016 9431975 9110829 10905726
41220 10905726 13060942 9867843 1407536 -5380856 -5601579 -888095 5436808 12232818
41212 12232818 18309087 21303139 20879007 19341075 17599742 14201332 9485924 6416259
41204 6416259 5688412 4602718 2919149 4784801 11491820 17235473 16817729 13477437
41196 13477437 13256379 14709640 11397164 3668410 468543 7624048 20226413 29558216
41188 29558216 32900406 32714728 29869495 23233544 15255303 12554824 18348037 26772226
41180 26772226 28090035 19669141 9369390 6728178 12547453 19484012 21825242 21066134
41172 21066134 21147318 22185569 21992839 21299062 23280058 28310808 32785921 33712947 31536610
41163 31536610 27518320 21306244 13224749 6959487 6899270 12704741 18637260 19330999
41155 19330999 15247428 11304496 10769199 12427895 14321994 17903159 25812516 36456807
41147 36456807 44251662 46012566 44100299 41862977 39039897 34061862 28196446 24040999
41139 24040999 21588171 19290767 17910664 19588472 23542413 26395768 26883758 26726542
41131 26726542 26561265 24864200 21941094 21137177 24040592 27570377 28228591 26796750
41123 26796750 26259184 27000396 26828440 24651364 21676545 19483862 18664619 18783804 18357549
41114 18357549 15828297 11927027 9799890 11061866 13054480 12346260 10053876 10863588
41106 10863588 16607190 23197187 24759090 19382470 10411116 3521318 2914911 8644587
41098 8644587 16406843 20720494 19413581 15017531 11647917 11017469 11598824 10819267 7462767
41089 7462767 2478219 -1777115 -3188973 -1417795 1976247 5091294 7349790 9474902
41081 9474902 12139747 15365396 19297962 24371122 29645835 31951094 28789134 22325250
41073 22325250 18321606 19929580 24235315 26308637 24745028 21143531 16236858 10170802
41065 10170802 5662119 6431078 11678079 16042157 16758527 17368715 21840577 28016751
41057 28016751 30345907 27335686 22689322 19714391 17931843 15520571 12514451 10672161
41049 10672161 11581278 15346653 20254304 23796652 24791494 23992846 22002675 18093641
41041 18093641 12747080 9734977 12683350 19879237 25406109 25882203 23478826 21512503
41033 21512503 19898703 17032459 14309621 15833935 23294202 32722625 37302046 33332052
41025 33332052 23346890 13514492 8215123 7393735 8748905 11010579 14079460 17122765
41017 17122765 18613427 18512841 18868217 21415368 25359426 28215535 28396629 26374269
41009 26374269 23541760 20752079 18518982 18171927 21246827 26715152 30167813 28069587
41001 28069587 22557595 19370042 20573468 22344497 21224688 19198447 19866593 22412033
40993 22412033 23174719 21506192 19866707 18810790 16152840 11476025 7700220 7217875
40985 7217875 9475338 13024493 16741004 18141193 14174497 5812837 -876772 -679086
40977 -679086 5334639 11918029 15376469 15472424 13416321 10360694 7541998 6585707 9445235
40968 9445235 17315069 28025908 35302101 33855972 25930635 19662855 19651671 22174138
40960 22174138 21361745 16807592 12514791 11187903 12673824 15803673 18517837 18043886
40952 18043886 14458998 12686957 17244226 25631169 30383239 27583928 20452763 14658389
40944 14658389 12966314 14624047 17172287 18058432 16437271 14141669 13839704 16348201
40936 16348201 20634897 25416017 29302768 30745505 29819513 28683133 28114095 25498992
40928 25498992 19279130 13316174 12369756 14279372 11902397 3352356 -4700835 -5662900
40920 -5662900 -735888 4311520 6688071 8158076 11354250 16949553 23121913 26351679
40912 26351679 24179521 18098952 12101878 8011519 4543815 1170543 -370339 658328
40904 658328 2669459 5090723 9454278 15329029 18996840 18853984 18549714 21429945 25049091
40895 25049091 25088749 22141769 20370626 21201625 22288935 21159137 16140157 5663736
40887 5663736 -8726074 -20097371 -22071112 -16750214 -12034402 -11332502 -11019170 -8151821
40879 -8151821 -4697858 -2378637 974275 6642770 11013292 10221675 5782039 1949009
40871 1949009 -144530 -2121318 -4027391 -4235080 -2942763 -2478253 -4102486 -6802016
40863 -6802016 -9134087 -10411714 -10288875 -8738616 -6220960 -3003185 608086 2514224
40855 2514224 -303333 -6785799 -10057054 -4805560 4483319 7364106 217859 -9219642
40847 -9219642 -11930009 -7813315 -2251638 3810727 14169767 28027240 36659109 32957764
40839 32957764 21042995 12082392 11501954 14329413 13658679 9705052 7828753 10068279
40831 10068279 12543343 11179249 6632421 2059394 -1715260 -6406580 -12428369 -17257177
40823 -17257177 -18323228 -16111505 -13246306 -11170051 -9085467 -6157563 -3176128 -1128813
40815 -1128813 506106 2394812 3474683 3224589 5330864 14869089 30021435 40594101
40807 40594101 38647169 28141457 19680676 17614902 17872098 17590486 19497310 24459293
40799 24459293 26574228 20926125 11989845 8467170 11976770 16446986 17624460 17456556
40791 17456556 18500399 19075810 16121253 9787229 3289378 -46099 1083962 4759381
40783 4759381 6514851 3691458 -613774 -884227 2964888 4597345 -355536 -8478097
40775 -8478097 -13780538 -15602380 -17409821 -19534672 -17928401 -10759601 -2422035 1240111
40767 1240111 -207026 -2002647 -644344 2147856 2726324 1032110 433619 2095282
40759 2095282 2489956 -1351007 -6338833 -6808500 -2846493 -713283 -3752164 -7016759
40751 -7016759 -3720676 5980783 15895041 21098102 20697138 15417400 7357879 1584643
40743 1584643 2587365 7739608 8881432 2919967 -3118003 -1307067 5963281 9123313
40735 9123313 4721852 -187974 1410093 6627193 7508091 2851219 -366010 2633178
40727 2633178 7990808 9577021 7478156 5826621 4863775 980706 -5521281 -8767860
40719 -8767860 -5762383 -1511313 -1688177 -3857302 -1402063 5577333 9389392 5461473
40711 5461473 -1380142 -3735174 -812673 2430989 2691935 1075276 -462977 -1710513
40703 -1710513 -2669407 -2101802 937557 5313264 8763404 10233184 10497666 10593673 10217837
40694 10217837 7965374 3101526 -3102605 -8023192 -9794003 -8798235 -7116766 -6495232
40686 -6495232 -6726486 -6050417 -3374246 -25567 1180737 -1257947 -6083725 -10526357
40678 -10526357 -12211339 -10022557 -4709461 735758 3081576 2596531 3233181 7374284
40670 7374284 12121589 13430400 12465152 13986942 18568293 20710635 16276022 8295638
40662 8295638 2972585 2436104 3982124 4402137 2334811 -1856835 -5402553 -3801752
40654 -3801752 3952645 11399495 10275745 1151101 -5646123 -2012379 8265134 15006702
40646 15006702 14329433 11461507 11775832 14218124 15301631 15092324 15378288 14666153 10100072
40637 10100072 3857486 2465882 8235894 15667943 18855878 18557597 18303826 17063741
40629 17063741 11379867 3246584 -444612 2821488 7802754 9228418 8090746 7401156
40621 7401156 6031453 1208372 -5258969 -7849126 -4050401 2940868 8231084 9777226
40613 9777226 9114112 9225867 11513349 14033130 13658117 10428746 7632321 6609854 4601862
40604 4601862 -70992 -4156836 -4554724 -4373277 -8834035 -16597022 -20689260 -18020857
40596 -18020857 -12710603 -9077911 -6425848 -2805685 430846 892683 -776706 -1725827
40588 -1725827 -142569 3669180 7403185 7256176 1523419 -5063523 -4541733 4226466
40580 4226466 12511144 12356394 6921488 5377351 9870859 13727200 12446169 10134719
40572 10134719 12504487 18270729 21659267 20939102 19860054 20807051 20555090 14727460
40564 14727460 4274848 -5064737 -9252265 -9465851 -8547158 -6382846 -1264097 5072383
40556 5072383 7005398 1129909 -8794514 -14846180 -12692663 -5395583 218948 -24300
40548 -24300 -4877924 -10171355 -12958058 -13051233 -11560602 -9428819 -7612113 -7176688 -8087866
40539 -8087866 -8728809 -7606869 -4800356 -1042158 3207058 6626608 6887662 3769475
40531 3769475 814236 1267992 3855451 5641712 7362105 11513674 16146583 16121097 11154551
40522 11154551 6899665 6044954 4012265 -2853545 -9634393 -8550463 344277 9143349
40514 9143349 11647077 9023792 6616664 8367585 14063116 19663802 20724193 16969449
40506 16969449 12393231 9963317 8747644 7569962 7679627 9025073 7921801 2539943
40498 2539943 -2962030 -4720518 -5886164 -10578463 -14115923 -7723930 7501766 19929178
40490 19929178 22321705 19651906 19206663 20437585 19357184 16686610 15219332 13132458
40482 13132458 6805636 -1446745 -4909322 -2059484 475594 -3790804 -13294731 -20761748
40474 -20761748 -21418915 -16745208 -10865117 -5652596 -681620 3366122 4212225 1879916
40466 1879916 414096 3194756 8255722 11219777 11478375 11807928 12721859 11539271 7303838
40457 7303838 2589758 -187418 -497202 2454867 8859327 14336789 12238582 2476828
40449 2476828 -6508555 -7689164 -3519624 -1137655 -3431483 -8314943 -13146665 -15780404
40441 -15780404 -14205702 -9252664 -5269975 -4564552 -3942841 -440140 2951876 2162999
40433 2162999 -348297 1201747 6819094 10843361 10444445 8235837 6452082 4161969
40425 4161969 1085300 -990443 -2153400 -5445014 -12195796 -19552815 -24011764 -24573953
40417 -24573953 -21612641 -15746176 -8897895 -3655693 -431544 2671272 6872530 11775481
40409 11775481 16979892 21824117 24168576 22901339 21054550 22347461 25056880 24106524
40401 24106524 19220544 15387112 14323639 11699389 5195325 -802480 -2436769 -3075465
40393 -3075465 -7798359 -14928583 -18247092 -15295054 -8895265 -2268436 3100006 6195166
40385 6195166 7072648 7688003 8873581 8028694 3237439 -2153807 -3210453 -304453 2116434
40376 2116434 2791931 4779979 9060751 11674120 8761883 1205550 -7145518 -13404330
40368 -13404330 -16841751 -18229593 -18602245 -17237270 -11721775 -2445302 4554172 3594632
40360 3594632 -2255087 -3968132 1429789 7131291 6888480 3342999 2133928 2821369
40352 2821369 1395979 -1771602 -3395195 -5037410 -11967947 -23550429 -31576351 -30637442
40344 -30637442 -24495403 -18986822 -14141953 -8233256 -4962514 -9451781 -18786884 -23709272
40336 -23709272 -20308624 -13939430 -10206343 -8305350 -6160608 -6021085 -9737466 -12865003
40328 -12865003 -9921107 -3241574 -58312 -1594319 -1749352 2654265 6895941 6122013
40320 6122013 2515958 950562 1591158 1073354 -1620982 -4405502 -5400235 -3750135 988548
40311 988548 7043610 9965268 7622430 4026602 4299021 7342322 8005943 5429725 3774571
40302 3774571 4389113 3029572 -2954759 -9495385 -11296938 -9286405 -8973526 -13072380
40294 -13072380 -18719799 -21132574 -17968996 -10935978 -4526327 -1956384 -1198106 3102647
40286 3102647 12297014 20715318 22389549 18641285 15794081 16932068 19684427 21318666
40278 21318666 21791408 21551851 20632837 21183133 26619473 35408232 38916502 29624821 10687404
40269 10687404 -5910548 -10933299 -5707934 1248596 2985591 -964921 -6302732 -8968427
40261 -8968427 -8573090 -7284730 -5850084 -2265571 4480106 10876697 11650817 5911039
40253 5911039 -1708154 -6220194 -6408008 -3633989 448880 3661752 3640915 867899 -572199
40244 -572199 2021469 5542046 4555851 -1488317 -7448576 -8704476 -5367605 -203098
40236 -203098 4523898 7087454 5908298 1018644 -5408506 -11082665 -14876374 -15636438
40228 -15636438 -11989846 -4754270 2448157 6897078 9582949 12342319 13735064 10615956
40220 10615956 3329089 -3522207 -6037796 -4579262 -1595122 1962129 6218663 9476923
40212 9476923 8166137 628945 -9982704 -17681364 -18506645 -12934124 -3922433 5943707
40204 5943707 14805519 20609305 21738787 18571532 13441791 9208512 8215353 11234709
40196 11234709 15921376 17707312 14601491 10150830 8954171 10270261 9722748 6756504
40188 6756504 5625702 8287368 11522546 13113131 15485894 19663998 20737087 14826523
40180 14826523 6898555 5113513 9211327 11163837 7045247 1689570 271326 1143962
40172 1143962 -167903 -4149034 -7720807 -8841020 -7930906 -6331015 -5242976 -5009469
40164 -5009469 -4418191 -2061588 1234119 3234779 3774391 4960608 7521052 9869493
40156 9869493 11627115 14708501 19120498 20827827 16624579 9186059 4475126 5075693
40148 5075693 8192991 9491007 7141576 2603513 -1218868 -2775707 -3281314 -4718224
40140 -4718224 -6738507 -7295143 -6248894 -5718441 -6215804 -5446693 -2515474 -522264 -2662990
40131 -2662990 -7775340 -11998016 -13159645 -11572320 -8521083 -6432324 -8641972 -15855732
40123 -15855732 -23706904 -26502462 -22904228 -16018589 -9177694 -4151936 -2213710 -3511370
40115 -3511370 -5514076 -5202422 -3296858 -3621846 -7363486 -10287856 -7345459 976548
40107 976548 8335055 8668623 2189072 -5155735 -8264522 -7834351 -7446056 -7222611 -4078570
40098 -4078570 1510660 3856821 -44730 -5120731 -5206422 -2561898 -4873800 -13930188
40090 -13930188 -23006471 -25921080 -23462794 -19442060 -15211527 -10746847 -7500589 -6860733
40082 -6860733 -7644639 -7557028 -5833477 -2957397 414176 2597876 943789 -5017365 -11777508
40073 -11777508 -15266242 -15057086 -13239728 -10188455 -4158567 4682513 12111020 13238742
40065 13238742 7618037 149640 -3247592 -672407 5020585 9826752 11892641 11368156
40057 11368156 8921356 5742336 3552308 2600508 574768 -4313418 -9942982 -12586261
40049 -12586261 -12129290 -11984614 -13816232 -15726740 -16284683 -16693063 -17517321 -16903422 -14368527
40040 -14368527 -12980250 -14513506 -15196965 -10408028 -2031436 3270164 2808089 740454
40032 740454 1509884 4137911 4881129 2968878 1307502 2506649 5983310 8810543 8585243
40023 8585243 5623850 2657144 2140544 4000735 6468508 8494651 10166339 11283525
40015 11283525 11425381 11516743 13114097 15251491 14222826 8411459 1788408 65364
40007 65364 3931032 8690375 10665044 10995631 11814039 11507712 6951641 -503452 -4732182
39998 -4732182 -1596306 6043874 11461822 11055489 7073899 4336062 5541717 9354379
39990 9354379 11914704 10194696 4454353 -2500494 -8141134 -11309874 -10814317 -5397012
39982 -5397012 3355265 10047284 10170844 5321249 1486046 2233448 5555267 7315128
39974 7315128 5600158 1390808 -2869282 -4675161 -3390227 -1659263 -3188999 -8178637
39966 -8178637 -12492715 -12288669 -7959107 -2617970 1501019 3736512 3783333 1842400 -718125
39957 -718125 -2460326 -3258263 -3661238 -3846718 -4318010 -6226539 -9087357 -9401907 -4377517
39948 -4377517 3241113 7230331 5740474 4104277 7543941 13354854 14000256 7502882
39940 7502882 726328 746280 6210386 10209040 9465318 6586788 4072125 1031296 -2959687
39931 -2959687 -5396933 -5060672 -4932580 -7099081 -7730214 -2074557 7086164 11355324 7290363
39922 7290363 526476 -1405494 3468839 11720524 17743567 15947594 4803260 -8879689
39914 -8879689 -14243601 -8434681 -901208 -1995236 -10380109 -16125820 -13916179 -7869752
39906 -7869752 -3940150 -2967831 -2800261 -3234997 -5760764 -9861017 -12344380 -10939287 -7240401
39897 -7240401 -4723397 -4047831 -2384382 1436490 3624357 397680 -5621623 -8654598
39889 -8654598 -8603741 -10632025 -15089359 -14936957 -6711889 2438715 4250150 825145 22265
39880 22265 3150134 4812834 2935631 1053503 800657 -655660 -4587374 -8073966 -8656378
39871 -8656378 -6567969 -1758856 5758902 11873879 10861105 3568829 -2853822 -5334835
39863 -5334835 -8428218 -14486071 -17319237 -11039902 173019 7414136 8423686 7453930
39855 7453930 6778426 5109942 2929069 2534644 2723334 -413447 -6314887 -9138804 -6196442
39846 -6196442 -2431307 -3375470 -7132285 -7155483 -1227167 5931517 8655457 6108966 1679912
39837 1679912 -1067819 -579080 2994842 8128493 11909665 11562912 7178753 2043092
39829 2043092 -910106 -2301878 -4762239 -8997187 -13135493 -15413076 -15329417 -12427209
39821 -12427209 -6730597 -976349 535731 -2982954 -6985484 -6718424 -2686593 667137
39813 667137 339095 -2934453 -6536812 -8190043 -7026468 -4153958 -1764949 -467503
39805 -467503 1836852 7080527 13579595 16903007 14256131 7305968 800882 -1334032
39797 -1334032 827279 3407396 2453189 -2484740 -8879911 -14419078 -18091660 -18935207
39789 -18935207 -16399847 -12132902 -8712333 -6105887 -2182833 2683326 4990142 3478755
39781 3478755 1592515 2435942 4644487 5903656 7128080 9501814 10321190 6459027
39773 6459027 388888 -1960271 951413 4542378 4426591 1184661 -1621850 -1602725 788476
39764 788476 3014269 2976125 1912214 3485970 8405694 12039312 9975980 3960427 -795868
39755 -795868 -2129069 -1044133 2428710 8444907 13541806 13084253 7683848 2552464
39747 2552464 520740 489286 2436852 7810452 13980767 14762293 8906913 2384696 -614840
39738 -614840 -3170764 -8374816 -12380312 -10273607 -4696388 -2432980 -4996756 -8528625
39730 -8528625 -11207413 -14520276 -17659772 -16721416 -10690775 -3752895 -204380 -301088 -1875988
39721 -1875988 -2798124 -1215017 3091608 6593186 4892600 -777648 -3675014 -589587
39713 -589587 2793919 -600220 -8800100 -12768608 -8373343 -1370103 1111993 -353787
39705 -353787 -481080 1539936 1050897 -3839557 -7926636 -5320074 2863203 10306519 13129331
39696 13129331 12463545 10641419 8680118 7625672 8632578 10393570 9401501 4609689
39688 4609689 -94134 316902 7073305 17292853 26588425 30760311 27207483 17168075
39680 17168075 5863648 -1276777 -2469578 357174 3740967 4560468 2180660 38761
39672 38761 2741756 9845818 14929341 13136236 7240839 3183027 1756985 -1112064
39664 -1112064 -6844202 -11618805 -11958908 -8988452 -5602505 -2499131 939098 4137113
39656 4137113 6156565 7775092 10370000 13054239 12936890 8709073 2633375 -1891910
39648 -1891910 -3967258 -5243862 -6670295 -6928518 -4932017 -2221236 -948748 -480464
39640 -480464 1463527 4557741 5589042 2900769 -1468516 -4601808 -4856574 -886757
39632 -886757 7388617 15296499 15586242 7534535 32268 1239748 8160274 11242290
39624 11242290 6700064 -1288054 -8622118 -14856578 -19037538 -18619544 -14120445 -9820259
39616 -9820259 -8252527 -8101512 -8191312 -8763332 -8106717 -3537944 2754354 4672422 1163839
39607 1163839 -1862344 -1363192 -2152180 -7728843 -12984378 -12469041 -10040783 -12150660 -15872271
39598 -15872271 -13133500 -4743236 -124869 -2730727 -5394377 -2690222 819079 -956136
39590 -956136 -5973849 -8240987 -6455144 -3052585 1215226 6056108 8128783 4874452
39582 4874452 271698 1004393 7296062 12711139 13367378 12452450 14173870 17286091 17049876
39573 17049876 11299621 2560394 -4518614 -6621376 -3879312 481908 3324350 4520698
39565 4520698 5691170 6702026 5699703 2649372 275486 889680 4644844 11210245
39557 11210245 19721471 25866046 23379456 11955895 506295 -2019503 2787852 6145672
39549 6145672 4578061 2962740 4674198 5511722 946824 -5726581 -7544168 -3294272
39541 -3294272 2120620 5018590 5845267 5748853 5252942 6325740 10710569 15154832 13318765
39532 13318765 4854226 -1753190 1048966 10446444 17631424 19312542 20011596 23495460
39524 23495460 26893809 25012150 17330911 8513839 3444661 3261071 5306034 5830815
39516 5830815 3328117 -97106 -1043262 1475890 5462166 8823907 11118394 12004487
39508 12004487 10139711 5349727 460841 -1444331 -1233547 -2690752 -6698767 -8944201
39500 -8944201 -5395169 1511021 5141117 3159318 680396 3353549 9828001 14067435
39492 14067435 13747343 12348608 12562510 11850851 6980904 -155356 -4827489 -5918668
39484 -5918668 -6308948 -7409863 -7231210 -4459455 -810814 2292509 6354537 12639982
39476 12639982 18395409 19166761 14270807 7557689 2672356 -468322 -3753282 -6788933
39468 -6788933 -6388230 -827210 6148999 7706252 1760144 -5264378 -5506313 176070
39460 176070 3271208 -277736 -3979816 -345026 7460653 9330860 2260182 -5513381
39452 -5513381 -5612047 378686 4712030 3737442 611226 -623480 -184562 -1565399 -7174465
39443 -7174465 -15242564 -20563442 -19030407 -12168262 -6224846 -5742903 -8750804 -9330870
39435 -9330870 -4401276 3038112 7214837 5514878 1009974 -1135891 189154 913365
39427 913365 -1898536 -4644258 -1717872 5343565 8339970 3554417 -2525131 -1946797
39419 -1946797 4418059 9956047 12385071 14608661 16885077 15074055 8205657 2200094
39411 2200094 2804245 8130657 11308946 8607825 2430747 -2384875 -2972479 196958
39403 196958 4395642 6613484 5008685 -774197 -9140512 -15605467 -14593071 -5064497
39395 -5064497 6647687 12719955 12027292 9420255 7823222 5460609 954467 -3805408
39387 -3805408 -7142680 -9360542 -9555643 -5642914 270510 1939189 -2156924 -5166872
39379 -5166872 -1577108 4271363 5088730 1965387 1819411 6123407 9783670 10460339 11598833
39370 11598833 15373865 19012619 19656052 17505326 12803074 5057882 -3008412 -6064892
39362 -6064892 -3172945 450170 1120041 1532628 5037901 9571234 10997219 8771901
39354 8771901 4409438 -2220355 -10526009 -15867406 -13855118 -6953647 -2223842 -2651129
39346 -2651129 -4508073 -3469514 76683 2536287 1319145 -3308740 -8753669 -11753208
39338 -11753208 -10709499 -6870223 -2736841 361998 2716966 5290716 9038306 13817763
39330 13817763 16978879 14760679 6871757 -1549416 -4434294 -597544 6024797 10536745
39322 10536745 10115116 4811660 -2265390 -6678054 -6829144 -5680007 -6665488 -9336363
39314 -9336363 -11146520 -11757102 -12441305 -12399293 -9336220 -3596174 1564446 4215391 5518532
39305 5518532 6932743 8343972 9461299 10415309 10146050 6604822 -265147 -7450825
39297 -7450825 -11616107 -11653558 -8520660 -4542451 -3018815 -6009808 -11526548 -14812700
39289 -14812700 -13308298 -8813808 -4438689 -1554470 -358100 -951537 -2460568 -2960721
39281 -2960721 -1681615 136898 1481832 2918149 4791161 6117845 6515893 7140526
39273 7140526 8108901 7078408 2479349 -3547883 -7715485 -9675516 -11228255 -12848621
39265 -12848621 -13818717 -14855330 -17306152 -19758944 -18668661 -13286438 -7486096 -5470758
39257 -5470758 -7455733 -10544102 -12020360 -10648737 -6655058 -2219743 -609495 -2742121
39249 -2742121 -5304629 -4205171 452341 4649920 5543461 4325021 3696861 4404682 5299036
39240 5299036 5659000 6453354 9735936 16670591 24824498 27730010 20016095 4404493
39232 4404493 -8930954 -12339248 -8182505 -3999516 -2644120 -1276444 1499738 3231056
39224 3231056 3116653 4452627 8846657 12140176 9757403 3467843 -816064 -388307
39216 -388307 2210794 3202386 703313 -5057663 -11676321 -15215274 -13509438 -8853028
39208 -8853028 -5803453 -6758430 -10732172 -15052113 -16812756 -14540048 -10415834 -8997908
39200 -8997908 -11627658 -14222565 -12893905 -9060751 -6005436 -3448234 231308 3055703
39192 3055703 1888793 -1927893 -4571243 -5961008 -8700748 -12246628 -13929529 -14346828
39184 -14346828 -15120191 -12744366 -3017761 8583637 10626544 1833431 -6206727 -6096026
39176 -6096026 -4538612 -9335625 -15859085 -15145443 -8486055 -4163987 -4200221 -4114866 -3091503
39167 -3091503 -4793077 -9126617 -11900887 -12557200 -14370149 -16751696 -15096238 -9355199
39159 -9355199 -5569093 -7051917 -10299022 -11467102 -11040799 -10172969 -8172053 -5957985
39151 -5957985 -6708062 -10664376 -14291533 -16722647 -21496515 -29165170 -34063247 -32274968
39143 -32274968 -27233135 -22723911 -15950494 -4051913 7017133 8548111 2344836 -422618
39135 -422618 5706115 14018082 16439302 13967727 12107655 11215230 7355191 161342
39127 161342 -6220685 -9549648 -11359516 -11602587 -6843962 3354165 12567235 14414440
39119 14414440 10807757 8582386 9397787 8393532 2807061 -3839727 -7786105 -10012713
39111 -10012713 -12459193 -13955901 -13450693 -13071175 -13751860 -11720588 -4509975 2873605
39103 2873605 3976170 742424 383138 3584003 3627431 -1910135 -6342719 -3911049 1507869
39094 1507869 2117117 -3314701 -8786105 -8472071 -1745012 7244751 12688278 11651055
39086 11651055 7183627 4978955 5928846 4790851 -2457110 -13116275 -21347804 -24063740
39078 -24063740 -21311440 -14349478 -6308249 -1889549 -2976106 -6229392 -7557122 -6937363
39070 -6937363 -6337898 -5375285 -2601446 438086 194477 -4046856 -9031410 -11311245 -10345412
39061 -10345412 -8010400 -6520199 -6870516 -8622932 -11149428 -14339231 -16802918 -14746196
39053 -14746196 -5944605 5360837 11485491 10088223 6260215 5002152 5920275 6716100
39045 6716100 6911233 5651532 880805 -5875247 -8726779 -5629705 -2961328 -7029401
39037 -7029401 -14864474 -18759798 -16691096 -12708395 -9789244 -7930620 -6906242 -5383106
39029 -5383106 200934 10107985 17370749 15945526 10343268 9784884 14708711 17333092
39021 17333092 14610929 11593001 11446532 11236853 9494715 9305451 11069823 10444853 6950752
39012 6950752 6406589 10258016 10554214 1751037 -9433974 -13316493 -10890923 -10016207
39004 -10016207 -11742006 -9237135 716202 12802919 20464148 22572921 21980208 21562823
38996 21562823 22338752 22433655 18044859 8128942 -2695553 -8675301 -9058337 -6890149
38988 -6890149 -3926865 -942028 -1095725 -7187735 -15559044 -18253717 -12686247 -4788595
38980 -4788595 -917265 -615742 471182 4007923 8089439 10539480 10346101 7352145
38972 7352145 2921551 -113356 -263782 511072 -767785 -4202899 -7345281 -9031463
38964 -9031463 -10840809 -14266103 -18140288 -19993806 -18892820 -15543979 -10313701 -3240047
38956 -3240047 3638994 6305464 3106255 -1949455 -2494369 3505362 11892705 17102487
38948 17102487 17258029 14606247 12780206 14001844 17260050 18666388 15070400 7849240
38940 7849240 1920669 916271 4597621 10348614 14823898 14656011 9163796 3149776
38932 3149776 3376787 10482705 17419470 17842770 13080664 8575348 6572155 5428465
38924 5428465 3541610 335398 -4733175 -10336377 -11808048 -5672052 4518653 10450759
38916 10450759 7824894 541920 -4101528 -2428540 3255946 7133657 4423736 -4831866
38908 -4831866 -15925380 -23742680 -26230153 -23693723 -17271832 -9840728 -5872736 -7235700
38900 -7235700 -10303347 -9971697 -5642818 -873275 1615323 1767358 118859 -2990153
38892 -2990153 -6395347 -8609498 -8972999 -6988368 -2428370 1904145 546919 -7679200
38884 -7679200 -15532025 -14960076 -7333310 -982725 346382 691230 3565514 6825103
38876 6825103 7687984 7626807 9525578 13618675 18388414 22331699 23345243 19856364 14175582
38867 14175582 11171930 11829008 11642853 7353495 1609049 -1498542 -2025656 -2204813 -1734121
38858 -1734121 1321263 6326275 9760101 8682018 3012287 -4770943 -11140248 -13673622
38850 -13673622 -12372524 -8343565 -2277924 3959028 6274515 2806460 -1947062 -2496675
38842 -2496675 -971259 -4033051 -11209729 -14177554 -9809923 -5778417 -8924987 -15599104
38834 -15599104 -19232072 -20538245 -22927438 -23705296 -18625127 -11221012 -8436875 -9355539
38826 -9355539 -7479452 -2979597 -2982284 -8978017 -13370489 -11305168 -7686206 -8164859 -9910247
38817 -9910247 -6940684 -174736 3787100 2052039 -1329715 -1573205 622739 324843
38809 324843 -5030688 -11443965 -12132034 -5830816 944897 1696404 -2487065 -6075257 -7239660
38800 -7239660 -8377201 -10170882 -10567839 -9472185 -9195301 -9689996 -8456754 -6331010 -8207420
38791 -8207420 -15671886 -22987258 -23103609 -15050820 -3804855 4551909 6647145 3990354
38783 3990354 2342478 5872039 11485975 12574803 8492964 5444509 6988300 9119018
38775 9119018 6997113 1511991 -3656003 -6900373 -7677925 -5223427 -1625227 -1796644
38767 -1796644 -6643252 -10277059 -7811870 -1949848 2046356 3607087 4614091 4418700
38759 4418700 2643508 2960644 7685562 11807537 9376884 3487184 2406418 7013034
38751 7013034 9858352 6854659 2334495 1048922 2058448 3148892 5409462 9933847
38743 9933847 14229413 15332217 13749759 11905953 10914453 10383236 9130074 5271876
38735 5271876 -1696254 -8361016 -10089459 -6848628 -2841520 197913 4971751 12366446
38727 12366446 17772664 16650312 10694226 5600039 4785665 7252076 9422174 7605776
38719 7605776 1283782 -4685914 -4273497 1824733 6215944 4628180 1176017 758754
38711 758754 1239834 -1508057 -4747757 -2324915 4365565 6381982 -276636 -8154832
38703 -8154832 -7377189 2745380 14411874 20920558 21908714 20173658 17115430 12781678
38695 12781678 8653049 7970565 12292274 18520723 20918560 16586178 8081754 365912
38687 365912 -3667287 -4280519 -3275796 -2508545 -2822803 -3329230 -2719420 -1854349 -3155517
38678 -3155517 -6380425 -7576393 -4500566 -750054 -1210134 -4943008 -6463425 -3444003
38670 -3444003 980305 3886890 6257454 9341032 11001372 8626012 3653185 340993
38662 340993 856769 3684613 6215363 6891758 5193749 1740275 -1095951 -533136 3293993
38653 3293993 6186493 3646774 -3968705 -11180362 -12889147 -9222661 -3987464 500601
38645 500601 4938112 9878559 14049690 16789751 19334216 21723015 21029709 15776011
38637 15776011 10310368 10706155 16456720 20130666 16457048 8824769 5009289 8268893
38629 8268893 14313445 16183568 11158264 3336529 -518541 1733244 5388288 5378743 3321749
38620 3321749 4846376 10772352 15563506 15444358 13379200 13629519 15497079 15850325 14472038
38611 14472038 12836838 10258370 5964199 3233903 6197307 12849427 16200139 12949683
38603 12949683 6564736 853838 -4674417 -10763787 -14067912 -10886203 -3340659 1612795
38595 1612795 -1071578 -10451493 -21040747 -26553665 -23634698 -14334633 -4683244 548193
38587 548193 1207449 -537745 -3680820 -7637110 -10102615 -8969106 -5842173 -4684991
38579 -4684991 -6863591 -10000868 -11746734 -11976774 -10915019 -8095872 -4438056 -2723394
38571 -2723394 -4109910 -5998682 -5264094 -2168181 831522 2904643 5277486 8586163
38563 8586163 12081881 15311232 18369369 19987388 17311218 8936539 -2605407 -12502212
38555 -12502212 -17668855 -18455339 -16496863 -11995510 -4330799 4853539 11248115 12319906
38547 12319906 11044973 12598076 17360131 20134441 17269717 11619002 8429051 8789321
38539 8789321 9812472 9307606 7050592 2799722 -3275206 -8615959 -10148341 -8178625
38531 -8178625 -5491462 -2975989 216416 2329907 -474342 -7844273 -13790875 -13899906
38523 -13899906 -10486083 -8026600 -6898611 -4929965 -2300564 -1006992 -1195626 -1518524
38515 -1518524 -1761680 -2052136 -1148196 1085461 1301717 -3119034 -8890544 -10655762 -9383870
38506 -9383870 -11556828 -19231417 -26188958 -26178740 -20703448 -15738460 -14065765 -14109679 -13937925
38497 -13937925 -12896555 -10480865 -6686432 -3166636 -1681236 -1291362 1153820 7147974
38489 7147974 13811896 15598067 9429362 -1141943 -7842131 -5596716 1904961 6830866
38481 6830866 6850141 6572322 8868635 9541071 3889901 -4808539 -8131376 -2908310 5183577
38472 5183577 8590738 5260390 -1584120 -8139913 -12658775 -14675766 -13540248 -8481161
38464 -8481161 -223824 7959302 12021910 10525456 5500215 -176775 -4805323 -6948999
38456 -6948999 -4891481 1192921 8089231 12551133 14442926 15298041 15269195 13832802 12365453
38447 12365453 13138409 15902611 17868156 17177431 14352995 10249885 4772002 -1685926
38439 -1685926 -7061975 -8823955 -6121650 -1157808 1277861 -2721185 -11613114 -18773433
38431 -18773433 -19497096 -16269973 -14682661 -15914808 -17032757 -17528610 -20359961 -25598829
38423 -25598829 -27921941 -23023697 -13287386 -4589011 -86377 572315 -1278201 -3574919
38415 -3574919 -3396061 102787 3971890 5677846 7564874 13407221 21244251 23985162
38407 23985162 18077221 7963323 182826 -3897399 -6853573 -9099388 -8084655 -3683930
38399 -3683930 -747179 -3976453 -11768211 -17584344 -17225717 -12586978 -7795580 -4082526
38391 -4082526 -345363 2933525 3416758 656309 -2477700 -3118870 -1402299 802618
38383 802618 2449426 3403914 3719847 4651439 8960880 17611306 26503279 29121517 23157158
38374 23157158 12778867 3843188 -1163889 -2669527 -1383408 1037783 390402 -6789092
38366 -6789092 -17647523 -24420063 -23470483 -19902240 -20110677 -22339680 -19296358 -9149451
38358 -9149451 1561623 6970380 8457257 9442980 8473434 2303143 -6942569 -13043191
38350 -13043191 -13417798 -11299948 -10416609 -11324067 -13054555 -14599641 -14025846 -9321804 -1262372
38341 -1262372 6665321 11620200 13050914 11837281 10332349 12070383 17883116 23139828
38333 23139828 22802362 18288918 14489004 10925580 2545143 -10041517 -18597851 -18337208
38325 -18337208 -14078736 -11455853 -8754180 -2987395 2069461 1294018 -2544032 -2862955
38317 -2862955 -145105 -959836 -7204490 -13671050 -16205983 -15398765 -11747206 -4177945
38309 -4177945 4901515 9387127 7016602 2167710 -1314026 -5240372 -12003072 -18727137
38301 -18727137 -20453180 -16421377 -9724513 -2775908 3654959 8367643 9837788 8071574
38293 8071574 4392163 -299030 -5665054 -10659591 -13189410 -11314726 -5175733 1606957
38285 1606957 3354926 -2824870 -13395911 -21083867 -21461980 -16031939 -9626849 -6376200
38277 -6376200 -7260295 -9413227 -8405796 -3262721 1560950 1111986 -4611769 -12320152
38269 -12320152 -19979256 -26043541 -26894906 -20638946 -12144142 -8412782 -9528470 -10090945
38261 -10090945 -8695585 -8564382 -8787514 -3799162 6338055 13960748 15640896 17259994
38253 17259994 22401826 24533595 17770119 7684324 2972200 2826791 1902600 2092017
38245 2092017 8256531 15874059 15037503 5999364 -575957 330500 2535363 1254844
38237 1254844 670331 4542868 8407128 7298391 4680290 7168175 14488971 20236404
38229 20236404 19960877 14360592 6683688 204343 -3566908 -6098922 -9086634 -9969604
38221 -9969604 -4278181 6484382 14415476 14804739 11061480 7797129 5109609 3244270
38213 3244270 6015725 13633475 18043011 13039441 4683489 3147353 7160066 6147656
38205 6147656 -2930467 -10813066 -9797363 -3379423 1642721 4808012 8165200 8930589
38197 8930589 3217572 -5909813 -11044375 -10414502 -9501537 -12203769 -15438637 -14368445
38189 -14368445 -9076638 -3264357 1051522 4074463 4675804 325386 -8311456 -15590607
38181 -15590607 -16075297 -10314481 -3432222 1079060 3732956 5770525 6651915 5631746
38173 5631746 3254804 76299 -3852955 -6990069 -6310410 -1184341 4951717 8765476
38165 8765476 10615459 11932510 11972750 10312734 9578448 11274508 11417611 6034953 -476305
38156 -476305 643531 9790248 17286566 16361813 11060426 7850984 6001345 1714746
38148 1714746 -3476304 -5310683 -4552305 -5236051 -7045994 -6220779 -3110618 -2017072 -3523535
38139 -3523535 -3787127 -2265330 -3153461 -7184880 -8974964 -5819581 -2614678 -3586480 -5167676
38130 -5167676 -2811780 403871 -842081 -3909986 -1492154 6582961 12756942 12740301
38122 12740301 9779197 7437402 5364115 3617075 3958629 4366532 -784076 -11461491
38114 -11461491 -19240487 -18246637 -13147909 -11149045 -11269441 -7728619 138243 7960227
38106 7960227 13258733 15800287 13815394 7038247 1526005 3550865 9244098 8209116
38098 8209116 -1877544 -11816603 -13562646 -9092031 -4241880 -787268 1687715 2195414
38090 2195414 1138842 1983257 5986978 9418912 9672992 9547389 11314956 11484153 6901481
38081 6901481 1776513 2087059 5971892 6686866 3431729 1956694 4400229 5400587
38073 5400587 144395 -8872813 -15385563 -16059852 -11947383 -6331926 -2795083 -3056443
38065 -3056443 -5250549 -5759153 -3204574 667394 3450730 3349283 -1109994 -9595968
38057 -9595968 -18263133 -22292867 -20447215 -15226164 -9383204 -4965609 -4628887 -9866716
38049 -9866716 -17670259 -22341950 -21221790 -16247596 -10585956 -6956900 -8027280 -13574596
38041 -13574596 -17469666 -13005796 -2272679 5097438 4158628 218657 -141941 2103939
38033 2103939 2467259 797464 -216837 -1229142 -5405473 -12639160 -18809112 -20183936
38025 -20183936 -15792728 -6947985 2605129 7618235 5544893 -1150476 -8787382 -16209239
38017 -16209239 -22362807 -23693712 -18337382 -10373824 -5051421 -1815210 2614106 6251465
38009 6251465 3973807 -2509510 -4472804 1549841 7821473 5954668 -1376069 -4512760
38001 -4512760 -56246 5176868 3228134 -5629894 -13429629 -12624264 -3123945 8038153
37993 8038153 13919029 14246904 13800512 14856497 14090002 8147912 -369801 -5140851 -3333721
37984 -3333721 1620583 4244555 2552736 -420688 410480 7358833 17175420 23328447
37976 23328447 21760039 14322736 6662772 3650901 6705471 13454125 18779786 17971428
37968 17971428 11019442 3238272 -103687 534457 206820 -3841810 -8627983 -9165346
37960 -9165346 -4331949 2102090 5576724 4583999 562583 -4330195 -8051145 -8417485
37952 -8417485 -4735536 -421756 -1320754 -9050015 -17726384 -20293692 -16976109 -13783187
37944 -13783187 -13224541 -11455334 -5834192 -55398 1592273 815261 1510922 2495829 -211215
37935 -211215 -5287107 -6431930 -1158776 6279048 11892521 16370762 20285999 20538413
37927 20538413 15825095 11260552 11877502 13952395 8919647 -4482053 -17577828 -22251761
37919 -22251761 -19299699 -14551952 -11086665 -8411254 -6195226 -4809621 -3411348 -951789
37911 -951789 1140714 39296 -4482646 -9267620 -11309209 -10191471 -6643693 -812525
37903 -812525 6692858 13427462 16644057 16170957 14650832 14582833 15719823 15871068 13996741
37894 13996741 11641154 10764442 10920149 10027931 7881679 6855799 8032146 8591764 5410557
37885 5410557 236905 -1655081 1756261 6407178 7110957 3367066 -988978 -2263234
37877 -2263234 350015 5091545 9102392 10437636 9933788 10304476 12387794 13496845
37869 13496845 10840355 5302697 85694 -3224912 -5140308 -5939989 -5632192 -5728194 -7887939
37860 -7887939 -10444768 -9410540 -4052322 1364011 3000466 2043861 1853295 2970230
37852 2970230 3725203 3763837 3398565 716867 -6307871 -14615703 -17307146 -11806560 -3466076
37843 -3466076 1006370 699100 -1309587 -3563178 -5990390 -6354193 -2246142 3601003
37835 3601003 5092347 1086918 -2440948 -470659 4788968 8204901 8598303 7983832
37827 7983832 7085343 5666439 5059043 6136466 6526835 4156113 1814493 3111822 5236625
37818 5236625 1940269 -6321106 -11899575 -10972901 -8368792 -8658840 -8995000 -5349424 -488238
37809 -488238 16331 -3822442 -7482236 -8732452 -8217410 -5659251 -831896 3527184 5038244
37800 5038244 6198457 10103070 13426308 10353938 3020536 797600 7666390 16509768
37792 16509768 18519377 13421045 7675942 6357693 9267345 12211609 10568597 4213240
37784 4213240 -747391 1372240 7629028 9672092 5277694 650586 212243 1271819
37776 1271819 1618640 4719009 12079884 17002970 12956464 3638670 -2454519 -3997260
37768 -3997260 -5872126 -8870327 -8746268 -4978684 -2392706 -2894430 -2718929 -87114 823186
37759 823186 -3013845 -7504862 -6872505 -1692671 2845201 4693521 6480981 9536452
37751 9536452 10507202 6069383 -983035 -3465267 1848624 10112968 14549857 14440094
37743 14440094 13420067 11537289 5010696 -5246233 -11618497 -9948503 -5871447 -5851930
37735 -5851930 -7183534 -3956584 1039624 -677405 -9574014 -16205560 -14082245 -6898290
37727 -6898290 -1095515 1838919 2934143 1782792 -1380096 -4235479 -5999382 -8374358
37719 -8374358 -10656525 -8810778 -2467108 1950975 -1018985 -8859935 -15578374 -19542829
37711 -19542829 -22690268 -25126696 -25139940 -22563793 -18128621 -11181019 -1700966 6967331
37703 6967331 10948537 10423008 8772839 8612691 11020083 16492903 23462612 27538718
37695 27538718 25541612 19299501 12960068 7986606 3278112 -1490788 -5435198 -7991964
37687 -7991964 -8648342 -6900532 -4426290 -4665212 -7822859 -9459985 -7059913 -4248387
37679 -4248387 -4372697 -3969239 1398204 7955359 7928649 1946194 -399335 6571617 17620560
37670 17620560 24261792 23941658 19440402 14070597 10261169 9187895 9120483 6691368
37662 6691368 1452900 -3303953 -5099933 -4565836 -2491910 1703050 7229060 11238297
37654 11238297 12539593 12830265 12869269 10886907 6349310 1665862 -1726668 -5289449
37646 -5289449 -9210788 -10222765 -6706013 -2719447 -3335178 -8160676 -12645460 -13953952
37638 -13953952 -12814645 -11462438 -12269144 -16279305 -20611772 -19917122 -13422625 -7664621
37630 -7664621 -8270081 -11704434 -10449306 -4819509 -3250660 -10038343 -18762398 -21000745
37622 -21000745 -17440398 -15947063 -20250765 -25021767 -23235291 -15460673 -9018586 -8523064
37614 -8523064 -10588045 -9852835 -7592578 -9860493 -17164936 -21209957 -14941880 -2435948
37606 -2435948 5368878 3333321 -3273387 -6277485 -3111139 2701216 6712481 7813788
37598 7813788 8432939 11037706 14154288 12878361 4619070 -6740779 -14230547 -14608695
37590 -14608695 -10137984 -4734046 -875608 231577 -1615904 -5037419 -8069729 -10164271
37582 -10164271 -11749896 -12030203 -9356110 -4266062 -306816 -798300 -5482481 -10656275
37574 -10656275 -12272420 -9636868 -6837255 -9139065 -16341691 -21322459 -17949224 -9388629
37566 -9388629 -4978922 -8862144 -15481253 -17372217 -13867280 -10070756 -10081028 -13873368
37558 -13873368 -18971552 -22396855 -21985572 -18377902 -15394304 -16379476 -20262945 -22866243
37550 -22866243 -21757483 -17892239 -12749918 -6675471 -1102335 486484 -3189855 -7353481
37542 -7353481 -5471989 1909699 6352165 1877831 -6859594 -10454722 -6809987 -2479353
37534 -2479353 -2569611 -5099315 -6944823 -9576091 -14962874 -20135049 -20935396 -18591447 -17472745
37525 -17472745 -18073098 -17460515 -15550257 -15059083 -15032632 -10413328 -22028 9909753 13068543
37516 13068543 10558908 8420721 10262297 14800658 18631823 19152278 16192293 12457530
37508 12457530 11118818 12018505 11949055 9357374 6385173 5090914 4160527 1114082 -4151484
37499 -4151484 -9542116 -12737953 -11945575 -6967195 -853119 1898289 400103 -1548977
37491 -1548977 -802803 1378934 2572075 3133360 4465543 6081799 7144143 8338257
37483 8338257 9241163 6621134 -708097 -7576320 -7681796 -2000658 2758127 3760788
37475 3760788 5083662 10025521 15052415 14528807 9016817 5239627 7634081 12398376
37467 12398376 11971969 5146021 -102248 3707505 13056347 17210997 12326310 5960963
37459 5960963 5541333 8581438 8816042 6369399 5155843 4373266 784850 -2868136 -896562
37450 -896562 4070450 2387846 -7589772 -14500635 -8711606 4601198 12630204 10245997
37442 10245997 2438778 -4773329 -9640853 -12523070 -13805417 -14094684 -13562832 -11658685
37434 -11658685 -9119044 -8097164 -8268345 -5979997 -341176 3381639 918112 -3547125
37426 -3547125 -2895953 1723324 1805964 -6354966 -16685568 -21819646 -20861109 -16511650 -10102919
37417 -10102919 -3471562 -1467873 -7155582 -16092102 -19991120 -15849371 -8024910 -1585452
37409 -1585452 2630128 5658188 6919813 5493382 2679649 581450 -865854 -2953152
37401 -2953152 -4913353 -4535973 -2347883 -1834782 -3719640 -3071829 4470186 15322175
37393 15322175 21028557 18577531 13459894 11460107 11622712 9827145 5730943 2286264
37385 2286264 380822 -1860024 -4965645 -6974776 -6721544 -5352709 -4006810 -2505452
37377 -2505452 -1112587 -1313448 -3686471 -6588041 -7841729 -6369891 -1686773 6199317
37369 6199317 15109537 20731202 20477876 16713231 14235060 14477154 13805594 8290730 -868538
37360 -868538 -7890640 -8272606 -3081285 2966680 6614169 8075706 8683754 8630428 7665881
37351 7665881 6322823 5143639 3691586 1527719 -659343 -2120275 -3571906 -6439434
37343 -6439434 -10977442 -15940965 -19402171 -19268287 -14490768 -7176854 -2002688 -1407879
37335 -1407879 -2375689 -267892 4968528 9074977 9494376 8005100 6912192 5670444
37327 5670444 2873065 -468893 -1647542 389395 3623929 4843163 2691067 -984794
37319 -984794 -3164620 -3190501 -3084658 -3825368 -3582541 -1482595 -476946 -2967001 -5594642
37310 -5594642 -3123050 3368264 7441709 6511589 4299892 2943607 -908156 -8933996
37302 -8933996 -15890381 -16361658 -12586483 -10485900 -11199458 -11818655 -11676143 -11936885 -10707533
37293 -10707533 -4829390 3844724 9621716 10589135 9947294 9628575 8145814 5648143
37285 5648143 5364584 7949016 9489951 7803134 6093655 7138074 7982803 4560424
37277 4560424 -1297342 -3743004 -376209 5528724 9275821 8677511 4753525 581617
$$ [...]
##END NTUPLES=NMR SPECTRUM
##END=
