##TITLE=31Pec_DE-95K_TFA
 CDCl3, 64 sc
 9.6.2025
##JCAMPDX= 6.0         $$ Bruker NMR JCAMP-DX V2.0
##DATA TYPE= NMR SPECTRUM
##DATA CLASS= NTUPLES
##ORIGIN= UXNMR, Bruker Analytische Messtechnik GmbH
##OWNER= root
$$ XWIN-NMR		Version 3.5
$$ Mon Jun  9 14:48:29 2025 Russian Standard Time (UT+4h)  she@DPX200
##.OBSERVE FREQUENCY= 81.013821
##.OBSERVE NUCLEUS= ^31P
##.ACQUISITION MODE= SIMULTANEOUS
##.ACQUISITION SCHEME= undefined
##.AVERAGES= 64
##.DIGITISER RES= 17
##SPECTROMETER/DATA SYSTEM= spect
##.PULSE SEQUENCE= zgpg30
##.SOLVENT NAME= CDCl3
##.SHIFT REFERENCE= (INTERNAL, CDCl3, 0, 198.062)
##AUDIT TRAIL= $$ (NUMBER, WHEN, WHO, WHERE, WHAT)
$$ ##TITLE= Audit trail, XWIN-NMR		Version 3.5
$$ ##JCAMPDX= 5.01
$$ ##ORIGIN= Bruker BioSpin GmbH
$$ ##OWNER= she
$$ F:/spectra/data/she/nmr/P31/2/pdata/1/auditp.txt
$$ ##AUDIT TRAIL=  $$ (NUMBER, WHEN, WHO, WHERE, WHAT)
(   1,<2025-06-09 14:47:12.18 +0400>,<she>,<DPX200>,
      <created by zg, POWCHK disabled, PULCHK disabled
       configuration hash MD5:
       00 E9 B6 7A A2 85 ED C7 34 08 36 98 17 FE 4E 26
       data hash MD5: 32K
       DF AE 14 2E 28 CF 44 CC 1D CF A1 C1 BD 2B 32 8A>)
(   2,<2025-06-09 14:47:14.65 +0400>,<she>,<DPX200>,
      <Start of raw data processing
       efp BC_mod = 2 LB = 1.5 FT_mod = 6 PKNL = 1 PHC0 = 1483.834 PHC1 = -136.7066 SI = 64K 
       data hash MD5: 64K
       94 B1 3A 05 D8 80 19 C6 CD C3 C0 40 45 9A AB 1F>)
(   3,<2025-06-09 14:47:38.51 +0400>,<she>,<DPX200>,
      <pk PHC0 = 217.739 PHC1 = -599.6002 
       data hash MD5: 64K
       B6 AC 8B 79 A4 F2 57 A2 C5 A6 E0 F4 E1 6A FE 73>)
(   4,<2025-06-09 14:47:43.18 +0400>,<she>,<DPX200>,
      <abs ABSG = 5 
       data hash MD5: 64K
       B9 E7 EE 2F 70 2E B5 13 B3 EC 41 D1 E1 CD 70 31>)
(   5,<2025-06-09 14:47:51.48 +0400>,<she>,<DPX200>,
      <abs ABSG = 5 
       data hash MD5: 64K
       8D D4 6C F6 10 AA 60 57 AE 69 FC 5B 0B 72 0E 49>)
$$ ##END=
$$ 
$$ hash MD5
$$ B9 FE DA BC 5F 15 A7 46 5E DC D2 17 50 66 E6 1C
##$RELAX= 
##$RELAX= 
##$RELAX= 
##$RELAX= 
##$RELAX= 
##$RELAX= 
##$RELAX= 
##$RELAX= 
$$ Bruker specific parameters
$$ --------------------------
##$DU= <F:/spectra>
##$EXPNO= 2
##$NAME= <P31>
##$PROCNO= 1
##$TYPE= <nmr>
##$USER= <she>
##$AMP= (0..31)
100 100 100 100 100 100 100 100 100 100 100 100 100 100 100 100 100 100 
100 100 100 100 100 100 100 100 100 100 100 100 100 100 
##$AQSEQ= 0
##$AQ_mod= 1
##$AUNM= <au_zg>
##$AUTOPOS= <>
##$BF1= 81.014009
##$BF2= 200.13
##$BF3= 200.13
##$BF4= 200.13
##$BF5= 200.13
##$BF6= 200.13
##$BF7= 200.13
##$BF8= 200.13
##$BYTORDA= 1
##$CFDGTYP= 0
##$CFRGTYP= 5
##$CHEMSTR= <none>
##$CNST= (0..31)
1 1 145 1 1 1 1 1 1 1 1 1 1 1 1 1 1 1 1 1 1 1 1 1 1 1 1 1 1 1 1 1 
##$CPDPRG= <waltz16>
##$CPDPRG1= <>
##$CPDPRG2= <waltz16>
##$CPDPRG3= <>
##$CPDPRG4= <mlev>
##$CPDPRG5= <mlev>
##$CPDPRG6= <mlev>
##$CPDPRG7= <mlev>
##$CPDPRG8= <mlev>
##$CPDPRGB= <>
##$CPDPRGT= <>
##$D= (0..31)
0 1 0 0 0 0 0 0 0 0.06 0 0.03 2e-05 3e-06 0 0 0.0002 0 0 0 0 0 0 0 0 0 
0 0 0 0 0 0 
$$ [...]
##$SUBNAM3= <"">
##$SUBNAM4= <"">
##$SUBNAM5= <"">
##$SUBNAM6= <"">
##$SUBNAM7= <"">
##$SUBNAM8= <"">
##$SUBNAM9= <"">
##$SW= 400.765351723535
##$SWIBOX= (0..15)
0 1 3 0 0 0 0 0 0 0 0 0 0 0 0 0 
##$SW_h= 32467.5324675325
##$TD= 32768
##$TD0= 1
##$TE= 0
##$TE2= 300
##$TE3= 300
##$TEG= 300
##$TL= (0..7)
0 120 53 12 22 120 120 120 
##$TP= (0..7)
150 150 150 150 150 150 150 150 
##$TP07= 0
##$TPNAME0= <>
##$TPNAME1= <>
##$TPNAME2= <>
##$TPNAME3= <>
##$TPNAME4= <>
##$TPNAME5= <>
##$TPNAME6= <>
##$TPNAME7= <>
##$TPOAL= (0..7)
0.5 0.5 0.5 0.5 0.5 0.5 0.5 0.5 
##$TPOFFS= (0..7)
0 0 0 0 0 0 0 0 
##$TUNHIN= 0
##$TUNHOUT= 0
##$TUNXOUT= 0
##$USERA1= <user>
##$USERA2= <user>
##$USERA3= <user>
##$USERA4= <user>
##$USERA5= <user>
##$V9= 5
##$VALIST= <valist>
##$VCLIST= <CCCCCCCCCCCCCCC>
##$VD= 0
##$VDLIST= <DDDDDDDDDDDDDDD>
##$VPLIST= <PPPPPPPPPPPPPPP>
##$VTLIST= <TTTTTTTTTTTTTTT>
##$WBST= 1024
##$WBSW= 4
##$XGAIN= (0..3)
0 0 0 0 
##$XL= 0
##$YL= 0
##$YMAX_a= 6692
##$YMIN_a= -35539
##$ZGOPTNS= <>
##$ZL1= 120
##$ZL2= 120
##$ZL3= 120
##$ZL4= 120
##$ABSF1= 198.0616
##$ABSF2= -202.7028
##$ABSG= 5
##$ABSL= 3
##$ALPHA= 0
##$AQORDER= 0
##$ASSFAC= 0
##$ASSFACI= 0
##$ASSFACX= 0
##$ASSWID= 0
##$AUNMP= <proc_1d>
##$AZFE= 0.1
##$AZFW= 0.5
##$BCFW= 0
##$BC_mod= 2
##$BYTORDP= 0
##$COROFFS= 0
##$CY= -3
##$DATMOD= 1
##$DC= 0
##$DFILT= <>
##$DTYPP= 0
##$F1P= 0
##$F2P= 0
##$FCOR= 1
##$FTSIZE= 65536
##$FT_mod= 6
##$GAMMA= 0
##$GB= 0
##$INTBC= 1
##$INTSCL= 9.790993e-09
##$ISEN= 30
##$LB= 1.5
##$LEV0= 0
##$LPBIN= 0
##$MAXI= 10000
##$MC2= 0
##$MEAN= 0
##$ME_mod= 0
##$MI= 50
##$NCOEF= 0
##$NC_proc= -8
##$NLEV= 6
##$NOISF1= 182.463
##$NOISF2= 159.3651
##$NSP= 0
##$NTH_PI= 0
##$NZP= 0
##$OFFSET= 198.0616
##$PC= 4
##$PHC0= 1701.573
##$PHC1= -736.3068
##$PH_mod= 1
##$PKNL= yes
##$PPARMOD= 0
##$PSCAL= 0
##$PSIGN= 0
##$REVERSE= no
##$SF= 81.0140089999434
##$SI= 65536
##$SIGF1= 159.3651
##$SIGF2= -187.1042
##$SINO= 113.3802
##$SIOLD= 16384
##$SREGLST= <1H.CDCl3>
##$SSB= 0
##$STSI= 65536
##$STSR= 0
##$SW_p= 32467.5324675325
##$SYMM= 0
##$S_DEV= 0
##$TDeff= 32768
##$TDoff= 0
##$TI= <>
##$TILT= no
##$TM1= 0
##$TM2= 0
##$TOPLEV= 0
##$USERP1= <user>
##$USERP2= <user>
##$USERP3= <user>
##$USERP4= <user>
##$USERP5= <user>
##$WDW= 1
##$XDIM= 65536
##$YMAX_p= 174282365
##$YMIN_p= -223973547
$$ End of Bruker specific parameters
$$ ---------------------------------
##NTUPLES= NMR SPECTRUM
##VAR_NAME=  FREQUENCY,     SPECTRUM/REAL,   SPECTRUM/IMAG
##SYMBOL=    X,             R,               I
##VAR_TYPE=  INDEPENDENT,   DEPENDENT,       DEPENDENT
##VAR_FORM=  AFFN,          ASDF,            ASDF
##VAR_DIM=   65536,         65536,           65536
##UNITS=     HZ,            ARBITRARY UNITS, ARBITRARY UNITS
##FACTOR=    0.49542278885378, 1,            1
##FIRST=     16045.7642231865, 0,            0
##LAST=      -16421.768244346, 0,            0
##MIN=       -16421.768244346, -223973547,   0
##MAX=       16045.7642231865, 174282365,    0
$$ Real data points
##PAGE= N=1
##DATA TABLE= (X++(R..R)), XYDATA
$$ [...]
7473d919614P7159K677216K880135J619929J048642Q10210j19867q61809o25916
$$ -4919614 -4842455 -2165239 714896 2334825 3383467 4193677 4073810 3212001 2586085
7464B586085q47427k551464l798101k751846j240066j789252k800435p40630L657388
$$ 2586085 1738658 -812806 -4610907 -7362753 -8602819 -10392071 -13192506 -13933136 -10275748
7455a0275748N668768L384882L88120M06604K401033K773254L80713k559223l558504
$$ -10275748 -4606980 -1222098 -833978 -427374 1973659 4746913 5127626 2568403 -990101
7446i90101k400099q20386l22325n17445l2999J009691Q51344q40419j689877
$$ -990101 -3390200 -4210586 -4532911 -5050356 -5083355 -4073664 -3222320 -4062739 -5752616
7437e752616j96019J207326n59271m000685m421548l69525M415617N920210L964523
$$ -5752616 -5948635 -4741309 -5300580 -9301265 -13722813 -14092338 -9676721 -3756511 208012
7428B08012P96220j735706k623511j678421k43958o6194o52503J75629K347810
$$ 208012 1004232 -731474 -3354985 -5033406 -5277364 -5343558 -5996061 -5820432 -3472622
7419c472622K785876J03736k477083j357041K038191K980996p9791l500763l230882
$$ -3472622 -686746 -583010 -3060093 -4417134 -2378943 602053 522262 -2978501 -6209383
7410f209383M74315L993597M634099K857382Q27097q4395r5948r1683o83634k064073
$$ -6209383 -5735068 -1741471 2892628 5750010 6577107 6492712 6396764 6305081 5621447 3557374
7400C557374l895122m998276l981670q84950K367367L870451L582712K609844
$$ 3557374 -337748 -5336024 -9317694 -10202644 -7835277 -3964826 -382114 2227730
7392B227730J421489j52217j715969k373949j884168q85221j88221m09274j640649
$$ 2227730 3649219 3497002 1781033 -592916 -2477084 -3362305 -3550526 -3959800 -5600449
7383e600449k797874k282555k39944J057038L26621o45193K27212J949991K135579
$$ -5600449 -8398323 -10680878 -10920822 -9863784 -9537163 -10182356 -9955144 -8005153 -5869574
7374e869574Q57122J30358M16251N43887M98333J139773J510410j23665k490395
$$ -5869574 -5012452 -4882094 -4465843 -3921956 -3423623 -2283850 -773440 -897105 -3387500
7365c387500k223292Q90736L226431K792115J638986J472112Q15308j273744k392377
$$ -3387500 -5610792 -4720056 -1493625 1298490 2937476 4409588 5224896 3951152 1558775
7356A558775p15154J247584J67464l032222m882838m321193k693059m25931K725530
$$ 1558775 843621 2091205 2258669 -773553 -5656391 -9977584 -12670643 -13096574 -10371044
7347a0371044N053823M113088M96790k460407k803361j414969M01640K240892
$$ -10371044 -5317221 -1204133 -707343 -3167750 -5971111 -7386080 -6984440 -4743548
7339d743548L411135K861078Q07822j297358k624930l262205k889373j059730
$$ -4743548 -1332413 1528665 2336487 1039129 -1585801 -4848006 -7737379 -8797109
7331h797109J208165K009857R61294m91423j136219q60700K33606J754064K323951
$$ -8797109 -7588944 -5579087 -4617793 -5109216 -6245435 -7106135 -6872529 -5118465 -2794514
7322b794514J041673n06254J5763J919748K075827l22958k457168k387459j919855
$$ -2794514 -1752841 -2259095 -2243332 -323584 1752243 1429285 -1027883 -3415342 -5335197
7313e335197l045652m071037k104371K057797M463013L027646k88455k244155
$$ -5335197 -8380849 -12451886 -14556257 -12498460 -8035447 -5007801 -5296256 -7540411
7305g540411j365966J626276M533151M776795J717671j841151k356366j67458
$$ -7540411 -8906377 -7280101 -2746950 2029845 3747516 1906365 -450001 -617459
7297f17459P35211j552500l806755k341397J373064K820465J154265J48075K043398
$$ -617459 117752 -1434748 -5241503 -7582900 -6209836 -3389371 -2235106 -2087031 -43633
7288d3633M038387K715236q24056k871593k354107j249268p79140k66629L66668
$$ -43633 3994754 6709990 5885934 3014341 660234 -589034 -1368174 -1634803 -1268135
7279a268135r3660j716971k668346j794790j08436J072354J634885J577831M41617
$$ -1268135 -1361795 -3078766 -5747112 -7541902 -7650338 -6577984 -4943099 -3365268 -2923651
7270b923651j040947p50994J720558L463631J719586k182531m364286l139624
$$ -2923651 -3964598 -4715592 -2995034 468597 2188183 5652 -4358634 -7498258
7262g498258l04052J846426K805845L068435K721234J508960m08959k186885k737521
$$ -7498258 -7802310 -5955884 -3150039 -81604 2639630 4148590 3739631 1552746 -1184775
7253a184775j760667l52407J81407J39133P35709J452225K06197k854329m238174
$$ -1184775 -2945442 -3297849 -3116442 -2977309 -2241600 -789375 -583178 -3437507 -7675681
7244g675681j916331R92754M60701k088523j604193K807831O201728M846340J032387
$$ -7675681 -9592012 -8599258 -8138557 -10227080 -11831273 -9023442 -2821714 2024626 3057013
7235C057013j182123j636397k441622l156943j525945J795136L146582J175179
$$ 3057013 1874890 238493 -2203129 -5360072 -6886017 -5090881 -1944299 -769120
7227g69120r12551L2805K591201L100434J037056o54864l27893P9588j476539
$$ -769120 -1681671 -1648866 942335 4042769 5079825 4424961 4097068 4176656 2700117
7218B700117l615479l448728q21017J560044J833680P29975m51718j503065k343265
$$ 2700117 -915362 -4364090 -5185107 -3625063 -1791383 -1061408 -1513126 -3016191 -5359456
7209e359456k289789j306842m95268l37015J13143J214822J495502r2814k035474
$$ -5359456 -7649245 -8956087 -9451355 -9788370 -9675227 -8460405 -6964903 -7057717 -9093191
7200i093191k143951n44549J012408J868604K477127K491325J137210q04403j605457
$$ -9093191 -11237142 -11781691 -10769283 -8900679 -6423552 -3932227 -2795017 -3599420 -5204877
7191e204877j129027o55687k49334J263817L369853L627080J442291l97197K77089
$$ -5204877 -6333904 -6989591 -7238925 -5975108 -2605255 1021825 2464116 2066919 2344008
7182B344008J521771J50678l184186m552221k237067Q86789J326942n59803j589399
$$ 2344008 3865779 4016457 832271 -3719950 -5957017 -5070228 -3743286 -4303089 -5892488
7173e892488k76627J454758J230977n23725j256316L40611K635105K895391L18701
$$ -5892488 -6169115 -4714357 -3483380 -4007105 -5263421 -4922810 -2287705 607686 926387
7164I26387k979844l899998j466534J843126K412070m62030l583913l681895j210963
$$ 926387 -2053457 -5953455 -7419989 -5576863 -3164793 -3626823 -7210736 -10892631 -12103594
7155a2103594R85211J691798J780228J375062l61623k359635j898130R84406K435539
$$ -12103594 -11118383 -9426585 -7646357 -6271295 -6632918 -8992553 -10890683 -9906277 -7470738
7146g470738J43205k958901k814615K23199K776474L400088L032745K014682O7875
$$ -7470738 -7327533 -10286434 -13101049 -12877850 -10101376 -6701288 -3668543 -1653861 -1585986
7137a585986j587026j354472j16003q6729j210694j459156l14456Q21338J307540
$$ -1585986 -3173012 -4527484 -4643487 -4730216 -5940910 -7400066 -7714522 -6893184 -5585644
7128e585644J581292J261841j64225j302702o31718K70835j160077l594679l133413
$$ -5585644 -4004352 -2742511 -2906736 -4209438 -4841156 -4570321 -5730398 -9325077 -12458490
7119a2458490M31941L004639K386524P17967j71638j238857k587607k029572N84728
$$ -12458490 -12026549 -9021910 -6635386 -5917419 -6089057 -7327914 -9915521 -11945093 -11360365
7110a1360365K001928R77204O61655K732161L683110P18117k867838k710177j93623
$$ -11360365 -9358437 -8381233 -7719578 -4987417 -1304307 -586190 -3454028 -6164205 -6357828
7101f357828P12587L16973J317538K507870P06709k247468j100027L915335O110618
$$ -6357828 -5645241 -5328268 -4010730 -1502860 -796151 -3043619 -4143646 -228311 5882307
7092E882307J996542l535901m356945j066912J452295J240040K70182n0188p79093
$$ 5882307 7878849 4342948 -13997 -1080909 371386 1611426 1881608 1831420 1052327
7083A052327k822291m852595m757867k273122O14839J952180J985876K262615
$$ 1052327 -1769964 -6622559 -11380426 -13653548 -13038709 -11086529 -9100653 -6838038
7075f838038K847901K169796J75476o21934J067722K594140J011739k192191l146996
$$ -6838038 -3990137 -1820341 -1644865 -2266799 -1199077 1395063 2406802 214611 -2932385
7066b932385j281856N51625J100363J975006L585842L699818J337780j136206
$$ -2932385 -4214241 -3662616 -2562253 -587247 2998595 6698413 8036193 6899987
7058F899987j494528n99772k48656m56970o67759j508443l305949m481600l397961
$$ 6899987 5405459 4805687 4557031 4100061 3432302 1923859 -1382090 -5863690 -9261651
7049i261651o52944J986800L673704M079206K455648r52021l681361l383102r10352
$$ -9261651 -9914595 -7927795 -4254091 -174885 2280763 1328742 -2352619 -5735721 -6646073
7040f646073O69046j79800k209621l511760l262369j474347J318330L746044M313126
$$ -6646073 -5977027 -6156827 -8366448 -11878208 -15140577 -16614924 -15296594 -11550550 -7237424
7031g237424L122438K050214K489202L462248K802790Q6811k464519k480384l53997
$$ -7237424 -4114986 -2064772 424430 3886678 6689468 6776279 4311760 1831376 1477379
7022A477379J144319J56387k218837l516273k737279r65415K09906J37164n82165
$$ 1477379 2621698 2778085 559248 -2957025 -5694304 -6659719 -6449813 -6312649 -6894814
7013f894814n90149R37626L009114L598399K290698J011904J169861J449060N8567
$$ -6894814 -7484963 -6547337 -3538223 60176 2350874 3362778 4532639 5981699 6040266
7004F040266k027520k260119l21009J528671J714905Q10200k74165j382297k090863
$$ 6040266 4012746 1752627 1431618 2960289 4675194 5485394 5211229 3828932 1738069
6995A738069j611567k65194O15633O82498R05307J635304J987434J461523N37354
$$ 1738069 126502 -138692 476941 1159439 2064746 3700050 5687484 7149007 7686361
6986G686361o05551k247840l755361l861402k687637j717524j427343p55823P53664
$$ 7686361 7080810 4832970 1077609 -2783793 -5471430 -7188954 -8616297 -9372120 -8618456
6977h618456K155263K760166K745714J976098K56369j215223r69138J68447K01345
$$ -8618456 -6463193 -3703027 -957313 1018785 1275154 59931 -909207 -740760 -539415
6968e39415n31081j42680O82590n22038k637370j276290L828233O722580L408843
$$ -539415 -1070496 -1213176 -530586 -1052624 -3689994 -4966284 -1138051 5584529 8993372
6959H993372k328062m771545l822227k579483j269329J285497L075139J429074
$$ 8993372 6665310 1893765 -1928462 -4507945 -5777274 -4491777 -1416638 12436
6951A2436j629542j958314l2711J61483j868082k649126j052674L18916M27369
$$ 12436 -1617106 -3575420 -3608131 -3446648 -5314730 -7963856 -9016530 -8697614 -8270245
6942h270245J238818K961557K921120O89524l91329J239181K607165J253151r40755
$$ -8270245 -7031427 -4069870 -1148750 -459226 -850555 388626 2995791 4248942 3308187
6933C308187j511026j346236j981844k215868o91286P60188j81867k138016j880913
$$ 3308187 1797161 450925 -1530919 -3746787 -4438073 -3677885 -3859752 -5997768 -7878681
6924g878681Q01422L058147L035431J437754m19116j850513k366916j822401q99744
$$ -7878681 -7077259 -4019112 -983681 454073 34957 -1815556 -4182472 -6004873 -6904617
6915f904617k79743K34349R05985J299091J284760J653317K568335K659814J034114
$$ -6904617 -7184360 -6950011 -6044026 -4744935 -3460175 -1806858 761477 3421291 4455405
6906D455405r95598j692832j324852j228947j486129j270377o73954l36524J34495
$$ 4455405 3459807 1766975 442123 -786824 -2272953 -3543330 -4217284 -4553808 -4419313
6897d419313J442434K590440J583912j537699l986664l342889n00859J351893
$$ -4419313 -2976879 -386439 1197473 -340226 -4326890 -7669779 -8170638 -6818745
6889f818745N05203j241841q53824J928515M100210L494988J759767J516207K026258
$$ -6818745 -6313542 -7555383 -8409207 -6480692 -2380482 1114506 2874273 4390480 6416738
6880F416738N95993k343098l174491o35717K133678K352731J063583J14686r83503
$$ 6416738 7012731 4669633 1495142 859425 2993103 5345834 6409417 6524103 5540600
6871E540600k792399l567477k100626m78395r24962k036338j337794L91387P78436
$$ 5540600 2748201 -819276 -2919902 -3398297 -4323259 -6359597 -7697391 -7306004 -6527568
6862f527568J37758M64829J475770J313956K18292n6069L88326K20199r2872O11225
$$ -6527568 -6389810 -5924981 -4449211 -3135255 -2916963 -2973032 -2584706 -2364507 -2457379 -1846154
6852a846154J210915K43823m68107J476784L969547L117467J49735k75352J681810
$$ -1846154 -635239 -391416 -859523 617261 4586808 7704275 7854010 7578658 9260468
6843I260468J201972k137658k875777O36734K637094k14429k707656j73052K881853
$$ 9260468 10462440 8324782 5449005 6085739 8722833 8508404 5800748 5627696 8509549
6834H509549K83353m802960m692928J44993K078038j068217l076729j15846L343028
$$ 8509549 8792902 3989942 -702986 -557993 1520045 451828 -2624901 -2740747 602281
6825F02281K283292j289162k392483m76645J156868P86675l30901p32769l90786
$$ 602281 2885573 1596411 -796072 -1272717 -115849 670826 339925 -392844 -783630
6816g83630n1389k69742p76161n80878N07490R20808o21650k728618l047815j727671
$$ -783630 -835019 -1104761 -1880922 -2461800 -1954310 -1033502 -1655152 -4383770 -7431585 -9159256
6806i159256o45024J55422J961003L592507K115120j915353l962826j857820J095119
$$ -9159256 -9804280 -9648858 -7687855 -4095348 -1980228 -3895581 -7858407 -9716227 -8621108
6797h621108J450314M84382R16897J916062R83654j288342k148753j326720j257421
$$ -8621108 -7170794 -6686412 -5769515 -3853453 -2869799 -4158141 -6306894 -7633614 -8891035
6788h891035k889369m129262k819234O47676L972227N064549L689035J745274
$$ -8891035 -11780404 -15909666 -18728900 -18081224 -14108997 -9044448 -5355413 -3610139
6780c610139J249137J619666M95162k155856l193735j090968J193281O55915j009385
$$ -3610139 -2361002 -741336 -246174 -2402030 -5595765 -6686733 -5493452 -4837537 -5846922
6771e846922n62636J022830L26801k142603k224282J110920L934089L406784J403675
$$ -5846922 -6409558 -5386728 -5059927 -7202530 -9426812 -8315892 -4381803 -975019 428656
6762D28656L41851p01644l132240n238351m576187j936885K1627P61200J750258
$$ 428656 770507 68863 -3063377 -8301728 -12877915 -14814800 -14793173 -14031973 -12281715
6753a2281715L220667L613423K088184l17274k024525k198471j079610k7911m61225
$$ -12281715 -9061048 -5447625 -3359441 -3676715 -5701240 -7899711 -8979321 -9007232 -9468457
6744i468457j713898j144524K156600N122773M332163R01590q64139O29503K517409
$$ -9468457 -11182355 -12326879 -10170279 -5047506 -715343 186247 -677892 -48389 2469020
6735B469020J963775l33340k148790k805563k623222j249422J302577L083738
$$ 2469020 4432795 4099455 1950665 -854898 -3478120 -4727542 -3424965 -341227
6727c41227J936854j466740m092602m052745k218605l62529P47249J063439N62215
$$ -341227 1595627 128887 -3963715 -8016460 -10235065 -10597594 -9850345 -8786906 -8224691
6718h224691l49250o84650M8951J193771J829122J671552P89782n86069j465217
$$ -8224691 -8573941 -9258591 -9209640 -8015869 -6186747 -4515195 -3725413 -4311482 -5776699
6709e776699n54950J727647K937719J649308l36372n92116K17083l30079j957230
$$ -5776699 -6331649 -4604002 -1666283 -16975 -353347 -945463 -728380 -1058459 -3015689
6700c015689j640544J578140M713587M914815K786697K31727k338429m649323
$$ -3015689 -4656233 -3078093 1635494 6550309 9337006 9568733 7230304 2580981
6692B580981m996768k750157m40573m21071j148945j6501J719766Q19328k067189
$$ 2580981 -2415787 -5165944 -5606517 -6027588 -7176533 -7193034 -5473268 -4653940 -6721129
6683f721129k916527q05907P01589l73272j414389j52919J439063R17831l01731
$$ -6721129 -9637656 -10443563 -9741974 -10115246 -11529635 -11682554 -10243491 -9325660 -9627391
6674i627391L93750K288549K750812J405647j52293j330434k239175j752540R43192
$$ -9627391 -9233641 -6945092 -4194280 -2788633 -2940926 -4271360 -6510535 -8263075 -7319883
6665g319883L721586L571508Q31495j493184k194635k628678l243875k645708
$$ -7319883 -3598297 -26789 804706 -688478 -2883113 -5511791 -8755666 -11401374
6657a1401374o30474Q56469P62842L97271Q12688J079693M42730N2036R36393
$$ -11401374 -12031848 -11175379 -10412537 -10015266 -9202578 -8122885 -7680155 -7628119 -6691726
6648f691726J948573J512623K36540j6372R77419J495361L76136j457801k350646
$$ -6691726 -4743153 -3230530 -2993990 -3010362 -2032943 -537582 -161446 -1619247 -3969893
6639c969893k026714j675808j982751j860245j2979K624534L591531K338299R91366
$$ -3969893 -5996607 -7672415 -9655166 -11515411 -11528390 -8903856 -5312325 -2974026 -1982660
6630a982660P21485k34675k858681m130207j033906L803188M868863J746139l58527
$$ -1982660 -1261175 -1495850 -4354531 -8484738 -9518644 -5715456 -846593 899546 541019
6621E41019J302314L265511K033777n95722j395200j035282j742115k590806j405483
$$ 541019 1843333 5108844 7142621 6546899 5151699 4116417 2374302 -216504 -1621987
6612a621987O67950Q76903j43638M38939K081564J119643k993585o038403m937646
$$ -1621987 -954037 -77134 -220772 218167 2299731 3419374 425789 -5612614 -10550260
6603a0550260j684822L48428Q87653J391420J769268J054357j68166l48183P88115
$$ -10550260 -12235082 -11886654 -10999001 -9607581 -7838313 -6783956 -6952122 -7300305 -6512190
6594f512190K208304K982775K467014K44880k601755l398470j023634J740450
$$ -6512190 -4303886 -1321111 1145903 1390783 -1210972 -4609442 -5633076 -3892626
6586c892626J272684j872994l480946j423370J613972K176406N67273n03572j78733
$$ -3892626 -2619942 -4492936 -7973882 -9397252 -7783280 -5606874 -5039601 -5543173 -5721906
6577e721906J52475J11126J166475L529187M603593K276177j657868l387258j848254
$$ -5721906 -5569431 -5458305 -4291830 -762643 3840950 6117127 4459259 1072001 -776253
6568g76253L03185L95608j374188l031633l112007j290381J691400L861595L194073
$$ -776253 -473068 -77460 -1451648 -4483281 -7595288 -8885669 -7194269 -3332674 -138601
6559a38601P4781k493337k228863j01197J481958J727518J284445L18020j202630
$$ -138601 -63820 -2557157 -4786020 -4887217 -3405259 -1677741 -393296 -75276 -1277906
6550a277906k040797p77301J710620K810484J401521j088943k865355l244135
$$ -1277906 -3318703 -4096004 -2385384 425100 1826621 737678 -2127677 -5371812
6542e371812j916707J103673M109020M286977J018632k681524l300001o56374
$$ -5371812 -7288519 -6184846 -2075826 2211151 3229783 548259 -2751742 -3408116
6534c408116K287871K774777O73201j858395k545075j199160J74347K3324n07796
$$ -3408116 -1120245 1654532 2327733 469338 -2075737 -3274897 -3100550 -3077226 -3585022
6525c585022O33806K810268L166102J063716n62270M01663J898366Q39836k231783
$$ -3585022 -2951216 -140948 3025154 4088870 3526600 3928263 5826629 6666465 4434682
6516D434682m174704l808959k777050k362115k079869j510234j125462p80471
$$ 4434682 259978 -3548981 -6326031 -8688146 -10768015 -12278249 -13403711 -14184182
6508a4184182N48014K726459L912876K994807J121297k57308j526470l578077
$$ -14184182 -13636168 -10909709 -6996833 -4002026 -2880729 -3138037 -4664507 -8242584
6500h242584n203748l808769Q64242N170861N051231Q58780k610365j614252K036394
$$ -8242584 -13446332 -17255101 -16390859 -11219998 -6168767 -5309987 -7920352 -9534604 -7498210
6491g498210L470841J223614j141908n15184J284763O92362j824143k411464K12676
$$ -7498210 -4027369 -2803755 -3945663 -4460847 -3176084 -2483722 -4307865 -6719329 -6506653
6482f506653K816464K468685M72431j14337J170489K304883J992140P75679m68894
$$ -6506653 -3690189 -1221504 -749073 -863410 307079 2611962 4604102 5379781 4910887
6473D910887j407027j717965j078126J39407J035493J168261P65547Q4812p45415
$$ 4910887 3503860 1785895 707769 847176 1882669 3050930 3816477 3901289 3155874
6464C155874j340435j288301q76170q92442j377565j133681Q29401L397697L721845
$$ 3155874 1815439 527138 -349032 -1241474 -2619039 -3752720 -2923319 474378 4196223
6455D196223L00584m525139o386027l781984m6927P39722j185563k163710n48417
$$ 4196223 4496807 -28332 -6414359 -10196343 -10243270 -9503548 -10689111 -12852821 -13401238
6446a3401238J331686J241388M58187J315435L175292L356641J355859l43268
$$ -13401238 -12069552 -10828164 -10369977 -9054542 -5879250 -2522609 -1166750 -1510018
6438a510018J02003J466964J487020k2449j179131o45567P10990R73190l20029
$$ -1510018 -1408015 58949 1545969 1523520 344389 -301178 409812 1383002 1062973
6429A062973j328969j17753K472016L264121O42881l025949m000277j572701J408484
$$ 1062973 -265996 -383749 2088267 5352388 5995269 2969320 -1030957 -2603658 -1195174
6420a195174K136105N95852j361372k376614k409549j995492j406635n13412O48188
$$ -1195174 940931 1536783 175411 -2201203 -4610752 -6606244 -8012879 -8526291 -7878103
6411g878103J303893N36367j200961j995829p68269J076714J489970O77600N71518
$$ -7878103 -6574210 -6037843 -7238804 -9234633 -10002902 -8926188 -7436218 -6758618 -6187100
6402f187100J645462K148051R19115p78217j188005n45487m69587j596125k837114
$$ -6187100 -4541638 -2393587 -1474472 -2252689 -3440694 -3986181 -4455768 -6051893 -8889007
6393h889007k697688p60621J814041L018904J849001k98898q72480P90118K569938
$$ -8889007 -11586695 -12347316 -10533275 -7514371 -5665370 -5964268 -6836748 -6046630 -3476692
6384c476692K331848O25809l48508K27431J040195P44962l33948r21703m97348
$$ -3476692 -1144844 -519035 -867543 -640112 400083 1145045 811097 -110606 -607954
6375f07954K39749L94711j01754p23609j314234k150371k877097k294158j8913
$$ -607954 -368205 26506 -75248 -798857 -2113091 -4263462 -7140559 -9434717 -9453630
6366i453630K350334K921357J911088J002676O60110j72471j701372k623816k336140
$$ -9453630 -7103296 -4181939 -2270851 -1268175 -608065 -780536 -2481908 -5105724 -7441864
6357g441864j800737j341990L54893L573646N699124M073572k87234l721646m037977
$$ -7441864 -9242601 -10584591 -10229698 -6656052 -956928 3116644 2829410 -892236 -4930213
6348d930213k025959M14492J873133J605147p2067j545860j435910k90440L61616
$$ -4930213 -6956172 -6541680 -4668547 -3063400 -3135467 -4681327 -6117237 -6407677 -6046061
6339f046061K76915M75935J278058J854526J672966J008334Q730j424443k697904
$$ -6046061 -5769146 -5293211 -4015153 -2160627 -487661 520673 529403 -895040 -3592944
6330c592944k658677r56821J437027L019444K570561q7414l196159l843443j100152
$$ -3592944 -6251621 -7208442 -5771415 -2751971 -181410 -268824 -3464983 -7308426 -8408578
6321h408578K343094L289230K047880J378528K058056K030372Q7068k078534k325635
$$ -8408578 -6065484 -2776254 -728374 650154 2708210 4738582 4825650 2747116 421481
6312D21481q18027N02541N9113k028187l738069k641283R96011L389469J663130
$$ 421481 -396546 105995 165108 -1863079 -5601148 -8242431 -7246420 -3856951 -2193821
6303b193821j664804j558810K447284N510537M287813Q46806j418587k198487
$$ -2193821 -3858625 -5417435 -2970151 2540386 6828199 7675005 6256418 4057931
6295D057931k658595k600800j684383r92384j008420k50803J826762K873376J070549
$$ 4057931 1399336 -1201464 -2885847 -3878231 -4886651 -5137454 -3310692 -437316 633233
6286F33233j631475k360756j410665p26721k70700J032913K368751K225797J207096
$$ 633233 -998242 -3358998 -4769663 -5496384 -5767084 -4734171 -2365420 -139623 1067473
6277A067473O86403R4673j416746k265423q92293O49521m57005k645487k075860
$$ 1067473 1753876 1848549 431803 -1833620 -2725913 -2076392 -2533397 -5178884 -7254744
6268g254744R57324K437247J109726l15122n66262j351800k793503k449716k25558
$$ -7254744 -6297420 -3860173 -2750447 -3065569 -3631831 -4983631 -7777134 -10226850 -10452408
6259a0452408P29272k60499J68331L044762M342511J729175j007168k95012J088367
$$ -10452408 -9723136 -9983635 -9815304 -6770542 -2428031 -698856 -1706024 -2001036 -912669
6250i12669p98093l614335k397712J831884L346109O08772j861095o65589K321640
$$ -912669 -1710762 -5325097 -7722809 -5890925 -2544816 -1936044 -3797139 -4462728 -2141088
6241b141088L642254K141495j336249m629350m474312K82918N454761N348778
$$ -2141088 1501166 3642661 2306412 -2322938 -6797250 -6514332 -1059571 4289207
6233D289207L34836l410299k506206l59438r26608k839914k597766k10608J715033
$$ 4289207 4624043 1213744 -1292462 -1651900 -2578508 -5418422 -8016188 -8226796 -6511763
6224f511763K231368K148700J494608q2071j430030j160207j07349j68508j275773
$$ -6511763 -4280395 -2131695 -637087 -719158 -2149188 -3309395 -3416744 -3585252 -4861025
6215d861025j692137p72895O48144K058372L269338L124616O81192k399398l196311
$$ -4861025 -6553162 -7326057 -6677913 -4619541 -1350203 1774413 2455605 56207 -3140104
6206c140104j658540q87391k422746l685741j741402K284510M675525L936862
$$ -3140104 -4798644 -5686035 -8108781 -11794522 -13535924 -11251414 -6575889 -2639027
6198b639027J982211R55568R52007J048241P47624j94404j840504l123954k218705
$$ -2639027 -656816 298752 1250759 2299000 3046624 2852220 1011716 -2112238 -4330943
6189d330943R26890L537207L063430N80297o77380J87974Q90729q3305j094784
$$ -4330943 -3404053 133154 3196584 3776881 3099501 3287475 4178204 4094899 3000115
6180C000115k79615J113538M84541k053878l692511k788248o65349O48243O84706
$$ 3000115 2720500 3834038 4318579 2264701 -1427810 -4216058 -4881407 -4233164 -3548458
6171c548458M2990p88333j330938j023644l8484O61256O65318O60819J127540
$$ -3548458 -3505468 -4293801 -5624739 -6648383 -6686867 -6025611 -5360293 -4699474 -3571934
6162c571934J498022J322621J285419K080351K975773K534263L86691k497363
$$ -3571934 -2073912 -751291 534128 2614479 5590252 8124515 8511206 6013843
6154F013843m862381n697314m286426r52457K307202L099035J041296j682286
$$ 6013843 1151462 -4545852 -8832278 -9784735 -7477533 -4378498 -3337202 -5019488
6146e019488k543174j058816J271220K884351L357105K859013J373362q33851
$$ -5019488 -7562662 -8621478 -7350258 -4465907 -1108802 1750211 3123573 2289722
6138B289722k463979k069927M4859J760480J495821j57793j623077k071801j238344
$$ 2289722 -174257 -2244184 -2199325 -438845 1056976 899183 -723894 -2795695 -4034039
6129d034039J055638L733601M184812J304180k122232k569230o27705K46405o03053
$$ -4034039 -2978401 755200 4940012 6244192 4121960 1552730 925025 1171430 568377
6120E68377m16069J484620J946281m32165k186862n13993J740323O31009k234926
$$ 568377 152308 1636928 3583209 3151044 964182 450189 2190512 2821521 586595
6111E86595k400561j86Q39286p41805j267900L97079P78520j999765m482749l086682
$$ 586595 -1813966 -1814152 -974866 -1716671 -2984571 -2587492 -1808972 -3808737 -8291486 -11378168
6101a1378168O27154K787091K398055Q53006j134227l055976l214028r62984J264082
$$ -11378168 -10751014 -7963923 -5565868 -4712862 -5847089 -8903065 -12117093 -13080077 -11815995
6092a1815995J155433K47211J351234L615697L678772J043760j266308j382005
$$ -11815995 -10660562 -10413351 -9062117 -5446420 -1767648 -723888 -1990196 -3372201
6084c372201o41724o03854r17789p86657q1627J458991L750164M829068K568127
$$ -3372201 -4013925 -4617779 -5535568 -6322225 -6403852 -4944861 -1194697 3634371 6202498
6075F202498j555533l401437j845582m01384j628256l102633j466552K083672
$$ 6202498 4646965 1245528 -600054 -1001438 -2629694 -5732327 -7198879 -5115207
6067e115207L515489J608810j208382k759506k910925j937126J2364J695988J565448
$$ -5115207 -1599718 9092 -1199290 -3958796 -6869721 -8806847 -8794483 -7098495 -5533047
6058e533047K11385j01813J210726K214767J532252J75895n66320j039517j681992
$$ -5533047 -5321662 -5423475 -4212749 -1997982 -465730 -289835 -856155 -1895672 -3577664
6049c577664j407074N82185K607942K352186L63250m69649R30612K299724J453013
$$ -3577664 -4984738 -4402553 -1794611 557575 920825 451176 1381788 3681512 5134525
6040E134525n80233j347840o84806n81480j669649k103083o69570R67008P43729
$$ 5134525 4554292 3206452 2521646 1940166 270517 -1832566 -2502136 -1535128 -791399
6031g91399m63519k01502J463932J802062k91639k408455k219688p44992k47917
$$ -791399 -1254918 -1456420 7512 1809574 1517935 -890520 -3110208 -3855200 -4103117
6022d103117p30591q63020r50360j994883k527683J22254M949884P070615L960603
$$ -4103117 -4833708 -5696728 -6647088 -8641971 -11169654 -11047400 -6097516 973099 4933702
6013D933702q31391k348998m57148J186164Q23637J17192M54732Q68903K59574
$$ 4933702 4102311 1753313 1296165 2482329 3305966 3423158 3877890 4746793 5006367
6004E006367p55857j283379j631366k222201k503007k121430j897607k302826
$$ 5006367 4250510 2967131 1335765 -886436 -3389443 -5510873 -7408480 -9711306
5996i711306k092987m4471K703685L726581K356431R2017j698767k734257k647341
$$ -9711306 -11804293 -11848764 -9145079 -5418498 -3062067 -2970050 -4668817 -7403074 -10050415
5987a0050415j013225R97263J188456l61487o08928K217865N462661N333211K109198
$$ -10050415 -11063640 -10066377 -8877921 -9239408 -9848336 -7630471 -2167810 3165401 5274599
5978E274599m81353l91516R68734J858072K124578J548957p01383l719223m659551
$$ 5274599 4793246 4401730 5370464 7228536 9353114 10902071 10200688 6481465 1821914
5969A821914k658142o39583j146590k461111j422462J586852L457087L097486
$$ 1821914 -836228 -1475811 -2622401 -5083512 -6505974 -4919122 -1462035 1635451
5961A635451K208166J681976L66618k188051m358066m565347k911043l81648J796329
$$ 1635451 3843617 5525593 5892211 3704160 -653906 -5219253 -8130296 -8511944 -6715615
5952f715615K121332L49764j034662M86007L232641K949593p63227l243609j494083
$$ -6715615 -4594283 -4244519 -5279181 -4793174 -1560533 1389060 625833 -2617776 -4111859
5943d111859J470291J465114q03327j758139o81081K29478Q7976j6241J12939
$$ -4111859 -2641568 -1176454 -1979781 -3737920 -4419001 -4189523 -4101547 -4117788 -4004849
5934d004849m26886j215775q24867N40945J377028J668218K587493L523223K421529
$$ -4004849 -4431735 -5647510 -6472377 -5931432 -4554404 -2886186 -298693 3224530 5646059
5925E646059n85813k846986l086177k756548k718357j624800J007460L003698
$$ 5646059 5060246 2213260 -872917 -3629465 -6347822 -7972622 -6965162 -3961464
5917c961464K726812J657385J682995J999252J156019K75885J214256K690125
$$ -3961464 -1234652 422733 2105728 4104980 5260999 5536884 6751140 9441265
5909I441265J601155j924205l951242k116946Q97923R12961k200639m451693k941507
$$ 9441265 11042420 9118215 5166973 3050027 3947950 4860911 2660272 -1791421 -4732928
5900d732928N06008J723089n77941l319316l135412o23655Q92176J77086m56332
$$ -4732928 -4226920 -2503831 -3081772 -6401088 -9536500 -10160155 -9267979 -9090893 -9547225
5891i547225J061861L375826L741467J898552J08178j02726M60767L02816q90001
$$ -9547225 -8485364 -5109538 -1368071 530481 638659 535933 996700 1299516 409515
5882D09515k329597l132759k835903j506652J87373J198018P73118p42679j712797
$$ 409515 -1920082 -5052841 -7888744 -9395396 -9208023 -8010005 -7236887 -7979566 -9692363
5873i692363l97135L008107N958959O162137M230724K493362J566893N1594k317687
$$ -9692363 -10089498 -7081391 -1122432 5039705 9270429 11763791 13330684 13382278 11064591
5864A1064591l674297l060398k090228k143293k156304j093382l76956j299047
$$ 11064591 7390294 4329896 2239668 96375 -2059929 -3153311 -3530267 -4829314
5856d829314j932432J78115L524554M329002K068612k44400j023398j539788k151604
$$ -4829314 -6761746 -6583631 -3059077 1269925 3338537 3094137 2070739 530951 -1620653
5847a620653j233378R39380J219465j463945l695773k661265n04792n38423j849186
$$ -1620653 -2854031 -1914651 -695186 -2159131 -5854904 -8516169 -9020961 -9559384 -11408570
5838a1408570j417865M42410J017938M42823J531627M408626N622631L550755
$$ -11408570 -12826435 -12384025 -11366087 -10923264 -9391637 -4983011 639620 4190375
5830D190375Q31176j95887j014360l514415n815638m655218n02913K773128K938862
$$ 4190375 5021551 4825664 3811304 296889 -5518749 -10173967 -10676880 -7903752 -4964890
5821d964890J533835Q69412J121772J136056M85495l74615j134149j751257j858046
$$ -4964890 -3431055 -2561643 -1439871 -303815 181680 -192935 -1327084 -3078341 -4936387
5812d936387r45092O79643J723824J266285J02324k2370J236057K138971J320718
$$ -4936387 -5881479 -5201836 -3478012 -2211727 -2109403 -2131773 -895716 1243255 2563973
5803B563973P771K77527J645037J549919n27002j923208r49052K56511p65548
$$ 2563973 2571744 2849271 4494308 6044227 5517225 3594017 2644965 2901476 2135928
5794B135928k392018j221637K111014L102494j88608m286336n279720l679773
$$ 2135928 -256090 -1477727 633287 3735781 3547173 -739163 -6018883 -9698656
5786i698656k118838p64296J724785M087948L194362q36954l662765k335283O61557
$$ -9698656 -11817494 -12581790 -10857005 -6769057 -3574695 -4411649 -8074414 -10409697 -9748140
5777i748140J144820p62993j204930J319937L466628J771623k293387m091328
$$ -9748140 -8603320 -9366313 -10571243 -9251306 -5784678 -4013055 -6306442 -10397770
5769a0397770j782934J681516K692028J134144n42706q99138n49241l39703k04336
$$ -10397770 -12180704 -10499188 -7807160 -6673016 -7215722 -8114860 -8664101 -9003804 -9208140
5760i208140J02113M18830N95122N79033N3063j000626j409695J52102K931452
$$ -9208140 -9106027 -8687197 -8092075 -7513042 -7459979 -8460605 -9870300 -9718198 -6786746
5751f786746M292956K785831j55616k168651k370198j169020Q11557K529347K625588
$$ -6786746 -2493790 292041 136425 -2032226 -4402424 -5571444 -4759887 -2230540 395048
5742C95048J110288j58693K1770M59037j95348r07343j9638J638032J858812N30025
$$ 395048 1505336 1346643 1368413 1827450 1632102 724759 705121 2343153 4201965 4731990
5732D731990n57238q49297j275706j694034j099030m01647j703181m244454m502058
$$ 4731990 4174752 3325455 2049749 355715 -743315 -1144962 -2848143 -7092597 -11594655
5723a1594655j463237J568625K028397J508986J904871J625642j034849l608218
$$ -11594655 -13057892 -11489267 -9460870 -7951884 -6047013 -4421371 -5456220 -9064438
5715i064438k656500N36690J815281P14642O86839K851033M055881K248107k31446
$$ -9064438 -11720938 -11184248 -9368967 -8654325 -7967486 -5116453 -1060572 1187535 956089
5706I56089o27156J62816j50963j363475j775662j429066j639407k130504j168549
$$ 956089 328933 491749 340786 -1022689 -2798351 -4227417 -5866824 -7997328 -9165877
5697i165877J489533L804950M013580K528780P96491n41966j501228j559528P5139
$$ -9165877 -7676344 -3871394 142186 2670966 3467457 2925491 1424263 -135265 -60126
5688f0126K784931M200197K626362m87580j865806n48200P37456o08699l220610
$$ -60126 2724805 6925002 9551364 9063784 7197978 6649778 7387234 6778535 3557925
5679C557925l611084j176665R24257J70867k089036k785925j084056J057757J578204
$$ 3557925 -53159 -1229824 -305567 -134700 -2223736 -5009661 -6093717 -5035960 -3457756
5670c457756M85499n43728j76565J095773J603626O67587n64566r94470j258959
$$ -3457756 -2972257 -3515985 -3692550 -2596777 -993151 -325564 -890130 -1884600 -3143559
5661c143559k214322k659467p52915K436046L251232J69239l747064m377480j244030
$$ -3143559 -5357881 -8017348 -8770263 -6334217 -3082985 -2913746 -6660810 -11038290 -12282320
5652a2282320K469045L669739K148910K11638J23769J557898J773603q23011m029401
$$ -12282320 -9813275 -6143536 -3994626 -3782988 -3659219 -2101321 -327718 -1150729 -5180130
5643e180130m498125k310692k40984J106518L609591O481176N473877k91530m968293
$$ -5180130 -9678255 -11988947 -12229931 -11123413 -7513822 -1032646 4441231 4149701 -818592
5634h18592l383160J500095L234862J485051J255382L716444M202851K79812l951095
$$ -818592 -4201752 -2701657 533205 2018256 3273638 6990082 11192933 11472745 7521650
5625G521650l980287q63727J662016K320349J558197j027523m877271o479699
$$ 7521650 3541363 2677636 4339652 6660001 8218198 7190675 2313404 -4166295
5617d166295l201811K112314M070085J763659m84860N45575L032470L333655P92232
$$ -4166295 -7368106 -5255792 -1185707 577952 93092 638667 3671137 7004792 7797024
5608G797024j923201k038606N12294K797161J500618l155541o572329m523721
$$ 7797024 5873823 3835217 4347511 7144672 8645290 5489749 -1082580 -5606301
5600e606301J392808N056608L006520j643584l467356j209825J585427J484133
$$ -5606301 -4213493 843115 3849635 2206051 -1261305 -2471130 -885703 598430
5592E98430j107444l178362k773280o87445J090288J765660J961686J901113P28909
$$ 598430 -509014 -3687376 -6460656 -7148101 -6057813 -4292153 -2330467 -429354 299555
5583B99555j569507k842358j149000K018564K992082O63934k054875k217110k61027
$$ 299555 -1269952 -4112310 -5261310 -3242746 -250664 413270 -1641605 -3858715 -4119742
5574d119742J741279L205827M376606M124062J215224k690453m144371k472879
$$ -4119742 -2378463 827364 5203970 9328032 10543256 7852803 3708432 1235553
5566A235553q33276j746266l660293l434334o21174K541319M302706M523008L231979
$$ 1235553 402277 -1343989 -5004282 -8438616 -9059790 -6518471 -2215765 2307243 5539222
5557E539222L89038k642233l462486j481704J012159J685594Q66939K08160j78441
$$ 5539222 5928260 3286027 -176459 -1658163 -646004 1039590 1906529 2114689 1936248
5548A936248j406390l236424l965281l048471j796860q68771Q35430L573372N090188
$$ 1936248 529858 -2706566 -6671847 -9720318 -11517178 -12385949 -11550519 -7977147 -2886959
5539b886959L562247P32599l37005L40314L14182q57624j162162l58571q97479
$$ -2886959 675288 1407887 1070882 1411196 1725378 867754 -294408 -652979 -1550458
5530a550458l225368l831677n49974L270200L295397N45536q18273l39390j095711
$$ -1550458 -4775826 -8607503 -9157477 -5887277 -2591880 -2046344 -2864617 -3204007 -4299718
5521d299718l241940l039656N59746L290052J932212p85111q48760P50444L21777
$$ -4299718 -7541658 -10581314 -10021568 -6731516 -4799304 -5584415 -6433175 -5682731 -5360954
5512e360954k068174k704276l8374L365360M745674L908818J792951r20145l055554
$$ -5360954 -7429128 -10133404 -10171778 -6806418 -2060744 1848074 3641025 2720880 -334674
5503c34674l116183j173038R21542J716541J274972J54694j047995j216205K27504
$$ -334674 -3450857 -4623895 -3702353 -1985812 -710840 -556146 -1604141 -2820346 -2592842
5494b592842J696767J098266o59023m68362J899363K545664q67117m820733m230874
$$ -2592842 -896075 202191 -456832 -925194 974169 3519833 2652716 -2168017 -6398891
5485f398891M76430L762868K139801j930390l909135k733196j136421j504235
$$ -6398891 -5922461 -2159593 -19792 -1950182 -5859317 -8592513 -9728934 -11233169
5477a1233169k845822k152604J640849N693358O047396K371410j383631j829946
$$ -11233169 -14078991 -16231595 -14590746 -8897388 -2849992 -478582 -1862213 -3692159
5469c692159k66268l42041k604640l841506j991253Q04645J330851l55998j560714
$$ -3692159 -3958427 -4300468 -6905108 -10746614 -12737867 -11933222 -10602371 -10958369 -12519083
5460a2519083q62327O98066K000875L241844M451593M499694K735074L98232q43691
$$ -12519083 -13381410 -12683344 -10682469 -7440625 -2989032 1510662 4245736 4643968 3800277
5451C800277q92629n86677o8632O49722M03078j680382l840333l291054l42391
$$ 3800277 2907648 2320971 2252339 2902061 3305139 1624757 -2215576 -5506630 -5849021
5442e849021J730075J520239J169581J921697J482065j491631l475505q74282
$$ -5849021 -4118946 -2598707 -1429126 492571 1974636 483005 -2992500 -3866782
5434c866782L310938K805857k356434n061980j309629L783558L122810k880859
$$ -3866782 -555844 2250013 -106421 -5168401 -6478030 -2694472 428338 -2452521
5426b452521p670467p119716k960551J192860L528069L751422K271780N76993
$$ -2452521 -10122988 -17242704 -20203255 -19010395 -15482326 -11730904 -9459124 -8882131
5418h882131L86921J497124J817064K35674j754456k077919p54353M56689N82079
$$ -8882131 -8495210 -6998086 -5181022 -4945348 -6699804 -8777723 -9532076 -9075387 -8493308
5409h493308M61706J114149K073007K114728J101083L0128n48478q29625m25442
$$ -8493308 -8031602 -6917453 -4844446 -2729718 -1628635 -1598507 -2146985 -2976610 -3402052
5400c402052J387098L444680L004478j83455k439262j170102R77439L35568j546518
$$ -3402052 -2014954 1429726 4434204 4250749 1811487 641385 1618824 1954392 407874
5391D07874n61039K360533K187186j447717k862201L27420K866880N64718k488753
$$ 407874 -153165 2207368 4394554 2946837 84636 412056 3278936 3843654 1354901
5382A354901p56097L286130L118704j216302l540072j515103O81237J47322o14025
$$ 1354901 598804 3884934 7003638 5787336 2247264 732161 1413398 1560720 946695
5373I46695P54838K063747O03400k185540l092307j712649n5648O68627O64295
$$ 946695 1701533 3765280 4368680 2183140 -909167 -2621816 -2677464 -2008837 -1344542
5364a344542J99804m86216o75598M2964Q92833O88018p07615k018871j589828
$$ -1344542 -1144738 -1630954 -2306552 -2263588 -1370755 -682737 -1390352 -3409223 -4999051
5355d999051Q38089L170231K859465L77571q86042N29963J518168j111416n472080
$$ -4999051 -4160962 -990731 1868734 2246305 1360263 1890226 3408394 2296978 -3175102
5346c175102p071209m993392k033166K61223K521768L978745K540182r06052k523267
$$ -3175102 -10246311 -15239703 -17272869 -17011646 -14489878 -10511133 -7970951 -8877003 -11400270
5337a1400270j079652L58375l10743j051157L04680K319561K601386J461478O01580
$$ -11400270 -12479922 -12121547 -12432290 -13483447 -13178767 -10859206 -8257820 -6796342 -6194762
5328f194762L49952K33656L56167N19519j23334j221300j166511J1951K69686
$$ -6194762 -5844810 -5611154 -5254987 -4735468 -4858802 -6080102 -7246613 -7234662 -6964976
5319f964976p31423n53294J687536L116302J519945r82905j343306p890Q84543
$$ -6964976 -7696399 -8249693 -6562157 -3445855 -1925910 -2908815 -4252121 -4260011 -3375468
5310c375468J289032K139804K508535J110265q70092j425352r15137r50758j404111
$$ -3375468 -2086436 53368 2561903 3672168 2802076 1376724 461587 -489171 -1893282
5301a893282j080130j32702N03787P83314O91543m68246j988283j410239J353152
$$ -1893282 -2973412 -3106114 -2602327 -1819013 -1127470 -1595716 -3583999 -4994238 -3641086
5292c641086K495510M4042k091894J6057L375741K314288k418719m749723k511669
$$ -3641086 -1145576 -1101534 -3193428 -3177371 198370 2512658 93939 -4655784 -7167453
5283g167453N20530J760047K793960M244630L608203M11443j528106K13618K714781
$$ -7167453 -6646923 -4886876 -2092916 2151714 5759917 6171360 4643254 4856872 7571653
5274G571653K183322r25125l781415n160124n070632l178299j79436J492729O78261
$$ 7571653 9754975 8829850 5048435 -111689 -5182321 -8360620 -8540056 -7047327 -6369066
5265f369066o99138o67783Q2558K77170M32192J130445J297511L97978L361Q03383
$$ -6369066 -7068204 -7735987 -7653429 -7376259 -6944067 -5813622 -4516111 -4118133 -4114772 -3311389
5255c311389N34075k217254m464458k635181J753822M080465L206285K009741
$$ -3311389 -2777314 -4994568 -9459026 -12094207 -10340385 -6259920 -3053635 -1043894
5247a043894J756087M10180k529969l703679p46521L397706L945860N80230k477270
$$ -1043894 712193 1122373 -1407596 -5111275 -5857796 -2460090 1485770 2066000 -411270
5238d11270k173007J18105J373039Q16658j51545n37080n49597k88861N91779
$$ -411270 -2584277 -2466172 -1093133 -276475 -428020 -965100 -1514697 -1803558 -1211779
5229a211779J598050J357308k77466j410884o11413Q72631R46861j79383o00910
$$ -1211779 386271 1743579 1466113 55229 -556184 316447 1263308 1083925 483015
5220D83015M9947J77137r60900k168040k435860k141768j562365j94320J609318
$$ 483015 532962 710099 -250801 -2418841 -4854701 -6996469 -8558834 -8753154 -7143836
5211g143836K223957J048969m19861q26924o02314l39301N60640K147067K652983
$$ -7143836 -4919879 -3870910 -4290771 -5117695 -5720009 -6059310 -5498670 -3351603 -698620
5202f98620R00504j426641j933651q12838R774p6006m34184j330749l228351m307912
$$ -698620 201884 -1224757 -3158408 -3971246 -3961472 -4037478 -4471662 -5802411 -9030762 -13338674
5192a3338674j858361L123786N554752K224626l672030n973201k616668K621434
$$ -13338674 -15197035 -12073249 -6518497 -4293871 -7965901 -13939102 -16555770 -13934336
5184a3934336N156391M422970L000804K414813J560035p19680l142476l312687
$$ -13934336 -8777945 -4354975 -1354171 1060642 2620677 1900997 -1241479 -4554166
5176d554166r22170J722001K369097Q67463j538380l549665l969501k028076J320274
$$ -4554166 -5476336 -3754335 -1385238 -517775 -2056155 -5605820 -9575321 -11603397 -10283123
5167a0283123L506676L077338J572846J346755K180792J779573n35111k480704
$$ -10283123 -6776447 -3699109 -2126263 -779508 1401284 3180857 2645746 165042
5159A65042j782628Q65418K800466K619440J385593P90563J008870Q13389n00090
$$ 165042 -1617586 -752168 2048298 4667738 6053331 6843894 7852764 8666153 8166063
5150H166063j963438k107705r52920n7614m37107j247248j109609r9560M77158
$$ 8166063 6202625 4094920 3142000 3084386 2647279 1400031 290422 190862 668020
5141F68020l031p85808j041535r36599r61821r26634m11037J37461k19757j258758
$$ 668020 664989 -120819 -1162354 -2098953 -3060774 -3987408 -4398445 -4260984 -4480741 -5739499
5131e739499j364119K49807J916453J513124k76070o08706J194851K190433J55745
$$ -5739499 -7103618 -6853811 -4937358 -3424234 -3700304 -4309010 -3114159 -923726 -767981
5122g67981k570211k119140J181979L197248J887468m14456j284458j482755k302032
$$ -767981 -3338192 -5457332 -4275353 -1078105 809363 394907 -889551 -2372306 -4674338
5113d674338k589091j041920O20743o4580j997257j740611J202370L478996K794214
$$ -4674338 -7263429 -8305349 -7684606 -7749186 -9746443 -11487054 -10284684 -6805688 -4011474
5104d011474R39622O78148J794841J982214L05321j950352l192846k821834r99243
$$ -4011474 -3071852 -2393704 -598863 1383351 1688672 -261680 -3454526 -6276360 -7275603
5095g275603J537051L423467L480768J869982q2768j292105j702993j706684j358590
$$ -7275603 -5738552 -2315085 1165683 3035665 2952897 1660792 -42201 -1748885 -3107475
5086c107475n02520N43679Q19032l78618k238368k589208k04105L131168M168475
$$ -3107475 -3609995 -3066316 -2247284 -2625902 -4864270 -7453478 -7657583 -4526415 -357940
5077c57940K340167Q08755K019764L673539J606908l882379p666358o407624k643231
$$ -357940 1982227 2790982 4810746 8484285 10091193 6208814 -1457544 -7865168 -10508399
5068a0508399p02689j122390j426011m18155J137073K736629M053373L616177
$$ -10508399 -11211088 -12333478 -13759489 -14177644 -13040571 -10303942 -6250569 -2634392
5060b634392P29659j958714j244222J546763J939179j028407l466529k749507
$$ -2634392 -1904733 -3863447 -5107669 -3560906 -1621727 -2650134 -6116663 -8866170
5052h866170r00755m14616o97251p12632j321610k447410j621741J632403L540612
$$ -8866170 -9766925 -10181541 -10878792 -11591424 -12913034 -15360444 -16982185 -15349782 -11809170
5043a1809170J681880o22748L65583K393592J122867k225720k880091n38444O35838
$$ -11809170 -10127290 -10750038 -10384455 -7990863 -6867996 -9093716 -11973807 -12512251 -11876413
5034a1876413n54964r03902Q02034J589439j66793j864106j091733R94735K307878
$$ -11876413 -12431377 -13335279 -12533245 -10943806 -11110599 -12974705 -14066438 -13071703 -10763825
5025a0763825K466358J601105k47357j622302p65246J113289J052292p84619j280689
$$ -10763825 -8297467 -6696362 -6943719 -8566021 -9331267 -8217978 -7165686 -7950305 -9230994
5016i230994J87918Q81364P3901M68973K720654L413442P61612k180605k588401
$$ -9230994 -9043076 -8161712 -8087811 -7618838 -4898184 -1484742 -723130 -2903735 -5492136
5007e492136j900690j976987j420715Q56198K150529r633l162437l063098M29510
$$ -5492136 -7392826 -9369813 -10790528 -9934330 -7783801 -7793434 -10955871 -14018969 -13589459
4998a3589459L834415M773020L567635J639816M08867L88529K61544j190366k041035
$$ -13589459 -9755044 -4982024 -1414389 225427 634294 1022823 1284367 94001 -1947034
4989a947034M43995M102506L421869j818001n085393k885029p4197j456835l866106
$$ -1947034 -1503039 2599467 6021336 4203335 -882058 -3767087 -3841284 -5298119 -9164225
4980i164225k092100K087486L184328R28158n10483K5692R0423r18836j195748
$$ -9164225 -11256325 -9168839 -5984511 -5056353 -5566836 -5541144 -5450721 -6369557 -7565305
4971g565305m82198M1576P52413K342802L075080J362035o65113l51280O82797
$$ -7565305 -8047503 -8005927 -7253514 -4910712 -1835632 -473597 -1138710 -1489990 -807193
4962h07193o09186l013459k995782o74356Q97833R65350J013008R75768j2907
$$ -807193 -1416379 -4429838 -7425620 -8099976 -7202143 -6236793 -5223785 -4248017 -4260924
4953d260924o75739K55257Q67870n53602j478165N73145K487171K29848l461929
$$ -4260924 -4936663 -4681406 -3813536 -4367138 -5845303 -5272158 -2784987 -2555139 -6017068
4944f017068k760201J674512L807591J842435l23552p55054j586532l257743l166233
$$ -6017068 -8777269 -7102757 -3295166 -1452731 -1776283 -2531337 -4117869 -7375612 -10541845
4935a0541845p95379J325606K014879J819478j33163m123139o067289k262091
$$ -10541845 -11337224 -10011618 -7996739 -6177261 -6310424 -10433563 -16500852 -18762943
4927a8762943L281853L386280j244578l197727k39093K184399R44927m68197P15439
$$ -18762943 -15481090 -12094810 -13339388 -16537115 -16776208 -14591809 -13646882 -14115079 -13399640
4918a3399640K348421K471521K077447J216773j464851m246193l574951m34747
$$ -13399640 -11051219 -8579698 -6502251 -5285478 -6750329 -10996522 -14571473 -15006220
4910a5006220P70262k56400M57J382939K92643k834354l980573l054378l001032
$$ -15006220 -14235958 -14492358 -14491901 -13108962 -12816319 -15650673 -19631246 -22685624 -25686656
4901b5686656k483150J654499N957165M427072k36983l85448K983007K471596
$$ -25686656 -28169806 -26515307 -20558142 -16131070 -16368053 -16753501 -13770494 -11298898
4893a1298898j374631j702975k7105l676717r282944o397114K117129K842448
$$ -11298898 -12673529 -14376504 -14403609 -18080326 -27363270 -33760384 -31643255 -28800807
4885b8800807l811330l957249K498990J75845j1100928j2481009j654226m03421
$$ -28800807 -32612137 -36569386 -34070396 -33894551 -44995479 -57476488 -59130714 -59534135
4877e9534135j3562136j6791674n606655j4611431n2805956o1061560J0922283
$$ -59534135 -73096271 -89887945 -95494600 -110106031 -162911987 -223973547 -213051264
4870b13051264J11558779J36859937O6831277j1805718k6844318j855253O226676
$$ -213051264 -101492485 35367452 102198729 90393011 63548693 61693440 67920116
4863F7920116p011125j0405497J26760L002840n162781q026726k483921n54986
$$ 67920116 60908991 50503494 50630254 53633094 48470313 40443587 37959666 37404680
4855C7404680l750973k494004K564892J735658m021112m812156p16565o52895
$$ 37404680 33653707 31159703 33724595 35460253 31439141 26626985 25910420 25257525
4847B5257525m656044m458018L4700J010689j792779j145772K985460L266652
$$ 25257525 20601481 16143463 16178163 17188852 15396073 14250301 17235761 20502413
4839B0502413p85834k080571M24811L33698l405914m605598j698031l29r57082
$$ 20502413 19716579 17636008 18060819 18394517 14988603 10383005 8684974 8684645 7727563
4830G727563m2493L182814L332120o81901l325411k019645k40371K64163J640681
$$ 7727563 7685070 10867884 14200004 13518103 10192692 8173047 7932676 8196839 9837520
4821I837520L179591J262290k584877k463917J443460K168005k181792m880237
$$ 9837520 13017111 14279401 11694524 9230607 10674067 12842072 10660280 5780043
4813E780043j913356J802498J425619m22877J75893J616369R67560m06949J7049
$$ 5780043 3866687 5669185 7094804 6671927 6847820 8464189 9431749 9024800 9041849
4804I041849J404384J833851J375096K25489k325697m914370m349296r41732Q24407
$$ 9041849 10446233 12280084 13655180 13880669 11554972 6640602 2291306 1349574 2173981
4795B173981r71150k838008j898052K2709P84602J594882L325133L679170J348494
$$ 2173981 1202831 -1635177 -3533229 -3510520 -2725918 -1131036 2194097 5873267 7221761
4786G221761r43870p63296L40970N17356J229964L790557N739822M404944J237824
$$ 7221761 6277891 5514595 5855565 6372921 7602885 11393442 17133264 21538208 22776032
4777B2776032q85146k037621l466038m049485k362949k17653k42446j426233q78274
$$ 22776032 21890886 19853265 16387227 12337742 9974793 9757140 9514694 8088461 7210187
4768G210187J022520J101475j296213l081618k047313K05934J007576J41704o83852
$$ 7210187 8232707 9334182 8037969 4956351 2909038 3114972 4122548 4264252 3580400
4759C580400n34966N8100O22807J523889K744897K917591Q79354k044653k984020
$$ 3580400 3045434 3103534 3726341 5250230 7995127 10912718 11792072 9747419 6763399
4750F763399j222603P32380O33973p85115j749430j934885j320021R78538M185611
$$ 6763399 5540796 6273176 6907149 6122034 4372604 2437719 1117698 2096236 6281847
4741F281847M669670P03250l695769l744984r17936k38524k001168j974977N03400
$$ 6281847 10951517 11654767 7958998 4214014 3296078 3057554 1056386 -918591 -415191
4732d15191J152920j280771k090697J490838N054269L751248o4586p05946K164370
$$ -415191 737729 -543042 -2633739 -1142901 3911368 7662616 7598030 6892084 9056454
4723I056454L580844P61210l608599n414502l446855M26872L332460L510497J706259
$$ 9056454 12637298 13398508 9789909 4375407 928552 1355424 4687884 8198381 9904640
4714I904640L66894P90363J734005J380388m14019k507622l920521m142025l099139
$$ 9904640 10271534 11061897 12795902 14176290 13762271 11254649 7334128 3192103 92964
4705I2964j504132l20585L90416J075643J362089O80566q0487M10553J410797
$$ 92964 -1411168 -1731753 -1341337 -265694 1096395 1776961 1696474 2107027 3517824
4696C517824R62928p20304j384997m78601J29682l19434l11109O86395R44670
$$ 3517824 4480752 3760448 2375451 1896850 2026532 1707098 1395989 2082384 3027054
4687C027054k37590r74592j22872O30931j76208j188532o35891Q35074J530302
$$ 3027054 2789464 1814872 1692000 2322931 2146723 958191 322300 1157374 2687676
4678B687676J002876m10086k285974l210854j590696J455227K683632J398639
$$ 2687676 3690552 3280466 994492 -2216362 -3807058 -2351831 331801 1730440
4670A730440M51365J210551J233488r37632k565553j326944M85842O6838q23244
$$ 1730440 2181805 3392356 4625844 3688212 1122659 -204285 281557 348395 -474849
4661d74849P70651L132517K301540j184831k937000j536694o5176n65385j129540
$$ -474849 295802 3428319 5729859 4545028 1608028 71334 6158 -559227 -1688767
4652a688767M16147L013697L880627J735178k079091m524222l281351N01559K835075
$$ -1688767 -1272620 1741077 5621704 7356882 5277791 753569 -2527782 -2026223 808852
4643H08852J738558q3097N63186K434630K135748k83107j729519j224955p90325
$$ 808852 2547410 2464313 3027499 5462129 7597877 7314770 5585251 4360296 3569971
4634C569971j380596j690447j276919j300411j564594k39417K529277L898170
$$ 3569971 2189375 498928 -777991 -2078402 -3642996 -3882413 -1353136 2545034
4626B545034K415961N9254r93667r72558o95735J55206J401474J491545L7748
$$ 2545034 4960995 5020249 4026582 3054024 2358289 2513495 3914969 5406514 5444262
4617E444262r43953j53110P31832L987q17104O46037L271886L407317l5982l984143
$$ 5444262 4500309 4347199 5079031 5083018 4265914 4911951 8183837 11591154 11555172 7571029
4607G571029n117978l478265j503875r41966j606877k271199j835885k9468K274015
$$ 7571029 2453051 -1025214 -2529089 -3471055 -5077932 -7349131 -9185016 -9214484 -6940469
4598f940469L542063L000278J622065J166676K029342K650391J592127l76691
$$ -6940469 -3398406 -398128 1223937 2390613 4419955 7070346 8662473 8285782
4590H285782j276944p18984k94520r05115j311856l60286P57056J68682j492379
$$ 8285782 7008838 6289854 5995334 5090219 3778363 3418077 4175133 4343815 2851436
4581B851436j565302Q96638L614634L993111K278683Q05072P45210P56134r67526
$$ 2851436 1286134 2182772 5797406 9790517 12069200 12874272 13619482 14375616 13408090
4572A3408090l959146n489402l545917N74642L301389K508694l81365k263802
$$ 13408090 9448944 3959542 413625 988267 4289656 6798350 6416985 4153183
4564D153183j734459j45259L20936r47538k516715k594396j046492N54214R86485
$$ 4153183 2418724 2273465 2594401 1646863 -869852 -3464248 -4510740 -3956526 -2970041
4555b970041P80805R31825J068860K57245q87241o68797J041716K369811K002539
$$ -2970041 -2189236 -1257411 -188551 68694 -818547 -1487344 -445628 1924183 3926722
4546C926722N66966r30585k241404k847988j760781N83006J932551R96124q46726
$$ 3926722 4493688 3563103 1321699 -1526289 -3287070 -2704064 -771513 224611 -622115
4537f22115j751225j740974j481175m03402J974440L947987L004690q73010m733260
$$ -622115 -2373340 -4114314 -5595489 -5998891 -4024451 -76464 2928226 2055216 -2678044
4528b678044n549635k953240O03098K085610Q60684o26588j13440J179904N72785
$$ -2678044 -8227679 -11180919 -10577821 -8492211 -7631527 -8258115 -8371555 -7191651 -6618866
4519f618866j274790q72835K315241M425695L122440J125954J262502J670051
$$ -6618866 -7893656 -8766491 -6451250 -2025555 1096885 2222839 3485341 5155392
4511E155392m45236l302084l198454p09886L11407j084454k027477o89858J699308
$$ 5155392 4710156 1408072 -1790382 -2500268 -2188861 -3273315 -5300792 -5990650 -4291342
4502d291342L500719L990526K418719r44240l286157k202798L42569O35306q61284
$$ -4291342 -790623 3199903 5618622 4674382 1388225 -814573 -472004 163302 -697982
4493f97982n13198J780822J955018j204314l434724j525458J868670K758280J593648
$$ -697982 -1211180 569642 2524660 1320346 -2114378 -3639836 -1771166 987114 2580762
4484B580762J230987J832820J372414l49709j519338j494922j452127j885906
$$ 2580762 3811749 5644569 7016983 6667274 5147936 3653014 2200887 314981
4476C14981j551165O37389L777525N554879M462542J428723j039752j703723j897714
$$ 314981 -1236184 -598795 3178730 8733609 13196151 14624874 13585122 11881399 9983685
4467I983685l118650m347363l544841j104607M89724K88079k23538k4855L8293
$$ 9983685 6865035 2517672 -1027169 -2131776 -1642052 -1353973 -1577511 -1602366 -1564073
4458a564073o85456j397413j413195j072132m14025J179772L314677M341707L563213
$$ -1564073 -2249529 -3646942 -5060137 -6132269 -6546294 -5366522 -2051845 2289862 5853075
4449E853075K132484J155176L98519o15856j694953k567051l110510k888359j710952
$$ 5853075 7985559 9140735 9539254 8923398 7228445 4661394 1550884 -1337475 -3048427
4440c048427l94117L79938J206866K332439K181969j07136k129507j320120P13097
$$ -3048427 -3442544 -3062606 -1855740 476699 2658668 2551532 422025 -898095 -184998
4431a84998P03983p10080n21108N58474q31192l673989l062998J118949K692140
$$ -184998 518985 -191095 -712203 -153729 -984921 -4658910 -7721908 -6602959 -3910819
4422c910819j082076m679447l019217Q20353J413917l58103k8823K652541M251465
$$ -3910819 -4992895 -9672342 -12691559 -11871206 -10457289 -10815392 -10844215 -8191674 -3940209
4413c940209L614165K313492R62466o19075j388982j027696j624687l727357l747103
$$ -3940209 -326044 1987448 2949914 2330839 941857 -85839 -1710526 -5437883 -9184986
4404i184986K20906L353809O60507m174120l383791K888198O493647L252419j945986
$$ -9184986 -8964080 -5610271 -4949764 -9123884 -12507675 -9619477 -3125830 126589 -1819397
4395a819397l327109j321913O71179J400479J060816m46869k166503k179435p09246
$$ -1819397 -5146506 -6468419 -5797240 -4396761 -3335945 -3782814 -5949317 -8128752 -8837998
4386h837998j04626o80657q4925K096536K999341J310329m11420j68631M37108
$$ -8837998 -8942624 -9623281 -9708206 -7611670 -4612329 -3302000 -3713420 -3882051 -3444943
4377c444943j46830l47665J189164K357023Q70937j682565k299744j188083q08708
$$ -3444943 -3591773 -3939438 -2750274 -393251 477686 -1204879 -3504623 -4692706 -5501414
4368e501414j603496j641140O6899K198540K819580J092033k083550m236324l263155
$$ -5501414 -7104910 -8746050 -8679151 -6480611 -3661031 -2568998 -4652548 -8888872 -12152027
4359a2152027N089K586000L200122L220765L179586J448917j943784l523753j185329
$$ -12152027 -12146938 -9560938 -6360816 -3140051 39535 1488452 -455332 -3979085 -5164414
4350e164414J995281K105280J55602l70199L23913o26479k634461j899821J823498
$$ -5164414 -3169133 -1063853 -908251 -1278450 -954537 -1581016 -4215477 -6115298 -4291800
4341d291800L788063J267157k348817k890929j123905n7805L53739J962085L819392
$$ -4291800 -503737 763420 -1585397 -4476326 -5600231 -5658036 -5304297 -3342212 477180
4332D77180L030218l69137l079387l137422j586769N61298L384149N250388K981896
$$ 477180 3507398 3138261 58874 -3078548 -4665317 -4104019 -719870 4530518 7512414
4323G512414k951598o826133m501881O19339K170451n08529k590092j643384l59554
$$ 7512414 4560816 -2265317 -6767198 -6147859 -3977408 -4485937 -7076029 -8719413 -9078967
4314i078967r84955j848086j124205J8251K74137P09765J987489K368804J182370
$$ -9078967 -10063922 -11912008 -13036213 -13017962 -12743825 -12034060 -10046571 -7677767 -6495397
4305f495397R96466L105075M106104J048819k864799k625109O19085J409982j329964
$$ -6495397 -5498931 -2393856 1712248 2761067 -103732 -2728841 -2109756 -699774 -2029738
4296b029738l226317j978266j91432K31147J045568L158165M004301J930420p26402
$$ -2029738 -5256055 -7234321 -7425753 -7194606 -6149038 -2990873 1013428 2943848 2217446
4287B217446j417379q87459o86109m16445L45778N19566m655M58125J769762J155841
$$ 2217446 800067 -87392 -773501 -1189946 -844168 -324602 -329257 128868 1898630 3054471
4277C054471j705957k819538r1363K682042J814107k50233M74988K467273J706300
$$ 3054471 1348514 -1471024 -1562387 1119655 2933762 2683529 3158517 5625790 7332090
4268G332090j017547j783879o56990q98384k175972j049975J923073K128780j190298
$$ 7332090 6314543 4530664 3873674 2975290 799318 -250657 1672416 3801196 2610898
4259B610898l214616j428191O93036K93677j61640J803527L514638J549225k208333
$$ 2610898 -603718 -2031909 -1338873 -1045196 -1206836 596691 4111329 5660554 3452221
4250C452221l279414j083066J138118J281806m2964j677906k786777k482425q02279
$$ 3452221 172807 -910259 227859 1509665 1466701 -211205 -2997982 -5480407 -6282686
4241f282686Q65171J796253K787411L735498K840932N0707j583267n26875K04562
$$ -6282686 -5417515 -3621262 -833851 2901647 5742579 5793286 4210019 3683144 3887706
4232C887706k090314m704446l406777P28769K951266J893113L44874j57724p39275
$$ 3887706 1797392 -2907054 -6313831 -5585062 -2633796 -740683 -395809 -553533 -1292808
4223a292808j438025p78480O03212L31984j199660j018259J131329K158556J159527
$$ -1292808 -2730833 -3509313 -2906101 -2574117 -3773777 -4792036 -3660707 -1502151 -342624
4214c42624P94478J751330Q96285k744077n051496l046695K98469J158193P87308
$$ -342624 451854 2203184 3099469 355392 -4696104 -7742799 -7444330 -6286137 -5498829
4205e498829K046388L458972J886238j178880j442221J071683J877158r15118
$$ -5498829 -3452441 6531 1892769 713889 -728332 343351 2220509 1305391
4197A305391l895455l612598r80554R01054Q48133J66346N06178K003049L073299
$$ 1305391 -2590064 -6202662 -7183216 -6282162 -5434029 -5267683 -4761505 -2758456 314843
4188C14843K168387j15277j742540k189052k656504k964212j347575J412403J511371
$$ 314843 2483230 2367953 625413 -1563639 -4220143 -7184355 -8531930 -7119527 -5608156
4179e608156j790986l594178m29396L849274L760211M77781q81799L80752P50675
$$ -5608156 -7399142 -10993320 -11422716 -7573442 -3813231 -3335450 -4217249 -3836497 -3085822
4170c085822p35555j858532k211712l147603l676183j955793J41739m33012k038033
$$ -3085822 -3821377 -5679909 -7891621 -11039224 -14715407 -16671200 -16529461 -16962473 -19000506
4161a9000506r37031J656523J570305q10198j946604k212093l752570l580660
$$ -19000506 -19937537 -18281014 -16710709 -17520907 -19467511 -21679604 -25432174 -29012834
4153b9012834J773339O809911L482756m261459n220572K78453J156768m105782
$$ -29012834 -27239495 -20429584 -16946828 -21208287 -26428859 -26150406 -24993638 -29099420
4145b9099420n194368r17555k734007j1381912j2330980m803154r617080k9577317
$$ -29099420 -34293788 -35211343 -37945350 -49327262 -61658242 -66461396 -76078476 -105655793
4137a05655793k8404469K0063176Q0027571Q9452028M1371711q768056j9012348
$$ -105655793 -134060262 -113997086 -33969515 55482513 96854224 88086168 69073820
4130F9073820n955015l053050j0531655r726975q36080J775495k544071k861142
$$ 69073820 63118805 60065755 49534100 39807125 38971045 40746540 38202469 35341327
4122C5341327J130094L61125m778613n336569r35153O4108l786161n336012k323112
$$ 35341327 36471421 36832546 32053933 26717364 25782211 25846319 22060158 16724146 14401034
4113A4401034n3681n76685k72622J440440R15438j765971k386598k91419J351809
$$ 14401034 14347353 13770668 13498046 14938486 15853924 14087953 11701355 11409936 12761745
4104A2761745K315512M437583N125221L28330o610671p887035l102713L99172
$$ 12761745 15077257 19514840 24640061 24968391 18357720 10470685 7367972 7767144
4096G767144m35866p32563K491057N247133L916453O00564j590789k645164k764034
$$ 7767144 7331278 6598715 9089772 14336905 18253358 18853922 17263133 14617969 11853935
4087A1853935q86794J840502K149558j53758j817416j912776k780036m371301
$$ 11853935 10967141 12807643 14957201 14803443 12986027 11073251 8293215 3921914
4079C921914l422552L02330K635024J667747L61804O08597J59456k190575l591478
$$ 3921914 499362 801692 3436716 5104463 5466267 6074864 6234320 4043745 452267
4070D52267k097824m6235L06470L91644J889817L414921L183355J788972L56975
$$ 452267 -1645557 -1691792 -1385322 -993678 896139 4311060 7494415 9283387 9640362
4061I640362r44828j259783M71696K282264O25383l613686n096356j761984K064234
$$ 9640362 8695534 7435751 7907447 10189711 10815094 7201408 2105052 343068 2407302
4052B407302K422506R18520N88056J044835Q16709N69855Q45222L7148k408402
$$ 2407302 4829808 5748328 6336384 7381219 8197928 8767783 9613005 9650153 7241751
4043G241751l954092k784677n83293P38003J697412K553143J827634j32560k51987
$$ 7241751 3287659 502982 -80311 657692 2355104 4908247 6735881 6603321 6351334
4034F351334J957956K520870m67588k909427j085628K268860K567823K63460j400409
$$ 6351334 8309290 10830160 10362572 7453145 6367517 8636377 11204200 11467660 10067251
4025A0067251k069233k943233k853279o33640J222574K11972j296454J67970K802692
$$ 10067251 7998018 5054785 2201506 1567866 2790440 3002412 1705958 1873928 4676620
4016D676620K259808j065786k944848k202738j255481o85629J155170L396125
$$ 4676620 6936428 5870642 2925794 723056 -532425 -1218054 -62884 3333241
4008C333241K919101j60983k068493j102853M37508O62700L59903J82175n26983
$$ 3333241 6252342 6091359 4022866 2920013 3357521 4020221 4380124 4562299 4035316
3999D035316j254415k84767J925735K634349R14997j171817k111488k498816k481947
$$ 4035316 2780901 2496134 4421869 7056218 7971215 6799398 4687910 2189094 -292853
3990b92853r48894J785964L491174L204031K220988J251407n09529k757779l630036
$$ -292853 -1241747 544217 4035391 7239422 9460410 10711817 10202288 7444509 3814473
3981C814473k888585k575509l373660l317212j452944K43768L15577L42737J956828
$$ 3814473 925888 -1649621 -5023281 -8340493 -9793437 -9549669 -9234092 -8891355 -6934527
3972f934527L824596L930675K849105K343836K309374J535446L63040J51273O65183
$$ -6934527 -3109931 820744 3669849 6013685 8323059 9858505 10221545 10372818 11038001
3963A1038001J54659j983120m187076m538351k635908K76560K330738K334149
$$ 11038001 11192660 9209540 5022464 484113 -2151795 -1875235 455503 2789652
3955B789652O76693j084475j753731j371498n92974J73650Q23137J329735J689847
$$ 2789652 3466345 2381870 628139 -743359 -1336333 -1162683 -339546 990189 2680036
3946B680036J698105Q71792q25392k365529k560580j557738o77855p49829j280941
$$ 2680036 4378141 5249933 4424541 2059012 -501568 -2059306 -2737161 -3486990 -4767931
3937d767931j292574m27384P42453J197674N45183k80212j25191N11612R4510
$$ -4767931 -6060505 -6487889 -5745436 -4547762 -4002579 -4282791 -4407982 -3896370 -3801860
3928c801860j157820j180742K46417L22707k169923l709384q52208L726358M343190
$$ -3801860 -4959680 -6140422 -5894005 -5571298 -7741221 -11450605 -12302813 -8576455 -4233265
3919d233265O94658j582654P17954L961206L383494m78327l489881l390802j134939
$$ -4233265 -3538607 -5121261 -4403307 -442101 2941393 2463066 -1026815 -4417617 -5552556
3910e552556J338895K514666J874143P21411J090972K658447K633509J26371j741879
$$ -5552556 -4213661 -1698995 175148 896559 1987531 4645978 7279487 7405858 5663979
3901E663979l37422K023039J205840k455476m538031k967477o02876n02180j588912
$$ 5663979 5326557 7349596 8555436 6099960 1561929 -1405548 -2008424 -2510604 -4099516
3892d099516r59412J430372K854883J975127N74810O41409J474923J004999r28542
$$ -4099516 -5058928 -3628556 -773673 1201454 1776264 2417673 3892596 4897595 3969053
3883C969053k254937j601406n4173N47475r8762r55022j165958m81911R88026
$$ 3969053 1714116 112710 58537 606012 507250 -447772 -1613730 -2095641 -1107615
3874a107615K430349K512553J060883j22196O35902K501825L135283J610981q74959
$$ -1107615 1322734 3835287 4896170 4773974 5409876 7911701 11046984 12657965 11783006
3865A1783006k729870l145817k073258l18128Q15902J134471J980300L746869
$$ 11783006 9053136 5907319 3834061 3515933 4331835 5466306 7446606 11193475
3857A1193475M250104J655473k070315l309201j824577p43596j591357k394223
$$ 11193475 15443579 17099052 15028737 11719536 9894959 9151363 7560006 5165783
3849E165783j341562M41849R01576k97771k155348l597010l585234j681265Q20239
$$ 5165783 3824221 4266070 5167646 4869875 2714527 -882483 -4467717 -6148982 -5328743
3840e328743J890830J322629O94689P50212Q32118R40291J816295K604210J207331
$$ -5328743 -3437913 -2115284 -1420595 -670383 161735 1102026 2918321 5522531 6729862
3831F729862k105261m043506k497659P48699K607208K052026J36634j297887m19943
$$ 6729862 4624601 581095 -1916564 -1167865 1439343 3491369 3628003 2330116 1910173
3822A910173K740854M908197K838708j719993l779481k235007r32664j595992
$$ 1910173 4651027 9559224 12397932 10677939 6898458 4663451 3730787 2134795
3814B134795r56082K546632M596162J685937k596450l032427q09847m50402j723968
$$ 2134795 1178713 3725345 8321507 10007444 7410994 4378567 3568720 3118318 1394350
3805A394350j027767J132383R68536r53724J1168L966746N023289O44948l739751
$$ 1394350 366583 1498966 2467502 1513778 1524946 5491692 10514981 11159929 7420178
3796G420178k882850O30174J168367j303966k269238j94582J787274J217589o24905
$$ 7420178 4537328 5167502 6335869 5031903 2762665 2568083 4355357 5572946 4948041
3787D948041j470276r74375l8010P69022J138716P01826k91319p20152J80596
$$ 4948041 3477765 2503390 2465380 3234402 4373118 5074944 4783625 4063473 4244069
3778D244069J681504K278215J521388O23171R58203K270238K911825J858548j32777
$$ 4244069 5925573 8203788 9725176 10348347 11306550 13576788 16488613 18347161 18214384
3769A8214384j612260k102985k254806k718344l280335l032179j455881M39757
$$ 18214384 16602124 14499139 12244333 9525989 6245654 3213475 1757594 2197351
3761B197351O68288j183737k698215j534371R50878J319503p70825j922876k67817
$$ 2197351 2865639 1681902 -1016313 -2550684 -1599806 -280303 -1051128 -2974004 -3241821
3752c241821J773517J602981L11808J15438N50939K6478r75322j150978r53045
$$ -3241821 -1468304 134677 446485 561923 1112862 1139340 164018 -986960 -1940005
3743a940005j022179m0530K627414M232703K422692j55009M81686K846440K044295
$$ -1940005 -2962184 -3002714 -375300 3857403 6280095 6125086 6606772 9453212 11497507
3734A1497507k012957m104654j891781R57720J251574N97886R74910P98480j438896
$$ 11497507 9484550 5379896 3488115 4445835 5697409 6295295 7270205 8068685 6629789
3725F629789l479221k777002q21165n93230j813963j852120P6608K210681K690918
$$ 6629789 3150568 373566 -447599 -1040829 -2854792 -4706912 -4630304 -2419623 271295
3716B71295R39599k110780l863562j913706K620374N568990M695901J970926p8302
$$ 271295 1210894 -899886 -4763448 -6677154 -4056780 1512210 6208111 8179037 8100735
3707H100735j207533j303854P61739L734245L381834j275037m810550k736735
$$ 8100735 6893202 5589348 6351087 10085332 13467166 12192129 7381579 4644844
3699D644844J291933Q44786l263370m515997j117661J711263M20175k033251k009368
$$ 4644844 5936777 6781563 3518193 -997804 -2115465 -404202 15973 -2017278 -4026646
3690d026646o95804q52513j883585j452167M31935J865540K051362J538948O02233
$$ -4026646 -4722450 -5574963 -7458548 -8910715 -8478780 -6613240 -4561878 -3022930 -2420697
3681b420697p55926j936421k168065j213290Q43899L435442M884302L580673L36070
$$ -2420697 -3176623 -5113044 -7281109 -8494399 -7650500 -4215058 669244 4249917 4585987
3672D585987k078021k276791j395125m98218P98555K259045K173923J78705j354734
$$ 4585987 2507966 231175 -1163950 -1662168 -863613 1395432 3569355 3748060 2393326
3663B393326o76593N98651K26387j107918j443165j009807j051224n42408K292699
$$ 2393326 1716733 2315384 2541771 1433853 -9312 -1019119 -2070343 -2612751 -320052
3654c20052N658227N291409O50605l451334l029949m6838P41672j902804m887254
$$ -320052 5338175 10629584 11280189 7828855 4798906 4752068 5493740 3590936 -1296318
3645a296318n156861k606857R41843L683344M576512L574556J566228m51225j998996
$$ -1296318 -6453179 -9060036 -8118193 -4434849 141663 3716219 5282447 4831222 2832226
3636B832226k543891j222457J692035L812283K848346l88279k872278l230780
$$ 2832226 288335 -934122 757913 4570196 7418542 7030263 4157985 927205
3628I27205k816739k642553j560550J277209M129167M708164L218173J438327
$$ 927205 -1889534 -4532087 -6092637 -4815428 -686261 4021903 7240076 8678403
3620H678403j36969j999378l206966k027764P32528J617283j122224m841467n531356
$$ 8678403 8541434 6542056 3335090 1307326 2039854 3657137 2534913 -2306554 -7837910
3611g837910k426834J583854L389780K470641P45154M08298J772315L034313K481089
$$ -7837910 -10264744 -8680890 -5291110 -2820469 -2075315 -1667017 105298 3139611 5620700
3602E620700O70131m10125o5945N09108L03313m08852j219621k109681k364988
$$ 5620700 6290831 5880706 5814761 6323869 6627182 6218330 4998709 2889028 524040
3593E24040q68879J666876K583093N44894k608908m314805l904441j805449J635152
$$ 524040 -344839 1322037 3905130 4450024 1841116 -2473689 -6378130 -8183579 -6548427
3584f548427M900196N195607J992775j150396q96278J386280K222660J384298
$$ -6548427 -1648231 3547376 5540151 4389755 3493477 4879757 7102417 8486715
3576H486715J128176J404378K8387k749071m141142l585402l312653l390097q65337
$$ 8486715 9614891 11019269 11047656 8298585 4157443 572041 -2740612 -6130709 -6996046
3567f996046M266709O823167L407859j956866l113438j49543J774426M16053j284545
$$ -6996046 -2729337 4093830 7501689 5544823 2431385 2281842 4056268 4472321 3187776
3558C187776p13952Q31854J067142M2105r25775j426703j565901r49217N08615
$$ 3187776 2473824 3305678 4372820 4414925 3489150 2062447 496546 -452671 55944
3549E5944J765916J893005J494983J776535K490206J920450p72241l888092m674538
$$ 55944 1821860 3714865 5209848 6986383 9476589 11397039 10624798 6736706 2062168
3540B062168k526480J33087Q12611K0021R0004J451404K072871R22846k73710
$$ 2062168 -464312 -331225 481386 501407 591411 2042815 4115686 5038532 4764822
3531D764822Q5333Q47750J34559j595218k619573k826178l085277k684921k59859
$$ 4764822 4850155 5697905 5832464 4237246 1617673 -1208505 -4293782 -6978703 -7238562
3522g238562K922875L546376P36569k460514k993821j135095J063304K613064
$$ -7238562 -4315687 -769311 -32742 -2493256 -5487077 -6622172 -5558868 -2945804
3514b945804L518016L458563K173173L38800j006497j259752q4960K195714L532739
$$ -2945804 572212 4030775 6203948 6542748 5536251 4276499 4191539 6387253 9919992
3505I919992J469235l150008n729561l228703J538638L309113J050547j519059
$$ 9919992 11389227 8239219 2509658 -719045 819593 4128706 5179253 3660194
3497C660194j636982n84534m59744p47613K12124K165008L211212K266903o1621
$$ 3660194 2023212 1438678 978934 231321 443445 2608453 5819665 8086568 8024947
3488H024947k357828l150196j696675Q11647J707450q1638k149466j487501J240129
$$ 8024947 5667119 2516923 820248 1631895 3339345 3257707 1108241 -379260 860869
3479H60869K390405M55826j770047j175738J420741K771530J764124L59054L03422
$$ 860869 3251274 3707100 1937053 761315 2182056 4953586 6717710 7076764 7380186
3470G380186J018961J212113Q24696L83735l42779j739339l029555k843952r97382
$$ 7380186 8399147 9611260 10435956 10819691 10476912 8737573 5708018 2864066 1866684
3461A866684J208087K446804K444456J674348P33234J14777P095J57118K40621
$$ 1866684 3074771 5521575 7966031 9640379 10373613 10488390 10495485 10652603 10893224
3452A0893224J91071k11855j518914l460411m123215j808461K194001M349034
$$ 10893224 11084295 10872440 9353526 5893115 1769900 -38561 2155440 6504474
3444F504474L048587N23082l94543J18320M2142r94888j590931j393120j688101
$$ 6504474 9553061 10076143 9681600 9799920 9842062 8847174 7256243 5863123 4175022
3435D175022k950424l870787l408834k011478j78395K197130M119341L404714
$$ 4175022 1224598 -2646189 -6055023 -8066501 -8244896 -6047766 -1928425 1476289
3427A476289R2901k116306m40387K487103J989312j560130l021544l35872K253063
$$ 1476289 1569190 -547116 -987503 1499600 3488912 1928782 -1092762 -1428634 824429
3418H24429R40504j638107r52165J665747R50965l446324n630656k318965J950661
$$ 824429 1764933 126826 -825339 840408 1791373 -1654951 -7285607 -9604572 -7653911
3409g653911J584679j793868k126135K038515N913974N530269K198222p83345
$$ -7653911 -6069232 -7863100 -9989235 -7950720 -2036746 3493523 5691745 4908400
3401D908400k211059k312564j087931O62568R86468m68684j322123j46694Q01725
$$ 4908400 2697341 384777 -703154 -40586 945882 477198 -844925 -991619 -189894
3392a89894p81609k762075j264256L096847N603543M128007J575602P28673M20681
$$ -189894 -971503 -3733578 -4997834 -1900987 3702556 7830563 9406165 10134838 10555519
3383A0555519j194894k769561j976236M98111K025494J732937N48919j201892
$$ 10555519 9360625 6591064 4614828 5112939 7138433 8871370 9420289 8218397
3375H218397l463266m610721l011793j72895O15011j052308k183663r94413Q48666
$$ 8218397 4755131 144410 -2867383 -3040278 -2425267 -3477575 -5661238 -6655651 -5806985
3366e806985J476492J450835J641564J092946q49176k349820j544712K46764M13989
$$ -5806985 -4330493 -2879658 -1238094 -145148 -994324 -3344144 -4888856 -4642092 -4228103
3357d228103p48981n13552J874171L952289L646618J840731N23617K13617K81483
$$ -4228103 -4977084 -5490636 -3616465 335824 3982442 5823173 6346790 6560407 6841890
3348F841890M11965N42922K96496m15022q33018l57451L27326J1563j350332k425539
$$ 6841890 7253855 7796777 8093273 7678251 6845233 6487782 6815108 6826671 5476339 3050800
3338C050800k004306l09253J250686J487558N82365k62242l62694k83658o14604
$$ 3050800 1046494 737241 1987927 3475485 4057850 3795608 3432914 3149256 2534652
3329B534652p17183K35317J416334J084134q03944k419730k908302l441667m424111
$$ 2534652 1817469 2052786 3469120 4553254 3749310 1329580 -1578722 -5020389 -9444500
3320i444500l774704o2456M160989M889191J963202r08095j462772j280696j973476
$$ -9444500 -13219204 -13281660 -9120671 -4231480 -2268278 -3176373 -4639145 -5919841 -7893317
3311g893317j929869Q99589M838735N931762L119448l87016j251718J83550R76769
$$ -7893317 -9823186 -8923597 -4084862 1846900 4966348 4579332 3327614 3511164 4487933
3302D487933n42143k784933k644316R03181M996872N407848J346527l231073m226264
$$ 4487933 3945790 1160857 -1483459 -580278 4416594 9824442 11170969 7939896 3713632
3293C713632k297988j306633k516217l092700r75115J540271J059958j843974
$$ 3713632 1415644 109011 -2407206 -5499906 -6475021 -4934750 -3874792 -5718766
3285e718766l364358j624415J285282K631631K336737K030730K202333J691055
$$ -5718766 -9083124 -10707539 -9422257 -6790626 -4453889 -2423159 -220826 1470229
3277A470229k61479k471390k775181m21048K822564M314799L261523J250800O428
$$ 1470229 1208750 -1262640 -4037821 -4458869 -1636305 2678494 5940017 7190817 7197245
3268G197245m78972j033281j547231j304255n16941k09140o79969j197631j156216
$$ 7197245 6718273 5684992 4137761 2833506 2316565 2107425 1427456 229825 -926391
3259i26391n31942N79791J666081J330075j191275l974058l853141n90949K307383
$$ -926391 -1458333 -878542 787539 2117614 926339 -3047719 -6900860 -7491809 -5184426
3250e184426K056013M2076p69564j66789p3522p14813l73733J022485J076466
$$ -5184426 -3128413 -3086337 -3855901 -4022690 -4096212 -4811025 -5184758 -4162273 -3085807
3241c085807j174205k963443j358986K445214M657207L889142K220403J417919
$$ -3085807 -4260012 -7223455 -8582441 -6137227 -1480020 2409122 4629525 6047444
3233F047444P44082n95039j285863j61588J078815M9277k185165k111823Q90678
$$ 6047444 6791526 6196487 4910624 4749036 5827851 5877128 3691963 1580140 2470818
3224B470818L233414K269215p3027q01065m86835j435904l018085k538010j56541
$$ 2470818 5704232 7973447 7900420 7099355 6612520 5176616 2158531 -379479 -536020
3215e36020R10842m30361j375152J24730K119424J989275M13473k70019L07099
$$ -536020 374822 -55539 -1430691 -1305961 813463 2802738 3216211 2946192 3253291
3206C253291R08805J153188J272289O65652r48990j946202p66167J259804J478864
$$ 3253291 4162096 5315284 6587573 7253225 6304235 4358033 3591866 4851670 6330534
3197F330534k04121j480267j361944j118986j354913q43669Q76614K032989J087195
$$ 6330534 6126413 4646146 3284202 2165216 810303 -33366 843248 2876237 3963432
3188C963432q44985j391290J15331K069979K490066Q82635j420125k535182j877957
$$ 3963432 3118447 1727157 1842488 3912467 6402533 7285168 5865043 3329861 1451904
3179A451904n26219N59481J839204L793129N162551M194501J219427j577144k704517
$$ 1451904 925685 1485166 3324370 7117499 12280050 16474551 17693978 16116834 13412317
3170A3412317k315711j158775k43198r34389l330491m981508l481935l2901K010791
$$ 13412317 11096606 9937831 9694633 8760244 5429753 448245 -3033690 -3066591 -1055800
3161a055800J842824J613232K252700K263286J174667O69705J193120R23195m82293
$$ -1055800 787024 2400256 4652956 6916242 8090909 8760614 9953734 10876929 10394636
3152A0394636p45993O04973N57468k064453l500760q04734K855010K990830Q70715
$$ 10394636 9648643 10253616 10811084 8746631 5245871 4441137 7296147 10286977 11157692
3143A1157692O43118J684726j28846m415901n877121k551187J255747J866660
$$ 11157692 11800810 13485536 13356690 8940789 3063668 512481 1768228 3634888
3135C634888Q97448Q36830P56313n40576j156685M58258J847349K29314k479715
$$ 3634888 4532336 5369166 6125479 5584903 4428218 4886476 6733825 6963139 4483424
3126D483424k343482M62613K277799J929705J954151L561976M162521J396644
$$ 4483424 2139942 2602555 4880354 6810059 8764210 12326186 16488707 17885351
3118A7885351k952485n023956l594994j100240l15766j229601j680870p32731
$$ 17885351 14932866 9908910 6313916 5213676 4897910 3668309 1987439 1254708
3110A254708k93463k245028m681058l522238J409313M813789K691808j661027
$$ 1254708 961245 -1283783 -5964841 -9487079 -8077766 -3263977 -572169 -2233196
3102b233196j955488K091184M401266J453924k839656l098357K37187K563394
$$ -2233196 -4188684 -2097500 2303766 3757690 918034 -2180323 -1943136 620258
3094F20258J729551m34995k033401k992838l017254r05585K870727N216698L830066
$$ 620258 2349809 1914814 -118587 -3111425 -6128679 -7034264 -4163537 1053161 4883227
3085D883227L81226j385508k16723J457046Q91664j683996l711998l430600j448530
$$ 4883227 5264453 3878945 3662222 5119268 6010932 4326936 614938 -2815662 -4264192
3076d264192O06914K007946K976610L479854K960675J287559q11225k455131l127245
$$ -4264192 -3657278 -1649332 1327278 4807132 7767807 9055366 8244141 5789010 2661765
3067B661765k455988m76303J569851J909747N38198k85073R80962K716899K326542
$$ 2661765 205777 -270526 1299325 3209072 3747270 3462197 4443159 7160058 9486600
3058I486600R5321j229458m80133O40188O88858N19105J067440J190889n13047
$$ 9486600 9581921 8352463 7872330 8512518 9201376 9720481 10787921 11978810 11465763
3049A1465763l044594l985322k492815N5398J838384J961817Q26088J09089J362781
$$ 11465763 8421169 4435847 1943032 1998430 3836814 5798631 6624719 6733808 8096589
3040H096589L580343L557995J54472l383818l429964q65703O44957N7749n92881
$$ 8096589 11676932 15234927 15389399 12005581 8575617 7709914 8354871 8412620 7819739
3031G819739m27749o74209j270218m14535J535436J469239j506055l901128k807752
$$ 7819739 7391990 6717781 5447563 5033028 6568464 8037703 6531648 2630520 -177232
3022a77232k0638J212674P27152l1892j247886l064727l037901O05888M666559
$$ -177232 -197870 1014804 1741956 1710064 462178 -2602549 -5640450 -5034562 -368003
3013c68003M377350N03196j452287O45030K688528Q27040l067107m545008k351526
$$ -368003 4009347 4512543 3060256 3705286 6393814 7220854 4153747 -391261 -2742787
3004b742787J196982L580307L749834J912012n19838j695230j267317o19992n02912
$$ -2742787 -1545805 2034502 5784336 7696348 7176510 5481280 4213963 3593971 3091059
2995C091059j1173J213837J713814N92979o23109l40828M20922j57064j415367
$$ 3091059 3079886 4293723 6007537 6600516 5977407 5636579 6057501 5900437 4485070
2986D485070j231499L19253R16243l34415j575368j187747j07522p3294j014813
$$ 4485070 3253571 3572824 4489067 4154652 2579284 1391537 1284015 1210721 195908
2977A95908j519084j094919o82600j106588j946058k037886o30071J908067M094400
$$ 195908 -1323176 -2418095 -3100695 -4207283 -6153341 -8191227 -8821298 -6913231 -2818831
2968b818831M198278J793750j327193k439070o65528J892576K509132J030495
$$ -2818831 1379447 3173197 1846004 -593066 -1258594 633982 3143114 4173609
2960D173609k71076J3985O96497J59574j105680j409803l93317Q56570J652779
$$ 4173609 3902533 3916518 4613015 4772589 3666909 2257106 1863789 2720359 4373138
2951D373138K070394J774576K30252j836973k817403k328923j472901p75729M08958
$$ 4373138 6443532 8218108 8448360 6611387 3793984 1465061 -7840 -783569 -374611
2942c74611J980772K461846J271206j4204M1193N16889k99731k123528l009443
$$ -374611 1606161 4068007 5339213 5325009 5366202 5883091 5583360 3459832 450389
2933D50389j952224J74881J951615K590467K040632Q30075l34983j332081k559145
$$ 450389 -1501835 -1326954 624661 3215128 5255760 6085835 5750852 4418771 1859626
2924A859626l714120l494248j292848J566504L204646L185046K314276J180236
$$ 1859626 -1854494 -5348742 -6641590 -5075086 -1870440 1314606 3628882 4809118
2916D809118n7935r57236r77316j94948Q64217J785811K190921J735889P16008
$$ 4809118 4751183 3793947 2816631 2621683 3485900 5271711 7462632 9198521 9914529
2907I914529r0504o33393j565079k504131j914086K91432J836011J336972O07343
$$ 9914529 9824025 9190632 7625553 5121422 3207336 3498768 5334779 6671751 7279094
2898G279094J488661K187268m9612l684909m167332n72407K799071K525918L27969
$$ 7279094 8767755 10955023 10905411 7220502 3053170 2480763 5279834 7805752 8133721
2889H133721o32385p00577k181571m723740n375757k752921J300046M232853N089607
$$ 8133721 7501336 6800759 4619188 -104552 -5480309 -8233230 -6933184 -2700331 2389276
2880B389276M088022J601490j633132m157051m501650k378865Q52993L043593
$$ 2389276 6477298 8078788 6445656 2288605 -2213045 -4591910 -3738917 -695324
2872f95324L041710J733130P52592K34220j046123l040816l597435j463909J271349
$$ -695324 2346386 4079516 4832108 5066328 4020205 979389 -2618046 -4081955 -2810606
2863b810606J698315K97784K68088K568871M162588K350121j221227k873587j955861
$$ -2810606 -1112291 -814507 -546419 2022452 6185040 8535161 7313934 4440347 2484486
2854B484486j124552j892100k559265j412020L54421O98399J07528N28320J719293
$$ 2484486 1359934 -532166 -3091431 -4503451 -4149030 -3450631 -3343103 -2814783 -1095490
2845a095490J446262m95776j276073P37547L136935K839596N08905q37467m60392
$$ -1095490 350772 -145004 -1421077 -683530 2453405 5293001 5801906 4964439 4504047
2836D504047k87596j056278j118737K73932J216651J01297j683778j714720J78926
$$ 4504047 4216451 3160173 2041436 2315368 3532019 3633316 1949538 234818 413744
2827D13744K255652L427703L725628K947803Q09982j655791k593632j618888m15433
$$ 413744 2669396 6097099 9822727 12770530 13580512 11924721 9331089 7712201 7296768
2818G296768o17211k002731l143557l024073j638239K82557J658654J709824O34201
$$ 7296768 6679557 4676826 1533269 -1490804 -3129043 -2846486 -1187832 521992 1156193
2809A156193o93795j784011k657470k851947j449267J178544K715980J377102
$$ 1156193 462398 -1321613 -3979083 -6831030 -8280297 -7101753 -4385773 -3008671
2801c008671j428766k423885m88743K100727K802331J691169N24494M14892J551703
$$ -3008671 -4437437 -6861322 -7350065 -5249338 -2447007 -755838 -231344 183548 1735251
2792A735251L794513N862224N134620O01957m491549n527846k241707R13347P13553
$$ 1735251 5529764 11391988 16526608 17128565 12637016 7109170 4867463 5780810 6494363
2783F494363j155626j619814p71941o52383j382613j292540j2052J114554J341813
$$ 6494363 5338737 3718923 2946982 2294599 911986 -380554 -392606 721948 2063761
2774B063761J066192L27750j102887k265957j796851l11949M2715j237006k224877
$$ 2063761 3129953 3457703 2354816 88859 -1707992 -2019941 -1977226 -3214232 -5439109
2765e439109j407820N10605K170917L086455K953699J323727j019888j996580
$$ -5439109 -6846929 -6336324 -4165407 -1078952 1874747 3198474 2178586 182006
2757A82006p61063R53612J109110j59343j327574j582113j049346J7891J129176
$$ 182006 -579057 374555 1483665 1324322 -3252 -1585365 -2634711 -2616820 -1487644
2748a487644J487526J089518J124416K313977L602310L404430J471431j189083
$$ -1487644 -118 1089400 2213816 4527793 8130103 11534533 13005964 11816881
2740A1816881l371178l983755k476554Q9374J510777J032361L60778J011074J950845
$$ 11816881 8445703 4461948 1985394 2074768 3585545 4617906 4978684 5989758 7940603
2731G940603J339896n99809k209814k916890l223409k931900j453425M77500J363394
$$ 7940603 9280499 8680690 6470876 3553986 330577 -2601323 -4054748 -3577248 -2213854
2722b213854J085535P59749P01726L64337O5552P01189J683209J301260m95099
$$ -2213854 -1128319 -368570 333156 697493 763045 1464234 3147443 4448703 3953604
2713C953604j712499j258891l14448o2817R965O15754J269325J495206J797778
$$ 3953604 2241105 982214 667766 604949 614914 1230668 2499993 3995199 5792977
2704E792977K289180J948885M76083p54964r64048j418893k871634l400866j298876
$$ 5792977 8082157 10031042 10507125 9752161 8788113 7369220 4497586 1096720 -202156
2695b02156J334688R99312j821880k954305m09199L116594M387923L402562J766106
$$ -202156 1132532 2131844 309964 -2644341 -3053540 63054 4450977 7853539 9619645
2686I619645k552j679101k081204q79702l2388j095755k432364j537996R58672
$$ 9619645 9617093 7937992 5856788 4977086 4944698 3848943 1416579 -121417 837255
2677H37255K340579K055499J887036K208279J462316j95686k54738J835964K963557
$$ 837255 3177834 5233333 7120369 9328648 10790964 10595278 10340540 12176504 15140061
2668A5140061J038069j434479j180931O70880N45946j809916l073549j574915
$$ 15140061 16178130 14743651 13562720 14233600 14779546 12969630 9896081 8321166
2660H321166M82885O07460p63430j599879j004013L71014J410814J351952K86611
$$ 8321166 8804051 9411511 8648081 7048202 6044189 6415203 7826017 9177969 9464580
2651I464580q94744j599078k165061k740812k583853j665696j505254k495096
$$ 9464580 8569836 6970758 4805697 2064885 -518968 -2184664 -3689918 -6185014
2643f185014k079214J511469N154055M336442L6599k390534j239706k93374j560883
$$ -6185014 -8264228 -6752759 -1598704 2737738 2774337 383803 -855903 -1149277 -2710160
2634b710160j727656J445790M333114L173185M93257Q94936L389572L242466l23194
$$ -2710160 -4437816 -2992026 1341088 4514273 5007530 5902466 9292038 12534504 12211310
2625A2211310l470628l910239k903085j526770M87366K219005K146397J354154
$$ 12211310 8740682 4830443 1927358 400588 887954 3106959 5253356 6607510
2617F607510J986706K584040k21777m893783n340483R1999N162769M266094k2976
$$ 6607510 8594216 11178256 10956479 6062696 722213 814212 5976981 10243075 10220099
2608A0220099j739744k72471K93152j607700l241221k480437n38972O09021P34491
$$ 10220099 8480355 8207884 8501036 6893336 3652115 1171678 632706 1241727 1976218
2599A976218O65978R57654J632103K050274J198074q03017k034897r59903J290425
$$ 1976218 2642196 3599850 5231953 7282227 8480301 7677284 5642387 4682484 5972909
2590E972909K213075J066214o68132j519381j295956l86822Q07337J730202K001979
$$ 5972909 8185984 9252198 8584066 7064685 5768729 5381907 6189244 7919446 9921425
2581I921425J914662J911283J810608J126958k45704k070888l734630l836135
$$ 9921425 11836087 13747370 15557978 16684936 16439232 14368344 10633714 6797579
2573F797579j178183K966736N086159L345478L8269j431726p60083l7184k4786
$$ 6797579 5619396 8586132 13672291 17017769 17056038 15624312 14864229 14827045 14802259
2564A4802259L56721J317332J539007M09117j192637k609045l985261m834416
$$ 14802259 15158980 16476312 18015319 18424436 17231799 14622754 10637493 5803077
2556E803077l973442j500650Q06590J679436J502782Q80297k55840j480049j587333
$$ 5803077 1829635 328985 1135575 2815011 4317793 5198090 4942250 3462201 1874868
2547A874868m93653J05729p85960j617562l89268K263487L635293K298004l71098
$$ 1874868 1381215 1486944 700984 -916578 -1305846 957641 4592934 6890938 6519840
2538F519840k026315j828755q80601o39626j171409j170739J08159J483241J297199
$$ 6519840 4493525 2664770 1784169 1144543 -26866 -1197605 -1089446 393795 1690994
2529A690994r0989o61411K73686J028362J85805j235368j439748m95274J44660
$$ 1690994 1600005 938594 1212280 2240642 2426447 1191079 -248669 -743943 -599283
2520e99283n875j20715K76275O99103P12854M63571J69148q2979j20823J5556
$$ -599283 -605158 -725873 -449598 249505 962359 1425930 1595078 1512099 1391276 1406832
2510A406832j25665n03885J4758K170820M530776M594926J798411j757885l698292
$$ 1406832 1281167 777282 792040 2962860 7493636 12088562 13886973 12129088 8430796
2501H430796l426189j826046k46358Q0581r51366j570072R5907L027209L873491
$$ 8430796 5004607 3178561 2932203 3012784 2061418 491346 587253 3614462 7487953
2492G487953J411367j385599j262302Q52211J357743q67668l015661k051377J716697
$$ 7487953 8899320 7513721 6251419 7103630 8461373 7593705 4578044 2526667 4243364
2483D243364M984863M481627m3565m996609n856577k086272J835439J766960j008084
$$ 4243364 9228227 13709854 13666289 8669680 2813103 726831 2562270 4329230 3321146
2474C321146k279577j182570n87959j649650j996854l00886J148186L35467j168973
$$ 3321146 1041569 -141001 -728960 -2378610 -4375464 -4676350 -3528164 -3192697 -4361670
2465d361670j109939o1405M90747J115413K606711L366733J872817j0842L04477
$$ -4361670 -5471609 -5533014 -5042267 -3926854 -1320143 2046590 3919407 3908565 4213042
2456D213042J602095Q51312j277605j195406J495543L082900J654114k00880k2943
$$ 4213042 5815137 6666449 5388844 4193438 5688981 8771881 10425995 10225115 10202172
2447A0202172Q57469K96211j053759j419380r44782q44133j174009j289220j151878
$$ 10202172 11059641 11355852 10302093 8882713 7937931 7093798 5919789 4630569 3478691
2438C478691q02990K7750P14029q9101j967253k501859q12701Q56011O62979l4008
$$ 3478691 2675701 2703451 3417480 3328379 1361126 -1140733 -1953434 -1097423 -434444 -468452
2428d68452O16556J725887J578155Q42345J168590K090880K013250R89382p0989
$$ -468452 148104 1873991 3452146 4294491 5463081 7553961 9567211 10556593 10485604
2419A0485604j550977l601638l907610n19662L914068M599280J207066j738078
$$ 10485604 8934627 5332989 1425379 905717 4819785 9419065 10626131 8888053
2411H888053j549040o17136j615560l021368j928210R86321K173667Q9666k840407
$$ 8888053 7339013 6721877 5106317 2084949 156739 1143060 3316727 3406393 565986
2402E65986l194794k94765L256916M339693K445508j73110j496418j869968k358674
$$ 565986 -2628808 -2923573 333343 4673036 7118544 6945434 5449016 3579048 1220374
2393A220374k333139o61580J408565J084027j979946m708438m357764j518005
$$ 1220374 -1112765 -1774345 -365780 718247 -1261699 -5970137 -10327901 -11845906
2385a1845906J330696K641826K354517J102883n6835j17969Q18371J662041J913501
$$ -11845906 -10515210 -7873384 -5518867 -4415984 -4472819 -4590788 -3772417 -2110376 -196875
2376a96875K169652K664943K452559P52793j688751l231722k852209q18419J521979
$$ -196875 1972777 4637720 7090279 7843072 6154321 2922599 70390 -748029 773950
2367G73950K548231J659517j38204j363893j416102l54904J591031L184246K222586
$$ 773950 3322181 4981698 4843494 3479601 2063499 1708595 3299626 6483872 8706458
2358H706458j511080m373624k672739K014277M319121K122128r57384r99808J220928
$$ 8706458 7195378 2821754 149015 2163292 6482413 8604541 7647157 6647349 7868277
2349G868277K258595O65507k194362m336390m528383k719095l06790J108338J781313
$$ 7868277 10126872 10792379 8598017 4261627 -266756 -2985851 -3292641 -2184303 -402990
2340d02990L007015L987963K187948k108049m589542k424580J528212K662897
$$ -402990 2604025 6591988 8779936 6671887 2082345 -342235 1185977 3848874
2332C848874P86155o71524j67032N57474N7789r32420j421938j469926j070772
$$ 3848874 4635029 3963505 3796473 4353947 4411736 3479316 2057378 587452 -483320
2323d83320K82136K245500L295407K448001M52558j131116j501937j140592j064522
$$ -483320 -201184 2044316 5339723 7787724 8240282 7109166 5607229 4466637 3402115
2314C402115j438853j029011J156290L723596L895112J181912j566511j719083
$$ 3402115 1963262 934251 2090541 5814137 9709249 10891161 9324650 7605567
2306G605567J06752J674233K061558J462046k57379k756815m158972k921656j65257
$$ 7605567 7712319 9386552 11448110 12910156 12652777 9895962 5736990 2815334 2650077
2297B650077J594356J507682P88897P00287J358647J863415Q31178k021921m310701
$$ 2650077 4244433 5752115 6541012 7241299 8599946 10463361 11294539 9272618 4961917
2288D961917l072767P02380K498705Q18276k11169K424746M981186K457267l127705
$$ 4961917 1889150 2591530 5090235 5908511 5697342 8122088 13103274 15560541 12432836
2279A2432836n413348k982313j52208P72149J839616L596282L132824j53798k340581
$$ 12432836 7019488 4037175 3884967 4657116 6496732 10093014 13225838 13072040 10731459
2270A0731459j151376L37090q82555k792855k194653k0113P80907o3856r58506
$$ 10731459 9580083 9917173 9034618 6241763 4047110 4026997 4807904 4744048 3785542
2261C785542j604579k156991j426875Q60975K131367O28448j031260K92300K676629
$$ 3785542 2180963 23972 -1402903 -541928 1589439 2217887 1186627 1478927 4155556
$$ [...]
##END NTUPLES=NMR SPECTRUM
##END=
