##TITLE=31Pdec_DE-94rm_3h
 , 64 sc
 6.5.2025
##JCAMPDX= 6.0         $$ Bruker NMR JCAMP-DX V2.0
##DATA TYPE= NMR SPECTRUM
##DATA CLASS= NTUPLES
##ORIGIN= UXNMR, Bruker Analytische Messtechnik GmbH
##OWNER= root
$$ XWIN-NMR		Version 3.5
$$ Tue May  6 13:59:19 2025 Russian Standard Time (UT+4h)  she@DPX200
##.OBSERVE FREQUENCY= 81.013821
##.OBSERVE NUCLEUS= ^31P
##.ACQUISITION MODE= SIMULTANEOUS
##.ACQUISITION SCHEME= undefined
##.AVERAGES= 64
##.DIGITISER RES= 17
##SPECTROMETER/DATA SYSTEM= spect
##.PULSE SEQUENCE= zgpg30
##.SOLVENT NAME= D2O
##.SHIFT REFERENCE= (INTERNAL, D2O, 0, 198.062)
##AUDIT TRAIL= $$ (NUMBER, WHEN, WHO, WHERE, WHAT)
$$ ##TITLE= Audit trail, XWIN-NMR		Version 3.5
$$ ##JCAMPDX= 5.01
$$ ##ORIGIN= Bruker BioSpin GmbH
$$ ##OWNER= she
$$ F:/spectra/data/she/nmr/P31/2/pdata/1/auditp.txt
$$ ##AUDIT TRAIL=  $$ (NUMBER, WHEN, WHO, WHERE, WHAT)
(   1,<2025-05-06 13:58:02.84 +0400>,<she>,<DPX200>,
      <created by zg, POWCHK disabled, PULCHK disabled
       configuration hash MD5:
       00 E9 B6 7A A2 85 ED C7 34 08 36 98 17 FE 4E 26
       data hash MD5: 32K
       76 75 04 E8 BD 21 F7 DC 41 A5 54 FD 20 3A DC 70>)
(   2,<2025-05-06 13:58:05.15 +0400>,<she>,<DPX200>,
      <Start of raw data processing
       efp BC_mod = 2 LB = 1.5 FT_mod = 6 PKNL = 1 PHC0 = 1519.92 PHC1 = -249.3062 SI = 64K 
       data hash MD5: 64K
       3D E9 3D 67 31 17 14 AF 6F C7 54 0D D2 3A 44 61>)
(   3,<2025-05-06 13:58:36.68 +0400>,<she>,<DPX200>,
      <pk PHC0 = -144.4803 PHC1 = 396.5996 
       data hash MD5: 64K
       34 16 50 58 88 B0 2D D2 34 B5 E8 B6 3E 9A 11 90>)
(   4,<2025-05-06 13:58:45.87 +0400>,<she>,<DPX200>,
      <abs ABSG = 5 
       data hash MD5: 64K
       D0 8A 0D 14 D7 C1 C4 C0 0E 9F 78 DC 92 D3 3A 4D>)
$$ ##END=
$$ 
$$ hash MD5
$$ 94 64 03 72 42 BA BE 7C 58 31 6D EB 16 8A 17 64
##$RELAX= 
##$RELAX= 
##$RELAX= 
##$RELAX= 
##$RELAX= 
##$RELAX= 
##$RELAX= 
##$RELAX= 
$$ Bruker specific parameters
$$ --------------------------
##$DU= <F:/spectra>
##$EXPNO= 2
##$NAME= <P31>
##$PROCNO= 1
##$TYPE= <nmr>
##$USER= <she>
##$AMP= (0..31)
100 100 100 100 100 100 100 100 100 100 100 100 100 100 100 100 100 100 
100 100 100 100 100 100 100 100 100 100 100 100 100 100 
##$AQSEQ= 0
##$AQ_mod= 1
##$AUNM= <au_zg>
##$AUTOPOS= <>
##$BF1= 81.014009
##$BF2= 200.13
##$BF3= 200.13
##$BF4= 200.13
##$BF5= 200.13
##$BF6= 200.13
##$BF7= 200.13
##$BF8= 200.13
##$BYTORDA= 1
##$CFDGTYP= 0
##$CFRGTYP= 5
##$CHEMSTR= <none>
##$CNST= (0..31)
1 1 145 1 1 1 1 1 1 1 1 1 1 1 1 1 1 1 1 1 1 1 1 1 1 1 1 1 1 1 1 1 
##$CPDPRG= <waltz16>
##$CPDPRG1= <>
##$CPDPRG2= <waltz16>
##$CPDPRG3= <>
##$CPDPRG4= <mlev>
##$CPDPRG5= <mlev>
##$CPDPRG6= <mlev>
##$CPDPRG7= <mlev>
##$CPDPRG8= <mlev>
##$CPDPRGB= <>
##$CPDPRGT= <>
##$D= (0..31)
0 1 0 0 0 0 0 0 0 0.06 0 0.03 2e-05 3e-06 0 0 0.0002 0 0 0 0 0 0 0 0 0 
0 0 0 0 0 0 
##$DATE= 1746525482
##$DBL= (0..7)
120 120 120 11 120 120 24 19 
##$DBP= (0..7)
150 150 150 150 150 150 150 150 
##$DBP07= 0
##$DBPNAM0= <>
##$DBPNAM1= <>
$$ [...]
##$SUBNAM3= <"">
##$SUBNAM4= <"">
##$SUBNAM5= <"">
##$SUBNAM6= <"">
##$SUBNAM7= <"">
##$SUBNAM8= <"">
##$SUBNAM9= <"">
##$SW= 400.765351723535
##$SWIBOX= (0..15)
0 1 3 0 0 0 0 0 0 0 0 0 0 0 0 0 
##$SW_h= 32467.5324675325
##$TD= 32768
##$TD0= 1
##$TE= 0
##$TE2= 300
##$TE3= 300
##$TEG= 300
##$TL= (0..7)
0 120 53 12 22 120 120 120 
##$TP= (0..7)
150 150 150 150 150 150 150 150 
##$TP07= 0
##$TPNAME0= <>
##$TPNAME1= <>
##$TPNAME2= <>
##$TPNAME3= <>
##$TPNAME4= <>
##$TPNAME5= <>
##$TPNAME6= <>
##$TPNAME7= <>
##$TPOAL= (0..7)
0.5 0.5 0.5 0.5 0.5 0.5 0.5 0.5 
##$TPOFFS= (0..7)
0 0 0 0 0 0 0 0 
##$TUNHIN= 0
##$TUNHOUT= 0
##$TUNXOUT= 0
##$USERA1= <user>
##$USERA2= <user>
##$USERA3= <user>
##$USERA4= <user>
##$USERA5= <user>
##$V9= 5
##$VALIST= <valist>
##$VCLIST= <CCCCCCCCCCCCCCC>
##$VD= 0
##$VDLIST= <DDDDDDDDDDDDDDD>
##$VPLIST= <PPPPPPPPPPPPPPP>
##$VTLIST= <TTTTTTTTTTTTTTT>
##$WBST= 1024
##$WBSW= 4
##$XGAIN= (0..3)
0 0 0 0 
##$XL= 0
##$YL= 0
##$YMAX_a= 46721
##$YMIN_a= -59719
##$ZGOPTNS= <>
##$ZL1= 120
##$ZL2= 120
##$ZL3= 120
##$ZL4= 120
##$ABSF1= 198.0616
##$ABSF2= -202.7028
##$ABSG= 5
##$ABSL= 3
##$ALPHA= 0
##$AQORDER= 0
##$ASSFAC= 0
##$ASSFACI= 0
##$ASSFACX= 0
##$ASSWID= 0
##$AUNMP= <proc_1d>
##$AZFE= 0.1
##$AZFW= 0.5
##$BCFW= 0
##$BC_mod= 2
##$BYTORDP= 0
##$COROFFS= 0
##$CY= -3
##$DATMOD= 1
##$DC= 0
##$DFILT= <>
##$DTYPP= 0
##$F1P= 0
##$F2P= 0
##$FCOR= 1
##$FTSIZE= 65536
##$FT_mod= 6
##$GAMMA= 0
##$GB= 0
##$INTBC= 1
##$INTSCL= 9.790993e-09
##$ISEN= 30
##$LB= 1.5
##$LEV0= 0
##$LPBIN= 0
##$MAXI= 10000
##$MC2= 0
##$MEAN= 0
##$ME_mod= 0
##$MI= 50
##$NCOEF= 0
##$NC_proc= -7
##$NLEV= 6
##$NOISF1= 182.463
##$NOISF2= 159.3651
##$NSP= 0
##$NTH_PI= 0
##$NZP= 0
##$OFFSET= 198.0616
##$PC= 4
##$PHC0= 1375.44
##$PHC1= 147.2934
##$PH_mod= 1
##$PKNL= yes
##$PPARMOD= 0
##$PSCAL= 0
##$PSIGN= 0
##$REVERSE= no
##$SF= 81.0140089999434
##$SI= 65536
##$SIGF1= 159.3651
##$SIGF2= -187.1042
##$SINO= 113.3802
##$SIOLD= 16384
##$SREGLST= <1H.CDCl3>
##$SSB= 0
##$STSI= 65536
##$STSR= 0
##$SW_p= 32467.5324675325
##$SYMM= 0
##$S_DEV= 0
##$TDeff= 32768
##$TDoff= 0
##$TI= <>
##$TILT= no
##$TM1= 0
##$TM2= 0
##$TOPLEV= 0
##$USERP1= <user>
##$USERP2= <user>
##$USERP3= <user>
##$USERP4= <user>
##$USERP5= <user>
##$WDW= 1
##$XDIM= 65536
##$YMAX_p= 524929980
##$YMIN_p= -104574210
$$ End of Bruker specific parameters
$$ ---------------------------------
##NTUPLES= NMR SPECTRUM
##VAR_NAME=  FREQUENCY,     SPECTRUM/REAL,   SPECTRUM/IMAG
##SYMBOL=    X,             R,               I
##VAR_TYPE=  INDEPENDENT,   DEPENDENT,       DEPENDENT
##VAR_FORM=  AFFN,          ASDF,            ASDF
##VAR_DIM=   65536,         65536,           65536
##UNITS=     HZ,            ARBITRARY UNITS, ARBITRARY UNITS
##FACTOR=    0.49542278885378, 1,            1
##FIRST=     16045.7642231865, 0,            0
##LAST=      -16421.768244346, 0,            0
##MIN=       -16421.768244346, -104574210,   0
##MAX=       16045.7642231865, 524929980,    0
$$ Real data points
##PAGE= N=1
##DATA TABLE= (X++(R..R)), XYDATA
$$ [...]
46144D78694K9120j35106m77296q59908n11580N04762J159699J044449P32728
46135A965562L73346n33732j616157j558647j93401R18000P90400L86374P32297
46126A264042J133608M63677r97598k231766k870518k719371j126314J636506
46118e447734L409635K433001L6087q04621O02374J950155J306508m58179j255582
46109A771644n87291J73288j85492j210631j476691m92111N67366L99847n82022
46100a622093q69220j23689N13029N25580P28013J214476N86034j398814k327563
46091b774247m26364K155703K033816l88092j627907n35825L72276m46143r79377
46082b616160O12846K467399J680892j194234k889764j873197K08667J296749
$$ plain form
46144 478694 507814 372708 -104588 -964496 -1476076 -971314 188385 1232834 1965562
46135 1965562 2338908 1805176 189019 -1369628 -1563029 -645029 145371 531745 1264042
46126 1264042 2397650 2861327 1863729 -368037 -3238555 -5957926 -7084240 -5447734
46118 -5447734 -2038099 394902 430989 -373632 228742 2178897 3485405 3027226 1771644
46109 1771644 1184353 1357641 1172149 -38482 -1515173 -2007284 -1439918 -1040071 -1622093
46100 -1622093 -2491313 -2615002 -2101973 -1576393 -848380 366096 952130 -446684 -2774247
46091 -2774247 -3200611 -1044908 988908 600816 -1027091 -1562916 -1190640 -1636783 -2616160
46082 -2616160 -2003314 464085 2144977 950743 -1939021 -3812218 -3603551 -2306802
46074b306802J164228O66982K96198R2184J42133N70393J234988J577364Q72910
46065D310578q91821k307541j594757J079260L203912K710962M37002j213069
46057E734526j378514j166306j360976j362428o59730Q8066J58762n5663J60162
46048A57899N14820J08986j031284j649883p45824J047098J983752J184211j87382
46039A382393j45722J647313L185364K367976m18400k670132k613520r33364M48717
46030B250625N31415k53984j054347j418826j332870j031187q03175o44841j76871
46021c934061P46156J486496J224139J51800n48330k28568L02204k4054q33960
46012a658178p27435O04583J698998J288243J30022q2068P79308J079458r6275
$$ plain form
46074 -2306802 -1142574 -475592 -179394 -87210 54923 625316 1860304 3437668 4310578
46065 4310578 3418757 1111216 -483541 595719 3799631 6510593 6947595 5734526
46057 5734526 4356012 3189706 1828730 466302 -193428 -105362 53400 -2263 157899
46048 157899 672719 781705 -249579 -1899462 -2645286 -1598188 385564 1569775 1382393
46039 1382393 1236671 2883984 6069348 8437324 8018924 5348792 2735272 1801908 2250625
46030 2250625 2782040 2528056 1473709 54883 -1277987 -2309174 -3112349 -3757190 -3934061
46021 -3934061 -3187905 -1701409 -477270 -325470 -873800 -1102368 -800164 -824218 -1658178
46012 -1658178 -2385613 -1781030 -82032 1206211 1336233 1254165 2033473 3112931 3016656
46003C016656j437550j181264L61544J212321M92816m74860l07071L14632j94495
45994A802729j590856j811785l209J965783K009705O92743J06267O23328O93487
45985D488192k32515o95421K08116J166760P33331m90840j149325j247777j350317
45976A430204r16945N20579J476039K16534k087423k484080n71010Q95172K46320
45967a274610q47312m89249M80710L45321n32756o24731J23394N35499L37382
45958a946352K63718M75870M12622k9886m21305o61203q84662q39040l10384K23790
45948c716832K57640R6556J99839L09168J07641r538K13781J65863m06781m98435
45938c281098M42772J034905r96j329444p29184J337558K311454J384807K41972
$$ plain form
46003 3016656 1579106 397842 759386 1971707 2464523 1989663 1682592 1997224 1802729
45994 1802729 211873 -1599912 -1603121 362662 2372367 3065110 3171377 3794705 4488192
45985 4488192 4255677 3560256 3768372 4935132 5668463 5177623 4028298 2780521 1430204
45976 1430204 513259 1033838 2509877 2726411 638988 -1845092 -2416102 -1520930 -1274610
45967 -1274610 -2121922 -2611171 -2130461 -1785140 -2317896 -2942627 -2819233 -2283734 -1946352
45958 -1946352 -1682634 -1206764 -794142 -824028 -1245333 -1906536 -2791198 -3630238 -3940622 -3716832
45948 -3716832 -3459192 -3362636 -3162797 -2853629 -2745988 -2755526 -2541745 -2375882 -2782663 -3281098
45938 -3281098 -2838326 -1803421 -1804417 -3133861 -3863045 -2525487 -214033 1170774 1412746
45929A412746m3804k12546n33335k563J307287J592877K21953r41336m83020L75443
45919B693702R2872o76162p09436n52794j094841j321440Q7282J975420K051601
45910B546204M30006o10352j63968L77210K8886m41719l60902l09997o82976p80509
45900C1883k11920K39668N6279j4968N81557R17195j3962j425604j628558l86001
45890a854431Q69260J084176P34277O95871Q66676M72437o58359j698312j738810
45881a227215p96750K93251Q64124R70863R08829O51908J91708O6340Q06093J876148
45871D605299J970396O62105q98407j409993j018837q66816j394334j866556j560476
45862a777619o89972J13518O85265J224771J595478J293760K19397q90063j099465
$$ plain form
45929 1412746 1368942 1156396 623061 620498 1927785 3520662 3742615 2801279 2318259 2693702
45919 2693702 2786574 2110412 1400976 848182 -246659 -1568099 -1480817 494603 2546204
45910 2546204 2976210 2365858 2201890 2579100 2607986 2166267 1805365 1495368 812392 31883
45900 31883 -180037 59631 115910 100942 682499 1599694 1585732 160128 -1468430 -1854431
45890 -1854431 -985171 99005 833282 1529153 2395829 2868266 2209907 511595 -1227215
45881 -1227215 -2023965 -1730714 -866590 104273 1013102 1665010 1856718 1923058 2729151 4605299
45871 4605299 6575695 7237800 6339393 4929400 3910563 3043747 1649413 -217143 -1777619
45862 -1777619 -2467591 -2354073 -1668808 -444037 1151441 2445201 2664598 1774535 675070
45853F75070l03619O09071P22767R8053l78658j14685N15853P84073N82326L53824
45843C544075J96118l01810j131660j464570p42976L19990N95814R5062k27701
45834H82342p0319p1840l55995o0358J038230J590803M72170j264180j533116
45825F27737J4075J616805J752203P17326k95706o96080o73192n58853m13948
45816B090367J0180Q74295J569166R36757j122207k822190k416300o09613L12387
45807a177158l64468j075515n81333M42190R86614J206023J395757R87734k15972
45798A603872j064961o72660N0141r1395n05453N9764J052172P28288r88459k147153
45788a975844j479885J40683J326315J764766J607484O55714q82984j782528j027547
$$ plain form
45853 675070 371451 980522 1703289 1801342 1422684 1307999 1823852 2607925 3190251 3544075
45843 3544075 3740193 3438383 2306723 842153 99177 419167 1014981 1110043 882342
45834 882342 812023 740183 384188 323830 1362060 2952863 3425033 2160853 627737
45825 627737 641812 2258617 4010820 4728146 4432440 3736360 3063168 2504315 2090367
45816 2090367 2100547 2974842 4544008 5480765 4358558 1536368 -879932 -1489545 -1177158
45807 -1177158 -1541626 -2617141 -3198474 -2756284 -1769670 -563647 832110 1819844 1603872
45798 1603872 538911 -133749 -83608 -175003 -680456 -620692 431480 1159768 171309 -1975844
45788 -1975844 -3455729 -3315046 -1988731 -223965 1383519 2039233 1156249 -626279 -1653826
45779a653826P88423K134726K324670J884086J335883M71003r32950k312246k833208
45770A206561k511653k159225k078694j544154j37199J099430R33946Q481J73146
45761e009361J655764K564129J855104J056987J723307K698815J883764k21037
45753H207472j046227J54081J191695K01302j862366k822486j956927j66749J400669
45744C300464J936143J057531o69120j819112j539928n20396N8460L8657N6137
45735A898836K37993Q142q72527j791611j986067j346153l59005M74054R57913
45726b778425J073321Q30077M30866L80385R89527J724422J585029M12746p02480
45717C945468p61012j01596K61928O6383k01166l65118p12446j201922j369799
$$ plain form
45779 -1653826 -865403 1269323 3593993 5478079 6813962 7284965 6352015 4039769 1206561
45770 1206561 -1305092 -3464317 -5543011 -7087165 -7224364 -6124934 -5190988 -5182507 -5009361
45761 -5009361 -3353597 -789468 1065636 2122623 3845930 6544745 8428509 8207472
45753 8207472 7161245 7315326 8507021 8708323 6845957 4023471 2066544 1899795 3300464
45744 3300464 5236607 6294138 5625018 3805906 2265978 1745582 1804042 1842699 1898836
45735 1898836 2136829 2144971 1272444 -519167 -2505234 -3851387 -4210392 -3736338 -2778425
45726 -2778425 -1705104 -875027 -444161 -63776 925751 2650173 4235202 4647948 3945468
45717 3945468 3184456 3082860 3344788 3411171 3210005 2844887 2132441 930519 -439280
45708d39280j060458n97603k68952k06923n45150j000958o56794Q76491K326057
45699a573570J951317j19616j888423j964674r32202j5138M44081O89685P51518
45690b657022O00487M57473M76693O14634R65109J552196J744483P92936q84503
45681C662486j951694j927009j631231j537203r14541O93531K219524K233775
45673H47638P07356j119079k105486j927971j002730j72945L3963Q7908P64540
45664c886806J721428J761840P08711j76233l9821N15334P12810O33792L79786
45655B330841l92582j338515j282252j40466N09790r8912m67788P15672K188618
45646B024406J966932L44124q73597j067893p67598O7941J495247K145031P89676
$$ plain form
45708 -439280 -1499738 -2097341 -2366293 -2573216 -3118366 -4119324 -4776118 -3899627 -1573570
45699 -1573570 377747 258131 -1630292 -3594966 -4527168 -4542306 -4098225 -3408540 -2657022
45690 -2657022 -2056535 -1599062 -1122369 -507735 457374 2009570 3754053 4546989 3662486
45681 3662486 1710792 -216217 -1847448 -3384651 -4299192 -3605661 -1386137 847638
45673 847638 1554994 435915 -1669571 -3597542 -4600272 -4773217 -4739254 -4651346 -3886806
45664 -3886806 -2165378 -403538 305173 128940 89119 604453 1317263 1951055 2330841
45655 2330841 1938259 599744 -682508 -822974 -313184 -412096 -879884 -164212 2024406
45646 2024406 3991338 4335462 3461865 2393972 1626374 1694315 3189562 5334593 6124269
45637F124269j163982j274572J67131O66692k78365n45316N75296Q83481q96500
45628D258134k636968k082391l26850K25055l66666l08657N67704P49048j12279
45619c3870o62919k54065J34368j83067m21180J99178J048404J054283K89573
45610A170705k70632j72415J04542P8435n290L73217J096303J331433M96759r11295
45600C291762j734852j341785j47339R50232J293460P09540m30697j275825j122566
45591A91930k28342L92470J85323l47884m88756k51358j09508j75466j55807N9687
45581i27711K35979K33537L06370Q20606J701990K257401J801317O00571k03281
45572F826779n0926R0057r59637k622087l066983j764620k23955K92777M21332
$$ plain form
45637 6124269 4960287 3685715 3852846 4519538 4241173 3695857 4271153 5154634 4258134
45628 4258134 1621166 -461225 -788075 -563020 -929686 -1238343 -670639 78409 -33870
45619 -33870 -696789 -950854 -816486 -999553 -1420733 -1221555 -173151 881132 1170705
45610 1170705 900073 727658 832200 910635 905345 1278562 2374865 3706298 4203057 3291762
45600 3291762 1556910 215125 67786 1018018 2311478 3021018 2590321 1314496 191930
45591 191930 -36412 356058 541381 193497 -295259 -546617 -656125 -831591 -987398 -927711
45581 -927711 -691732 -458195 -151825 668781 2370771 4628172 6429489 7030060 6826779
45572 6826779 6775853 6865910 5906273 3284186 217203 -1547417 -1771372 -1478595 -1057263
45563a057263J115000J686690R44924n12101r32685j00701M08859j54712o25583
45554G72428r2338M70954j22878j211795j294340k97286O18489J010505J391832
45545A245571J726374J273758J27692n45588k72194j8245o02033j519136j999373
45536e83174k061627j716854l68676J836740L168286K279793K47036q35037n90448
45527A376039j07545L30380J238027K014054J299220o06074j840865j843008j912931
45518e2703k417197j895835J7669J273476N91355k80658N21625J815449J488357
45509A061538R3253l84070q2756o15124j619781j098463R36463K138530J482314
45500A911904N38769N42945P17014K76143k49790n74116j278119j934970r39649
$$ plain form
45563 -1057263 57737 1744427 2689351 2177250 1244565 1143864 1552723 1398011 772428
45554 772428 680090 1151044 1028166 -183629 -1477969 -1775255 -1156766 -146261 1245571
45545 1245571 2971945 4245703 4373395 3827807 3555613 3537368 2935335 1416199 -583174
45536 -583174 -2644801 -4361655 -4730331 -2893591 274695 2554488 2801524 1966487 1376039
45527 1376039 1268494 1598874 2836901 4850955 6150175 5544101 3703236 1860228 -52703
45518 -52703 -2469900 -4365735 -4348066 -3074590 -2483235 -2763893 -2242268 -426819 1061538
45509 1061538 1154791 770721 687965 72841 -1546940 -2645403 -1708940 429590 1911904
45500 1911904 2450673 2993618 3710632 3986775 3736985 3162869 1884750 -50220 -989869
45491i89869J568993K940400J727463n4999k76126r5254j505892l306996k738610
45482b730890k16974R86230j63473r59848N30450K329048J733088l99596r21752
45473A86283R48883K594884J761470n16164j613269p85608K80401N720j190325
45464A672275j813807j248470j60503N84708P24556M98619L48107O52654J274043
45455B532182J478711Q36649J4470j8104N32379M37618q08160k210944k508146
45446B86655j489273J64279J654703K358512K029284J161494O47421P12141O71189
45437H196405L3712p18911q22373j74073P97598J711225K250146K048458J085224
45428A4407411j4151m66334q9523N09294L91855r37469k896110m114400l772799
$$ plain form
45491 -989869 579124 3519524 5246987 5191988 4915862 4820608 3314716 7720 -2730890
45482 -2730890 -2947864 -1961634 -2125107 -3084955 -2554505 -225457 1507631 1108035 186283
45473 186283 1135166 3730050 5491520 4975356 3362087 2576479 2856880 2862600 1672275
45464 1672275 -141532 -1390002 -1550505 -965797 -241241 257378 605485 1258139 2532182
45455 2532182 4010893 4847542 4862012 4843908 5376287 5813905 5005745 2794801 286655
45446 286655 -1202618 -1038339 616364 2974876 5004160 6165654 6813075 7525216 8196405
45437 8196405 8230117 7511206 6688833 6514760 7312358 9023583 11273729 13322187 14407411
45428 14407411 14393260 13926926 13837403 14346697 14738552 13801083 10904973 6790573 3017774
45419C017774k451323j198640j79765R62371J825250J556303M35859j18348N09223
45410D358704J237222Q30144m79445j421033j181912j32549N61539L0472j205745
45401B597397j566723m31931Q14584P62501J99165Q06216K302869K924172K414313
45392A0822563K183439K407637J554204n92105j965179j352431k53442l74488
45384A2430198j290636j846717j927801j603849n37917M94111k72528k478124
45376B966737l070398p02877J765699J457289k45532l89199P44904Q06347k88680
45367C044290o95365k64912m08606r98460o55161L25144M51016M9058O67753J778890
45357C293647J328694m87986j289091n02782m0516o20834p06517K62907P99386
$$ plain form
45419 3017774 566451 -632189 -811954 150417 1975667 3531970 3967829 3849481 4358704
45410 4358704 5595926 6426070 5946625 4525592 3343680 3211131 3772670 3803142 2597397
45401 2597397 1030674 598743 1413327 2175828 2374993 3181209 5484078 8408250 10822563
45392 10822563 13006002 15413639 16967843 16375738 14410559 13058128 12804686 12430198
45384 12430198 11139562 9292845 7365044 5761195 5223278 5717389 5444861 2966737
45376 2966737 -103661 -806538 959161 2416450 2170918 1781719 2526623 3332970 3044290
45367 3044290 2348925 2084013 1675407 676947 21786 346930 797946 847004 1514757 3293647
45357 3293647 4622341 4134355 2845264 2342482 2301966 1681132 974615 1237522 2036908
45348B036908L85296M54346J333439J263209k83938j262854m80147M44718J17243
45339D008220l68940K1964J17959r89423j740802o91060P69795O75023l08261
45330A494475l72296K21248n0202j034610j210282k61569P35281J189515J295840
45321B007400R92450K02324m31281m49489n60793j399979k098911j502161n9039
45312c299479Q90590J011743Q48915N79406K12523K65643R50603J452436J184779
45303D097159P97956P44579R4413j697220l121641k576317q89621J08610M86609
45294a955473J404002K300169J576919k37156p40347O75938J880871J302409k5748
45285F181584n46088l83546l78161m23274j4216N10244M06015k87667q05465o93887
$$ plain form
45348 2036908 2422204 2876550 4209989 5473198 5189260 3926406 3446259 3890977 4008220
45339 4008220 3639280 3661244 3779203 2789780 1048978 357918 1127713 1802736 1494475
45330 1494475 1122179 1343427 1293225 258615 -951667 -1213236 -477955 711560 2007400
45321 2007400 2999850 3202174 2770893 2321404 1760611 360632 -1738279 -3240440 -3299479
45312 -3299479 -2408889 -1397146 -548231 31175 243698 509341 1459944 2912380 4097159
45303 4097159 4895115 5639694 5734107 4036887 915246 -1661071 -2550692 -2442082 -1955473
45294 -1955473 -551471 1748698 3325617 3088461 2348114 3024052 4904923 6207332 6181584
45285 6181584 5635496 5251950 4873789 4450515 4436299 4946543 5352558 5064891 4259426 3565539
45275C565539l39263m74042j176752j427809k24440J640094J905711k48760k624484
45266E95794k572723l54103J538189J747523J007013J61194p37233j290164p06217
45257f10727N90703R89253J5165q15928k42797R14390J066874j2550j287614j926797
45247a320028j811648j132312k72478K14531J18493j15494M3534N18577P57965
45238b998860M08653k87145o66287k37470P74490J597720J723267J296765O81783
45229B292916J66014J96007J069237K048685J782967K27030r34611o68069k46420
45220E933756j247944k904622l089555j349146P02555J685888J623051J047253
45212B401236L93571J10076J26041m19948j687770k119129n78204J282051R73215
$$ plain form
45275 3565539 3226276 2752234 1575482 147673 -76767 1563327 3469038 3220278 595794
45266 595794 -1976929 -2331032 -792843 954680 1961693 2122887 1385654 95490 -610727
45257 -610727 -20024 969229 984394 168466 -74331 840059 1906933 1894383 606769 -1320028
45247 -1320028 -3131676 -4263988 -4536466 -4321935 -4203442 -4318936 -4275402 -3756825 -2998860
45238 -2998860 -2590207 -2877352 -3543639 -3781109 -3006619 -1408899 314368 1611133 2292916
45229 2292916 2458930 2654937 3724174 5772859 7555826 7782856 6848245 6180176 5933756
45220 5933756 4685812 1781190 -1308365 -2657511 -1954956 -269068 1353983 2401236
45212 2401236 2794807 2904883 3030924 2610976 923206 -1195923 -1774127 -492076 481139
45203D81139r93900j697069j12081J769273K348690K222059J951274Q23930j001890
45194E791425j680915n52462M00480l50839j405841r91414o8491n27046j738863
45185a123966j539983J45316J230287P95272J86536N62732J289214J343502Q39785
45176C728695M17961J05623m48953j091107j118418j33470J259264J852213J177858
45167E749666J83147k0641K33380j52453r30195o22408R42521J967585J412644
45158H763246O60420J138941J886003J344592L63907J098331L412817M690386
45150B3358643L370086P23402j320655k384618k951158k928545k022968p58481
45142A5085706j30854n12838j436595k184753k222595j379628p2248P70623M16984
$$ plain form
45203 481139 -512761 -2209830 -2321911 -552638 1796052 4018111 5969385 6793315 5791425
45194 5791425 4110510 3558048 3958528 3607689 2201848 1210434 1141943 614897 -1123966
45185 -1123966 -2663949 -2518633 -1288346 -493074 -306538 256194 1545408 2888910 3728695
45176 3728695 4146656 4252279 3803326 2712219 1593801 1460331 2719595 4571808 5749666
45167 5749666 5932813 5912172 6145552 5993099 5062904 4440496 5383017 7350602 8763246
45158 8763246 9423666 10562607 12448610 13793202 14157109 15255440 18668257 23358643
45150 23358643 26728729 27452131 26131476 23746858 20795700 17867155 15844187 15085706
45142 15085706 14954852 14442014 13005419 10820666 8598071 7218443 7146195 7916818 8333802
45133H333802q63982j827585j350506K92656J435756P46405j073647j887854o07451
45124C197594J511200K385159J372493m14839j543398j396732k18191J291480
45116F184766K377474K607995K012425R60545J00412J62493J209717K130279J637661
45107A9383767q1410j474414j573355j013671q10764j015669j108881r88600r65970
45098A0351033j251222j805308k266550j992395q63903Q7905r3286o13602J8798
45089A571470J286582J035026r55526k075350p40312J096697J050927q1618r5004
45080B092892Q42777Q62540j40984n03726J61317N37829J58430q7960j62024j159500
45070B601591k875988l341153j672137M54747J167570P13706M31801P13294J048134
$$ plain form
45133 8333802 7469820 5642235 4291729 4584385 6020141 6766546 5692899 3805045 3197594
45124 3197594 4708794 7093953 8466446 8051607 6508209 5111477 4893286 6184766
45116 6184766 8562240 11170235 13182660 14143205 14243617 14406110 15615827 17746106 19383767
45107 19383767 19302357 17827943 16254588 15240917 14430153 13414484 12305603 11317003 10351033
45098 10351033 9099811 7294503 5027953 3035558 2171655 2259560 2166274 1552672 1571470
45089 1571470 2858052 3893078 2937552 862202 121890 1218587 2269514 2187896 2092892
45080 2092892 2935669 3798209 3657225 3153499 3314816 3852645 4011075 3923115 3761091 2601591
45070 2601591 -274397 -3615550 -5287687 -4832940 -3665370 -2951664 -2519863 -1806569 -758435
45061g58435J154513J083094P89257K99408j16835l21813m58485o11640p70468
45052B88596j016095j216413q91815q0085K74131k00489k21139J255800K787366
45043I79857K111313k82591j560065o42497N00025K13321n68168m37366K58158
45034E71987O53244R77767J438363J101946m84661j906657j745883o78404j27863
45025b00161L717M73836O42499n54301k146554j932640J82806J670432P42609
45016a117757j332298k081628r05748O12263R38857L01330R6281R45767J746369
45007g96564J018310r62638k155105j175518R95177K262737J781424M69471l01899
44998A135395J28282J438717K559725K442146J058474o20207j812540k488773
$$ plain form
45061 -758435 396078 1479172 2268429 2567837 2451002 2129189 1670704 1059064 288596
45052 288596 -727499 -1943912 -2835727 -2915812 -2641681 -2842170 -3063309 -1807509 979857
45043 979857 3091170 2808579 1248514 606017 1106042 1319363 751195 313829 571987
45034 571987 1225231 2202998 3641361 4743307 4258646 2351989 606106 -72298 -200161
45025 -200161 -196444 277392 919891 365590 -1780964 -3713604 -3530798 -1860366 -1117757
45016 -1117757 -2450055 -4531683 -5437431 -4825168 -3886311 -3584981 -3488700 -2542933 -796564
45007 -796564 221746 -740892 -2895997 -4071515 -3076338 -813601 967823 1437294 1135395
44998 1135395 1263677 2702394 5262119 7704265 8762739 8142532 6329992 3841219
44990C841219k592874j743123k80849M50446k08656j131098r60116N9988Q74506
44981a690557J354296J870376J860064M97370j490933k331741j576512n05525
44973b013162k3390L87072J227099J864973J548111N44406l96764r46752r70294
44964A221299j60835J316439K294243J562164o50736k658280k936365j602445
44956a614516j83657Q3595m30775m02993N79918J441819J168176K24899k19136
44947F47330L6025J68237k94564q64896q39353p5370R09849J216791K48373j399888
44937b47466k176200j316258J45324Q09945P10771P06111P85502L64957j92342
44928d09656O594N75888K08251r56812j125093L64724J707640J108267p05581
$$ plain form
44990 3841219 1248345 -494778 -775627 -325181 -533837 -1664935 -2625051 -2565063 -1690557
44981 -1690557 -336261 1534115 3394179 3891549 2400616 68875 -1507637 -2013162
44973 -2013162 -2036552 -1649480 -422381 1442592 2990703 3535109 3138345 2191593 1221299
44964 1221299 1060464 2376903 4671146 6233310 5582574 2924294 -12071 -1614516
44956 -1614516 -1798173 -1714578 -2145353 -2548346 -1968428 -526609 641567 866466 647330
44947 647330 683355 851592 557028 -307868 -1147221 -1222591 -312742 904049 1152422 -247466
44937 -247466 -2423666 -3739924 -3594600 -2784655 -2073884 -1367773 -582271 -217314 -409656
44928 -409656 -403062 172826 381077 -575735 -1700828 -1336104 371536 1479803 774222
44919G74222j632241r48344K62172Q41868O55352K34804J03480L02748K37414
44910H31475o32985j772383j938458q46941M04790R67593J267472J787909J907381
44901A975853R06695o67384j612320j456789n28754N95468J037943O5783j520133
44892a203638j662172J10838J484427O31555p26515J47883K469755K871972O00133
44883D724238j391169j046941J46135L06967R6955O53518R82789j84903j626121
44874B661468j279985L73747J064512K23669o43754p39788p80492j008371o44695
44865g73689K86536N65562k16142r49449q65744n01820k75803K16503Q17230M98779
44855a198037o23855p69210P36588J871775Q04784j078919j114443O74531J830986
$$ plain form
44919 774222 -858019 -1806363 -1544191 -702323 -46971 187833 291313 594061 831475
44910 831475 198490 -1573893 -3512351 -4359292 -3954502 -2986909 -1719437 68472 1975853
44901 1975853 2882548 2215164 602844 -853945 -1382699 -787231 250712 316495 -1203638
44892 -1203638 -2865810 -2754972 -1270545 -638990 -1365505 -1217622 1252133 4124105 4724238
44883 4724238 3333069 2286128 2432263 2739230 2836185 3489703 4472492 4287589 2661468
44874 2661468 1381483 1755230 2819742 3043411 2399657 1659869 879377 -128994 -773689
44865 -773689 -487153 78409 -137733 -1087182 -1952926 -2454746 -2730549 -2514046 -1696816 -1198037
44855 -1198037 -1821892 -2591102 -1854514 17261 822045 -256874 -1371317 -696786 1134200
44846A134200J201636Q6095l75442p10440j444602j845424j264427l03415K96520
44837c225299P56216J331473J374529M15292o53630o60143J04636L90565m1050
44828b07411j18854P72858J725967J476276R1570j071522j006808k11291Q5974
44819A536759l44528m01209O17394J619689J000914r51112k159423j502690k20006
44810h04212R1785k49188J28500J274734J842569J224406M02948L45775O13744
44801D871061J93504r39710j792653j627966p05582K18122P22415R14226R99802
44792B853219R14983M79430j86619o30991n62750k32807j58640n24655r98290
44783I52880j137898q70176m98756k79339j35357O8957J49465p8833j30268P68872
$$ plain form
44846 1134200 2335836 2421931 2046489 1336049 -108553 -1953977 -3218404 -3521819 -3225299
44837 -3225299 -2469083 -1137610 236919 652211 -1419 -661562 -556926 -166361 -207411
44828 -207411 -326265 446593 2172560 3648836 3740406 2668884 1662076 1450785 1536759
44819 1536759 1192231 791022 1408416 3028105 4029019 3077907 918484 -584206 -804212
44810 -804212 -712427 -961615 -833115 441619 2284188 3508594 3911542 4257317 4871061
44801 4871061 5064565 4124855 2332202 704236 -1346 216776 939191 1853417 2853219
44792 2853219 3768202 4247632 4061013 3430022 2867272 2634465 2475825 1951170 952880
44783 952880 -185018 -1055194 -1553950 -1833289 -1968646 -1899689 -1750224 -1829057 -1959325 -1190453
44773a190453K236916K519904O72392j645918j933613k33170Q69518m5794j283020
44764c3238p84555P37318J093619N6820n16651K34848R60931L96607p54313j087579
44754C03807m97662O0089J7889n40278j448048k255669j887608K57338K852424
44745c137718L528220J703878m59684p23567M03587O54845o14598j569773p24050
44736i38860Q30170J019865l29500j500629j344402m50593J15572J29924K8725
44727b439728K24024Q11559J380247J166656O2714p85128l23080P29382P81425
44718A608071j93639o51001k5088M31427j39764q55146p41285j37997M37368J179671
44708I12617J715996P68846j462596k421640n97476J824108J945638L41580l47727
$$ plain form
44773 -1190453 1046463 3566367 4238759 2592841 659228 426058 1295576 1249782 -33238
44764 -33238 -817793 -80475 1013144 1069964 553313 788161 1749092 2145699 1391386 303807
44754 303807 -193855 -133766 -115877 -656155 -2104203 -4359872 -6247480 -5990142 -3137718
44745 -3137718 390502 2094380 1634696 911129 1314716 1969561 1354963 -214810 -938860
44736 -938860 -108690 911175 581675 -918954 -2263356 -2713949 -2598377 -2468453 -2439728
44727 -2439728 -2215704 -1404145 -23898 1142758 1205472 420344 97264 826646 1608071
44718 1608071 1414432 763431 738343 1169770 1030006 174860 -566425 -704422 -267054 912617
44708 912617 2628613 3397459 1934863 -486777 -1084253 739855 2685493 3027073 2679346
44699B679346K02792J13169q72076j031870j80183j95481j429462j766740l46421
44690b826926P91078K94937q9418J249513K625703J706805m81426j050529K97431
44681B517168J110554J20895j186398j144640k6318R00726R77413L38599m65599
44672C142400p36823l00746O9037l44123r96291q40611m1069K63701j37286j72698
44662i4509O77800J425324J072291J39244j32123M13906O64425j97825j518042
44653B450491j826828n85683R88305J181967j40315j299648r74903N0846J09051
44644d6717q47796j160485J5612J339486J153126j42159o84421J61265R21931
44635G09842J93795j247940j406241K49847K053853K212933P54249r56117j845300
$$ plain form
44699 2679346 2882138 2995307 2123231 1091361 911178 715697 -713765 -2480505 -2826926
44690 -2826926 -2035848 -1740911 -1830329 -580816 2044887 3751692 3270266 2219737 2517168
44681 2517168 3627722 3748617 2562219 1417579 1391261 2291987 3269400 3607999 3142400
44672 3142400 2405577 2104831 2173868 1829745 833454 -7157 -48226 215475 78189 -94509
44662 -94509 583291 2008615 3080906 3220150 3088027 3501933 4166358 3968533 2450491
44653 2450491 623663 37980 1026285 2208252 2067937 768289 -206614 -155768 -46717
44644 -46717 -894513 -2054998 -2039386 -699900 453226 311067 -373354 -212089 709842
44635 709842 903637 -344303 -1750544 -1500697 553156 2766089 3520338 2564221 718921
44626G18921j658073n29918J010530J902549J380099q466q81110n50890M24978
44617A808620J040820O19061q68934k486549k695235j006499J016188J490257
44609a082271O55083K91608R56319J402514P93154k38266j026292j621631j669659
44600a539441m13715J498281K115530R87993m1843J63568M14862j06291J672J442026
44590D522642J855033o83670l622738k943162P54346K899197J531825m61454l18947
44581C533072Q64679Q29020k48685q00790o08609n72416r15884j144906j001243
44572f5762m23792O35960J631092J623213P17560J99777N90293P78862j28817
44563E558386j329032j581608q32406K82863J377333J838788P19632j669815l175182
$$ plain form
44626 718921 -939152 -1469070 -458540 1444009 2824108 2815642 1934532 1383642 1808620
44617 1808620 2849440 3468501 2599567 113018 -2582217 -3588716 -2572528 -1082271
44609 -1082271 -427188 -135580 820739 2223253 3016407 2778141 1751849 130218 -1539441
44600 -1539441 -1953156 -454875 1660655 2648648 2606805 2770373 3185235 3078944 3080616 4522642
44590 4522642 6377675 5694005 2071267 -871895 -117549 2781648 4313473 3852019 3533072
44581 3533072 4397751 5226771 4978086 4177296 3568687 2996271 2080387 935481 -65762
44572 -65762 -489554 146406 1777498 3400711 4118271 4318048 4908341 5687203 5558386
44563 5558386 4229354 2647746 1815340 2098203 3475536 5314324 6033956 4364141 1188959
44554A188959k200637J12897J384521R01863k21759r96383j200743o54985O08949
44545a077318J662394J475629L29839n65569o48976k80487J81321N55345M60828
44536B093006j78527n98726j78034N04101O67409P29720J295739J440832m3173
44527E732347j976604j673607J083746L145026K062112p61705k298823j776915
44519C535577p24099j87949K24930Q30120J032881L56853o57380r94755k36035
44510C180143R85680J425561M08918j170111j518782o3272J635496J721578L21753
44501F926964q27277o98235K5634K17433l09303q73303p54480K13218J391388
44492E312039J658263N52344q74619j023033K76288J454232J209947J61035q2298
$$ plain form
44554 1188959 -1011678 -898781 485740 1387603 1165844 169461 -1031282 -1686267 -1077318
44545 -1077318 585076 2060705 2390544 1824975 1175999 895512 1076833 1632178 2093006
44536 2093006 1914479 1315753 1137719 1641820 2309229 3038949 4334688 5775520 5732347
44527 5732347 3755743 2082136 3165882 6310908 8373020 7611315 5312492 3535577
44519 3535577 2811478 2623529 2848459 3678579 4711460 5068313 4410933 3416178 3180143
44510 3180143 4165823 5591384 6000302 4830191 3311409 3248137 4883633 6605211 6926964
44501 6926964 6099687 5401452 5427086 5644519 5335216 4461913 3707433 3920651 5312039
44492 5312039 6970302 7522646 6648027 5624994 5901282 7355514 8565461 8726496 8644198
44483H644198R59577K159296K325997J554512P87472M65763J50248m78607q22655
44474A5745801j90163P83290N27200j239730k662190k093343n34966l03033j600414
44465H432452k204515q53482Q92408J088968J16528m32385l59219o48348j368144
44456D664263j566731j024470n11081l25432l1251L28757K22507l8880N09370
44447B227052J629182J768927M29280q04298m66613P60957J212769M40940p50441
44438F447755j665436k108635k017017j557743j105547n55185O11249K029736
44430G9177K290348R48110l79769j22455R55032R63064l21719j398133j328511
44421A685144n74299K07536P44997O36990l28426j300089j096556R2399R09322
$$ plain form
44483 8644198 9603775 11763071 14089068 15643580 16431052 16896815 17047063 16568456 15745801
44474 15745801 15555638 16338928 16866128 15626398 12964208 10870865 10335899 10032866 8432452
44465 8432452 6227937 5374455 6266863 7355831 7472359 7039974 6680755 6032407 4664263
44456 4664263 3097532 2073062 1561981 1236549 1205298 1534055 1756562 1717682 2227052
44447 2227052 3856234 5625161 6054441 5250143 4783530 5544487 6757256 7198196 6447755
44438 6447755 4782319 2673684 656667 -901076 -2006623 -2561808 -1950559 79177
44430 79177 2369525 3317635 2937866 2815411 3770443 4733507 4411788 3013655 1685144
44421 1685144 1110845 1318381 2063378 2700368 2371942 1071853 -24703 67696 977018
44412I77018P68634L88952L41073L46768K01823J49487R0453l61654p85515k14689
44402A902350J125785J697201Q59662q6991J04600P52986M33646p92582j511197
44393D485460r11719L93596J380164J650111J393657Q75055K64114j38340J41489
44384I533587J136980J858123J136743o02196j454733p23646k73829j744523l544070
44375E322436k865792j19022J382276L27924q76717k40526P98218K59720q55312
44366C133205l94064J154669J394149j27193j273661n16817J211132K146780J713443
44357H441643O09151m9240M74943J739484K211391J009037o89469r90795J67554
44348A2923699R70117K32704j190303j808206j377366q73265j093551j768905
$$ plain form
44412 977018 1745652 2134604 2475677 2822445 3024268 3173755 3264208 2902554 2117039 1902350
44402 1902350 3028135 4725336 5584998 5498007 5602607 6355593 6789239 5996657 4485460
44393 4485460 3573741 3967337 5347501 6997612 8391269 9266324 9530438 9392098 9533587
44384 9533587 10670567 12528690 13665433 13063237 11608504 10884858 10611029 8866506 5322436
44375 5322436 2456644 2337622 3719898 4047822 3171105 2930579 3728797 3988517 3133205
44366 3133205 2739141 3893810 5287959 5160766 3887105 3370288 4581420 6728200 8441643
44357 8441643 9050794 9001554 9476497 11215981 13427372 14436409 13746940 12756145 12923699
44348 12923699 13893816 14126520 12936217 11128011 9750645 8877380 7783829 6014924
44340F014924j994926j371475n10104j43450P064P20066J701002J668052L60815
44331F451968p89808p08794j66790k54401n90640l59133m3702n05949j128718
44322A904033o72684N01627R17426M60727M62394J190305J177052l45956j945262
44313C649662j848501k36439J228353J450613O79871l12763j067858j440485j220523
44304H81930j68519J326398J991163R46602p24287q91431O75177J668832M81531
44295F187396j395132j653184m97252K48313K84752P22353J408251R56968n42626
44286E719839j307275p26133k01411n63531p84611l3439R61464J462555J771435
44277F298893J830767O97013j454220k631431j724866k97129k06996r43634r80395
$$ plain form
44340 6014924 4019998 2648523 2138419 1994969 2002033 2722099 4423101 6091153 6451968
44331 6451968 5662160 4953366 4786576 4532175 3941535 3582402 3538700 3032751 1904033
44322 1904033 1231349 1732976 2650402 3111129 3573523 4763828 5940880 5594924 3649662
44313 3649662 1801161 1564722 2793075 4243688 4923559 4610796 3542938 2102453 881930
44304 881930 713411 2039809 4030972 4977574 4253287 3361856 4037033 5705865 6187396
44295 6187396 4792264 3139080 2641828 2890141 3174893 3897246 5305497 6262465 5719839
44286 5719839 4412564 3686431 3485020 2921489 2136878 2103439 3064903 4527458 6298893
44277 6298893 8129660 8826673 7372453 4741022 3016156 2719027 2512031 1568397 588002
44268E88002m30079m07056p04062j82774R52699J204649J23333r57384p82231
44259e94903L37335J145077Q05216m35601j426084j097786K67912J128594N67104
44250F96864m16407k12605J246985K480594K323796J016728m36119j286505j388335
44241D024996r90079l38883M71802J108462Q22933n65162j742950j159615O82376
44232B313880J568955N96528o74625p88008m26581o68429q13053K50829J637641
44223B997137J514409K9642q30929k41670M46292k1580j042744j249172l39127
44214A262258P38467R00849J8072q18134l57026J104274J711253M62040j152626
44205C869427j052098N31364J481529P84961m52671r59351p76564n03966l22220
$$ plain form
44268 588002 157923 -249133 -953195 -1135969 -183270 1021379 1144712 187328 -594903
44259 -594903 -257568 887509 1692725 1257124 -168960 -1266746 -998834 129760 696864
44250 696864 280457 67852 1314837 3795431 6119227 7135955 6699836 5413331 4024996
44241 4024996 3034917 2696034 3167836 4276298 5099231 4534069 2791119 1631504 2313880
44232 2313880 3882835 4479363 3804738 3016730 2590149 1921720 1108667 1359496 2997137
44223 2997137 4511546 4541188 3710259 3468589 3914881 3893301 2850557 1601385 1262258
44214 1262258 2000725 2901574 2919646 2101512 1744486 2848760 4560013 5022053 3869427
44205 3869427 2817329 3348693 4830222 5615183 5162512 4203161 3426597 2922631 2600411
44196B600411j97146j19161J75021R26429J648141J498574M60570o13771j129915
44187E249153j161324q96084n50283n77404r56405o69165Q01442J904016P79467
44178C923413j533931j895454M22233K312126J125999j656129k807339j800094
44170a909176o56824l10478L73372J924539K872943J898314p0838j021034l89801
44161B711017N81842P86556O10990J041442J957382K055828O30794j198111j670199
44152G507541n35882P25201Q05735j15461j111856j700678j881788j715962j403648
44143E73202j227051r52640P7022J708999K559588J666796J3418o18454n284M21013
44133D216609j97836r98580q74457j17236J77476k14505m28702J54043J084854
$$ plain form
44196 2600411 2403265 2284104 2459125 3385554 5033695 6532269 6992839 6379068 5249153
44187 5249153 4087829 3191745 2641462 2064058 1107653 438488 1239930 3143946 3923413
44178 3923413 2389482 494028 916261 3228387 4354386 2698257 -109082 -1909176
44170 -1909176 -2566000 -2876478 -2503106 -578567 2294376 4192690 4121852 3100818 2711017
44161 2711017 3292859 4079415 4690405 5731847 7689229 9745057 10375851 9177740 7507541
44152 7507541 6971659 7696860 8502595 8387134 7275278 5574600 3692812 1976850 573202
44143 573202 -653849 -1606489 -1529467 179532 2739120 4405916 4419334 3800880 3795596 4216609
44133 4216609 4018773 3020193 2145736 2028500 2205976 1991471 1562769 1716812 2801666
44124B801666J510268J140845L20660m33984o28303M4206J151145J461337K95480
44115G663320j144886r40076P17460J209477r58377l507453l067819J05904K326663
44106B404213J559584n5173J56691J411773J172530n55733j289732j49035P79655
44097E434773j02285j315526p05991J074859J531562J62065q19350Q8640J431211
44088F779958J102064m66391j113234l59947l1581j149406k078125r86551J163999
44079B860786J868050P50649K6389J085069K492677K321054J007462M66010J206071
44070A4084217J957542J923733J813849K273884K586250J734857j9385j529940
44062B4825007k342808k973583l638125l601124k275456m64123K54347n57472
$$ plain form
44124 2801666 4311934 5452779 5773439 5339455 4711152 4755358 5906503 7367840 7663320
44115 7663320 6518434 5578358 6295818 7505295 6546918 3039465 -28354 77550 2404213
44106 2404213 3963797 3908624 4065315 5477088 6649618 6093885 4804153 4655118 5434773
44097 5434773 5332488 4016962 3310971 4385830 5917392 6079457 5260107 5348747 6779958
44088 6779958 7882022 7415631 6302397 5942450 5910869 4761463 2683338 1696787 2860786
44079 2860786 4728836 5479485 5505874 6590943 9083620 11404674 12412136 12878146 14084217
44070 14084217 16041759 17965492 19779341 22053225 24639475 26374332 26354947 24825007
44062 24825007 22482199 19508616 15870491 12269367 9993911 9529788 9784135 9226663
44054I226663j522826j135189K61122Q81538j14906j476628j566473n38249R6511
44045D111563k22641m20485K93367R84647M20851p95950q58025N90676J783425
44036E887428J259098k07450r51283p90155q41672j420039j489032l44385J275351
44027B377861K147864J829284O25954r00319j974629j905124q95552M07J97459
44018A503205K36054O41623Q86767K72162p50955j075333m31118M69568J043247
44009B795220J256435J102785N22113j34458k70099K36431R65799J538360J775681
44000I788267J486300O90633j08193m76255o71700j106708j482073j215888m79580
43991F424803L8796J98949L40214L56351j30363p74867p97767k83527p1987l03400
$$ plain form
44054 9226663 7703837 6568648 6829770 7711308 7596402 6119774 4553301 4015052 4111563
44045 4111563 3888922 3468437 3761804 4746451 5167302 4371352 3513327 4104003 5887428
44036 5887428 7146526 6939076 5987793 5197638 4355966 2935927 1446895 1102510 2377861
44027 2377861 4525725 6355009 6980963 6080644 4106015 2200891 1305339 1305746 1503205
44018 1503205 1739259 2380882 3267649 3539811 2788856 1713523 1282405 1751973 2795220
44009 2795220 4051655 5154440 5676553 5542095 5271996 5508427 6474226 8012586 9788267
44000 9788267 11274567 11965200 11857007 11380752 10709052 9602344 8120271 6904383 6424803
43991 6424803 6463599 6662548 7002762 7359113 7228750 6453883 5656116 5372589 5300602 4997202
43981D997202k95547j0403k45366r65862r18370L39332J376378R23047j26045
43972E074366j2261J327707K318526J968576Q36248o4540k69311K34916J205652
43963A2619879K060395K233252J801172J335896J073026O37113l10099j481349
43955A9969285k201822k119028j571327j222741j344269j584442j491696r73331
43947G460629r0792J083549J984424J587567k31819j920249j965823r98146p70675
43938F138665j325008j008062N21735J442542P67001J18140J007255K077139J123585
43929A0862992j249952k317572j180591J85551N9424p57107n34042Q45278J876432
43920G790413J362559k81984j443290q79934Q79885J886509R37772q92606j521881
$$ plain form
43981 4997202 4701655 4691252 4445886 3480024 2561654 2900986 4277364 5200411 5074366
43972 5074366 5062105 6389812 8708338 10676914 11513162 11448622 11179311 11414227 12619879
43963 12619879 14680274 16913526 18714698 20050594 21123620 21760733 21450634 19969285
43955 19969285 17767463 15648435 14077108 12854367 11510098 9925656 8433960 7460629
43947 7460629 7369837 8453386 10437810 12025377 11793558 9873309 7907486 6909340 6138665
43938 6138665 4813657 3805595 4327330 5769872 6536873 6655013 7662268 9739407 10862992
43929 10862992 9613040 7295468 6114877 6300428 6359852 5602745 5068703 5913981 7790413
43920 7790413 9152972 8870988 7427698 6547764 7427649 9314158 10251930 9359324 7837443
43911G837443l87722J069145J313854K77114j009279j549916j018228Q8385P47541
43902G368337L77886m09175n26090J01334L81842m18687j578948j756572o46578
43893B893349O16079P75211p0465o49702k49140K72671k20648j288375j439799
43884F39181m52230K04158l02692q04223k2909J359031J775280J064823L31030
43875C791449J13588Q2399J51888N10302P40902K34208n93371p07828m6917M63288
43865D739908M38638L77061M53442K44155j83618j67113K66347K29818m57927
43856E940711p02752K00809J300206J215724K7972q64226m87987P01402J488598
43847H820457J229727M68996K38320P62600J165370O36162n66643j617884k061224
$$ plain form
43911 7837443 7449721 8518866 9832720 10109834 9100555 7550639 6532411 6620796 7368337
43902 7368337 7746223 7337048 6810958 6912292 7294134 6875447 5296499 3539927 2893349
43893 2893349 3509428 4284639 4214174 3564472 3315332 3588003 3367355 2078980 639181
43884 639181 186951 391109 88417 -715806 -738715 620316 2395596 3460419 3791449
43875 3791449 3905037 3987436 4139324 4649626 5390528 5624736 5031365 4323537 4276620 4739908
43865 4739908 5178546 5555607 6009049 6253204 6069586 5902473 6168820 6398638 5940711
43856 5940711 5237959 5438768 6738974 7954698 7982670 7118444 6630457 7331859 8820457
43847 8820457 10050184 10519180 10757500 11520100 12685470 13321632 12754989 11137105 9075881
43838I075881j759998o42041P46195J197167M02641j51104Q45658K280761J982936
43829A3978096k102j353315p87635M12124O65563K03646Q1510M15350N80208K89979
43819A4483424l11778j005939j429087j247672p03867l77326l36870k87879m35889
43810H347117j127869j733853j234843J479N04916l1638l53590J47294N56092
43801E075105L49741L90276J110409J414118N15424o54140j058662j091158j234650
43792D816463p59594O73628J585247P58600m30502J05621J788303K153453O37750
43783A1328969o83860k81733R13242J275223N53531m72537j173379j233510n54703
43774I671243L80264O78584P5456o08899m03478O48268J440862R02842p35935
$$ plain form
43838 9075881 7315883 6673842 7420037 8617204 9019845 8868741 9714399 11995160 13978096
43829 13978096 13975994 12622679 11835044 12247168 12912731 13116377 13197887 13613237 14193445 14483424
43819 14483424 14171646 13165707 11736620 10488948 9785081 9407755 9070885 8783006 8347117
43810 8347117 7219248 5485395 4250552 4252031 4756947 4725309 4371719 4519013 5075105
43801 5075105 5424846 5815122 6925531 8339649 8855073 8200933 7142271 6051113 4816463
43792 4816463 4056869 4730497 6315744 7074344 6643842 6749463 8537766 10691219 11328969
43783 11328969 10645109 10363376 11276618 12551841 13105372 12632835 11459456 10225946 9671243
43774 9671243 10051507 10730091 10805547 10196648 9793170 10441438 11882300 12785142 12049207
43765A2049207j841831j070836P69634J418968R8960j296273p31664J244842K450330
43756A3091337J966120P42498j95271o89040p44172k49779M40652O97275N40661
43747A5600281N44937Q01766Q30619N20916K95454K83261J60320r3483o3890L28943
43737A9209124O34568O20572O03413Q07442Q64753K45562r56657j792433j175468
43728A9060876Q36033K631095K624720J249948M15181Q37794J221066N58909k85614
43719B9150008k77536K5302k09872l56816L94207J174710P81964l1744K90139
43710C0940362J368008J536654P60243N18341R85444Q10098j46793k98377J010752
43701C7484732K609260L744294M900398N779190M989724K788239J673222K846816
$$ plain form
43765 12049207 10207376 9136540 9906174 11325142 11424102 10127829 9396165 10641007 13091337
43756 13091337 15057457 15799955 15604684 14915644 14171472 13921693 14362345 15059620 15600281
43747 15600281 16145218 16946984 17777603 18298519 18593973 18877234 19037554 18944071 18880181 19209124
43737 19209124 19843692 20464264 21067677 21875119 22739872 22985434 22028777 20236344 19060876
43728 19060876 19896909 22528004 25152724 26402672 26817853 27655647 28876713 29435622 29150008
43719 29150008 28872472 28897774 28687902 28331086 28725293 29900003 30681967 30650223 30940362
43710 30940362 32308370 33845024 34605267 35123608 36109052 36919150 36772357 36473980 37484732
43701 37484732 40093992 43838286 48738684 54517874 59507598 62295837 63969059 66815875
43693F6815875M353889M380487M164778N507261P355485P532733O579459P022758
43685A13712725R342403J1343585J1667352J1670838J3268468J6559649K0205177
43678B07770197K2988221K4563238K5558243K7166616K9850647L2410933L3118051
43671D03426146L1594488K8583629K4055235J6929316P015021l957028j3837077
43664D93809730k1764255k7849049l1984089l3835677l3678150l2439254l0812909
43657B81446347k8740285k5934973k2680016j9766809j7543702j5378627j2575756
43650A38826179r718881q320818q803790r568978q778265o595718m831996m595674
43642G7612059n187713n361271m816655m090270l573430l181388k770037k429970
$$ plain form
43693 66815875 71169764 75550251 79715029 85222290 92577775 100110508 106689967 113712725
43685 113712725 123055128 134398713 146066065 157736903 171005371 187565020 207770197
43678 207770197 230758418 255321656 280879899 308046515 337897162 370308095 403426146
43671 403426146 435020634 463604263 487659498 504588814 511603835 507646807 493809730
43664 493809730 472045475 444196426 412212337 378376660 344698510 312259256 281446347
43657 281446347 252706062 226771089 204091073 184324264 166780562 151401935 138826179
43650 138826179 129107298 120786480 111982690 102413712 93635447 87039729 82207733 77612059
43642 77612059 72424346 67063075 62246420 58156150 54582720 51401332 48631295 46201325
43634D6201325k302692k295714k115205j620730j080423r12867j144647j319031
43626C3410016j048790m79495o7565o0680l49799o96396r35974j010147q81853
43617B7879317m18333N05314J588548J984438J079582n59470j521531j067881
43609B9469984O0803O08102K27004l90533n58178l55431l37518p34067j093668
43600B6896498q06077M1194N91924K29265n97110r33384n24123K9012K12773J68662
43590B5308634K68992N60688P00677K05066j038344k201009j962951k23324J165139
43581B2783568M81194j345729j710415J03096J887881J587588p3945j026248p28153
43572B1958837k84086l89851n91731m67627l52912n83819p41457j26580J169216
$$ plain form
43634 46201325 43898633 41602919 39487714 37866984 36786561 35873694 34729047 33410016
43626 33410016 32361226 31881731 31814166 31753486 31403687 30707291 29771317 28761170 27879317
43617 27879317 27460984 27966298 29554846 31539284 32618866 32059396 30537865 29469984
43609 29469984 29530787 30138889 30365893 29975360 29417182 29061751 28724233 27990166 26896498
43600 26896498 26090421 26131615 26723539 26952804 26355694 25422310 24898187 24927199 25139972 25308634
43590 25308634 25577626 26138314 26838991 27044057 26005713 23804704 21841753 21618429 22783568
43581 22783568 23264762 21919033 20208618 20311714 22199595 23787183 23713238 22686990 21958837
43572 21958837 21674751 21284900 20693169 20225542 19872630 19288811 18547354 18420774 19589990
43563A9589990J996176J279307m81445j390039m20656J045834J008562k44684
43555B2383045n85251N92061J400101N68640m19234K53263J708855J712373J66436
43546B7780289q02704n6951J130589J184343K99250k08262K92251J177361J373752
43537C2169918M38874r41899j585609j145298m77747l54150l82527J40077Q78604
43528B8740243R48690M87455O74486K056395L642943L963301K621196O74583l18590
43519D3490702K86185J615053K325366K274284K514974L463174M046374L348539
43511F3364651K225103K253220L594694M948702N377273N256751N488057O437857
43503I8946308P623344Q110781P551942P052303Q308610J1466849J4699705J6505033
$$ plain form
43563 19589990 21586166 22865473 22384028 20993989 20573333 21619167 22627729 22383045
43555 22383045 21797794 22389855 23789956 24358596 23939362 24192625 25901480 27613853 27780289
43546 27780289 26977585 26920634 28051223 29235566 29534816 29326554 29618805 30796166 32169918
43537 32169918 32608792 31666893 30081284 28935986 28458239 28104089 27721562 27861639 28740243
43528 28740243 29688933 30176388 30850874 32907269 36550212 40513513 43134709 43809292 43490702
43519 43490702 43776887 45391940 47717306 49991590 52506564 55969738 60016112 63364651
43511 63364651 65589754 67842974 71437668 76386370 81763643 87020394 92508451 98946308
43503 98946308 106569652 114680433 122232375 129284678 137593288 149060137 163759842 180264875
43495A80264875J7460513J8938307K1161216K3579318K6144827K8939995L1376187
43488C47865238L2977633L4022822L4104028L1228306K4164031J4747334N820588
43481E24929980k370463j1453694k1142593k8784558l2810772l4248944l4393642
43474C59725314l3187005l0569432k7473490k4656611k2066044j9826597j8250033
43467A83696102j6577246j3656604j0352836r130204j0380767j1292547r608646
43460A02697252o607316m849833m607512m277992l193545k249635k306364l263064
43452G1341991m350171m586643l533828k067200j527372j801608j533969n76833
43444E1364367m43894j576525k203953j242339l39830j197555k576040k216576
$$ plain form
43495 180264875 197725388 216663695 237824911 261404229 287549056 316489051 347865238
43488 347865238 380842871 414865693 448969721 480198027 504362058 519109392 524929980
43481 524929980 522559517 511105823 489963230 461178672 428367900 394118956 359725314
43474 359725314 326538309 295968877 268495387 243838776 221772732 201946135 183696102
43467 183696102 167118856 153462252 143109416 133979212 123598445 112305898 102697252
43460 102697252 96089936 91240103 86632591 82354599 79161054 76911419 74605055 71341991
43452 71341991 66991820 62405177 58871349 56804149 55276777 53475169 51941200 51364367
43444 51364367 50920473 49343948 47139995 45897656 45557826 44360271 41784231 39567655
43436C9567655m46277O03655N13773O95322J352409R94751o80286j756154q09053
43427D0035795J081215K036014J850175J710774K202512K596465J962744L96122
43419E3871816j030526j456929j158874q94411m63495J173177L977071O030996
43411F0048825N520343K918100M06509l92041N09327J966819K540959J521523
43403G5040364r2230l58970J084448K213995J344324l83499o60168O98901J828935
43394H0716100J704607J188386J298692K039125L072459M185403M919824M963756
43386A04088352N054813O323161Q518312R911591R158444O387430K435282j960293
43378A49917092o030368q990212j0553343j0956364j0511291r613152q856271
$$ plain form
43436 39567655 39121378 39725033 40238806 40934128 42286537 43281288 42601002 40844848 40035795
43427 40035795 41117010 43153024 45003199 46713973 48916485 51512950 53475694 53871816
43419 53871816 52841290 51384361 50225487 49331076 48867581 50040758 54017829 60048825
43411 60048825 65569168 68487268 68893777 68501736 69011063 70977882 73518841 75040364
43403 75040364 74948134 74589164 75673612 77887607 79231931 78848432 78188264 78887165 80716100
43394 80716100 82420707 83609093 84907785 86946910 90019369 94204772 99124596 104088352
43386 104088352 109143165 115466326 123984638 133896229 143054673 149442103 151877385 149917092
43378 149917092 143886724 134896512 124343169 113386805 102875514 93262362 84406091
43371H4406091q442902p811366o551232n221594m502334m157219l715046l379517
43363D0624881l186241k256038l69312P19493n28406k703906l125522j709805
43355B7465144o80636p04578k16817J102275J285266l75448j580394n75838Q90834
43346B6609808L41349j463470j769823m8823J429339R99336m07368r60995k38063
43337B4491290P24820R95930Q38964J182287K074860K212580O81922j306017j660363
43328C0236273k38970J014768Q32885q2747p55606j087744p96762P99491K997470
43319C2919058L652490K165408P19844J107405K117991J838634Q56860J039480
43311D6417170K440933L672064M310114M693999M279039K673288J608737L187253
$$ plain form
43371 84406091 75963189 68151823 61600591 56378997 51876663 47719444 44004398 40624881
43363 40624881 37438640 35182602 34813290 35532783 35004377 32300471 29174949 27465144
43355 27465144 26784508 26079930 25863113 26965388 28250654 27875206 26294812 25718974 26609808
43346 26609808 26951157 25487687 23717864 23669041 25098380 26097716 25690348 24729353 24491290
43337 24491290 25216110 26212040 27051004 28233291 30308151 32520731 33202653 31896636 30236273
43328 30236273 29997303 31012071 31844956 31762209 31006603 29918859 29122097 29921588 32919058
43319 32919058 36571548 38736956 39456800 40564205 42682196 44520830 45377690 46417170
43311 46417170 48858103 52530167 56840281 61534280 65813319 68486607 70095344 73282597
43303G3282597O427691Q230606P831649P627322R196885J1215536J2226359J2986844
43295A49025489J4635319J6480796J7195237J6735172J5576521J3256257R198600
43288B52103391M095216r34232n812386j0791813j4927696j6763667j6333425
43281A90635388j5205953j4528098j4034244j3031221j1407430r449547p439019
43274A05539876n787650n038607n310731n976313o200259n721787m913103m139973
43266F2451453l380381k662353k541134l479140m678657m405272k135610K76103
43258C9445009N88676j010444k257336j911631j140189j407081k308894k442161
43250B7555949j527546n52687k56001n07074r88962j514366j623990p59235Q27841
$$ plain form
43303 73282597 79710288 87940894 95772543 103399865 112596750 123812286 136038645 149025489
43295 149025489 163660808 180141604 197336841 214072013 229648534 242904791 252103391
43288 252103391 256198607 255264375 249451989 238660176 223732480 206968813 190635388
43281 190635388 175429435 160901337 146867093 133835872 122428442 112978895 105539876
43274 105539876 99752226 94713619 89402888 83426575 77226316 71504529 66591426 62451453
43266 62451453 59071072 56408719 53867585 50388445 45709788 41304516 39168906 39445009
43258 39445009 40033685 39023241 36765905 34854274 33714085 32307004 29998110 27555949
43250 27555949 26028403 25475716 25219715 24712641 23723679 22209313 20585323 19826088 20653929
43241B0653929J918400J522387J9055j161636r15541N67817K085598K565132J979095
43232B9234236J172841Q20308P12153K35454n88243r37570k49016Q50778J119200
43223C2370141K26694p69839p82008p9254K75026Q7648J97799Q46592R43291l58604
43213C2957486k134363k705676j772063n35804R4242L79140P94863J236604J500141
43204B9814570J704225J778628J239584O2192p24618J519K042046L910480M312621
43195D4141247L371133K372983K422248L424997M513553N373865O619096Q538113
43187H0777235J0130845J0248114R376530R212892J0345730J1304389J0235414
43180A51631149O796578K144935k158705m902949n743973n567283n758939o616635
$$ plain form
43241 20653929 22572329 24094716 24113771 22952135 22036594 22604411 24690009 27255141 29234236
43232 29234236 30407077 31227385 31939538 32174992 31586749 30649179 30400163 31250941 32370141
43223 32370141 32596835 31826996 31044988 30965734 31240760 31328408 31526207 32372799 33316090 32957486
43213 32957486 30823123 28117447 26345384 25809580 25903822 26282962 27077825 28314429 29814570
43204 29814570 31518795 33297423 34537007 34599199 33874581 33876100 35918146 39828626 44141247
43195 44141247 47512380 49885363 52307611 55732608 60246161 65620026 72239122 80777235
43187 80777235 90908080 101156194 110532724 119745616 130091346 141395735 151631149
43180 151631149 158427727 160572662 158413957 153511008 147767035 142199752 136440813 129824178
43172A29824178o957765n626416k788092N49816L487474N278306N417362M501427
43164A33686290M246301N743302Q252147J0483720J2335659J4354272J6221061
43157B05322752J7165936J7559629J8735402K1271879K4570435K7933647L0702368
43150C63262048L1354145K8083663K0861753J1767838K763084n818225j4167870
43143D38106436k1752040k8013450l3156451l7072741l8332514l5615196k9845592
43136B14318452k3800365j9670193j7736800j7061825j6425912j4721849j1567594
43129I3333914p873077n129233l920584l633267l582218l686514l926938l941686
43121E7640397l531538k992357k593801k207669j765300j583840j828883k051619
$$ plain form
43172 129824178 122866413 117239997 114451905 115001721 118489195 123767501 129184863 133686290
43164 133686290 137932591 143675893 151928040 162411760 174747419 189101691 205322752
43157 205322752 222488688 240048317 258783719 280055598 304626033 332559680 363262048
43150 363262048 394616193 422699856 443561609 455329447 458092531 452274306 438106436
43143 438106436 416354396 388340946 355184495 318111754 279779240 244164044 214318452
43136 214318452 190518087 170847894 153111094 136049269 119623357 104901508 93333914
43129 93333914 85460837 80331604 76411020 72777753 69195535 65509021 61582083 57640397
43121 57640397 54108859 51116502 48522701 46315032 44549732 42965892 41137009 39085390
43113C9085390j709148q94773j90355n809l48880r96081j592210j809948j668727
43104B9869459j443322j080688j69472J176711J987262J628871Q68156Q69242
43096C3706219J389784J049102m86671j655128q78792J425649L360808L633217
43088D1544188K557768J313723P85203J014525J368017J269550R35501J140461
43080E1928936K100021L034352L156679K581323J793227Q24035k97096q24189
43072F4297288j16818J054873J244720M38290J59414J087130J848480J028784
43064G1042161o21600j132534R2851J756183K477871K117416J382824J074897
43056G8190069J764784L350680M768834M900549L974404L403633M054369N360931
$$ plain form
43113 39085390 37376242 36481469 36291114 36285305 35936425 34940344 33348134 31538186 29869459
43104 29869459 28426137 27345449 27175977 28352688 30339950 31968821 32836977 33706219
43096 33706219 35096003 36145105 35658434 34003306 33124514 34550163 37910971 41544188
43088 41544188 44101956 45415679 46200882 47215407 48583424 49852974 50788475 51928936
43080 51928936 54028957 57063309 60219988 62801311 64594538 65418573 65121477 64297288
43072 64297288 64180470 65235343 66480063 66918353 67077767 68164897 70013377 71042161
43064 71042161 70420561 69288027 69380878 71137061 73614932 75732348 77115172 78190069
43056 78190069 79954853 83305533 88074367 92974916 96949320 100352953 104407322 109768253
43048A09768253O352545O781292O891995O877302P129961Q359641J0714280J3194960
43040A76070229J4646754J5095267J5548120J6721829J8452338K0026608K0546717
43033B97107862J9338985J6651246J3588259J0661701O883897J310466m872712
43026C60669704r132268j0523581j0572484j0976315j1792853j2527955j3677716
43019B81466532j6008588j9030524k1285431k1808618k0597571j8186223j5557030
43012A48992547j3895643j3454062j3037266j1497123r294618p639354o616475
43005G3558006n403537l988762l244336l330657l417026l144878l050630l272501
42997D4705679l144645k484226k042370k181359k280923j971399j749396j814663
$$ plain form
43048 109768253 116120798 122902090 129794085 136671387 143801348 152160989 162875269 176070229
43040 176070229 190716983 205812250 221360370 238082199 256534537 276561145 297107862
43033 297107862 316446847 333098093 346686352 357348053 364231950 365542416 360669704
43026 360669704 351537436 341013855 330441371 319465056 307672203 295144248 281466532
43019 281466532 265457944 246427420 225141989 203333371 182735800 164549577 148992547
43012 148992547 135096904 121642842 108605576 97108453 87813835 80174481 73558006
43005 73558006 68154469 64165707 60921371 57590714 54173688 51028810 47978180 44705679
42997 44705679 41561034 39076808 37034438 34853079 32572156 30600757 28851361 27036698
42989B7036698j612866j213784j661313k963327l276544j527325N13185N61284
42981A5856008q24547j263457k33074N24096Q8201m06655J6681P12892Q16214
42972A5286359M75701j6688q55655j706157j468497l2273R49661J60684j437261
42963A1355874j869674o33634J114429K197870K181776J051513o94847j886529
42955A2816778j657329n21144L01229M35879M43898O15829O82609O96769J134394
42946A4948912J824798J711973K68461j460927j905810p97252O21780J122611
42938A6334546P20765L14738N62138J404434K397982L061063K988770K160045
42930B9944481J258383J158581J808421K158623J650874J177387J780547K838627
$$ plain form
42989 27036698 25423832 24210048 22548735 19585408 16308864 14781539 15294724 15856008
42981 15856008 15031461 13768004 13534930 14059026 14147227 13740572 13757253 14470145 15286359
42972 15286359 15762060 15745372 14889717 13183560 11715063 11682790 12632451 12793135 11355874
42963 11355874 9486200 8852566 9966995 12164865 14346641 15398154 14703307 12816778
42955 12816778 11159449 10638305 10939534 11375413 11819311 12435140 13117749 13814518 14948912
42946 14948912 16773710 18485683 18754144 17293217 15387407 14590155 15211935 16334546
42938 16334546 17055311 17370049 17932187 19336621 21734603 24795666 27784436 29944481
42930 29944481 31202864 32361445 34169866 36328489 37979363 39156750 40937297 43775924
42922D3775924K621085O14873j722750k733146k215385j105078l78664o08294
42914C8248565j766102l024885l442368l176848l253865l836827l759087k337879
42906A3650704n77380L08973O25431J330933K188562K086648Q39749n87866j547595
42897A8318159k259062k830987k754793j698655j59926R43532R98618O2215j103948
42888I515153j501841q33812J53877N75146L65614M8633J9878M37996J198903
42879I979547J558820O29106j064187j537764N6120J803455J456067l85200j340977
42870A1154987q72772o12392j224835j381009l77287M94516K02640l33497n7423
42861F992928L80786M1596m30044L1114R03272Q89031K7803n81328o73348r04608
$$ plain form
42922 43775924 46397009 47011882 45289132 42555986 40340601 39235523 38856859 38248565
42914 38248565 36482463 33457578 30015210 26838362 23584497 19747670 15988583 13650704
42906 13650704 13073324 13382297 14007728 15338661 17527223 19613871 20453620 19865754 18318159
42897 18318159 16059097 13228110 10473317 8774662 8614736 9558268 10556886 10619101 9515153
42888 9515153 8013312 7179500 7333377 7908523 8274137 8322770 8342648 8780644 9979547
42879 9979547 11538367 12167473 11103286 9565522 9621642 11425097 12881164 12495964 11154987
42870 11154987 10282215 9669823 8444988 7063979 6686692 7181208 7383848 7050351 6992928
42861 6992928 7373714 7415310 6985266 7016380 7919652 8808683 8836486 8255158 7581810 6677202
42851F677202j336682j311092q05032o03441r60856j148642n63783M87530J241056
42842A676260J126803Q3549j151554j316258M1094J709051K094484J123633J4216
42833E401278n23514p47969p52726k35694M26201K16768q88522j467424n23786
42824I04612J091320J894382J666272J294545J257708J170725O36246j69426p28809
42815I017575n87051L05255J294863J382480L78814n48333r9605J444492K330053
42806A4918543J289846j007423k646233k346365n20550J322943K001662J499736
42798A4512159N89744r0149l84677k88492J74212O02083L31007o49606j319898
42789A3476383q00387L55434Q06534L00373q784O30453J411527J320491Q32692
$$ plain form
42851 6677202 5340520 4029428 3224396 2620955 1660099 511457 -52326 435204 1676260
42842 1676260 2803063 2886612 1735058 418800 459894 2168945 4263429 5387062 5401278
42833 5401278 4877764 4129795 3377069 3141375 3567576 3784344 2895822 1428398 904612
42824 904612 1995932 3890314 5556586 6851131 8108839 9279564 9915810 9746384 9017575
42815 9017575 8430524 8735779 10030642 11413122 11791936 11243603 11143998 12588490 14918543
42806 14918543 16208389 15200966 12554733 10208368 9687818 11010761 13012423 14512159
42798 14512159 15101903 15011754 14627077 14338585 14512797 15114880 15445887 14796281 13476383
42789 13476383 12675996 13031430 13837964 14138337 14129553 14760006 16171533 17492024 18324716
42780A8324716J124588J975085J847461K72618j186929j074033n4414K78364j81464
42771B1325992k51665K73189K10747q59973j581265q15691N00970P14039m5950
42762A9470393q2961J322176K874161L036458J866324O05908J23949L27670P24701
42753C0268779R93498J071225J046308J042392J122560J323193J739097K395134
42745D1002186L020368L195871K869247K560570K857240L715155M410000M308967
42737F7939604L686654L580016M648838O362458P698068Q532969R709264J1558138
42729A23716009J3114379J3377897J2854195J3128913J5135108J8372747K1520662
42722B31219910K3252979K2920354K1251327J9956300J9600539J8270170J3760876
$$ plain form
42780 18324716 19449304 21424389 23271850 23544468 22357539 21283506 21229092 21507456 21325992
42771 21325992 21074327 21347516 21558263 20698290 19117025 18301334 18802304 19516343 19470393
42762 19470393 19387432 20709608 23583769 26620227 28486551 29092459 29216408 29544078 30268779
42753 30268779 31262277 32333502 33379810 34422202 35544762 36867955 38607052 41002186
42745 41002186 44022554 47218425 50087672 52648242 55505482 59220637 63630637 67939604
42737 67939604 71626258 75206274 79855112 86217570 93915638 102448607 112157871 123716009
42729 123716009 136830388 150208285 163062480 176191393 191326501 209699248 231219910
42722 231219910 254472889 277393243 298644570 318600870 338201409 356471579 370232455
42715C70232455O939211J132702k215415n330579j0470877j6314785j9803591
42708C24169121k0372478k0109901k0208498j9644406j7683692j5531883j4491106
42701A96127157j4025457j2859716j0956683r239393q108707p365205p035499
42694A26536497p140628p013867n969509m468295l564527l289292k682009j498156
42686I0910214p15297r45005j384503j019948r4916M08867K26222q7390k17496
42677H7080748m40703r36369j394259j432040j008187l72215J00121Q2899l74708
42668H1305287q00918r00628j020007j589296k313698k528115k284456k388833
42660F7479336l223712m154460m345150l674002k660588j981232k171284l169891
$$ plain form
42715 370232455 377171666 378304368 376088953 370758374 360287497 343972712 324169121
42708 324169121 303796643 283686742 263478244 243833838 226150146 210618263 196127157
42701 196127157 182101700 169241984 158285301 149045908 140937201 133571996 126536497
42694 126536497 119395869 112382002 106412493 101944198 98379671 95090379 92408370 90910214
42686 90910214 90194917 89249912 87865409 86845461 86750545 87159412 87385634 87298244 87080748
42677 87080748 86640045 85703676 84309417 82877377 81869190 81496975 81597096 81679995 81305287
42668 81305287 80504369 79603741 78583734 76994438 74680740 72152625 69868169 67479336
42660 67479336 64255624 60101164 55756014 52082012 49421424 47440192 45268908 42099017
42652D2099017l971168l481738k044963j258939j791253k381210j866208j152643
42644B4150895j734107k932080k524102j84291J623454R72843q59143j316141
42636A7197328j01488P66393L1013j248534j490346o95574m0720j04892m30543
42627A3882637o42036j036561j674651j616986k1235K121728K495447K88618k386196
42618A1410765k917201j419081k03803l65688o60823r2081L31330m16696j200584
42609D466138l19644J603507K299801J151402q7248n6592M96171L99916n8377
42600I895074P3652P82371J297387J295740J030746P26322N15386N00361L18050
42591A6435089p12324k344402l049680j829670K29144J262964R77767M87962K29113
$$ plain form
42652 42099017 38127849 34646111 32601148 31342209 29550956 27169746 25303538 24150895
42644 24150895 22416788 19484708 16960606 16776315 18399769 19372612 18513469 17197328
42636 17197328 17095840 17862233 17893246 16644712 15154366 14458792 14418072 14313180 13882637
42627 13882637 13240601 12204040 10529389 8912403 8891168 11012896 13508343 13796961 11410765
42618 11410765 8493564 7074483 6870680 6504992 5844169 5752088 6083418 5666722 4466138
42609 4466138 4146494 5750001 8049802 9201204 9113956 9057364 9553535 9953451 9895074
42600 9895074 9968726 10751097 12048484 13344224 14374970 15101292 15616678 16117039 16435089
42591 16435089 15722765 13378363 10328683 8499013 8728157 9991121 10968888 11456850 11685963
42582A1685963m56483j636270k229913j616366n64915M9250M05438R23734J245456
42573G805894Q81630J69234k63336m20387n42875l55197L93232J068775Q18085
42564I555055j03643n60701n7839O87377P06247k05476j349905j645681o27449
42555F397985O98573O64181p74159j491204n8880J805233J431134p50937j642616
42546F279310n4017J633683J245869r3193k33883N52398N47786k39810k76751
42537I361392O31298R79710J61106n99142m00377p6861o59323j690382j995542
42528E711879j312164l16632M26852P98061P10311M4116r54857j559831j116374
42519B431361J35606R66067M30382o87756n63361J101287K250229J176933r43975
$$ plain form
42582 11685963 11229480 9593210 7363297 5746931 5182016 5231266 5636704 6560438 7805894
42573 7805894 8687524 8856758 8593422 8173035 7630160 7274963 7668195 8736970 9555055
42564 9555055 9451412 8890711 8832872 9520249 10226496 10021020 8671115 7025434 6397985
42555 6397985 7096558 7760739 6986580 5495376 5436496 7241729 8672863 7921926 6279310
42546 6279310 6225293 7858976 9104845 9011652 8777769 9330167 9877953 9638143 9361392
42537 9361392 9992690 10972400 11133506 10534364 10133987 10057126 9397803 7707421 5711879
42528 5711879 4399715 4083083 4509935 5307996 6018307 6062423 5107566 3547735 2431361
42519 2431361 2566967 3533034 3963416 3275660 2712299 3813586 6063815 7240748 6296773
42510F296773j684267p82324p8414l56348l94182N36554J307587R05057L5877
42501E786313k77669k60753m35449m11612J39760M18832k85301j197922j141658
42492B334541k46193N96604J156867J487691R97275n68805j883117j458201N4341
42483B471003O52075r7689o02001J94020J384527J639566Q46881k74613j144549
42474E069220j419041r51588p4455O42410J008170J042869M88739n97402j113863
42465D095059r8412J437680J361483o31471k388137k155121p24322J9973m40562
42456D76170j129334j072333j35185J034502J395415N09847n31211j01841J660551
42447B106581K675275J647724j80084q57336k24704M65972N28359K46650p1607
$$ plain form
42510 6296773 4612506 3830182 3751768 3395420 3001238 3537792 4845379 5750436 5786313
42501 5786313 5508644 5247891 4812442 4400830 4540590 4959422 4674121 3476199 2334541
42492 2334541 2088348 2684952 3841819 5329510 6326785 5757980 3874863 2416662 2471003
42483 2471003 3123078 3025389 2423388 2617408 4001935 5641501 6488382 6213769 5069220
42474 5069220 3650179 2698591 2624136 3266546 4274716 5317585 5806324 5208922 4095059
42465 4095059 3996647 5434327 6795810 6164339 3776202 1621081 896759 916732 476170
42456 476170 -653164 -1725497 -1860682 -826180 569235 1079082 547871 446030 2106581
42447 2106581 4781856 6429580 6249496 5392160 5167456 5633428 6161787 6408437 6336830
42438F336830l14454k50484Q6994J28246l57922p08162m48487j51541k87678j60465
42428C872877P40552J236675J9280j853501j987289j22752J371377Q78084l63816
42419C791487l50624Q80972J611719P74560j017265k352844k322323j235941l41070
42410e61329m59325q74589k18681J508978K717100K290199R51877Q5751M2468
42401E482449K50544K98495J52311k32256q10070j248259j344241j324766j294132
42392f9925q28361L02095J394353J518636P84526J92889K21386K40656l99858
42383C356397j228117j141275L2563J016430N42963q98805j446686j81369J644862
42374A696963K240189J488036O24227J70382n09230j572769k026570j264643j80399
$$ plain form
42438 6336830 6022376 5771892 5858886 5987132 5629210 4921048 4472561 4321020 4033342 3872877
42428 3872877 4613429 5850104 5869384 4015883 2028594 1905842 3277219 4155303 3791487
42419 3791487 3440863 4321835 5933554 6708114 5690849 3338005 1015682 -220259 -561329
42410 -561329 -1020654 -1895243 -2113924 -604946 2112154 4402353 5354230 5439981 5482449
42401 5482449 5732993 6031488 6183799 5951543 5141473 3893214 2548973 1224207 -69925
42392 -69925 -898286 -596191 798162 2316798 3101324 3294213 3515599 3756255 3356397
42383 3356397 2128280 987005 1019568 2035998 2578961 1680156 233470 52101 1696963
42374 1696963 3937152 5425188 6049415 6219797 5710567 4137798 2111228 846585 666186
42365F66186R0598k44259k05468L49835O41029K36525m32550q03311p83516n65155
42355a050086k89529J5853M01429Q71372J191298J048989N79202M17717R36333
42346D122578J652121J702128P91183n10357j314136j228654p77512q80104j660177
42337A897070k090535j347617j14139L46855P4890J26092N46211K41215q28494
42328a148452j099280J27819J332564J080259J83238Q5161M39167J04275n28739
42319E76012k93291L74733L5217j067493j127977L06689J607066J597921R34612
42310B943489M50319n6841o72613o67243J16121N29744k47429j408136j680823
42301f93412q69746M26390J669135K330037J950346Q54909p5367p02615j582673
$$ plain form
42365 666186 756784 512525 307057 656892 1297921 1534446 1101896 298585 -484931 -1050086
42355 -1050086 -1339615 -1323762 -922333 -50961 1140337 2189326 2768528 3186245 4122578
42346 4122578 5774699 7476827 8268010 7757653 6443517 5214863 4437351 3557247 1897070
42337 1897070 -193465 -1541082 -1655221 -1308366 -1233476 -1107384 -561173 -319958 -1148452
42328 -1148452 -2247732 -2119913 -787349 292910 476148 561309 1000476 1104751 576012
42319 576012 282721 657454 692671 -374822 -1502799 -1196110 410956 2008877 2943489
42310 2943489 3393808 3336967 2664354 1997111 2113232 2642976 2395547 987411 -693412
42301 -693412 -1563158 -1136768 532367 2862404 4812750 5667659 5592292 4889677 3307004
42292C307004k343423j691013K96085J563753Q51543m66747n93617Q5926J32137
42283A141648m91703q21321p45283o87603k88172P71877J365220L11616j341543
42274g85264j477416n5819R81247Q47197P35228J226687J121166k79859j564967
42265G48200j098032O97384K022661J866930O82510m44565o99083j40053K92102
42256C928054q9515o31317k64567O34034O20431m69733j080245l27378O46227
42247B965991M82385n28126j290410j479286j331403q89932m00648m92792j032148
42238c996369q20360N18195J437596N76018j000675j229431k0863R27996Q89212
42229b718681Q07002J192993J144394P4481r93866p86336M15480J190672P81672
$$ plain form
42292 3307004 963581 -727432 -431347 1132406 1983949 1517202 923585 1009511 1141648
42283 1141648 649945 -171376 -916659 -1604262 -1892434 -1120557 244663 556279 -785264
42274 -785264 -2262680 -2318499 -1337252 -490055 245173 1471860 2593026 2313167 748200
42265 748200 -349832 347552 2370213 4237143 4919653 4475088 3776005 3635952 3928054
42256 3928054 3838539 3207222 2942655 3576689 4197120 3727387 2647142 2319764 2965991
42247 2965991 3448376 2920250 1629840 150554 -1180849 -2070781 -2471429 -2964221 -3996369
42238 -3996369 -4816729 -4298534 -2860938 -2284920 -3285595 -4515026 -4535889 -3607893 -2718681
42229 -2718681 -1911679 -718686 425708 500189 -493677 -1280013 -864533 326139 1107811
42220A107811j79137n86983r1580O09419N95824j92130q78486p45816l7444N83959
42210A85437Q83458Q82331L72365o27208j285657p71739M37195R64388L53933
42201A394503l44097o8294Q54014J180803K17749j485837k667623k458932j138799
42192d516513K39200J058404J631662K242878K331579J330955j87771j130809
42184B999585j273184j009727j43688J594615K927989J826494j417856l639530
42176A864698k564131J81561J338993L05553p08412l19405L78666J41001m04857
42167B13667j31162N74032N85914N3062Q1119O51247M28287r99833k063489j279809
42157a886965N23146J186211J9598j496987j750064o75841P70167J810420K036148
$$ plain form
42220 1107811 928674 341691 250111 859530 1455354 1263224 384738 -361078 -398522 185437
42210 185437 1068895 1951226 2323591 1696383 410726 -361013 76182 1040570 1394503
42201 1394503 1050406 982112 1836126 3016929 3234678 1748841 -918782 -3377714 -4516513
42192 -4516513 -4277313 -3218909 -1587247 655631 2987210 4318165 4130394 2999585
42184 2999585 1726401 716674 572986 2167601 5095590 6922084 5504228 1864698
42176 1864698 -699433 -517872 821121 1126674 418262 98857 477523 618524 213667
42167 213667 82505 656537 1242451 1295513 1376632 2027879 2456166 1456333 -607156 -1886965
42157 -1886965 -1363819 -177608 -158010 -1654997 -3405061 -4080902 -3310735 -1500315 535833
42148E35833J266919k1328o41984J44849J617694K302311J532613j12288j622180
42139E002439k268129j774338m56180Q23660J322044J052981M95685q1315o07102
42130C509745q60643p46322o99279j138067j612257j204869J48237J362817J415579
42121A74941M21759o38858r66060o25091l55184o36576r37518l15912J084555
42112b793944J866758J199244K0990l55892p2503n2093j71194M37129J540148
42103A618643J816380Q15400m26869r06553n80766K82098J321297J534339P0942
42094E544911k051109k622294j219263J07827q6192n89208K00517J500088J374080
42085B159357k12658j381479r99965J78148R52183J011438P17591M35924K77521
$$ plain form
42148 535833 1802752 1781424 1139440 1284289 2901983 5204294 6736907 6624619 5002439
42139 5002439 2734310 959972 503792 1327452 2649496 3702477 4198162 4116847 3509745
42130 3509745 2649102 1902780 1203501 65434 -1546823 -2751692 -2603455 -1240638 174941
42121 174941 596700 -42158 -1008218 -1633309 -1988493 -2625069 -3562587 -3878499 -2793944
42112 -2793944 -927186 272058 293048 -62844 -135347 -187440 -358634 78495 1618643
42103 1618643 3435023 4250423 3823554 2917001 2336235 2618333 3939630 5473969 5544911
42094 5544911 3493802 871508 -347755 -239928 -326120 -915328 -714811 785277 2159357
42085 2159357 1946699 565220 -434745 -256597 695586 1707024 2424615 2860539 3138060
42076C138060Q8715k72658n48230l99454j56678m36631q86493m50622P98713J516566
42066B391288J321284J451104K216626J778852q16525l177529k509035K12602
42058B868667J623440P51085l78278n60969q27555j660109j657637m3682J754754
42049A869716K261598J874919J496034R35447l6576n45691M6703P97113N33990
42040I233253l59193p72873o56385o91189q37382n24205O5392Q9189o38568j272348
42030C635691r10143M76858J914526K060734N22349j259429j300814L29877J267749
42021F737398k4728j976389k001327r4974J263919O10222p26996p83039L74018
42012C378104J057061M06004o31892q05797j95668K29208K37802N82273J482612
$$ plain form
42076 3138060 3226775 2954117 2405887 2006433 1849755 1413124 526631 76009 874722 2391288
42066 2391288 3712572 5163676 7380302 9159154 8342629 5165100 2656065 2868667
42058 2868667 4492107 5243192 4864914 4303945 3476390 1816281 158644 114962 1869716
42049 1869716 4131314 6006233 7502267 8437714 8401138 7855447 7902150 8699263 9233253
42040 9233253 8874060 8101187 7444802 6753613 5916231 5392026 5457418 5546607 4908039 3635691
42030 3635691 2725548 3202406 5116932 7177666 7700015 6440586 5139772 5469649 6737398
42021 6737398 6712670 4736281 2734954 2639980 3903899 4514121 3787125 3004086 3378104
42012 3378104 4435165 4841169 4209277 3403480 3207812 3437020 3674822 4257095 5739707
42003E739707J866881Q19588r56870k066677k229696k060408j564020l18910J041549
41994B71144J175618O8402q11028p28430n17824p33995o44249J42706O47530J93307
41984i36819l14160R149M40108L5819n41548j25202R10882J277676Q17525M30870
41974B004300M02453J89456l97546r58359j162333p42649N90618K251233K568548
41965D745721P52572j578369k180663r53069L74513O81905J49500q41696j835479
41956f85065j807585l11660J192181R31592m93017q90463J92491R95878N64560
41947c11088O9132M71670Q62623J99692q17849q46880R7493Q15752N64666k03594
41937I01617m65129K72747J249298J069154m82924j823085j561254l22589N46171
$$ plain form
42003 5739707 7606588 8426176 7469306 5402629 3172933 1112525 -451495 -770405 271144
41994 271144 1446762 1515164 704136 -24294 -542118 -1276113 -1920362 -1777656 -1130126 -936819
41984 -936819 -1250979 -1241830 -801722 -765903 -1307451 -1432653 -521771 755905 1573430 2004300
41974 2004300 2406753 2596209 2198663 1240304 77971 -664678 -74060 2177173 4745721
41965 4745721 5498293 3919924 1739261 786192 1160705 1842610 1992110 1150414 -685065
41956 -685065 -2492650 -2804310 -1612129 -680537 -1173554 -2064017 -1871526 -875648 -311088
41947 -311088 -241956 229714 1092337 1292029 474180 -372700 -275207 540545 1105211 901617
41937 901617 436488 709235 1958533 3027687 2544763 721678 -839576 -1162165 -615994
41928f15994J052572J672574J498644l35751k151432j553620N24515Q61331p81824
41919A71015j057200J368187L368336K331329Q6321o31835n20700j417678k294331
41910A403444j202874O08247L95600j329222j572340Q6402R70206K440o53647
41901a291744M97104J838820J462661J4420p58463m98359R9261O98429J136228
41892C198357R04309p2430r04252q11203j16941L64857L17686n1727l29068l6482
41882B463106Q47003J456569R47012j86095o42088j70613J78228k61571r59984
41873C671567j245281j074211n20568M23847J244145J114161N0697r91970j360608
41864A311779j206224p66955j48074K16353l3192l97733k86577k81458j136466
$$ plain form
41928 -615994 436578 2109152 3607796 3272045 1120613 -433007 91508 952839 171015
41919 171015 -886185 482002 3850338 6181667 6267988 5636153 5115453 3697775 1403444
41910 1403444 200570 808817 1204417 -124805 -1697145 -1610743 -640537 -638097 -1291744
41901 -1291744 -794640 1044180 2506841 2521261 1762798 1264439 1363700 2062129 3198357
41892 3198357 4102666 4030236 3125984 2314781 2197840 2562697 2880383 2828656 2499588 2463106
41882 2463106 3310109 4766678 5713690 5527595 4885507 4714894 4893122 4631551 3671567
41873 3671567 2426286 1352075 831507 1255354 2499499 3613660 3664357 2672387 1311779
41864 1311779 105555 -661400 -809474 -593121 -626313 -1024046 -1310623 -1592081 -2728547
41855b728547j834845o80443J605166K212683K70893j789367j886880r78014o70701
41846f480055m40443P13373J700147R50332n92222o83206O34129J167547J68823
41837b861575n87905K83764J790197K246474J508232O43931L04165K05569j96366
41828C336486r91652j645636j536111p63553n0987L64566J005126J849687J775634
41819C343560K78283j182751r32309M61744J017197K44838m20895k6693P03528
41810C486502Q35183M65458J02250l9863J79130O69651N97367p28442k279521
41801C287715k102054j34028J313082O71487p48519q66716J74678O05247j56932
41792B043960q67510m51154O70610J401016J217154L95020l99440n77031q1414
$$ plain form
41855 -2728547 -4563392 -5243835 -3638669 -1425986 -1155093 -2944460 -4831340 -5809354 -6480055
41846 -6480055 -6920498 -6207125 -4506978 -3556646 -4148868 -4832074 -4197945 -3030398 -2861575
41837 -2861575 -3449480 -3165716 -1375519 870955 2379187 3023118 3327283 3532852 3336486
41828 3336486 2344834 699198 -836913 -1600466 -1651453 -1286887 -281761 1567926 3343560
41819 3343560 3621843 2439092 1506783 1968527 2985724 3230562 2809667 2782974 3486502
41810 3486502 4321685 4787143 4889393 4849530 5028660 5698311 6295678 5567236 3287715
41801 3287715 1185661 1051633 2364715 3036202 2287683 1420967 1595645 2200892 2043960
41792 2043960 1176450 725296 1395906 2796922 4014076 4409096 4009656 3432625 3351211
41783C351211N37237P11323M01055j16244o67266j068960r64991k65401M94789
41774B412753P35384N97530O39224Q99278Q26214J86356m64298m73213N334J21994
41764E486556n97666j483837j338812N2766J407988J400062L66195j64601L88988
41755E517639R23994L90356o73677j088105q06328p12952r79269p73410K37195
41746B035443J090140P86503k48348o53851P5957R03650N58238q24485j811462
41737A911785j427322l30615J15473l91266q74899n41729K84890Q76142J006005
41728F28464P45028M5709q43328j134340m71566K74268Q8827n90742m21207P53023
41718i25864J517242R05720k85344q08115o43792m90510k82027O05866J891709
$$ plain form
41783 3351211 3888448 4599771 5000826 4884582 4217316 3148356 2183365 1917964 2412753
41774 2412753 3148137 3745667 4384891 5284169 6110383 6296739 5832441 5359228 5364562 5486556
41764 5486556 4888890 3405053 2066241 2119007 3526995 4927057 5293252 5128651 5517639
41755 5517639 6441633 6831989 6158312 5070207 4263879 3550927 2571658 1798248 2035443
41746 2035443 3125583 3912086 3663738 3009887 3085844 3989494 4547732 3723247 1911785
41737 1911785 484463 153848 269321 -121945 -996844 -1538573 -1253683 -377541 628464
41728 628464 1373492 1419201 575873 -558467 -1030033 -755765 -666938 -1257680 -1678887 -925864
41718 -925864 591378 1497098 1211754 403639 -240153 -730663 -1012690 -406824 1484885
41709A484885K300528J196360n29699j567931j544573q78391P5935J072758J531428
41700C141300Q74962n78959j629948j376624j30074J008762J265660P59055J60072
41691C494206l8555R195k61582j003962j500696r32631L68173J008726K30669
41682A373543r63645r59456M60551J907346K115917J228746K53553j33731L6176
41673E319000L55988L76137p8488o24370o27511m7568L63814L6423n89806o57210
41663C826409m8355N73807P17124M67903J7238n43559q34510l09021Q42574J500004
41653F209614R13692j96984n37015J1098L53151r1254n48559j64261O65199R10179
41643G524860L57542l12513o03652n88343l82439l5668R7052l03485p54874m08926
$$ plain form
41709 1484885 3785413 4981773 4452074 2884143 1339570 461179 537114 1609872 3141300
41700 3141300 4016262 3437303 1807355 430731 300657 1309419 2575079 3334134 3494206
41691 3494206 3455651 3464846 3203264 2199302 698606 -234025 134148 1142874 1373543
41682 1373543 409898 -549558 -89007 1818339 3934256 5163002 5416555 5282824 5319000
41673 5319000 5674988 6051125 5972637 5348267 4720756 4673188 5037002 5073425 4483619 3826409
41663 3826409 3778054 4351861 5068985 5536888 5554126 5010567 4176057 3867036 4709610 6209614
41653 6209614 7123306 6926322 6389307 6400405 6753556 6662302 6113743 5949482 6614681 7524860
41643 7524860 7882402 7569889 6966237 6377894 5995455 5959787 6056839 5753354 4998480 4589554
41633D589554N99333J176504R20061O86052R88725R59334j89476j606818j880264
41624F243005j008807q7445M35718Q41439Q82585J0032j187561j321672k33106
41615D574188P27080P86448O78127R49980Q58041j18660r67757n99259L19027
41606G207215L32928n71561j063292n42781J36366J15568l26409m37383j42301
41597D708350n0836m87957q63331k95779J056217J797680J048298o9270J77646
41588G021018J452324J643738J28544j112340n80830L71902j06599j180361p09604
41579F927792J061020J690689K67284j423380j823484j551818j643376j703491
41571A801236r90343K6076M69045N24681R32420J585304J671350R06258j46534
$$ plain form
41633 4589554 5188887 6365391 7285452 7971504 8960229 9919563 9730087 8123269 6243005
41624 6243005 5234198 5146753 5582471 6423910 7306495 7316527 6128966 4807294 4574188
41615 4574188 5301268 6087716 6765843 7715823 8573864 8455204 7487447 6888188 7207215
41606 7207215 7540143 6968582 5905290 5362509 5498875 5614443 5288034 4850651 4708350
41597 4708350 4657514 4169557 3306226 3010447 4066664 5864344 6912642 6843372 7021018
41588 7021018 8473342 10117080 10245624 9133284 8552454 8924356 8817757 7637396 6927792
41579 6927792 7988812 9679501 9946785 8523405 6699921 5148103 3504727 1801236
41571 1801236 810893 836969 1306014 1830695 2763115 4348419 6019769 6926027 6779493
41562F779493p93612p61801l03719r4532o33188j457100j474754m19816O48671
41553A489642P80484M24742N73612J108659R52072j89379j120483o16583Q62153
41544D264919J515543L54606j449965j872947n38153Q26191O49662o03150j403984
41535A742722j199214n43439J49048P91720R81055M56209n1895K39090O26674
41526C191970j16868j407821j379681M7363P38100l14950j326897o05080P97632
41517c76232R38088j4972m57690O5937P64776J251942J552468J151859k25709
41508D650467j437132j216902j72077K05912r051L65765J113652P86505n70699
41499C716440j115710j47531P00866O0310j142323j315203m51358L84562P14504
$$ plain form
41562 6779493 5985881 5224080 4920361 4825829 4192641 2735541 1260787 840971 1489642
41553 1489642 2270126 2694868 3268480 4377139 5329211 5139832 4019349 3402766 4264919
41544 4264919 5780462 6135068 4685103 2812156 2274003 3100194 3749856 3146706 1742722
41535 1742722 543508 69 149117 940837 1921892 2378101 2326206 2565296 3191970
41526 3191970 3075102 1667281 287600 334963 1073063 758113 -568784 -1173864 -376232
41517 -376232 561856 546884 89194 155131 919907 2171849 3724317 4876176 4650467
41508 4650467 3213335 1996433 1824356 2030268 2021217 2386982 3500634 4287139 3716440
41499 3716440 2600730 2453199 3154065 3214375 2072052 756849 305491 690053 1404557
41490A404557O73389K00544p37603j591930j652187p52338O54841J591380Q73419
41481F64072j515179l366128k186151J335650L552330K433863J19074m27910M98171
41472A107792N98061n04392j130586o97842l92984o80272n52783K77936O56846
41463a318224K20563L05294J513469K245822J160580m68399o87338K1219l05975
41454B687011j697159k123448q25880M82993M13128m9675N38203J588789J445867
41445B459829n203j216175j141421k69910L84613K95493m61501j164578p08359
41436a827212J038727K323164J257437j445365k917826j721214M42535J309699
41428a540055R33492Q13399J264541J220358J93945j001443j473625j157041m71686
$$ plain form
41490 1404557 2077946 2278490 1540887 -51043 -1703230 -2455568 -1800727 -209347 664072
41481 664072 -851107 -4217235 -6403386 -5067736 -1515406 918457 1037531 609621 1107792
41472 1107792 1705853 1201461 70875 -626967 -1019951 -1700223 -2253006 -1975070 -1318224
41463 -1318224 -1097661 -792367 721102 2966924 4127504 3659105 2971767 2992986 2687011
41454 2687011 989852 -1133596 -1959476 -1476483 -1063355 -1113030 -574827 1013962 2459829
41445 2459829 2454626 1238451 97030 -172880 211733 507226 45725 -1118853 -1827212
41436 -1827212 -788485 1534679 2792116 1346751 -1571075 -3292289 -2849754 -1540055
41428 -1540055 -606563 206836 1471377 2691735 2885680 1884237 410612 -746429 -1218115
41419a218115J37228L43553K17078J86372K86601l7428q05566j005620j78193
41410b074090M15936l67945j356094o06741J257116J577369k34545j496028j26615
41401c011637K310631K910035J269741o14403j297031j042846n58975j05544J94770
41392E4741K56217K79700M30899M28780j0468o33896j038543j160688r44842j67749
41382b505849Q61333J192518N48356l8134K59238P37774M03868k92773k82648
41373H83683K14720J18085n71698q40315n11112m11670o37943l11203N95354Q27599
41363f44500o3640o73803J97281J550625J454797l39799k164792k494664j337771
41354d516266K56512J281247J350769Q16533M72728Q22863J524719J724445R86886
$$ plain form
41419 -1218115 -1080887 -737334 -520256 -333884 -47283 -84711 -890277 -1895897 -2074090
41410 -2074090 -1658154 -2026099 -3382193 -3988934 -2731818 -1154449 -1388994 -2885022 -3011637
41401 -3011637 -701006 2209029 3478770 2864367 1567336 524490 -34485 -140029 54741
41392 54741 310958 590658 1021557 1450337 1439869 805973 -232570 -1393258 -2338100 -2505849
41382 -2505849 -1644516 -451998 96358 58224 317462 1055236 1459104 1166331 883683
41373 883683 1098403 1216488 644790 -195525 -706637 -1118307 -1756250 -2067453 -1472099 -644500
41363 -644500 -708140 -1381943 -1184662 365963 1820760 1480961 -683831 -3178495 -4516266
41354 -4516266 -4259754 -2978507 -1627738 -811205 -338477 484386 2009105 3733550 4720436
41345D720436j89533q28916m76872L03991O20699L84159K91837N33028K39968
41336E598797j157819k658827k724510j278641K87929R05072O43032j2662n33514
41327i31143j67904J196526K001517N51306k111080k822234o39647J473273P98996
41318f50390j188421j254338O19795J552099N29231k62250O10608J452014M73905
41309A882253j077662r12239O38786J247009K26912o98117l25317L20147j35948
41300A165824j310840j807160j158972r4207O15724P35376L22098l03450m46528
41291b282135L87922J670673K104961R88130r06394k029696j580807k07467Q03618
41282a051195Q75106M67820J26156k74223r26103j267463o80038J52189k03469
$$ plain form
41345 4720436 4530903 3701987 3225115 3529106 4149805 4533964 4825801 5358829 5598797
41336 5598797 4440978 1782151 -942359 -2221000 -1933071 -1027999 -384967 -397629 -931143
41327 -931143 -1099047 97479 2098996 2650302 539222 -2283012 -2922659 -1449386 -650390
41318 -650390 -1838811 -3093149 -2473354 -921255 -392024 -654274 -43666 1408348 1882253
41309 1882253 804591 -107648 531138 1778147 2005059 1306942 981625 1301772 1165824
41300 1165824 -145016 -1952176 -3111148 -3205355 -2589631 -1854255 -1532157 -1835607 -2282135
41291 -2282135 -1894213 -223540 1881421 2869551 1963157 -66539 -1647346 -1854813 -1051195
41282 -1051195 -176089 291731 417887 143664 -782439 -2049902 -2729940 -2577751 -2781220
41273b781220j681288k291048p86789J337915J789548O15678j68184K90071O90277
41264b985040p3205j169990j111618K80442J784849J979091L67499j875068k429620
41255e232660l39627K169674K088383j52239j115384M89208J872205Q09910o51384
41246f1914L00189K351578K081867n01450k137682j517650o29278p34080o30452
41237a478872K16621K38144j064548j533778J22054J786642J143697o94383j178830
41228b443253k31432L87030K83466L43512L58520n15511j391954m93257J599969
41219b102910K146631K34764j720800j390321M56078J510100J025112J6797o51227
41210d75776r95456j116192q04156k2830Q14282J194356R52247L73508j20697
$$ plain form
41273 -2781220 -4462508 -6753556 -7540345 -6202430 -4412882 -3797204 -3965388 -3675317 -2985040
41264 -2985040 -3058245 -4228235 -5339853 -5059411 -3274562 -1295471 -927972 -2803040 -5232660
41255 -5232660 -5572287 -3402613 -1314230 -1466469 -2581853 -2092645 -220440 589470 -61914
41246 -61914 238275 2589853 4671720 4170270 2032588 514938 -114340 -848420 -1478872
41237 -1478872 -1262251 -1024107 -2088655 -3622433 -3500379 -1713737 -570040 -1264423 -2443253
41228 -2443253 -2674685 -2287655 -2004189 -1660677 -1302157 -1817668 -3209622 -3702879 -2102910
41219 -2102910 43721 278485 -1442315 -2832636 -2376558 -866458 158654 175451 -475776
41210 -475776 -1471232 -2587424 -3391580 -3414410 -2600128 -1405772 -453525 -80017 -200714
41201b00714m26804p33294r64231o95206L9905M25324k0031n37477k15373M78476
41191b849425L93699l25952l30417P49583J594883J192220L10632J61205N23525
41182A419953K65160p58160j371075o63368P62013J353228K53587j670419k550554
41173b959635j489348L89127J340192J174257J105313J483559J091579o18182
41165A516862j959333j153735P32823Q55506j393193l269938k325790L58579J885670
41156d752549J420652N85051L94285o5494j304588j716331J97107K958611L453696
41147A170440J002354j666603j918908k12431J163649J131078M99397L25191P45544
41138B239711J211640J045864r5987j684226k428320j562459P5892P81228k13758
$$ plain form
41201 -200714 -627518 -1360812 -2325043 -3020249 -2980344 -2555020 -2575051 -3112528 -3327901 -2849425
41191 -2849425 -2455726 -2781678 -3112095 -2362512 -767629 424591 735223 896428 1419953
41182 1419953 1685113 926953 -444122 -1107490 -345477 1007751 1261338 -409081 -2959635
41173 -2959635 -4448983 -4059856 -2719664 -1545407 -440094 1043465 2135044 1516862
41165 1516862 -442471 -1596206 -863383 -7877 -1401070 -4671008 -6996798 -6638219 -4752549
41156 -4752549 -3331897 -2746846 -2352561 -2418055 -3722643 -5438974 -5241867 -2283256 1170440
41147 1170440 2172794 506191 -1412717 -1625148 -461499 669579 1168976 1494167 2239711
41138 2239711 3451351 4497215 4401228 2717002 288682 -1273777 -1197885 -416657 -630415
41129f30415j956937k683307j383915J176092K897380K357825N24698l07897N20522
41120E14046J260758M47463j000650j447959j050229j038272j402627j132412
41112d849882l11893j05763p07897j017117n08979J16748L81850O46792R57506
41103e398635O65122l40825j163991j057705j46047J029381J668766P75411j423347
41094e391870k484665k72382L530239M854743K622111K5069m55768l36363j620694
41085D70420k853326j574640J179527K137661O82821o44274l33800K86109j68765
41076h18267j005714r70110j28696O55049R40246P62140L24619l7659k53919p47734
41066a280045j517578j540159k73818R18470N18945n19290r214J834322K481567
$$ plain form
41129 -630415 -2587352 -5270659 -6654574 -5478482 -2581102 -223277 301421 -6476 514046
41120 514046 1774804 2222267 1221617 -226342 -1276571 -2314843 -3717470 -4849882
41112 -4849882 -5161775 -5267538 -5975435 -6992552 -7501531 -7384783 -7002933 -6356141 -5398635
41103 -5398635 -4733513 -5074338 -6238329 -7296034 -7442081 -6412700 -4743934 -3968523 -5391870
41094 -5391870 -7876535 -8148917 -4618678 236065 2858176 2883245 2427477 2091114 470420
41085 470420 -2382906 -3957546 -2778019 -640358 42463 -601811 -935611 -649502 -818267
41076 -818267 -1823981 -2794091 -2922787 -2267738 -1327492 -565352 -240733 -278392 -532311 -1280045
41066 -1280045 -2797623 -4337782 -4611600 -3693130 -3174185 -3693475 -3702689 -1868367 613200
41057F13200J120922m6893M98859J178320J72635j514963j933606j391618j430621
41048b733765j811213j048910O85589J670562J435515J153781J195669O04113
41040A151341n90569q29170L32793J114069K85135p45636k05522J140791J238313
41031B891545r1014j193773j231769q26952l13396O64608J681457J567784L72095
41022C520585m36382k79164k29877p36899n45953Q30183J467863k13187k500920
41013H76249k521381m19137J078900Q34273L70625O51420N06898q39566k026341
41004a488060j720885p54018n77077r26786n43597P41372J998889K549852K218780
40995A498470J015926m08759q45464j10135L55829m23523j306982q41851L01088
$$ plain form
41057 613200 1734122 1687229 2186088 3364408 3537043 2022080 88474 -1303144 -2733765
41048 -2733765 -4544978 -5593888 -4908299 -3237737 -1802222 -648441 547228 1151341
41040 1151341 560772 -268398 64395 1178464 1463599 717963 512441 1653232 2891545
41031 2891545 2800531 1606758 374989 -451963 -765359 -100751 1580706 3148490 3520585
41022 3520585 3084203 2805039 2575162 1838263 1292310 2122493 3590356 3377169 876249
41013 876249 -1645132 -2064269 -985369 -151096 219529 870949 1377847 538281 -1488060
41004 -1488060 -3208945 -3962963 -4540040 -5466826 -6010423 -5269051 -3270162 -720310 1498470
40995 1498470 2514396 2105637 1260173 1150038 1505867 1082344 -224638 -1066489 -765401
40986g65401M21346m27262o80805O6523O12357M00857L66756J123194J879040
40977B996605J780946J120501N59295P8509o67819j552573k006422j568548l30884
40968D09610R18497J267121P62859M23497O79482O11076m64154j601015j603200
40959A403773q60313l49486K44484J519745K272565Q10990j930284l100534j911079
40950a900139m40294r6751R0325Q33658R41464j95435p82139P54315K983374L303197
40940E491575J404336q48341k027110j995595r98341M47513J266763Q23227j53029
40931C410998o07906n42798m96938m91156m47277p43233j323693j246700k11383
40922b700086N62979K23525j59453N68880J459755R72219l19208o30348J02200
$$ plain form
40986 -765401 -344055 -771317 -1452122 -1385599 -773242 -372385 -5629 1117565 2996605
40977 2996605 4777551 5898052 6457347 6535856 5868037 4315464 2309042 740494 409610
40968 409610 1328107 2595228 3358087 3781584 4461066 5072142 4607988 3006973 1403773
40959 1403773 543460 193974 438458 1958203 4230768 5041758 3111474 10940 -1900139
40950 -1900139 -2340433 -2437184 -2346859 -1513201 -571737 -767172 -1549311 -794996 2188378 5491575
40940 5491575 6895911 6047570 4020460 2024865 1026524 1474037 2740800 3564027 3410998
40931 3410998 2803092 2260294 1763356 1272200 824923 81690 -1242003 -2488703 -2700086
40922 -2700086 -2137107 -1913582 -2073035 -1504155 -44400 927819 608611 -21737 80463
40913H0463L93249r7289k90881L1891l8753l85293K64772J773998K090638K82497
40903D105292j757764j867332m57770N03047K93306j61999r2312K18991K54902
40894A038361Q2671J55858O70373J237379J177875K46674j003343j769923j786776
40885D9149j367327r26997p14874o76354l47458N89599J411011Q77109q53120
40876a959262j911661j177094R4571K72403j91529P8255Q00669O82173N835L04713
$$ plain form
40913 80463 473712 376423 85542 117433 78680 -306613 -41841 1732157 3822795 4105292
40903 4105292 2347528 480196 22426 525473 818779 656780 564468 783459 1038361
40894 1038361 1121032 1276890 1947263 3184642 4362517 4609191 3605848 1835925 49149
40885 49149 -1318178 -2245175 -2960049 -3636403 -3983861 -3394262 -1983251 -1106142 -1959262
40876 -1959262 -3870923 -5048017 -4953446 -4681043 -4872572 -4794317 -3993648 -3311475 -3305640 -3000927
$$ [...]
##END NTUPLES=NMR SPECTRUM
##END=
