##TITLE=31Pdec_DE-94_oil
 CDCl3, 64 sc
 7.5.2025
##JCAMPDX= 6.0         $$ Bruker NMR JCAMP-DX V2.0
##DATA TYPE= NMR SPECTRUM
##DATA CLASS= NTUPLES
##ORIGIN= UXNMR, Bruker Analytische Messtechnik GmbH
##OWNER= root
$$ XWIN-NMR		Version 3.5
$$ Wed May  7 14:12:14 2025 Russian Standard Time (UT+4h)  she@DPX200
##.OBSERVE FREQUENCY= 81.013821
##.OBSERVE NUCLEUS= ^31P
##.ACQUISITION MODE= SIMULTANEOUS
##.ACQUISITION SCHEME= undefined
##.AVERAGES= 64
##.DIGITISER RES= 17
##SPECTROMETER/DATA SYSTEM= spect
##.PULSE SEQUENCE= zgpg30
##.SOLVENT NAME= D2O
##.SHIFT REFERENCE= (INTERNAL, D2O, 0, 198.062)
##AUDIT TRAIL= $$ (NUMBER, WHEN, WHO, WHERE, WHAT)
$$ ##TITLE= Audit trail, XWIN-NMR		Version 3.5
$$ ##JCAMPDX= 5.01
$$ ##ORIGIN= Bruker BioSpin GmbH
$$ ##OWNER= she
$$ F:/spectra/data/she/nmr/P31/2/pdata/1/auditp.txt
$$ ##AUDIT TRAIL=  $$ (NUMBER, WHEN, WHO, WHERE, WHAT)
(   1,<2025-05-07 14:10:45.31 +0400>,<she>,<DPX200>,
      <created by zg, POWCHK disabled, PULCHK disabled
       configuration hash MD5:
       00 E9 B6 7A A2 85 ED C7 34 08 36 98 17 FE 4E 26
       data hash MD5: 32K
       12 85 32 85 76 53 C6 27 BD E8 4C EC 31 BF 79 5A>)
(   2,<2025-05-07 14:10:47.90 +0400>,<she>,<DPX200>,
      <Start of raw data processing
       efp BC_mod = 2 LB = 1.5 FT_mod = 6 PKNL = 1 PHC0 = 1370.305 PHC1 = 74.69341 SI = 64K 
       data hash MD5: 64K
       0B 96 74 7E 63 BF 4C F4 31 26 DF 77 1A 70 43 25>)
(   3,<2025-05-07 14:11:03.71 +0400>,<she>,<DPX200>,
      <pk PHC0 = 41.64027 PHC1 = 0 
       data hash MD5: 64K
       DF 68 D7 0E 1F 1D EF 60 77 5D 26 4F 94 46 89 E8>)
(   4,<2025-05-07 14:11:09.20 +0400>,<she>,<DPX200>,
      <abs ABSG = 5 
       data hash MD5: 64K
       90 21 4A D8 0E 05 84 4B 12 1E 41 5B 16 33 A0 96>)
(   5,<2025-05-07 14:11:36.04 +0400>,<she>,<DPX200>,
      <pk PHC0 = 132.7278 PHC1 = -353.6 
       data hash MD5: 64K
       CE A6 41 E5 07 C1 1C B5 8D 53 D8 24 C3 02 84 C3>)
(   6,<2025-05-07 14:11:40.04 +0400>,<she>,<DPX200>,
      <abs ABSG = 5 
       data hash MD5: 64K
       C2 3D DF 00 47 31 58 F4 04 66 CE 69 DF 26 6B 5D>)
(   7,<2025-05-07 14:11:45.73 +0400>,<she>,<DPX200>,
      <abs ABSG = 5 
       data hash MD5: 64K
       8D F8 9A 1E EF CB 07 EB BD C5 15 B4 8C B0 9F 5F>)
$$ ##END=
$$ 
$$ hash MD5
$$ D6 A2 C0 A3 5C F7 43 97 9A 24 12 3B 5C C8 AB 75
##$RELAX= 
##$RELAX= 
##$RELAX= 
##$RELAX= 
##$RELAX= 
##$RELAX= 
##$RELAX= 
##$RELAX= 
$$ Bruker specific parameters
$$ --------------------------
##$DU= <F:/spectra>
##$EXPNO= 2
##$NAME= <P31>
##$PROCNO= 1
##$TYPE= <nmr>
##$USER= <she>
##$AMP= (0..31)
100 100 100 100 100 100 100 100 100 100 100 100 100 100 100 100 100 100 
100 100 100 100 100 100 100 100 100 100 100 100 100 100 
##$AQSEQ= 0
##$AQ_mod= 1
##$AUNM= <au_zg>
##$AUTOPOS= <>
##$BF1= 81.014009
##$BF2= 200.13
##$BF3= 200.13
##$BF4= 200.13
##$BF5= 200.13
##$BF6= 200.13
##$BF7= 200.13
##$BF8= 200.13
##$BYTORDA= 1
##$CFDGTYP= 0
##$CFRGTYP= 5
##$CHEMSTR= <none>
##$CNST= (0..31)
$$ [...]
##$SUBNAM3= <"">
##$SUBNAM4= <"">
##$SUBNAM5= <"">
##$SUBNAM6= <"">
##$SUBNAM7= <"">
##$SUBNAM8= <"">
##$SUBNAM9= <"">
##$SW= 400.765351723535
##$SWIBOX= (0..15)
0 1 3 0 0 0 0 0 0 0 0 0 0 0 0 0 
##$SW_h= 32467.5324675325
##$TD= 32768
##$TD0= 1
##$TE= 0
##$TE2= 300
##$TE3= 300
##$TEG= 300
##$TL= (0..7)
0 120 53 12 22 120 120 120 
##$TP= (0..7)
150 150 150 150 150 150 150 150 
##$TP07= 0
##$TPNAME0= <>
##$TPNAME1= <>
##$TPNAME2= <>
##$TPNAME3= <>
##$TPNAME4= <>
##$TPNAME5= <>
##$TPNAME6= <>
##$TPNAME7= <>
##$TPOAL= (0..7)
0.5 0.5 0.5 0.5 0.5 0.5 0.5 0.5 
##$TPOFFS= (0..7)
0 0 0 0 0 0 0 0 
##$TUNHIN= 0
##$TUNHOUT= 0
##$TUNXOUT= 0
##$USERA1= <user>
##$USERA2= <user>
##$USERA3= <user>
##$USERA4= <user>
##$USERA5= <user>
##$V9= 5
##$VALIST= <valist>
##$VCLIST= <CCCCCCCCCCCCCCC>
##$VD= 0
##$VDLIST= <DDDDDDDDDDDDDDD>
##$VPLIST= <PPPPPPPPPPPPPPP>
##$VTLIST= <TTTTTTTTTTTTTTT>
##$WBST= 1024
##$WBSW= 4
##$XGAIN= (0..3)
0 0 0 0 
##$XL= 0
##$YL= 0
##$YMAX_a= 6119
##$YMIN_a= -31908
##$ZGOPTNS= <>
##$ZL1= 120
##$ZL2= 120
##$ZL3= 120
##$ZL4= 120
##$ABSF1= 198.0616
##$ABSF2= -202.7028
##$ABSG= 5
##$ABSL= 3
##$ALPHA= 0
##$AQORDER= 0
##$ASSFAC= 0
##$ASSFACI= 0
##$ASSFACX= 0
##$ASSWID= 0
##$AUNMP= <proc_1d>
##$AZFE= 0.1
##$AZFW= 0.5
##$BCFW= 0
##$BC_mod= 2
##$BYTORDP= 0
##$COROFFS= 0
##$CY= -3
##$DATMOD= 1
##$DC= 0
##$DFILT= <>
##$DTYPP= 0
##$F1P= 0
##$F2P= 0
##$FCOR= 1
##$FTSIZE= 65536
##$FT_mod= 6
##$GAMMA= 0
##$GB= 0
##$INTBC= 1
##$INTSCL= 9.790993e-09
##$ISEN= 30
##$LB= 1.5
##$LEV0= 0
##$LPBIN= 0
##$MAXI= 10000
##$MC2= 0
##$MEAN= 0
##$ME_mod= 0
##$MI= 50
##$NCOEF= 0
##$NC_proc= -8
##$NLEV= 6
##$NOISF1= 182.463
##$NOISF2= 159.3651
##$NSP= 0
##$NTH_PI= 0
##$NZP= 0
##$OFFSET= 198.0616
##$PC= 4
##$PHC0= 1544.673
##$PHC1= -278.9066
##$PH_mod= 1
##$PKNL= yes
##$PPARMOD= 0
##$PSCAL= 0
##$PSIGN= 0
##$REVERSE= no
##$SF= 81.0140089999434
##$SI= 65536
##$SIGF1= 159.3651
##$SIGF2= -187.1042
##$SINO= 113.3802
##$SIOLD= 16384
##$SREGLST= <1H.CDCl3>
##$SSB= 0
##$STSI= 65536
##$STSR= 0
##$SW_p= 32467.5324675325
##$SYMM= 0
##$S_DEV= 0
##$TDeff= 32768
##$TDoff= 0
##$TI= <>
##$TILT= no
##$TM1= 0
##$TM2= 0
##$TOPLEV= 0
##$USERP1= <user>
##$USERP2= <user>
##$USERP3= <user>
##$USERP4= <user>
##$USERP5= <user>
##$WDW= 1
##$XDIM= 65536
##$YMAX_p= 306901639
##$YMIN_p= -53613552
$$ End of Bruker specific parameters
$$ ---------------------------------
##NTUPLES= NMR SPECTRUM
##VAR_NAME=  FREQUENCY,     SPECTRUM/REAL,   SPECTRUM/IMAG
##SYMBOL=    X,             R,               I
##VAR_TYPE=  INDEPENDENT,   DEPENDENT,       DEPENDENT
##VAR_FORM=  AFFN,          ASDF,            ASDF
##VAR_DIM=   65536,         65536,           65536
##UNITS=     HZ,            ARBITRARY UNITS, ARBITRARY UNITS
##FACTOR=    0.49542278885378, 1,            1
##FIRST=     16045.7642231865, 0,            0
##LAST=      -16421.768244346, 0,            0
##MIN=       -16421.768244346, -53613552,    0
##MAX=       16045.7642231865, 306901639,    0
$$ Real data points
##PAGE= N=1
##DATA TABLE= (X++(R..R)), XYDATA
$$ [...]
9592 1709563 527788 -1234988 -2628941 -1380116 2310320 5029102 4465696 2174970
9584 2174970 816791 933930 1870080 3554140 5552910 6351285 5457790 4423335 4038925
9575 4038925 2670845 -460750 -2671165 -1491082 852770 203062 -3312376 -5581364
9567 -5581364 -4743761 -3332680 -3587574 -4157096 -3004069 -886523 74941 -363992 -670885
9558 -670885 -25053 818670 946748 685470 1412701 3918808 6869676 7651467 5500978
9549 5500978 2910627 2684392 4544165 6373194 7775515 9753349 11263058 9353851
9541 9353851 3546887 -2693021 -6102727 -6901351 -6727313 -5903364 -4663347 -4745360 -7078399
9532 -7078399 -9298411 -8236605 -4143295 -140009 1911257 2702462 3074581 2757055 1689848
9523 1689848 573536 -295504 -1199761 -1945331 -2277831 -3289362 -6325747 -10120525 -11228863
9514 -11228863 -8273832 -3850814 -1045068 78463 968558 1438504 459956 -916801 -294401
9505 -294401 2243733 3508800 1351764 -2421990 -4561980 -4385624 -3659502 -3362040 -2546399
9496 -2546399 -437452 2123517 3994594 5149457 5827296 5379906 3356307 1065458 310480
9487 310480 575767 -700977 -4379793 -7797315 -8010372 -5663754 -3887890 -3982696 -4179407
9478 -4179407 -2712505 -147274 2020942 3396033 4152913 3732448 1569206 -1429818 -3450438
9469 -3450438 -3633241 -2422037 -412414 1938749 3523947 2874055 -114652 -3450881 -4725613
9460 -4725613 -3413256 -1335670 -979528 -3278118 -6766756 -8995735 -8982593 -7997321 -7691370
9451 -7691370 -8077294 -8010501 -7015691 -5564260 -3984299 -2412177 -1586956 -2123044 -2914335
9442 -2914335 -1994385 565803 2409683 2296912 1766842 2055360 1428570 -1980501 -5990207
9433 -5990207 -6118211 -1483357 3829350 6018848 5777014 6021683 7526349 8753590 8755965
9424 8755965 8020414 6817090 4802718 2623755 2180180 4331964 7460841 9488213 10623611
9415 10623611 12632247 15496687 16571142 13959783 9402405 6237438 5217152 4271254
9407 4271254 2263818 630567 453493 157562 -2062447 -5061953 -6230340 -5312314 -4417064
9398 -4417064 -4520849 -4357824 -3119522 -2051054 -2432810 -3569542 -3791193 -2350067 405727
9389 405727 3691232 6444093 7791238 7939075 7742740 7145053 5278637 2451245 465403
9380 465403 240558 665530 775291 1458696 3578487 5751338 5840379 3971821 2398352
9371 2398352 2626262 3943635 4606887 3550516 1216448 -629125 -465392 1017718 1476311
9362 1476311 170552 -664336 1062466 4179320 6029962 6294406 6910771 8799292 10863046
9353 10863046 12035635 12196072 10986954 7830242 3634643 784473 737496 2707857 4882142
9344 4882142 5759561 4468713 1462857 -925698 -360070 2634598 5196561 5833835 5928674
9335 5928674 7136051 9190087 11096327 12606138 13275138 11767580 7855201 4078948
9327 4078948 3593400 6563094 9855049 10160408 6704266 1302405 -3354752 -5561995 -5395053
9318 -5395053 -3891511 -1675076 1140581 3967751 5728169 6067625 5724787 5424493 5172676
9309 5172676 4783297 4254454 3524932 2694847 2350403 2612437 2181627 -165940 -3299490
9300 -3299490 -4707340 -3760062 -2146713 -1109335 -493671 -596107 -2125177 -3780291 -3032156
9291 -3032156 -445011 100478 -2814714 -5608915 -5276052 -3931560 -4542415 -5526913 -3961092
9282 -3961092 -1500473 -1971672 -4697453 -5653738 -4531455 -5040719 -8047959 -10061124 -9542737
9273 -9542737 -9099998 -9485070 -7025871 -282495 5609789 5564208 1903907 486583 2156737
9264 2156737 3036657 1767843 1280463 3339010 5716626 5827021 4039038 2236538 1284162
9255 1284162 827369 51259 -1773893 -4215974 -5358031 -4110885 -2348434 -2670871 -4396585
9246 -4396585 -4281383 -1371746 1454085 1496777 -508013 -2076901 -1858836 217733 3679919
9237 3679919 7034274 8239733 7118427 5882963 5861430 5182113 1495522 -4185559 -8427470
9228 -8427470 -9527764 -8784049 -7955119 -7416421 -6948374 -6522736 -5622100 -2997922 2082636
9219 2082636 8819550 15293687 19384747 19538823 15790948 10369277 6410136 5549524 7052061
9210 7052061 9034224 9670477 7555536 2612242 -2774449 -5099677 -3395059 -482553
9202 -482553 596119 265138 875065 2493814 2834027 1505525 1518975 4934126 8940377
9193 8940377 8708364 3568118 -1913073 -3318007 -1056425 1105797 792267 -966201 -1801338
9184 -1801338 -804192 830579 1189767 -550000 -3274854 -4704135 -3255469 621957 4836179
9175 4836179 7216270 6837386 4437076 1998049 1524178 3394191 5689348 5675449 2455675
9166 2455675 -1876544 -4048227 -2789387 -156800 616866 -1233986 -2946079 -1504608
9158 -1504608 2191351 3693260 260371 -5322503 -7713801 -5448674 -2501538 -2820870
9150 -2820870 -5141737 -5010824 -1093308 2879229 2977206 -20257 -2121529 -1568527 -771033
9141 -771033 -2518018 -6001656 -7948361 -6900142 -4716213 -3722752 -3917646 -3846878 -3062684
9132 -3062684 -2214201 -1168510 1153420 4586327 6867337 6167299 3696045 2426844 3389817
9123 3389817 4482696 3274275 22138 -2712949 -2919371 -993408 1034883 1713715 1683327
9114 1683327 3099642 7234265 12482968 15263758 13371631 8161652 3026781 164565
9106 164565 -539132 -13169 1244608 2704044 3414922 3059899 2771758 3904203 6196912
9097 6196912 7983489 8108714 6829252 4878569 2672765 767574 81643 848216 1935487
9088 1935487 2103656 1637146 1868111 3280439 5089172 6728522 8595212 10837872 12468610
9079 12468610 12566946 11634050 10723118 9810258 8340885 7059425 7559074 9633426 10783957
9070 10783957 9412096 7124985 6378174 6900296 6495953 4910667 4366245 5682055 6322588
9061 6322588 3998749 492957 -461952 1595078 3212782 1756250 -1517102 -3959367
9053 -3959367 -5075028 -5969896 -6702487 -6342017 -5160246 -4583774 -4696947 -3770452 -1177668
9044 -1177668 867755 -9640 -2927263 -4727809 -3975644 -2172541 -846510 684584 3614908
9035 3614908 7049437 8680524 7710386 5787041 4873289 5092291 5056014 3830939 2168609
9026 2168609 1737915 3057302 4376268 3373411 258453 -1890371 -874048 1501548
9018 1501548 1694939 -682481 -2396066 -1262837 983512 1612263 682698 93704 257101
9009 257101 -6688 -829891 -812082 657950 2378339 3048886 2637960 1700723 628957
9000 628957 -60752 19773 124655 -1138546 -3767012 -5995067 -6527596 -5852835 -4637693
8991 -4637693 -2323593 1453186 5314893 7590766 8440737 8903580 8546724 6035623 1857151
8982 1857151 -1569542 -2968603 -3705588 -5391893 -7290523 -7206176 -4291746 -71494 3028892
8973 3028892 3644366 2256648 402507 -1026156 -2554753 -4672681 -5952416 -3943157
8965 -3943157 1637309 7791571 11149768 11180235 9767207 8524137 7645756 6788792 5747501
8956 5747501 4313413 2423466 482629 -1014042 -1849342 -1532185 774574 4594088 7201939
8947 7201939 6241688 3146491 1915126 4001602 6359770 5512752 1778086 -1962394 -4149336
8938 -4149336 -5229423 -5373751 -3815251 -602801 2687165 4479743 4381533 2620429 -584688
8929 -584688 -4645680 -8357387 -10449704 -10110534 -7260807 -3086394 34936 400615 -1003970
8920 -1003970 -1356364 880387 4504175 7277217 8057071 7167482 5893173 5884977 7762438
8911 7762438 9831958 9472149 6362108 3014531 1478198 1100320 596383 648769 2699794
8902 2699794 6292409 9515746 11417741 12166247 11394357 8506900 4665597 2506685 3277099
8893 3277099 5522348 7026124 6945700 5734406 4128287 2768984 1999215 1487795 502394
8884 502394 -1209875 -3088708 -4164958 -3540301 -1063752 1909499 3256105 2472202 1444612
8875 1444612 1758417 2341322 1288696 -1184557 -3637679 -6005471 -8558548 -9227346 -5581073
8866 -5581073 512277 3991024 3169533 1526192 1701803 1737168 -406179 -2433691 -1373454
8857 -1373454 1195160 1637073 162624 29844 1780945 2475932 759024 -1036508 -688460
8848 -688460 872316 1325206 -359882 -3772311 -7785468 -10773048 -11535159 -10414520 -8473917
8839 -8473917 -5984674 -3190056 -1751043 -3141639 -5940658 -7113397 -5892531 -4041560
8831 -4041560 -2491019 -498272 1777272 2939997 3151944 4206638 5951214 5738224 2742345
8822 2742345 -101681 6955 2663272 6528326 11479534 16427589 18302424 16241098
8814 16241098 14097827 15407151 18138108 18206626 16213997 16142926 18306782 18513888 14753905
8805 14753905 10336215 8806717 9143936 8098329 4995991 2130608 1711883 3984124
8797 3984124 7467987 9951881 9935113 7877247 5609020 4348974 3867738 3264738 1514082
8788 1514082 -2275291 -7536897 -11388187 -10939885 -6670362 -1893036 1165392 2886520
8780 2886520 3819081 3175778 709598 -1966398 -3279578 -3530273 -3782339 -4206653 -4426333
8771 -4426333 -4244248 -3254187 -1095327 1182902 1581889 -141894 -1849649 -2039234 -1700464
8762 -1700464 -1996852 -2080141 -882752 728017 1630436 2778048 5584619 9104217 11111467
8753 11111467 11166013 10440318 9346183 7678964 6396338 6608228 7117502 5711813 3032822
8744 3032822 2417064 5147302 8191083 7776053 3581710 -1508817 -4494805 -4496122 -3191417
8735 -3191417 -3441627 -6258961 -9076357 -8537896 -4936681 -1919052 -1675478 -2758295 -3158912
8726 -3158912 -2976842 -2961607 -2843790 -2597783 -3206119 -4554846 -4647195 -2727752 -1145477
8717 -1145477 -1952013 -3524821 -3071137 -891674 605338 820653 871223 575162 -1087930
8708 -1087930 -2854937 -2000253 1324857 3749950 3509658 2705974 3571914 5159170 5415719
8699 5415719 4403565 3548343 3254207 3094290 3197007 3712111 3751349 2465147 642304
8690 642304 -91458 706796 2090106 3058872 3151678 2173862 326310 -1617328 -2951673
8681 -2951673 -3629397 -3836258 -3499570 -2631339 -1565750 -495419 542278 1013051 286972
8672 286972 -931080 -926925 495573 1189865 -488379 -3240192 -4647416 -4444067 -4344155
8663 -4344155 -5286434 -6596910 -7658515 -8778101 -10168434 -11222153 -11145327 -9790303 -7950473
8654 -7950473 -7113808 -8190207 -9841447 -9068320 -4616922 956809 3881803 3192687 943685
8645 943685 -721053 -1010592 382494 3503001 7320716 10292111 11993074 13034925 13528648
8636 13528648 13090849 12312398 12592484 14171543 15575849 15282404 12967523 9237784 5325059
8627 5325059 2924961 3077566 5193632 7941445 10288204 10620559 6629092 -1346363 -8201988
8618 -8201988 -8905698 -5097662 -3017887 -4647269 -5363888 -1780293 2759243 3547223 1698917
8609 1698917 1966249 5566162 9169688 9958918 8209382 5373093 2655092 1355825 2051573
8600 2051573 3347388 3339958 2047290 740680 -319911 -1481780 -1970808 -1007883 15809
8591 15809 -876836 -2819199 -2928044 -552066 1866742 2402235 1769896 1586173 2673334
8582 2673334 5167776 7994400 8270485 4037432 -2030404 -4595739 -2179214 1118107
8574 1118107 1404810 -577755 -2372497 -3867565 -5739476 -6405701 -4078811 -687089 -304457
8565 -304457 -3627987 -6636500 -5286311 241442 6448422 10225419 11015363 10230040 9338472
8556 9338472 8594416 7596629 6724181 7098047 8866760 10481071 10212024 7679233 3645352
8547 3645352 -598498 -3320262 -3348257 -1814498 -1471125 -3272083 -5090161 -4955276 -3826445
8538 -3826445 -3473675 -3375909 -2184490 -992010 -2048996 -4517720 -4639742 -876245 3614231
8529 3614231 4809513 2294278 -1299870 -3768076 -4770809 -4784733 -4197763 -3349061 -2532048
8520 -2532048 -1771181 -857531 361041 1588184 1818922 28627 -3197980 -5338199 -4448006
8511 -4448006 -1719346 -128794 -637208 -1392830 -950776 -383022 -1272353 -3201278 -4493125
8502 -4493125 -4260217 -2478652 788860 4680041 6993926 6302729 4285171 4132009 6551260
8493 6551260 8970168 8950088 6837273 4560130 3324717 3297010 4191751 5036661 4384231
8484 4384231 2013874 -336835 -1167529 -1335001 -2400001 -3530880 -2293313 1333866 4123332
8475 4123332 3825240 2145083 1768556 2094725 421470 -3434544 -6576541 -7377163 -7743032
8466 -7743032 -9855110 -12739930 -13844814 -12648916 -10745050 -9105366 -7317703 -5400366
8458 -5400366 -4442192 -4940905 -5914691 -6292622 -6085150 -5547839 -4297549 -2281269 -873995
8449 -873995 -1724172 -4600496 -7418144 -8599264 -8576554 -8558029 -8536185 -7371119 -4681960
8440 -4681960 -1777212 -297036 -419798 -998209 -1298080 -1942480 -3924741 -7131321 -10205883
8431 -10205883 -11707577 -11147848 -9009867 -6047389 -2692141 860460 4086871 5983392
8423 5983392 5813275 3891087 1235371 -1494566 -4222380 -6611213 -7703349 -6855978 -4697411
8414 -4697411 -2737437 -2094774 -2651378 -3185436 -2404880 -427294 707359 -1175176 -5669197
8405 -5669197 -9628902 -10364970 -8388016 -6280090 -5514450 -5386684 -4572197 -2424879 1155191
8396 1155191 5694376 9516313 10308172 7178294 1586769 -4328975 -9645110 -14114217
8388 -14114217 -16578742 -15546122 -11570367 -7628179 -6137393 -6381534 -5975602 -4260424
8380 -4260424 -2661990 -1779805 -173278 2947371 5568031 5264056 2766769 1038652 1237990
8371 1237990 1899317 2155484 3138368 5212687 6239627 4429422 1301982 -221883 310734
8362 310734 843004 -26481 -1725103 -3274202 -4473056 -5469873 -6395657 -7353496 -7807632
8353 -7807632 -6487528 -3132796 272422 1567690 1263055 1603119 3152338 4281559 3924045
8344 3924045 2642381 714417 -2467443 -6222331 -7938218 -5986394 -1850158 1803792
8336 1803792 3880183 4642451 4140375 2197984 -935097 -4840268 -8755639 -10530349 -7726527
8327 -7726527 -1343041 3430228 2641900 -1314329 -2671356 159314 2882848 1448841
8319 1448841 -2889641 -5853187 -5455418 -3490972 -2908163 -5069475 -8897128 -11683246 -11299714
8310 -11299714 -8338459 -5414925 -3902185 -2625473 -702578 62630 -2193722 -5417818
8302 -5417818 -5325202 -1379880 1931732 1307262 -490889 1426915 6930104 11019934 10759643
8293 10759643 8565927 7710671 7766917 6650710 4857916 4769562 6756081 8684819 9038931
8284 9038931 8172338 6476688 3710138 699940 -504313 710730 2368227 2565820 1823543
8275 1823543 1395339 578301 -2288941 -6603917 -9302859 -8421499 -5592609 -4189349 -5616468
8266 -5616468 -8227365 -9646643 -9225586 -7798361 -5780259 -2718985 1131373 4028961
8258 4028961 4444122 2872834 1058698 -14830 -411117 -247267 196001 -156329 -2054728
8249 -2054728 -4292931 -4814117 -3431496 -1698494 -12686 2961128 7307796 10495253
8241 10495253 10329453 7625794 4564926 1921869 -453065 -1743934 -821801 1757620
8233 1757620 4096340 5050448 4764559 3571824 1691673 -200933 -1260018 -1300580 -719584
8224 -719584 -5902 106535 -1207659 -3697256 -5738681 -6029640 -4805686 -2760030 -113984
8215 -113984 2200064 2143947 -754050 -3644932 -3520666 -1229499 3571 -696317 -1317542
8206 -1317542 -815618 -498755 -1162178 -1664761 -1278484 -942296 -1007058 -142772 1906806 2683645
8196 2683645 321709 -3085195 -3942001 -2186982 -1343033 -3578125 -7029388 -8714304 -8192508
8187 -8192508 -7005163 -5708284 -3321289 369247 3615175 4605192 3568755 1997426
8179 1997426 522050 -1079354 -2231572 -1799995 -250233 268744 -1278563 -3639626 -5665093
8170 -5665093 -7701359 -9199681 -7488296 -1631428 4408398 5948649 3891005 3095437
8162 3095437 4887965 5459501 2420011 -1386368 -2606251 -2270631 -3157389 -5029691 -5784985
8153 -5784985 -5560821 -6287763 -7953361 -8441647 -7073395 -5713170 -5878174 -6692809 -6407464
8144 -6407464 -4654823 -2537287 -1168702 -554444 194977 1335854 1292970 -1913638 -7608201
8135 -7608201 -12240853 -13293943 -12125530 -11507948 -11527445 -9860613 -5515224 -344240 3106268
8126 3106268 3808387 2498272 1060811 1411012 3669241 5758781 6036521 5633205 6549008
8117 6549008 8195463 8077881 5591852 2676527 653700 -922593 -1863387 -830919 1473751
8108 1473751 1473310 -2743122 -8155577 -10567652 -10053812 -9972023 -11620045 -12859475 -11830215
8099 -11830215 -9274084 -6812055 -5227338 -4905613 -5698682 -5656899 -2271197 3733120 7937988
8090 7937988 7336110 4267965 3231169 4973083 6088354 3928085 -400537 -3945413
8082 -3945413 -4827589 -3001163 118367 2300815 2187893 718398 -278617 -747090 -1970926
8073 -1970926 -3685749 -4086372 -3186811 -3425642 -5672091 -7281942 -6023571 -3563039 -2704095
8064 -2704095 -3303457 -3703486 -4289081 -6225987 -8060445 -7399766 -5269089 -4853007 -6124361
8055 -6124361 -5889320 -3536460 -2323978 -3698724 -4640156 -2765965 -199205 377347 124627
8046 124627 1298103 2944963 2908027 1867364 1643902 1290979 -1094255 -3912518 -3700613
8037 -3700613 -747541 1178981 900695 1379265 4160897 6245998 4568898 601075 -1904527
8028 -1904527 -1606408 341970 3153142 6592442 9063462 8225225 4000204 -738855 -3206218
8019 -3206218 -3380809 -2947024 -2470466 -1014059 1392459 2547923 836825 -1571910 -512430
8010 -512430 4760392 10100616 11621859 10297647 9483880 9623301 8316511 4905570 1765353
8001 1765353 566651 -60104 -2001954 -4732476 -6200587 -5433064 -3177433 -749724 971106
7992 971106 1892242 2405824 2385586 822458 -2641087 -6255414 -7646361 -6653843 -5283823
7983 -5283823 -4853666 -4658455 -3545811 -1326529 1484688 3832836 4018683 1176612 -2983436
7974 -2983436 -5736779 -6841962 -8408949 -10909891 -11808281 -9285337 -5111278 -2226213
7966 -2226213 -1204395 -770386 -304160 78094 916225 2929449 5469365 6836711 6042331
7957 6042331 3502190 372580 -2211152 -3711490 -4396084 -4469648 -3168135 85860 3752331
7948 3752331 5221355 4150762 2833600 2704108 2715419 2090132 2083370 3286930 3574483
7939 3574483 1164972 -2009699 -2652792 -706896 930348 611880 -460532 -460927 1226391
7930 1226391 4106123 6873372 8040706 7587179 7104233 6982155 5070919 318056 -3933216
7921 -3933216 -3503853 584969 3163907 2001368 308224 1345189 3784565 4172023 1731901
7912 1731901 -1188791 -2181029 -884480 1066292 1360947 -819024 -3449022 -3543057 -754583
7903 -754583 2143114 2756193 1685924 1148689 2365377 5000549 7989766 10189198 11090108
7894 11090108 11302904 11488484 10877606 8229568 4276567 1448751 812287 1104175 1288958
7885 1288958 1943395 3126664 3084457 807578 -1736790 -1889411 210310 2236996 3044449
7876 3044449 3614911 4984918 6848676 8275117 8611840 7543719 5155200 2177896 -260231
7867 -260231 -1256292 -608323 807527 1179205 -710893 -3696076 -4931926 -2989016 538439
7858 538439 2941733 2990605 1267643 -780152 -1394760 572506 4227668 7107700 7944561
7849 7944561 7796247 7593906 6251192 2799889 -1082928 -2863867 -2631513 -2594510 -3553711
7840 -3553711 -4070054 -3115825 -1502896 -325525 336919 734687 840597 773708 672683
7831 672683 69840 -1348464 -2446532 -1725195 162370 785613 -683493 -2245567 -1997621
7822 -1997621 -524090 777197 2126079 4432831 6974941 7859745 6542641 4466753
7814 4466753 3218123 3081369 3364656 3250511 2352886 1162403 786557 1522769 2008384
7805 2008384 820070 -1210618 -1527523 982663 4445761 6196531 5574152 3732578 1536933
7796 1536933 -1023053 -3554408 -4835037 -4261008 -2921398 -2510858 -3447377 -4484354 -3968455
7787 -3968455 -1290224 2466544 5054879 4887422 2879053 1859387 3419449 5957537
7779 5957537 6805318 5604874 4129716 3229290 1991796 209630 -500978 820703 2580595
7770 2580595 2738681 1632836 1101011 1665022 2267236 2252128 1935667 1461385 640992 -127715
7760 -127715 -150844 372924 687373 928787 1982163 3867816 5403613 5505851 4004488
7751 4004488 1627248 137675 1431302 4745809 5890172 1914467 -4074941 -6034967
7743 -6034967 -2951279 31730 -743259 -2814915 -2654643 -1269534 -1302557 -1783195 -220348
7734 -220348 2097987 1758726 -645243 -879069 2186482 4689850 3711265 1106968 -144206
7725 -144206 156929 1146124 3238659 6230816 7719197 6243440 4042818 3937173 5107388
7716 5107388 4806714 2944576 1950331 2821809 4154974 4714044 4395854 3024860 794037
7707 794037 -457973 714609 2204296 533121 -3327214 -3884449 1573699 8680071 11225320
7698 11225320 8371682 4248857 2335624 3105661 5955011 10168565 13941489 15064473
7690 15064473 13279855 10400463 7832703 5444579 3010707 1130801 212203 -128291
7682 -128291 -131269 453971 1263456 1025532 -873022 -3374567 -5020559 -5589390 -5845053 -6212610
7672 -6212610 -6327489 -5541192 -3431653 -168156 3251677 5443138 5637513 4111453 1729364
7663 1729364 -447211 -1303504 -449110 871832 642276 -1564947 -3858453 -4289162 -3132574
7654 -3132574 -2238264 -2819548 -4710392 -7100694 -8871314 -8665581 -6020877 -2498541 -475295
7645 -475295 -431817 -387739 1477305 4437027 6119340 5261614 2793946 382116 -1297793
7636 -1297793 -2583534 -3720547 -4422913 -4579661 -4766762 -5498668 -6247452 -5982400 -4751700
7627 -4751700 -3834638 -3833438 -3427042 -943325 3220068 6692897 7558706 5939115 3324602
7618 3324602 1194110 232262 -30210 -867989 -2718675 -3885216 -2178093 1781249 4389801
7609 4389801 3192098 -7569 -1466914 -19781 2302093 3495495 3413610 2329698 -180933
7600 -180933 -3855021 -6618633 -6266223 -2843456 1480541 4544905 5610325 5215432 4484604
7591 4484604 4377188 4974197 5552411 5589074 5289428 4892746 4160154 2956287 1429458
7582 1429458 -993576 -5515889 -11577822 -15732830 -14957622 -10601246 -6906282 -5779492
7574 -5779492 -5414492 -4236009 -3225099 -3155274 -2502930 -431829 471302 -2466668 -7281344
7565 -7281344 -9247962 -6907613 -3036251 150500 3118377 5709067 5613811 2282522 -666644
7556 -666644 171246 3212208 4511638 3677884 3686075 5459109 6544228 5898284 6342547
7547 6342547 10124657 14534190 14729337 9826147 3644917 -218822 -1689382 -2318988 -2353844
7538 -2353844 -984674 1679551 4303889 5656378 5330452 3429323 530219 -1897970
7530 -1897970 -1887879 1504078 7006633 11697922 13068912 10909426 7321388 4697525 3650049
7521 3650049 3201692 2812366 3235761 4968515 7015606 8315066 9439425 11173507 11992546
7512 11992546 9379213 4063250 454126 1416417 4579132 5779595 4623432 4134698
7504 4134698 5748517 7475705 7144894 4936303 2012179 -1203242 -4290123 -6121756
7496 -6121756 -6256582 -5906541 -6293916 -6907193 -6519806 -5230668 -4285704 -4163180 -3814188
7487 -3814188 -1871839 1785368 5593160 7366874 6185482 3192346 79195 -2780432
7479 -2780432 -5639597 -7317677 -5782885 -1235869 3205332 4834338 3945254 2302077
7471 2302077 739488 -468151 -534411 708531 1691973 903729 -972325 -2280511 -2908793
7462 -2908793 -3850779 -4958251 -5001987 -3636602 -1694652 134548 1480658 1737494 943423
7453 943423 565171 1599760 2571799 1493058 -831481 -1905608 -1485319 -1539654 -2313038
7444 -2313038 -1720885 553201 1630560 -283112 -2963966 -3554973 -2569881 -2135442 -2044671
7435 -2044671 -281961 3447943 7146853 9079352 9021884 7403265 4978472 3031144 2250773
7426 2250773 1631452 -67076 -2112785 -2585867 -1087567 906718 2220137 2900409 3079224
7417 3079224 2662304 2373760 3403428 5478345 6738602 6129104 4541535 2892833 533843
7408 533843 -3268262 -7374539 -9737553 -9770465 -8486354 -6676809 -4387851 -2243253 -1775880
7399 -1775880 -3606219 -6139433 -7108428 -6181239 -5155643 -5460204 -6217663 -5261242 -1714070
7390 -1714070 2908897 6051974 6294910 4404095 2595525 2612560 4175726 5461211 5350238
7381 5350238 4731430 4971608 5673798 5202149 3361525 2048080 2626984 3949223 3985718
7372 3985718 2423262 341163 -1922040 -4814778 -7555085 -7925189 -4969500 -739598
7364 -739598 1830239 2282415 2781091 5058285 8327214 10551204 10822449 9708383 7888292
7355 7888292 5645415 3682155 3167937 4342618 5960466 6963286 8014433 10269274
7347 10269274 12994000 13694416 10829983 5561595 611913 -2034906 -2424481 -2369678 -3684123
7338 -3684123 -5835806 -5875668 -2142209 2348448 2390141 -3055641 -9150209 -10914385 -8657130
7329 -8657130 -6082120 -4927092 -4015721 -2564573 -1503738 -1400268 -1466078 -1185773 -974186
7320 -974186 -576199 1214513 4118466 5404842 3092208 -964743 -3162596 -2922127 -3260713
7311 -3260713 -6120190 -9092354 -8428357 -4392392 -1574985 -3537657 -8687700 -12301478
7303 -12301478 -11414715 -6567377 44680 6058082 9010882 7529538 3466402 1112816
7295 1112816 2939646 7103258 10029375 10147919 7982290 4208186 -289607 -3379933
7287 -3379933 -3159693 -498136 1840987 2833190 4141956 7015007 10012892 10745627 8621107
7278 8621107 5010502 1720616 82677 504747 1944974 2624728 2168119 2195735 3747837
7269 3747837 5062600 3580056 -252685 -3152313 -3337155 -2776111 -3926836 -5777575 -5199894
7260 -5199894 -1757158 1083643 151320 -3759929 -7515747 -9546242 -10533111 -11059246 -10578360
7251 -10578360 -8806402 -6468599 -4093061 -1260571 2207506 5048627 5255333 1886709
7243 1886709 -3706139 -8134587 -8117183 -3504875 2132925 5120906 5510869 5952629 7435777
7234 7435777 8415796 8000196 7219823 6526336 4866847 2488724 1906334 4198040 6696240
7225 6696240 6525883 4437396 2929229 2562283 2607415 3401443 5154403 6054764 4703211
7216 4703211 3043288 3514691 4533502 2650509 -1511031 -3614482 -1886921 1018346
7208 1018346 2881493 4541828 6529148 6936936 4611412 1568657 366564 1310153 3544478
7199 3544478 6484505 8913058 9195902 7731554 6741492 6579502 5250369 2891895 3042474
7190 3042474 7023284 10496534 8948485 3966992 522056 177784 814007 1320602 2253008
7181 2253008 2702039 931499 -1775638 -2003592 260327 684555 -3295849 -8525534 -10378108
7172 -10378108 -8664701 -6838888 -6678048 -6451097 -4303173 -1221252 389086 -109988 -1203002
7163 -1203002 -1681951 -1913942 -2110073 -961341 2334389 5721633 6343050 4749465 4442448
7154 4442448 6702178 8572965 7272307 4149143 2427421 3017310 4568153 5911329
7146 5911329 6265951 4614398 1359348 -593415 1022003 4357405 5433037 2900478
7138 2900478 -1361634 -5499707 -8896467 -10685434 -9943423 -7554570 -5501312 -4034476
7130 -4034476 -1673466 1776027 4387891 4794353 3816884 2833954 2082658 1159698 22835
7121 22835 -866268 -548414 2086977 6951193 12152879 15720739 17124147 16087377 11640963
7112 11640963 4506735 -1256229 -2211448 -320848 -351215 -2928496 -3994563 -1461935 1684651
7103 1684651 2282786 1319151 1276406 2155190 2682976 3288455 5134504 7385004 7744782
7094 7744782 5219474 923166 -3201108 -5447691 -5103424 -3282202 -2308848 -3457427 -5917496
7085 -5917496 -8214046 -9426943 -8753051 -5612467 -1047986 2455116 3491894 2906751 1864763
7076 1864763 288636 -1934343 -3687647 -3741399 -2247805 -464992 170066 -1371173 -4647716
7067 -4647716 -7176797 -6575526 -3411354 -222709 2011469 4042330 5351036 4413642 2424360
7058 2424360 2853583 5850791 6972251 3761105 -67524 -47460 2637993 3824642 2875486
7049 2875486 2401317 3128031 3228700 2087505 1035955 555874 -60315 -299685 1476887
7040 1476887 5358180 9581615 12908950 15351609 16792834 16740054 15092364 11665452 5922442
7031 5922442 -1146368 -6304608 -7415261 -6117705 -4926291 -3538701 -960756 776845
7023 776845 -871760 -3993434 -4215635 -1188000 1331856 1645868 1628912 1726280 -439493
7014 -439493 -4916612 -7543529 -5666348 -2108025 -968766 -2488400 -4362921 -5321641 -4995519
7005 -4995519 -2727338 1038242 4122104 5295177 5631776 5722298 4163659 708356 -1920384
6996 -1920384 -1856682 -1182831 -2379811 -3959473 -2790227 974871 4494599 6474780 7787548
6987 7787548 8901346 9567803 10224154 11072338 10707994 8324746 6209068 7047975 9657092
6978 9657092 10701230 10089877 10953108 14048077 15893971 13653682 8922075 5147004 3568231
6969 3568231 3321854 3807550 5117833 6856982 7801438 6666778 3092445 -1619879 -4966843
6960 -4966843 -5330296 -3487313 -1375352 38960 807187 1032726 1338157 3155279 6577208
6951 6577208 8980127 8210725 6251626 6823083 9939874 12186319 12188626 11940938 12127768
6942 12127768 10317777 5568147 1125704 8401 776556 398887 -1017856 -1132964 831133
6933 831133 3736977 6286127 6787548 3210311 -3644276 -8847330 -8575447 -5326484 -4435371
6924 -4435371 -6458410 -6972666 -3616553 762175 2570679 1498082 -854527 -3153302
6916 -3153302 -4010582 -2460238 -60375 192610 -1723401 -2427507 -561207 653480 -1359399
6907 -1359399 -3829047 -2528924 1804960 4753739 4710467 4190654 4934642 5534982 4734487
6898 4734487 3826196 4138741 4397021 2506061 -1244448 -4358252 -4957942 -3363678 -1238184
6889 -1238184 810 37196 -513391 -905496 -767286 122918 1828533 3489924 3393821
6880 3393821 895474 -2264436 -3808985 -3675441 -3506863 -3777354 -3284496 -1622145 -181889
6871 -181889 -9521 -401637 -614633 -1420397 -3643574 -6333328 -7892620 -8267657 -8478644
6862 -8478644 -8347419 -6305618 -1831310 3015334 5316908 4415740 2789389 3423216 6399624
6853 6399624 8822531 8514931 6770850 6232612 6859502 5994579 2396419 -1927623 -4537779
6844 -4537779 -5327877 -5572546 -5950607 -6658623 -7903797 -8958162 -8141716 -5148139 -2057492
6835 -2057492 -618154 30442 1280215 2278615 1444951 -436871 -1136401 -262959 809986
6826 809986 1752393 3416833 5411933 6221092 5941801 6402431 8149867 9702570 10276740
6817 10276740 10777422 11336850 10428138 7670421 5206928 4696008 4845902 3654832 1467129
6808 1467129 -28187 -478971 -586724 -135514 1651310 4214089 5903334 6136696 6061495
6799 6061495 6964236 8728051 9727043 7902387 2638874 -3844825 -7794944 -7378565 -4160306
6790 -4160306 -651088 2375698 5175181 7039770 6768723 4573812 2046689 500551
6782 500551 386888 1777354 4197757 6488750 8057074 9725554 12051225 13478347 11889472
6773 11889472 7693516 3596149 1328322 354773 -69349 420970 1852111 2959556 2935991
6764 2935991 2861985 3967053 5302385 4782978 2367152 601921 1400924 3374704 3496676
6755 3496676 1067508 -1329023 -1352301 -264728 -1420276 -5733911 -10192892 -11230720 -8282357
6746 -8282357 -3455850 892592 3221506 2782712 214418 -2410515 -3581086 -4032856 -5194508
6737 -5194508 -6544133 -6201707 -3916822 -1575471 -424423 490819 2436268 4949234 6603600
6728 6603600 6853127 6269353 5594948 5180866 4834711 3890326 2076353 441082 363645
6719 363645 1352427 1236555 -621135 -1721511 480683 4804098 7411911 6289855 2947637
6710 2947637 -233121 -2368996 -3240603 -2065445 1353686 5317507 7701119 8292599 8280764
6701 8280764 7844601 5973027 2703627 -329057 -2172635 -3655288 -5264315 -5677317 -3975453
6692 -3975453 -1887938 -1761855 -3185271 -3867143 -3351942 -3373099 -4498997 -4968263 -3483000
6683 -3483000 -994196 1007530 1960003 1414166 -830780 -2817988 -1323211 3698985 7974277
6674 7974277 8188614 6126893 5308794 5947287 6279428 6717283 8693326 10596625 9208623
6665 9208623 5074243 2360670 2830665 3790830 3037641 2022067 2245335 1908489 -1099118
6656 -1099118 -5151881 -6702811 -4883900 -1827877 811098 3342593 6152446 8165652
6648 8165652 7797901 4859576 1313609 9771 2040491 5305057 6475850 4388469
6640 4388469 674005 -2500733 -3872876 -2816007 93561 2252199 1411529 -598690
6632 -598690 591557 5567579 9432896 8271842 4289815 1885002 1396621 384975 -919962
6623 -919962 38117 2944810 4253715 2757198 1616123 3187626 5051537 3696433 70302
6614 70302 -1485980 789464 3704731 3165913 -1055778 -5559076 -7467583 -7153291 -6794271
6605 -6794271 -7366323 -8038287 -8096872 -8113437 -8798869 -9694148 -9672001 -8172869 -5506297 -2477664
6595 -2477664 63440 2043960 4594196 8500527 12113626 12507146 9391850 6057178
6587 6057178 5297607 6233063 6685561 6748666 7646968 8496962 7123403 3644858 593578
6578 593578 -607955 -1073363 -2189385 -3917346 -5582028 -6543309 -5881540 -3190313 57814
6569 57814 1634984 1332690 1013244 1692386 2283225 1600082 -10223 -1458658 -1932403
6560 -1932403 -979610 879678 1637735 -223812 -3101053 -3668341 -1205052 1670237 2981398
6551 2981398 3595328 4668963 5601725 5873026 6323502 6827940 5164515 512308 -4008380
6542 -4008380 -4942015 -3035853 -1461039 -990454 -173412 685923 -412250 -2885351 -3028920
6533 -3028920 802914 5233254 6008625 3223254 342041 -724538 -1214061 -2460391 -3523991
6524 -3523991 -2829306 -839107 441657 414219 777673 2682854 4225442 2567464 -1648133
6515 -1648133 -4042436 -1497822 4125768 8401882 9118855 7252071 4535975 2271248
6507 2271248 1931644 4435859 8374530 10880046 10923299 10158480 9865022 8892370 5989048
6498 5989048 2700159 1908011 3893756 5708686 4797133 1876174 -428945 -772510 51219
6489 51219 813414 1181129 1311569 1252735 1289608 2043987 3444009 4253177 3642320 2714969
6479 2714969 3124781 4429346 4521504 2905041 1573894 1735766 1646314 -559635 -3429670
6470 -3429670 -3986758 -2223405 -1197586 -2575170 -4595192 -5246310 -5185059 -5959822 -6956137
6461 -6956137 -6129954 -3168143 -91405 1401254 1841551 2761366 4395796 5321501 4205871
6452 4205871 1415602 -1351199 -2875471 -3436505 -3859931 -4094483 -3372952 -1469852 1049633
6443 1049633 3704960 6202509 7602808 6709243 3968293 1883516 2437105 4690948 5991393
6434 5991393 5174065 3559472 3016740 4072647 5842076 6785971 5494206 1836424 -2310593
6425 -2310593 -4430669 -3936895 -2576241 -1870100 -1226690 517211 2659040 3228305 1725389
6416 1725389 -261492 -1417663 -2289436 -3808054 -5363460 -5540358 -4299750 -3259853 -3738991
6407 -3738991 -5292129 -6316635 -5535148 -2847141 577060 2761589 2121611 -1155005 -4991272
6398 -4991272 -7063637 -6696255 -5128687 -4002171 -3648576 -2876211 -505852 2938805 5441099
6389 5441099 5625970 4272662 3191488 2978586 2783797 2253707 2502268 4418006 6768255
6380 6768255 7140316 4797258 1691190 157154 147715 -440315 -2754798 -5343092 -6251674
6371 -6251674 -5964973 -6689737 -8683267 -9206190 -6269968 -1912819 112776 -940177 -2546263
6362 -2546263 -3015425 -3384662 -4666939 -5559602 -4370215 -1780762 -134833 -692576 -2730601
6353 -2730601 -4823462 -6163416 -7069129 -8681293 -11547565 -14365553 -15226219 -14219874 -13157981
6344 -13157981 -12374401 -10102517 -6084346 -3181124 -3329255 -4245824 -3019851 -1099815 -2084983
6335 -2084983 -5557553 -7162420 -5007652 -2197686 -1925912 -3268938 -3513800 -2193485 -943674
6326 -943674 -1014701 -2517284 -4974289 -7498851 -9351079 -10728203 -11717335 -10594222 -5495357
6317 -5495357 1827938 6724213 7193136 5959195 5635311 5004195 2437277 -71293 289795
6308 289795 2522807 3793125 4430622 6714662 9443943 8412248 2965958 -2093516 -2814041
6299 -2814041 -1014589 -859443 -3120753 -5317215 -5923066 -5950307 -6896137 -8872830 -10668837
6290 -10668837 -10793554 -8860598 -6456169 -5855924 -7311049 -8541687 -7569826 -4989400 -2581303
6281 -2581303 -795729 1136488 3323598 4808645 4866608 3799674 2582589 2279882 3420841
6272 3420841 5363990 6720576 6921351 6724279 6569691 5365683 2078378 -2079133 -4504123
6263 -4504123 -4225282 -2852234 -2314648 -2713620 -2843895 -2028508 -802966 -121301 -321255
6254 -321255 -793937 -571024 660017 2256131 3585933 4994889 7144309 9425054 9907293
6245 9907293 7413308 3164470 -305078 -1763561 -2247016 -3393180 -5463710 -7438773
6237 -7438773 -8598629 -9212486 -9641928 -9581170 -8641639 -7089891 -5356558 -3295755 -867022
6228 -867022 665626 -526410 -4385071 -8131859 -8747896 -6041603 -2660587 -1177265 -1662771
6219 -1662771 -2171136 -1181977 801149 2101018 1941031 1079370 270446 -1049324 -3717165
6210 -3717165 -7057544 -9426864 -10513858 -11694483 -13557210 -14298402 -11659392 -5959051
6202 -5959051 -342792 1861938 -234111 -4555355 -7719058 -7751999 -5623552 -3717327 -2793808
6193 -2793808 -1476854 1004346 3063107 2760294 365249 -2364599 -4465387 -5905031
6185 -5905031 -6420068 -6030836 -6027393 -7345656 -8287258 -6189631 -1562856 1802258 1562817
6176 1562817 -579652 -2126210 -3400474 -6010542 -9285196 -10647243 -9001371 -5743193
6168 -5743193 -2595967 -287603 569321 -779111 -3806228 -6377273 -6924228 -6262749 -6326404
6159 -6326404 -7510814 -8225015 -7099200 -4845461 -3444221 -3742749 -4372210 -3248756 50049
6150 50049 3668414 5234893 4108015 1896015 875809 1876247 3682458 4655922 4828040
6141 4828040 5732923 7819286 8921025 6510499 1235216 -3166912 -3865929 -1796217 -10153
6132 -10153 -193307 -1653704 -3041427 -3947970 -4822714 -5988695 -7021769 -7176740 -6571653
6123 -6571653 -6521511 -7857355 -9166997 -8102405 -4725316 -1987130 -2040743 -3540403 -3851462
6114 -3851462 -2606975 -1367140 -745195 32003 1060726 1308300 388346 -875755 -1878196
6105 -1878196 -2691253 -2918315 -1807940 -44669 274669 -1501523 -2964930 -1115466 4110766
6096 4110766 9617112 12138697 11095233 8892844 8507416 10239585 11122810 8522868 3894262
6087 3894262 1262737 2073426 3834811 4436487 5091505 7301856 9399382 8961153 7238744
6078 7238744 7921694 11721761 15089677 14774603 11276558 7114603 3897560 2177049 2279161
6069 2279161 3737733 5012368 5026604 4241619 3483640 2845252 2591130 3676514 5894893
6060 5894893 6775397 4341654 302958 -1666862 -680799 530365 -148300 -1431865 -1127342
6051 -1127342 594064 2123562 3206582 4719198 6358491 6754279 5896389 5453851 6149316
6042 6149316 6469175 4789811 1472022 -1998127 -4708112 -6148004 -5550219 -2839225 437475
6033 437475 2439181 2831922 2245230 798069 -1340713 -2705397 -1887617 60361 643075
6024 643075 -514026 -1259994 -599651 -504026 -2766391 -5867750 -6697471 -4351630 -748637
6015 -748637 1757514 2117479 671440 -1274526 -2447385 -3013700 -4242325 -6084340 -6376049
6006 -6376049 -3630940 638857 3837247 5267178 5520285 4317493 1419078 -1193798
5998 -1193798 -905735 1799826 3681726 2941980 716656 -1704063 -4350129 -6630153 -6800726
5989 -6800726 -4773614 -3054348 -3220777 -3539316 -1957559 333652 490228 -2094074 -5529214
5980 -5529214 -8058873 -9011508 -8073963 -5749760 -3985023 -4334473 -5852619 -6572550 -6501589
5971 -6501589 -7031888 -7791786 -6658955 -3218444 212541 1790980 2222381 2593088 2239785
5962 2239785 421374 -1545107 -1922924 -1398539 -2087776 -3946643 -4318315 -1604876 2272062
5953 2272062 4124046 3241178 1800716 2049240 4176817 6915867 9195852 10731073 11577903
5944 11577903 11775139 11348367 10312688 8676436 6566054 4166287 1434444 -1728016
5936 -1728016 -4764653 -6501836 -6484914 -5724903 -5247238 -4456878 -2322684 69060 66784
5927 66784 -2839008 -5678054 -5652852 -3679356 -2536955 -2567631 -1599124 968903 2526240
5918 2526240 845695 -2369012 -3330451 -1091408 1028057 -525202 -5004512 -7886844
5910 -7886844 -5902809 -607693 3685714 4813662 4349283 4495810 5188817 5218938 4850216
5901 4850216 5615949 7813801 9583955 8762615 5124984 915243 -606183 2066059 6706969
5892 6706969 9111612 7769959 5676730 6175397 8404464 9069013 7640995 6762140 7698090
5883 7698090 8741513 8820574 9347444 10917212 11262893 8888057 6211982 6142511 7392398
5874 7392398 6553946 3619902 1709283 1601110 407361 -3456171 -7346914 -8111908 -6183819
5865 -6183819 -4020427 -2373600 -240386 2703712 5603850 7581930 7806956 5321971
5857 5321971 572545 -3677005 -4983942 -4348759 -4613417 -6041601 -6065012 -3865289 -2449831
5848 -2449831 -4561774 -8514048 -10168822 -7891243 -3547343 513373 3164846 3548029
5840 3548029 993045 -3317969 -6459155 -6714786 -5436007 -5160908 -6769588 -9153577 -10759563
5831 -10759563 -10704697 -9215271 -7751641 -7938967 -9634522 -10835403 -10176057 -8492559 -7043229
5822 -7043229 -5474654 -3030593 -693390 -132094 -1024416 -1466940 -951336 -917650 -2105004
5813 -2105004 -3302621 -3334150 -2567019 -1696978 -604840 677646 1298433 935109 602999
5804 602999 1052040 1451315 764380 -567412 -1441517 -1667957 -1572643 -905291 603819 2277396
5794 2277396 3175594 3006110 1433096 -2228647 -7103982 -9882873 -8191459 -4189318 -2304660
5785 -2304660 -3538193 -4632013 -3223196 -978722 -335519 -613672 459737 2854152 4269851
5776 4269851 3612896 2375605 2281622 3019237 3003228 1717594 657183 1837429 5350958
5767 5350958 8624691 8709352 5445675 1675228 54635 524072 1411293 1941201 2510655
5758 2510655 3174500 3319325 2789189 2131276 1533913 490892 -1240252 -3225775 -5186422
5749 -5186422 -7354724 -9532123 -10587667 -9618656 -7182134 -4790169 -3505804 -3419495 -3894056
5740 -3894056 -3641550 -1242148 3170258 6954615 7163060 4097984 1371202 1660727 3625899
5731 3625899 4226734 2994489 2074663 2443312 2420926 593624 -1868591 -3270456 -4280095
5722 -4280095 -6762239 -10338313 -12153948 -10320597 -6091531 -2176503 -111885 144508
5714 144508 -863928 -2595691 -4432677 -5894638 -6822185 -6999796 -5883061 -3131537 654054
5705 654054 3973804 5321968 4294095 2081474 626005 847027 1883020 2443642 2365634
5696 2365634 2033335 882418 -2028237 -5971297 -8660340 -8900950 -7807936 -6801047 -5775194
5687 -5775194 -4140708 -2354038 -1152327 -197493 1289050 3312181 5642808 8630331
5679 8630331 12051304 13981478 12605000 8822541 5448025 4025698 3939932 4262417 4509836
5670 4509836 3618711 420848 -4195126 -7485568 -8110740 -7594260 -7639507 -7684160 -6432035
5661 -6432035 -4337354 -2826013 -1941551 -556018 1389129 2379661 1183985 -1723325 -4605622
5652 -4605622 -5730091 -4502699 -2072524 -584592 -1212395 -3072726 -4293086 -3573177 -581809
5643 -581809 3915772 7614601 7786658 4212590 -35689 -2145326 -2787232 -4093371 -5679293
5634 -5679293 -5272748 -2756462 -666664 -389937 -605638 -252690 -422310 -2101468 -4425629
5625 -4425629 -6661913 -9621373 -13196036 -14711718 -12354498 -8642887 -7525808 -8959087
5617 -8959087 -9427806 -7414249 -5035989 -3911089 -2715612 -181773 2215023 2492122 1140370
5608 1140370 -97845 -912196 -1854109 -2348446 -1588069 -620153 -1062270 -2005058 -742855
5599 -742855 3088981 6550505 7381268 6645326 6127675 5365528 3377563 1610948 2388718
5590 2388718 5201402 7350961 8092010 9204236 11004743 10901531 7429287 3137982 1306498
5581 1306498 1705688 2009659 1816345 2379303 3264896 2434667 -331155 -2811392 -3416462
5572 -3416462 -2437263 -82509 3828142 7510965 7648678 3752048 -488714 -2048791 -2387056
5563 -2387056 -4263948 -7030781 -7958243 -6680113 -5229030 -4557262 -3995512 -3604767 -4060585
5554 -4060585 -4400271 -2950172 -746671 -971269 -4164161 -6849232 -6235066 -3774649 -2342296
5545 -2342296 -2040103 -1051793 761125 1594289 589344 -1090895 -2249570 -3156989 -4499206
5536 -4499206 -5817432 -5848591 -4237279 -2230492 -1240270 -1027391 -182240 1425080 1881441
5527 1881441 -165920 -3159113 -4298558 -2976578 -1109590 -528432 -1529163 -3475317
5519 -3475317 -5099216 -4736273 -2298440 -516378 -1782658 -4168368 -3613210 -50866 2305265
5510 2305265 1495617 521516 1731005 2680440 703230 -2014014 -2109428 -1152885 -3165280
5501 -3165280 -7428637 -8949723 -6053188 -2634212 -1866010 -2115340 -1020568 260351 -206247
5492 -206247 -858021 1473936 6591465 10767431 11230750 8584930 4912711 1644505 -276053
5483 -276053 -85179 1648166 2580740 775025 -2813263 -5165576 -4686962 -2745058 -1217412
5474 -1217412 151125 2491442 4807437 4473019 963411 -2947280 -4526613 -3922272 -2723651
5465 -2723651 -1448022 118339 1519019 2225909 2611437 2861460 2007814 -372597 -2545658
5456 -2545658 -2475805 -509554 1400316 2315364 2614911 2718301 3184709 4908624 7351283
5447 7351283 7954046 5534897 2756996 2497403 3348040 2221000 68773 507611 3131034
5438 3131034 3272584 -488008 -3295973 -691429 5441777 10090307 11182219 9838129
5430 9838129 7219413 4073705 1737337 1109002 1722166 3222228 5901491 8411113 7564485
5421 7564485 2635262 -2525354 -4214873 -3538100 -3594094 -4311073 -3645449 -2175732 -2283067
5412 -2283067 -3398165 -2215888 2048965 6249379 7893839 7917138 7811561 7037493 4995651
5403 4995651 3143770 3007253 3655032 3286670 2384298 3103718 5638402 7116097 4920744
5394 4920744 52635 -3909248 -4862939 -4068425 -3762455 -4156299 -3877725 -2471078 -722042
5385 -722042 1210533 3946739 6781122 7433682 4934983 1262409 -930798 -934665 443821
5376 443821 2248752 3162871 1652762 -2005074 -5068188 -5245689 -3217556 -968873 978035
5367 978035 3067620 4837574 5470365 5226287 4614773 3191296 878900 -677737 73390
5358 73390 2485586 5075982 7559197 9687207 9960121 8079573 6903361 8757033 11240813
5349 11240813 10355563 6729970 4582671 4931909 4416935 1461593 -881745 112278 2822335
5340 2822335 4424292 5082941 6503304 8315984 8315914 5413924 1026153 -1727999 10489
5331 10489 6048045 12099647 13663092 11332549 9885723 11608590 13406040 11624151 6804815
5322 6804815 1964741 -1202847 -2379684 -1243597 1519896 3429009 2624471 -11573
5314 -11573 -2592420 -4538042 -5734563 -5330542 -3297101 -1507124 -1254401 -1228324 54622
5305 54622 1390947 688188 -1755832 -4040094 -5463175 -6224675 -5600045 -3108510 -704190
5296 -704190 -1079734 -4005581 -6535746 -6558259 -4240445 -609523 3072286 5016034 4346283
5287 4346283 2679051 2252992 2870286 2784830 2039835 2362474 4043111 5677031 6963574
5278 6963574 8762981 10032737 8028440 2759629 -1820532 -3002406 -3218686 -6392014
5270 -6392014 -12176053 -16459797 -16649918 -13945848 -10689550 -7845880 -5607624 -4641508 -5493492
5261 -5493492 -7387948 -8575871 -8004467 -6346439 -5164176 -5046267 -4900627 -3470422 -1259425
5252 -1259425 -170153 -1122339 -2814449 -3259168 -1976626 -203885 604497 -45135 -1634171
5243 -1634171 -3068303 -3196775 -1547998 1027309 2633052 1760410 -1222331 -4177137 -5178178
5234 -5178178 -4333736 -3209348 -2608632 -1833895 -356046 1025457 1687251 2889944 6348587
5225 6348587 11242921 14266309 13184823 9211239 5218631 2630380 989676 -258805
5217 -258805 -994673 -1300294 -1722950 -2133239 -1357984 1109017 3646682 4011444 2310952
5208 2310952 1273523 3041556 6591392 8975298 8333097 4980228 502709 -3038300
5200 -3038300 -3855056 -2106878 -542744 -1731585 -4616413 -5579417 -3178606 69968 1211466
5191 1211466 161371 -1533971 -3240939 -4798326 -5043833 -3004361 62156 1797288
5183 1797288 1753297 1620206 2439523 3127845 2141067 -489557 -3182997 -4191350 -2874215
5174 -2874215 -310015 1296601 496066 -2010930 -4342025 -5608815 -6313214 -6565814 -5040024
5165 -5040024 -639492 5098460 8426608 7055874 3047650 891462 2400125 4782505
5157 4782505 4651255 2489397 1285561 1758805 1639160 -285817 -2180937 -2127810 -797584
5148 -797584 41602 -205730 -1323569 -2998312 -3920219 -2171598 1951894 5416074 6367802
5139 6367802 6495311 7521733 7733874 4971052 1203955 400577 2608937 3902545 2261103
5130 2261103 -58812 -768624 -817862 -1769015 -2548477 -1264057 1080225 1246028 -1797012
5121 -1797012 -4998973 -4852453 -1932549 -118191 -1082302 -1687771 1216867 4999507 3698409
5112 3698409 -3690868 -11091409 -12851229 -10024549 -7153970 -6048469 -5692143 -5662880 -6109891
5103 -6109891 -6067966 -5001103 -4422137 -5000027 -4196911 -484551 2275972 -536787 -6647758
5094 -6647758 -9203669 -6465808 -3812232 -5414841 -9103881 -11079729 -11058627 -10406360 -8927912
5085 -8927912 -6140810 -3065059 -637814 1420343 2705059 1650322 -1450767 -3400466
5077 -3400466 -1901379 1421301 3171220 1760383 -1850885 -5047317 -4808696 -475023
5069 -475023 4314394 5063330 2100413 -185482 13270 -133732 -2681824 -5609917 -6590948
5060 -6590948 -6170941 -5210664 -2956075 60389 991016 -671540 -902599 3258737 8934992
5051 8934992 11333452 9661150 6145316 2092461 -1759797 -3761350 -3823921 -4872444 -8216683
5042 -8216683 -10051416 -6625068 -549923 2580666 2071217 1855622 3615297 5190323 5483925
5033 5483925 6064569 7303624 7102895 4566792 1678689 306588 196920 673319 1879226
5024 1879226 3622247 5074894 6207555 7833190 10025436 11997536 13304731 13593989
5016 13593989 11826958 7738015 3422011 1267538 834175 1502 -1432580 -1881129 -1243382
5007 -1243382 -1156212 -1853746 -1593325 85240 934767 -992495 -4467769 -6293636 -4614534
4998 -4614534 -504153 3273925 4943087 5198048 5500102 5208038 2244160 -2910171 -6306651
4989 -6306651 -5135824 -1147683 2312531 4542003 6511965 7716513 6874681 4536698
4981 4536698 2379971 805843 -714762 -2131609 -3549707 -5814971 -8352289 -8521321
4973 -8521321 -5613483 -3236248 -4664634 -7850844 -8382900 -5587577 -2293828 -378278
4965 -378278 -184869 -2461072 -6651007 -8697654 -5003971 2128907 6930509 7254818 5681419
4956 5681419 4802981 5302253 7331879 9584035 8372578 2149396 -4484368 -6130477 -4420701
4947 -4420701 -4954221 -7812473 -7780831 -3783877 -1039610 -2553702 -4882645 -4450624 -2476351
4938 -2476351 -1117855 451473 3334800 6024625 6697467 5719694 4466507 4005844 5177343
4929 5177343 7255390 7222667 3855634 1267607 3848217 8964383 10190094 6857660 4203795
4920 4203795 4490366 4739614 3497953 2885190 3132761 1974747 472773 2447197 6902591
4911 6902591 8195562 5221486 3176168 4589232 6125749 6063726 7028179 9069749 8060340
4902 8060340 3555581 361172 -110575 -1817369 -5309229 -6060293 -3899221 -4156903 -6653635
4893 -6653635 -4427865 3078956 7228957 4782410 2948331 5132738 5212690 1756855 3004586
4884 3004586 10379591 13097446 8002575 7269451 15806518 20805949 17238819 21092712
4876 21092712 39288715 53235852 59781159 99461911 198574226 299755713 306901639
4869 306901639 204427837 81680381 23552819 22539366 22503204 5199322 -6501487
4862 -6501487 -2915174 563630 -3097045 -3917892 1028773 2598788 -604385 14729 4498728
4853 4498728 3265290 -4229486 -7597614 -3888177 -1517036 -3915487 -4585532 -1053402
4845 -1053402 544154 -1933793 -2562936 500704 1011400 -3235883 -5727232 -3256097 -2020286
4836 -2020286 -6466939 -11539842 -11773015 -9869704 -10297786 -11389640 -9801680 -7034239 -5772068
4827 -5772068 -4443337 -739245 3223914 4057537 2551385 2068879 3856241 6881788 9947502
4818 9947502 11577668 10252591 6760657 3964252 2859140 1602295 -500366 -1432366
4810 -1432366 -324739 590210 -289928 -1384001 -972596 38743 152457 -538497 -1698586
4801 -1698586 -3673244 -5733505 -6078132 -4860654 -4490606 -5748140 -6534534 -5723058 -5003659
4792 -5003659 -5221564 -4160466 -263654 4218276 6298863 6205653 5822638 5221938 3434777
4783 3434777 1275604 700104 1831744 2608328 1300060 -1748005 -4620830 -5395217 -3630269
4774 -3630269 -766647 1243071 1576126 455211 -1562591 -2997755 -1451665 3501423
4766 3501423 8119227 7824375 2647152 -2992217 -5667947 -5541485 -3939802 -1618824 148146
4757 148146 -78446 -1522236 -1765624 -353356 897745 1684883 4000685 7994760 10420253
4748 10420253 9092773 6064659 4275584 3562779 2306623 837948 553782 1142297 1236360
4739 1236360 856568 869731 623032 -1562770 -5346613 -7574934 -5471996 -124326 4026015
4730 4026015 3701819 566340 -702503 1529778 3577891 1668271 -2533411 -4287104
4722 -4287104 -2277168 641043 2544942 4434947 6717231 7400378 5186103 1632971
4714 1632971 -1055144 -2235376 -2065252 -874908 33858 -603463 -1609168 -535819 2260201
4705 2260201 3621884 2283492 328537 -915225 -2829598 -5836870 -7351712 -5593814
4697 -5593814 -2442049 -264635 1291223 3100865 4034866 3339271 3071784 5195958 8055091
4688 8055091 8469400 5928919 2392656 -687894 -3028024 -4482435 -5146525 -5275265 -4061539
4679 -4061539 -515064 3410667 3473968 -1241965 -6309448 -7830383 -7367870 -8284508 -10171709
4670 -10171709 -10465343 -9216558 -8362959 -7850209 -6159880 -3608047 -1951510 -1778937 -2979646
4661 -2979646 -6175837 -10751127 -13344223 -11690064 -8156919 -5913454 -3748250 786566
4653 786566 4944157 3217591 -4047895 -9950030 -9810464 -6043237 -3200956 -2559415 -3195318
4644 -3195318 -4513160 -5659272 -5446430 -4572849 -5219594 -7107979 -6907264 -3164956 1076256
4635 1076256 2559788 2123159 2435922 3536888 3220497 703022 -2333473 -3888229 -3424811
4626 -3424811 -1979375 -1379519 -2745054 -5205746 -6851532 -7137336 -7186937 -7632534 -7820188
4617 -7820188 -7521169 -7457260 -7253352 -4854440 478399 5990736 7993442 5904490 2313318
4608 2313318 -520609 -2803082 -5729579 -8985225 -10578990 -9243710 -6386617 -4732973
4600 -4732973 -4979251 -5059582 -3397041 -1408416 -1325232 -2735707 -3299172 -2197583 -694919
4591 -694919 440902 1803783 3456509 4229722 3434607 1727219 -32990 -1360133 -1569613
4582 -1569613 -311643 1228676 1429340 687581 902819 2205498 2203662 -821001 -5687317
4573 -5687317 -9992124 -12393955 -12466181 -9948138 -5454515 -1051779 992573 -44728 -2891003
4564 -2891003 -5147324 -5007600 -2945610 -1296439 -1441807 -2358193 -2964222 -4252608 -6997697
4555 -6997697 -8868240 -6892828 -2120195 1365171 1853127 1238796 900048 -123264 -2296561
4546 -2296561 -4387265 -5979091 -7854330 -8863649 -6060046 336435 5538459 6031184
4538 6031184 3945140 3278616 4503959 5644061 6337039 7650828 9261016 9637245 8253385
4529 8253385 5617213 2175011 -1002760 -1808796 488869 3392741 3687200 1148720 -1614690
4520 -1614690 -2096927 406332 4640165 7771867 7550233 5270017 4649950 6512992 7139509
4511 7139509 3826578 -730751 -2483675 -2030987 -3005281 -6108690 -8546504 -8526106 -6731311
4502 -6731311 -3820821 15539 3081753 3119318 608986 -1694781 -2739423 -3798568 -4861449
4493 -4861449 -3714335 162149 3592685 3443164 544865 -1791107 -1939893 -1144271 -1262002
4484 -1262002 -2600207 -3908770 -3961486 -2983163 -2233337 -2100178 -1561310 -205862 502993
4475 502993 -558121 -1834145 -1055551 1117955 1857150 518845 -292270 1316011 3743324
4466 3743324 4316925 2839594 1223161 581916 211510 -832810 -2327835 -3251828 -2942486
4457 -2942486 -1612385 11788 1265584 1847366 1943793 2119460 2444263 1489069 -2589504
4448 -2589504 -8885416 -13026835 -11777015 -7537817 -5516058 -6739476 -7305087 -5013663
4440 -5013663 -2771993 -3615862 -5995349 -6729700 -5717629 -4646424 -3435891 -1215424 1120055
4431 1120055 2508319 4032215 6431211 7261160 4249100 -136112 -1494199 260061
4423 260061 1485949 731354 -156542 -286065 -741367 -1336848 -444386 1597395 2522458
4414 2522458 1688727 61438 -2963073 -8444162 -13672621 -13888699 -9053027 -4427229 -3402299
4405 -3402299 -4159465 -4444938 -4713721 -4799422 -2448957 2238506 5315288 4713524 3388212
4396 3388212 3918571 4220395 2085407 -67760 820880 3079806 3439195 2804380 4127543
4387 4127543 6590683 6981935 5791638 6911356 11151968 14385508 13080593 8468374
4379 8468374 4133846 1909721 1321554 1437232 1992415 3083389 4262169 4379424 3069314
4370 3069314 1970265 2825642 4550729 4510781 2771070 1951425 2222183 302487 -4812417
4361 -4812417 -9008457 -8626008 -5468858 -3254483 -2401995 -1783239 -2254705 -4137610 -4127138
4352 -4127138 295180 5559354 6357357 3651122 2806024 4831122 5533343 3378823 1991934
4343 1991934 3434339 4561751 2561583 -269908 -199409 2618672 5148243 5526097 3907967
4334 3907967 1066439 -1972152 -4098745 -5068697 -5241834 -4185246 -1285436 2101943 3320477
4325 3320477 1731244 -644262 -2098597 -2697958 -2599737 -1484582 -190042 -337171 -1593952
4316 -1593952 -1784717 -468993 191088 -901856 -1859884 -804868 1630835 4119844 6572650
4307 6572650 8726745 9094538 7188894 4922162 3899047 2938197 226529 -3437036 -5621375
4298 -5621375 -5578164 -4613473 -3644219 -2216413 1605 2210564 3517856 4211088 5214089
4289 5214089 6307679 5792089 2862567 -276053 -540666 1667427 2714635 1222685 174009
4280 174009 1473375 1896467 -1749405 -6273008 -6040303 -1658564 1048050 355451 827202
4271 827202 5181034 9825235 10774621 9037333 7360785 5962435 4546552 4737955 7199769
4262 7199769 9492325 9869238 10133101 11654102 11875397 8645182 5216836 6375818 11176395
4253 11176395 13923928 11806942 7805160 6006920 7052038 8576774 8077901 5050368
4245 5050368 1480757 -74553 447419 616074 -813774 -2189963 -2033929 -1438316 -1619248
4236 -1619248 -1392871 620375 3211970 4397248 4387494 4517646 4790857 4643527 4522494
4227 4522494 4564498 3454374 859532 -766106 765762 4101553 6381630 6857904 6301059
4218 6301059 4896660 3358669 3989145 7396539 9847193 7418265 1823499 -1223627
4210 -1223627 910912 5066177 6527285 3961881 224987 -625294 2396504 5751395
4202 5751395 5753997 3913442 4599141 7546776 7763892 4106117 1910500 4224392 6676834
4193 6676834 5441956 4137497 6919178 10301951 9076954 5870007 6796797 10889832
4185 10889832 12112068 9601774 7661465 7088352 4706241 723611 -1267686 -1210027 -2134123
4176 -2134123 -3338349 -1300318 3227404 6305421 8021057 11006855 13142020 10350046
4168 10350046 5623937 5934412 10705248 13083982 12260478 14021162 19022192 21680159
4160 21680159 21243669 22335140 23997633 20971427 16484812 19354646 27262000 29395055
4152 29395055 27476421 34519962 49440905 57569649 64193138 96583103 152582040 177031374
4144 177031374 123697737 23452272 -46485324 -53613552 -33969568 -27783755 -32328525
4137 -32328525 -29334128 -22354231 -23918014 -29063092 -25527827 -16586430 -13830974 -16747371
4129 -16747371 -16405469 -12145684 -9738547 -8889252 -5900365 -3740722 -7265546 -12755172
4121 -12755172 -13444258 -11347170 -12696128 -15471371 -12660836 -5212517 -881648 -1856079
4113 -1856079 -3614038 -4740257 -7849856 -11280151 -9706492 -3734202 -114983 -1337919
4105 -1337919 -3004815 -2669655 -3318589 -6142239 -7298159 -4708133 -1899946 -2180627 -4221157
4096 -4221157 -6073927 -8674942 -12417473 -14408026 -12274164 -7794957 -4375435 -3336542
4088 -3336542 -4324815 -6859015 -9914598 -12077666 -13132135 -13603881 -12641973 -9037530 -4466964
4079 -4466964 -2484872 -3656305 -4842934 -4123245 -3186915 -3677184 -4326127 -3488803 -2016247
4070 -2016247 -1696780 -2529818 -3052233 -2218421 -155983 1879465 2178969 524067 -936256
4061 -936256 -483744 340951 -761568 -2401781 -1059697 3124679 6132101 6251308 6302703
4052 6302703 8151868 9081112 6302477 1907208 70025 1299394 2503356 1591397 -606471
4043 -606471 -2330870 -2676881 -1735533 -438506 100523 -15653 471169 1773809 2250396
4034 2250396 982039 -159688 1313162 4989719 7726228 6987637 2979300 -2046045
4026 -2046045 -5488234 -5734407 -2976376 938585 3766468 4216019 2579088 646669 514682
4017 514682 2340235 3569302 1825675 -1572684 -2824413 -698254 1633086 797284 -2448788
4008 -2448788 -4521528 -3512376 -933621 413856 -888203 -3964295 -6390601 -5952979
4000 -5952979 -2404441 2257581 5244079 4762434 1057138 -3546012 -6103031 -5618119 -3937737
3991 -3937737 -3251599 -3396285 -2945837 -2073235 -2179845 -3068363 -3002893 -1822151 -1490912 -2856794
3981 -2856794 -4220066 -4164200 -3652865 -4026835 -4773228 -4633411 -3349952 -1169509 1687870
3972 1687870 3847046 2916815 -1563420 -6782563 -9795383 -10630204 -10851584 -10640805 -9169350
3963 -9169350 -6616065 -3893456 -1277430 1081593 2353682 2404231 2817399 4659850 6292231
3954 6292231 5514381 3026976 1480488 1633922 1797678 873018 -394478 -1389109 -2714441
3945 -2714441 -4714028 -6529706 -7248845 -6768016 -5124828 -2155092 1711716 5207627 7145965
3936 7145965 7059037 5112960 2234825 88777 -153613 937356 1790007 1570207 338211
3927 338211 -2009754 -5608210 -9552662 -12274809 -13140822 -12701610 -11444025 -9445450 -7266423
3918 -7266423 -5902774 -5485536 -4954830 -3344887 -751122 1967179 3709833 3543780 1547657
3909 1547657 -829850 -2161590 -2552287 -2703627 -1982446 739546 4220135 5024501 1763614
3900 1763614 -2425468 -3328458 -781734 1392493 402729 -2302671 -3465509 -2269667 -720077
3891 -720077 -241698 279212 2295796 4900534 6054423 5905964 6675506 8842192 9669403
3882 9669403 6893672 2155049 -1197540 -2602201 -4286957 -7157206 -9027262 -7430386
3874 -7430386 -2425797 4044172 10079041 14211689 15154603 12550299 7694434 2642177
3866 2642177 -1407604 -4458794 -6660280 -7487944 -6313986 -3665128 -1329030 -592040 -613240
3857 -613240 483320 2820003 4341271 3752484 2535824 2902211 4820698 6488287 6877194
3848 6877194 6194713 4494849 1767424 -752731 -1195963 792855 3846223 6673726 8501377
3839 8501377 7957316 3774316 -2701971 -7546512 -7897470 -4485966 5038 3681592 5794067
3830 5794067 5933202 4310433 2093301 338788 -983511 -2279008 -3329288 -3683643 -3395218
3821 -3395218 -2735695 -1805100 -940265 -742584 -1129891 -1220470 -858666 -1332501 -3562994 -6232667
3811 -6232667 -6827406 -4300103 55656 4042952 6162651 6193578 5035049 3850769 2834218
3802 2834218 1143036 -1419537 -3249301 -2450085 715104 3877384 5150701 4818648 4231398
3793 4231398 3919335 3498543 2963753 3047791 3967716 4530403 3375537 1020162 -368918
3784 -368918 247802 1156447 71762 -2662555 -4492606 -4170627 -3201628 -3208216 -3405002 -2041826
3774 -2041826 497584 1682296 -9711 -3103379 -4762895 -3787007 -1543052 -287429
3766 -287429 -992082 -2743417 -3961477 -4070069 -3987163 -4979297 -7068862 -8770971 -8636092
3757 -8636092 -6926931 -5286586 -4648156 -4170694 -2740820 -751232 631335 1350600 2092786
3748 2092786 2284587 435023 -3039381 -5265968 -4249384 -1196684 1536456 3111443
3740 3111443 3499217 2085788 -889613 -3055671 -2572678 -969260 -738554 -1146972 461258
3731 461258 3752319 5312743 3744182 1494450 796902 960035 951330 1624358 3471326
3722 3471326 4689328 3816851 2556157 3674549 7128623 10126912 10317168 7574230 3509678
3713 3509678 498107 403473 3050683 6346554 8384452 8699187 7499579 5255769 3266732
3704 3266732 2654196 2328037 220888 -2829671 -3249981 -57096 2951675 2304121 -663657
3695 -663657 -2864603 -4225105 -6199713 -7816422 -7005041 -4530504 -2993672 -2828790 -2616898
3686 -2616898 -2307412 -2435283 -1102870 3811453 9516110 10065268 4333806 -1881352 -3294078
3677 -3294078 -916013 1473386 2841587 3902709 3575007 267604 -4620841 -7845878
3669 -7845878 -8499927 -8355707 -8311139 -7218078 -4761178 -3205310 -4931270 -9318704 -13217757
3660 -13217757 -14093971 -11958466 -8482776 -5096122 -2303510 -341922 329653 -537105 -2538528
3651 -2538528 -5016303 -7604883 -10009048 -11547482 -11456120 -9652907 -6996084 -4841910 -4192423
3642 -4192423 -4743683 -4830179 -3118294 -430346 1110419 896821 519918 1288598 2577210
3633 2577210 3263528 3159888 2196138 111705 -1833993 -1039974 2659720 5441492 4116148
3624 4116148 534123 -1378635 -1359447 -2242075 -4724795 -6408742 -5844468 -4157700 -2558572
3615 -2558572 -1361553 -1535481 -3925542 -6629169 -6534944 -4079193 -3069954 -4899400 -6408029
3606 -6408029 -4849405 -1681284 272628 420631 -650592 -2915305 -5499688 -6153437 -4347459
3597 -4347459 -2575191 -2469930 -2108988 362773 2855849 2169304 -1003389 -3055015 -2442495
3588 -2442495 -872914 -234797 -997832 -3353341 -7547282 -12765156 -17075358 -18607099 -16360836
3579 -16360836 -10874641 -4833867 -1567515 -1761509 -2922321 -2918335 -2207339 -1600649 -390052
3570 -390052 1482461 1921167 -210808 -2633430 -2872050 -1743491 -707470 1900936 8053297
3561 8053297 15002154 17463820 14416697 9862623 6977177 5276064 3741516 2890514
3553 2890514 2779489 2153111 751430 -24926 423725 1048533 1242267 1333252 566457 -2682130
3543 -2682130 -7826871 -11678497 -12115744 -10123569 -7677095 -5991297 -6375303 -9862843 -14623150
3534 -14623150 -16263986 -12484466 -5753212 -187817 2450841 2729590 1773157 1048318 2083122
3525 2083122 4792863 7373509 8852116 10111024 11480478 11450610 9253765 6750045 5890744
3516 5890744 5866116 4674090 2299950 490744 238947 1049904 1999458 2338522 1859839
3507 1859839 1536510 2639598 4414767 4245067 1257946 -2012938 -3069669 -2764541 -3305798
3498 -3305798 -4643214 -5132482 -4426413 -3122123 -559659 4058110 8631520 9257262 5111073
3489 5111073 97831 -1385218 981563 3795165 3797113 774099 -2661197 -3641786 -1644764
3480 -1644764 1370414 3364841 4120010 4445324 4472398 3580423 1354403 -2069311 -5849118
3471 -5849118 -8136998 -7255599 -4076838 -1690316 -1386737 -705861 2518137 5817493 4722836
3462 4722836 -995794 -6807702 -9192382 -8989947 -8391211 -7525565 -5680711 -3816735 -3639926
3453 -3639926 -4886016 -5262485 -3256723 -177793 1005403 -1076686 -4326157 -5376872
3445 -5376872 -3916074 -3399006 -6302036 -10192028 -10700544 -7405318 -3954893 -2687632 -2356340
3436 -2356340 -1712453 -1905179 -3596684 -4600737 -2984894 -576300 -508917 -2369901 -2700581
3427 -2700581 -102136 2802670 3021515 775960 -1412209 -1735273 -202429 2217221 4318808
3418 4318808 4880739 3327838 664768 -690656 1233852 5807630 9711790 9672057 5596846
3409 5596846 715666 -1603060 -938801 324333 -210619 -2604469 -4821174 -5047495 -3623973
3400 -3623973 -2387845 -2104574 -1398823 1048793 4073137 5218634 4102068 2976305 3679107
3391 3679107 5481761 6442462 5501720 2651597 -1462707 -5176792 -6470377 -5268041 -3981336
3382 -3981336 -4500576 -5723756 -5504418 -3983902 -3110473 -3465871 -3607064 -2516818 -889784
3373 -889784 317397 1103768 1717594 1909702 1432886 545656 -268642 -599314 -305547 -16953
3363 -16953 -891825 -2947115 -4375372 -3890601 -2937658 -3616713 -5044719 -4398103 -1542399
3354 -1542399 408462 -64060 -594237 881581 2612681 2296447 1492953 3402132 7495659
3345 7495659 9850735 8482858 5111297 1513930 -2502593 -6459009 -7607295 -4178078
3337 -4178078 1434312 4836248 4327281 2012019 756491 1351419 2673332 3789107 5416605
3328 5416605 8938202 13726897 16376589 14051041 8284115 3630637 2404389 2763317
3320 2763317 2453745 1970931 2623388 3708951 3734226 2878534 2071279 961091 -812207
3311 -812207 -1537015 448414 3157715 2678795 -1292891 -4612226 -4039644 -664177 2958268
3302 2958268 6165454 8960955 9989374 8238857 5217203 3065465 1602445 -497472
3294 -497472 -2540947 -2411450 -31045 2189590 2499347 1268518 -896320 -4109440 -7405735
3285 -7405735 -8223359 -5430063 -1581046 -370530 -2407928 -4990615 -5653725 -4359635 -2109888
3276 -2109888 965093 5103104 9222384 10997159 9110236 5114709 2420211 2931251
3268 2931251 4821758 4363748 276648 -4491424 -6079969 -4203672 -2059441 -1895270 -2315304
3259 -2315304 -687466 3268551 7695703 11318936 14007223 15101887 13617731 10691096
3251 10691096 9531166 11370139 13055121 10668523 4657227 -720648 -2636088 -2157586
3243 -2157586 -1369900 -425393 1364126 3232206 3521947 1919941 -262918 -1852582 -2788552
3234 -2788552 -3341535 -3298045 -2340048 -794276 495144 1094464 1454201 2092401 2485770
3225 2485770 1538881 -640071 -2445179 -2929172 -3105273 -3840255 -3655690 -835042 2882109
3216 2882109 3620711 899818 -1051843 1011038 4874463 6347923 5268627 5054688 7211528
3207 7211528 9504663 9826158 9008835 8675669 8527842 7548125 6522897 7179966 9043357
3198 9043357 9198102 6078666 2131223 1103567 3182548 4823456 3805838 2126177
3190 2126177 2179971 2222274 -1141304 -6859226 -9811916 -7900092 -4906240 -4566470 -5385913
3181 -5385913 -4170343 -1738307 -1338447 -3194430 -4633728 -4842221 -5652756 -7672447 -9093455
3172 -9093455 -8713150 -7118625 -4564676 -744840 2891490 3902743 2843039 3164728 5737548
3163 5737548 6793692 3464488 -1685760 -4558298 -5511701 -7801461 -11316342 -11884008 -7252241
3154 -7252241 -641928 3014560 2457715 281213 -1010821 -1294778 -1277739 -409157 2277267
3145 2277267 5721720 7079369 5242231 2683840 2311050 3624626 4044433 3155952 2817244
3136 2817244 3171087 1890832 -1519007 -3773327 -2250181 906889 1613699 -741675 -3209977
3127 -3209977 -3652308 -2729805 -1848021 -1272335 -495524 979713 3358610 6010854 7333003
3118 7333003 6114953 2901112 -700439 -3642674 -5724964 -6950441 -7444515 -7407289 -6491541
3109 -6491541 -4125065 -1137561 258997 -704917 -1836364 -804038 1645679 3025409
3101 3025409 2629928 1660497 546525 -1494250 -4289950 -6325544 -7031674 -7810474 -10111902
3092 -10111902 -13572328 -16559136 -17854166 -17575571 -16857682 -16433293 -15282657 -11553538 -5442385
3083 -5442385 62789 2452732 2509664 2467905 2744093 2459635 1994202 2447571 3127608 2176512
3073 2176512 -391046 -2625739 -3585517 -4010733 -4065419 -2952975 -1117925 -262953 -481096
3064 -481096 188635 2353557 3630095 1672242 -2869624 -7420505 -9888535 -9267437 -5868291
3055 -5868291 -2153767 -1491769 -4557390 -8292208 -9640210 -8916223 -8216780 -7951650 -6615111
3046 -6615111 -3146630 1894985 7025001 10820020 12735633 13360863 13134520 11004082 6064673
3037 6064673 588169 -1147627 1816157 5319010 5261480 2469287 336886 -399315 -1694009
3028 -1694009 -4036601 -5233787 -3521064 106147 3021262 3255948 765276 -2564007
3020 -2564007 -4392754 -4167712 -3386910 -3184540 -2877310 -1742356 -631939 -368020 -23152
3011 -23152 1400934 2908694 3123100 2720403 3006059 3204749 1806579 -191640 -309610
3002 -309610 1445382 2538500 1924429 1227281 1463717 1471926 616295 473767 2325965 4934482
2992 4934482 6408180 6893573 7976676 10372367 13276696 15198845 14746588 11622143 7616260
2983 7616260 5673810 7142734 10483810 13000700 13160918 11291335 9110807 8507737 9411965
2974 9411965 9035206 5051564 -471330 -2670932 -11102 3650060 4245967 2347487 1126051
2965 1126051 1604793 2162420 1299004 -1288470 -5253067 -9130274 -10371422 -8078528 -4952092
2956 -4952092 -4313432 -5797410 -6248500 -4375746 -2016301 -923241 -914898 -1570826 -3285930
2947 -3285930 -5848699 -8078246 -9718660 -11684905 -13512269 -12775623 -8577310 -3732291
2939 -3732291 -1548086 -1812109 -2005947 -1336451 -1105971 -1635355 -1525044 -348486 301522
2930 301522 -526601 -1309735 -280752 1863533 3133090 3255690 3635503 4534550 4277862
2921 4277862 1908418 -931263 -2006832 -1493588 -1565121 -3327455 -5634676 -7130335 -7964819
2912 -7964819 -8629802 -8329521 -6086908 -2978420 -1371087 -1483594 -442237 3918006 9457870
2903 9457870 11834818 9932742 7188656 6957663 8444247 8630734 6816295 5063953 4560964
2894 4560964 3894640 1619184 -1325788 -3043261 -3309830 -3266970 -3123295 -1776325 1203792
2885 1203792 4450947 6100283 5523480 3477543 1105338 -819292 -2004306 -2549081 -3019515
2876 -3019515 -4498343 -7894125 -12482457 -15564595 -14953283 -11983605 -10395801 -11408237
2868 -11408237 -11723490 -8123069 -2501511 185338 -1753133 -5186737 -6763152 -6167739
2860 -6167739 -4350699 -1553959 1518525 3153464 3104540 3520136 5451412 6511357 4507892
2851 4507892 1606457 1619965 4027166 4176641 -345358 -6611484 -10412609 -10844810 -9715393
2842 -9715393 -8585373 -7922513 -7602492 -6721379 -4075977 -259710 1708620 -528979 -5362065
2833 -5362065 -8400119 -7045319 -3007061 -140578 -333706 -1730393 -935330 3060328 7499226
2824 7499226 8835242 6621068 3513870 1853883 1708529 2171500 2608501 2062684 -490272
2815 -490272 -4060679 -5647053 -3959582 -1578191 -1473805 -2834168 -2827082 -1472321 -1709790
2806 -1709790 -4729716 -8211480 -9806353 -9709870 -8784295 -6649570 -3221182 -122520 1294661
2797 1294661 1847816 2685031 3015405 1794540 468453 1344170 3569551 3516294 -171091
2788 -171091 -4177641 -4492948 -1306958 1647906 1942344 974292 1382382 3198892 3846064
2779 3846064 1953457 -221337 478717 3585835 5294674 3689006 1327483 1059138 1509958
2770 1509958 -340851 -3378622 -3003721 2048761 7132108 7564242 4317776 1658584 1195641
2761 1195641 947358 -810399 -3468435 -5703640 -7130925 -8100620 -9093576 -10253668 -10634294
2752 -10634294 -8568777 -4024438 200287 1240727 -488001 -2407524 -3490372 -4658716
2744 -4658716 -6042754 -6686769 -7122897 -9092093 -11706285 -11076174 -5857025 -558794 -403790
2735 -403790 -4491971 -7267428 -6018068 -3541215 -3077968 -3844111 -3132491 -584356 1781828
2726 1781828 2717622 2874579 3014675 2817765 1949881 1199639 1727600 3571242 5517384
2717 5517384 6372084 5928045 4717252 3297857 1978264 868470 -106283 -1034741 -1697496
2708 -1697496 -1797996 -1741670 -2553378 -4455423 -6188362 -6621001 -6378644 -6614116 -6773708
2699 -6773708 -5472399 -3445405 -3221062 -5115687 -5995532 -3667152 -433259 88664 -1709460
2690 -1709460 -2060485 818678 4806535 7363805 8231764 8030913 6727800 4799446 3927621
2681 3927621 4932335 6397287 6796772 6710001 7324123 7886804 6682865 4046612 2352341
2672 2352341 2795976 3745472 2736347 -996773 -6273388 -11103730 -13534634 -12360096 -7972631
2663 -7972631 -2359554 2216854 4613067 5089032 4726243 4632582 5200130 5895052 5981579
2654 5981579 5323324 4067366 1939907 -1093899 -3506426 -3059689 128481 2522930 657104
2645 657104 -4716889 -9358188 -10317484 -8505152 -6260882 -4205226 -1831928 67611 -216882
2636 -216882 -2436888 -3821765 -2411383 253655 1147619 -112563 -733349 1490648 5319524
2627 5319524 7833633 8086984 7710537 8203981 9082374 9169417 8594959 8511895 9326791 10206976
2617 10206976 10250623 9327491 7744573 5892097 4402387 3888950 4197464 4584481 4961841
2608 4961841 6158798 8367564 10090119 9511015 6494900 2483700 -1063791 -3224681
2600 -3224681 -3206083 -829859 2511489 4596252 4421041 2731066 516983 -1900174 -4027475
2591 -4027475 -4626288 -2742120 1169336 5432707 8058075 7738288 4969797 2074968 921912
2582 921912 789458 4174 -681027 1091815 4669541 5795018 2472738 -1381827 -981236
2573 -981236 2744213 5016536 4309044 3645504 5117817 7099408 7682990 7332037 6663612
2564 6663612 4689804 1308008 -888542 313055 3420095 5167349 4668996 3700954 3752301
2555 3752301 4681029 5669952 5770827 3937313 151781 -3684706 -5347181 -4628281 -3073577
2546 -3073577 -1885470 -1323678 -1638278 -2983307 -4498446 -4981698 -4629477 -4773868 -5637353
2537 -5637353 -5707172 -4021492 -2087771 -2529554 -6008648 -10081732 -11331724 -8688981 -4611294
2528 -4611294 -2707947 -4118112 -6603797 -7240560 -5318649 -2396084 -435575 -458275 -2109095
2519 -2109095 -3676379 -3245197 -747424 1671571 2051558 649987 -1143767 -2787231 -4203149
2510 -4203149 -4469956 -2723362 35171 1687850 1419816 84936 -1414248 -2609569 -2813833
2501 -2813833 -1770345 -633488 -390691 379235 3843571 8961230 11812191 10589162 7826645
2492 7826645 6599848 6842287 6886476 6456918 6142694 5576160 4332043 3499758 4237736
2483 4237736 5575773 5724371 5005797 5368401 7152499 8378518 7577590 5657957 4307682
2474 4307682 3694106 2505518 -245028 -3932179 -6716666 -7221412 -5815846 -3883836 -1973117
2465 -1973117 319393 2522305 3011707 1528287 421590 1794875 4525530 5863448
2457 5863448 5053925 3439319 1799025 -35186 -1270197 -450064 1992578 3729310 3641288
2448 3641288 2893428 2321290 988224 -1516450 -3366406 -2763018 -605182 685987 151759
2439 151759 -1155286 -1779330 -845342 1715142 4599944 5409485 2846819 -1516700 -4544817
2430 -4544817 -4336165 -1194131 3354234 7432931 9316871 8408730 5818242 3323973 1901621
2421 1901621 1587798 2021541 2343362 1329382 -1245295 -3792272 -4450728 -3082886 -899534
2412 -899534 1264211 3146739 4120103 3565712 2073215 885965 80518 -1421695 -3821601
2403 -3821601 -5652418 -5520626 -3793326 -2080132 -1537224 -1900714 -1840477 -326863 2071290
2394 2071290 3692082 3945101 3997334 4424338 3491795 -402825 -5498569 -8300259 -8190933
2385 -8190933 -7877257 -9055976 -10405043 -10671253 -10861798 -11689395 -11296147 -7808410 -2461449
2376 -2461449 2083551 5144323 7387583 8005808 5312567 -219295 -5944722 -9971540
2368 -9971540 -12051183 -11976429 -9694546 -7136456 -7188224 -9956469 -12282083 -11923142 -10056941
2359 -10056941 -8446248 -6443432 -2852970 932543 2214476 692387 -1477960 -3163598
2351 -3163598 -5477461 -8961502 -11555192 -10803981 -7148089 -3590533 -2299504 -2696760 -3097231
2342 -3097231 -3133243 -3690434 -5054502 -6415819 -7300625 -8135419 -8696867 -7345386 -3304860
2333 -3304860 1080431 2332086 125076 -2222279 -2046471 -485225 -439169 -2735517 -5464243
2324 -5464243 -6220487 -3993612 322259 4208910 5022638 2387013 -1261099 -3274290 -3346667
2315 -3346667 -2807518 -2462664 -2378324 -2834231 -3824575 -4213389 -3145896 -1901105 -2457633
2306 -2457633 -4459758 -5754461 -5991279 -7156322 -9764534 -11120005 -9070168 -5446516
2298 -5446516 -3516664 -3400581 -2616556 -544912 448370 -1242343 -3855406 -4381801 -1760391
2289 -1760391 2940537 8095326 12020811 12968919 10259653 5325423 637357 -2371518
2281 -2371518 -3753297 -3939694 -3242010 -2279731 -1778148 -1692147 -1310124 -377385 668681
2272 668681 1695357 3119980 4771787 5447144 4214029 1462078 -1775615 -4593446 -5782067
2263 -5782067 -4088802 -302625 2121387 628661 -2687022 -3144847 575248 4814460
2255 4814460 5954406 4804672 4550982 6162858 7869025 8155834 7198534 5709638 4212407
2246 4212407 3382766 3454248 3158830 828628 -3080551 -6031447 -6633398 -6537299 -8042283
2237 -8042283 -10641726 -11290984 -8105028 -2851954 628569 107604 -3223021 -6305828 -7011425
2228 -7011425 -5303075 -2360229 617286 2875127 4280326 5320619 6370751 6901381
2220 6901381 6175440 4758667 4203855 4856129 5166516 3827552 1441080 -669395 -2048011
2211 -2048011 -2637790 -2222155 -1611074 -2790661 -6027897 -8166626 -6099576 -1046393 2972891
2202 2972891 4158113 3827893 2951736 980177 -1673100 -3067704 -2453238 -1003922 740346
2193 740346 3341689 5552964 4160567 -1501682 -7547732 -10035517 -9188656 -7272294 -4889701
2184 -4889701 -2044715 -614634 -2337164 -5489030 -6772059 -5933384 -5580839 -6660625 -7027195
2175 -7027195 -4952490 -1717735 133293 -311609 -1747826 -2101980 -530967 1422675 1277392
2166 1277392 -1096717 -2878832 -2193197 -1008553 -2140706 -4759407 -5553236 -3617653 -1385186
2157 -1385186 -902433 -1811023 -3076436 -4205246 -4444682 -3053811 -781875 830085 1663531
2148 1663531 2521690 2688941 619069 -2789786 -4365147 -2692406 466256 3208157 5303714
2139 5303714 6501831 6046329 4895968 5533905 8275182 10441991 10428086 9691852 9329570
2130 9329570 7935140 4901807 2646835 2901590 3635142 2640763 1566182 2991942 5751384
2121 5751384 6902023 6594248 7029756 7865777 6788052 3946449 1701885 202180 -2645146
2112 -2645146 -6459463 -7712029 -4856474 -699956 1687393 2482090 3135080 3581248 3100116
2103 3100116 1954133 744624 -304083 -648025 118245 528331 -1685637 -5854041 -8117099
2094 -8117099 -6195272 -2190422 692349 1886736 2334253 2010601 796846 5594 781767
2085 781767 2350472 3766418 5790054 8817037 10540573 8447191 3730736 53052
2077 53052 -1087699 -1346613 -2388410 -4285976 -6896390 -10348467 -13896100 -16324855 -17637339
2068 -17637339 -18383429 -17407777 -12722447 -5134414 1286239 3310985 1457583 -1729213
2060 -1729213 -4316493 -5150985 -3542726 -202865 2928980 4859527 6141224 6601256 4636181
2051 4636181 222502 -3563383 -4282628 -3694531 -4913621 -7250311 -7076423 -3479331 242162
2042 242162 1344468 1006302 1651649 3255671 4072518 3411759 1823945 -441218 -3321116
2033 -3321116 -5745609 -6133759 -4100700 -724772 2700761 5362070 6690193 6399500 4785125
2024 4785125 2489384 220744 -1013416 -267357 1912624 3259820 2199258 -129962
2016 -129962 -1570178 -1981194 -2797264 -3938081 -3458963 -747440 2077391 3065720 3067540
2007 3067540 4102431 6350119 8229876 8637056 7759734 6342125 5381870 5880029 7504187
1998 7504187 8036570 5720420 2001516 468993 2921766 7616728 11436682 12593516
1990 12593516 11119054 8135246 5320345 4113460 4570149 5294820 4877826 3187416 1260446
1981 1260446 358031 1062227 2773337 4174436 4685019 5174848 6594418 8359321 9078253
1972 9078253 8436101 7010854 4556989 348702 -4490829 -7027879 -5956555 -3477118
1964 -3477118 -2457384 -2960088 -3080705 -2199742 -1465816 -1412665 -1129205 -275523 -316662 -2629112
1954 -2629112 -6101447 -7759514 -5890808 -2015646 476855 -519863 -4138916 -7726669
1946 -7726669 -9271061 -8593134 -6760890 -5035289 -4317648 -4929378 -6495046 -8075828 -8519682
1937 -8519682 -6974178 -3719229 -653110 21833 -1642675 -2924296 -1597337 1268364
1929 1268364 2940034 2560261 1262178 -438971 -2809764 -4614982 -3658354 -378036 1884577
1920 1884577 1457004 470941 771403 578606 -2113787 -5222603 -5161434 -2353554 -501432
1911 -501432 -954005 -1497723 -905803 -1004619 -3039222 -5024165 -4524521 -2014497 240231
1902 240231 1092894 732094 -722052 -3140952 -5584996 -6987155 -7406464 -7751998 -8482946
1893 -8482946 -9057444 -8373407 -5658285 -1547867 1762251 2479354 1462648 1290328 2811771
1884 2811771 4126317 3667623 2698352 3377509 5448253 6539588 5447640 3672657 3422638
1875 3422638 4936963 6282012 5675560 3706566 2695099 3501536 3830604 1006209 -4014062
1866 -4014062 -7291120 -6885741 -5268135 -5821837 -8613899 -10975259 -10977920 -8826647 -5781036
1857 -5781036 -3281198 -2491904 -3199787 -3543839 -2097394 205890 1371796 947414 -36177
1848 -36177 -1045788 -2140286 -2351899 -129447 3970072 6723429 5544613 1550612 -1596022
1839 -1596022 -1565594 462639 1282289 -1012591 -5121065 -7944167 -7905479 -6438611 -5922143
1830 -5922143 -6929850 -8370092 -9626670 -11094568 -12693353 -13435340 -13070933 -12967820 -14349475
1821 -14349475 -16222774 -16074649 -12732455 -7986366 -5003509 -5149863 -6716793 -7165788 -6330436
1812 -6330436 -6403485 -8527219 -10751002 -10518099 -8196568 -6413686 -6205148 -5741016 -3285868
1803 -3285868 287825 2929371 4120928 4872349 5701111 6069845 5863328 6175877 7895852
1794 7895852 10039516 10396174 7992998 4262694 1301179 -452425 -1965163 -3545988
1786 -3545988 -4468086 -4659897 -4974182 -5102822 -3174908 1111364 4747168 5019688 3560283
1777 3560283 4026074 6424422 6967742 3806433 -375526 -2625090 -3607971 -5359782 -7595990
1768 -7595990 -8718124 -8832882 -9140371 -9315117 -8149259 -6430250 -6620165 -9353753 -12341612
1759 -12341612 -13395095 -12854876 -12147215 -11258042 -8866048 -4499345 350278 3340730 3337038
1750 3337038 1488367 216984 903561 2716659 3940925 3990292 3537651 3105261 2426029
1741 2426029 1083057 -1038876 -3895797 -7052929 -9293633 -9392285 -7587648 -5518733 -4244581
1732 -4244581 -2950534 -280906 3311651 5314502 3701314 -388218 -3120762 -1756473
1724 -1756473 2214788 4668612 3779645 2097853 2803312 5162184 5571157 2652662 -930303
1715 -930303 -2279940 -1906353 -2269283 -4060912 -5712205 -6060894 -5738198 -5680527 -5667961 -5054405
1705 -5054405 -4064941 -3436530 -3113142 -2212131 -423247 1252554 1606727 697527 -297946
1696 -297946 -544338 -305406 -267121 -744353 -1734390 -3087045 -4232366 -4384850 -3618819 -3181526
1686 -3181526 -3964209 -5139918 -5313419 -4686923 -4765151 -5791232 -5876255 -3410318 627591
1677 627591 3646218 4103703 2418158 -93423 -2045786 -2099939 320444 3946428 6186305
1668 6186305 5403861 2315372 -1193855 -4015405 -5948820 -6503105 -4867783 -1381830 1983663
1659 1983663 3384738 2822085 1408227 -412483 -2640739 -4024057 -2513658 1646064
1651 1646064 4776243 3480365 -963891 -3619357 -1436229 3616062 7310642 7656897
1643 7656897 5839833 3872665 2676964 2092462 1553878 567291 -838966 -2023739 -2524496
1634 -2524496 -2703006 -3110483 -3461336 -3015708 -1907825 -1179993 -1282063 -1428772 -923567
1625 -923567 -328620 -604550 -1702810 -2899327 -4072648 -5515154 -6581173 -5809742 -2861470
1616 -2861470 601954 2573385 2555697 1286192 -511765 -2253844 -3090737 -2552835 -1410038
1607 -1410038 -1010437 -1927625 -3893331 -6444044 -8559975 -8394408 -5184492 -1340262 -637993
1598 -637993 -3753096 -7227998 -7546220 -4635120 -649082 2712616 4339541 3178686 -206030
1589 -206030 -2731544 -1759069 1639744 4347377 5338905 5748116 5394521 2484994 -2477071
1580 -2477071 -5444933 -3451969 1187708 3348404 1111173 -2308297 -2588837 864958
1572 864958 4539694 4925908 2438324 465087 479545 -229192 -4410264 -9792075 -10980682
1563 -10980682 -6412179 -587708 1542207 -40470 -2039225 -2589288 -2285093 -1859364 -997508
1554 -997508 1022446 4809849 10208930 15074657 15947124 11564592 4771810 -636032 -3945891
1545 -3945891 -6641277 -8708337 -8523876 -6201155 -4340692 -4708175 -6114661 -6481974 -5466912
1536 -5466912 -4013146 -2475842 -441380 2034516 4000969 4590069 4121836 4011178 5366903
1527 5366903 7758891 9815824 10908347 11351948 11002689 9161411 6319254 4162982 2845202
1518 2845202 322531 -3867220 -6294555 -3805646 1495837 4580231 3883902 2010823
1510 2010823 669603 -1080359 -3200925 -3534561 -1867591 -1485148 -4356913 -7640865 -7565489
1501 -7565489 -4561907 -1922295 -1214623 -1784234 -3326771 -5879550 -7867013 -6976703 -3174210
1492 -3174210 1023146 3306978 3211955 1373765 -1313441 -4044590 -6856539 -10545199 -14654292
1483 -14654292 -16500091 -14020416 -9040855 -5782154 -6258133 -8738764 -10477000 -10225122
1475 -10225122 -8227258 -5592409 -3917705 -4004687 -4654820 -3913267 -1515289 1037220 2512351
1466 2512351 2610503 946088 -2736512 -7137383 -9868687 -9773471 -7578645 -4281667 -423560
1457 -423560 2975166 4500853 3876939 2174784 332954 -1326049 -2343496 -2517946 -2782708
1448 -2782708 -3724932 -3556336 -223571 4285805 4937169 182134 -5320655 -6313590 -2965623
1439 -2965623 629725 1829017 949114 -964287 -3221456 -4974446 -5581003 -5133699 -3609717
1430 -3609717 -617905 2962599 4805169 4123112 3025799 3116363 2832358 507686 -2152102
1421 -2152102 -2782839 -2538004 -3649801 -4358297 -1045068 5030066 8195745 6264239 3152392
1412 3152392 2259072 2078595 788211 545258 3435522 6592816 5759496 1701128 -981330
1403 -981330 -82639 2940489 6787350 11279539 14806800 14829427 11569412 7950567 5202692
1394 5202692 1725146 -2689345 -4850308 -2439268 2159660 4671021 4002120 2304997
1386 2304997 1207918 489970 110077 1074862 3529003 5495289 4669929 1070432 -2832731
1377 -2832731 -4679015 -4560391 -4541615 -5971699 -7872319 -8404829 -7348228 -6191776 -5983432
1368 -5983432 -6192892 -5864200 -4819987 -3291644 -1321861 774750 2024377 1609997 -207725
1359 -207725 -2369396 -3875875 -4181614 -3309983 -1929061 -887469 -501994 -732081 -1802469
1350 -1802469 -3573574 -4376591 -2206464 2152760 4780340 2743025 -2527796 -7268234
1342 -7268234 -9527003 -9506990 -7066397 -1828768 4185818 7061260 5505607 2820474 2672400
1333 2672400 4444007 4842321 3095201 1890479 2931878 4052912 2240132 -1936509
1325 -1936509 -4896587 -4667949 -2998278 -2361233 -2518777 -1399312 1526387 4442294 5661204
1316 5661204 5375358 4559136 3443541 1827365 -70529 -1920715 -3734487 -5245498 -5567567
1307 -5567567 -4357803 -2699334 -1855207 -1620273 -849031 814433 2623853 3631543 3016216
1298 3016216 308164 -3426489 -5412540 -3940868 -911422 268632 -945383 -2162323
1290 -2162323 -2362662 -3557220 -7146413 -11093148 -12470769 -11045514 -8477058 -5487498
1282 -5487498 -2035200 732649 1215482 -97214 -929052 -373624 -131537 -2142027 -6173117
1273 -6173117 -10157365 -11993477 -10781923 -7189652 -2959021 471160 2912685 4606736
1265 4606736 4955754 3066549 -659986 -4549280 -7241971 -8366148 -7865494 -5885954 -3352472
1256 -3352472 -1434752 -268126 708625 1198674 325445 -1339458 -1820640 -581489 338517
1247 338517 -815398 -2994781 -4204431 -4644429 -6064889 -8680300 -10811565 -11465302 -11261774
1238 -11261774 -10547923 -8612965 -5604613 -3444811 -3502682 -4642482 -5100075 -5308421 -7039278
1229 -7039278 -10270519 -12930079 -13779524 -13525634 -12618677 -10146091 -6156631 -3099354 -2898240
1220 -2898240 -3902539 -3178154 -1151097 -1258629 -4896952 -9393620 -11717798 -11683003 -10282385
1211 -10282385 -7410800 -3366714 -685801 -1701698 -5030352 -6892470 -5720357 -3520282
1203 -3520282 -2844990 -4209951 -6394964 -7602013 -6374389 -2962034 330021 1635806
1195 1635806 1934465 3184976 4773408 4488985 2884180 3418289 7334576 11370118 12167110
1186 12167110 10464932 9001298 8457247 7804976 6969457 6554521 5951455 4190098 2168195
1177 2168195 1892805 3700207 5884328 6744702 5527158 1969557 -3269925 -8092948 -10652030
1168 -10652030 -11419160 -12070562 -12708984 -11953080 -9527195 -6820670 -4753891 -2830722 -546920
1159 -546920 1812846 3968365 5761796 6465405 5659636 4872556 6312894 9405409 10579525
1150 10579525 7616131 2699237 -111951 572549 2566047 2991514 1064030 -1637768
1142 -1637768 -2990754 -2453935 -1349575 -814610 -229611 1287689 2669624 2023270 -418305
1133 -418305 -2674046 -4363242 -7171203 -11407832 -14711465 -15350809 -14413900 -13256901 -11223768
1124 -11223768 -7923032 -5486595 -5797551 -6989709 -5663986 -1813050 1192062 1133825 -1010952
1115 -1010952 -3270970 -4430049 -3634427 -820188 2002721 2112601 -596189 -3452083 -4657653
1106 -4657653 -5183415 -6345303 -7478754 -7229438 -5681349 -3903719 -2377540 -982280 196561
1097 196561 977993 1468398 1679454 1232658 -150869 -2298906 -4732899 -6462904 -5926388
1088 -5926388 -2470251 2040508 4590950 4327295 3060090 2235572 1327852 -66623 -699344
1079 -699344 291159 1518334 1237329 -260933 -1845395 -3708399 -6150880 -7311715 -4830504
1070 -4830504 378240 4458836 5144641 4055130 3986080 5599735 7480168 8099271 6963466
1061 6963466 4772349 3020648 2760989 3578772 4511276 5725792 8007298 10661658 11564137
1052 11564137 9735255 6504697 3707220 2108020 1944699 3238163 4775519 4600174
1044 4600174 2728758 1713729 2993449 4304639 2803172 -437026 -1578636 715329
1036 715329 3637614 4132149 2307088 268522 -676314 -555145 389788 2183064 4765919
1027 4765919 7589782 9334589 8361427 4435249 -108894 -2196957 -1235795 684520 1895095
1018 1895095 2770124 3690808 3373877 789093 -2547214 -4015454 -3041299 -1328659 -511880
1009 -511880 -1070672 -3013456 -5796007 -7725715 -7393569 -5970419 -6210858 -8605213 -10428993
1000 -10428993 -9672532 -8096065 -8637312 -11059812 -12361193 -10996169 -8428501 -6278110
992 -6278110 -4135730 -1311682 885056 370036 -2783648 -6183161 -7933325 -8418562 -8913653
983 -8913653 -9396194 -8586375 -5913154 -2717139 -1141609 -1891831 -3354608 -3263536 -1287445
974 -1287445 475958 -72254 -2554149 -4713681 -5138273 -4328893 -3044480 -972114 2158284
965 2158284 5246124 6937796 7532262 8315899 9091674 7939997 4038348 -452923 -2321754
956 -2321754 -652741 2493626 4467500 4423346 3335183 2139992 331193 -3246109 -8234369
947 -8234369 -12237472 -13287033 -12297268 -11810508 -12523649 -12674296 -11118036 -9141408 -8234409
938 -8234409 -7703484 -6006006 -3292449 -1001574 160427 146500 -1614569 -5139229 -8018572
929 -8018572 -7074622 -2345476 2520340 4444057 3788735 2517571 1459872 574687 274350
920 274350 820077 1269294 470407 -1343366 -2986780 -3882346 -4316813 -4645111 -5052146 -5593678
910 -5593678 -5718048 -4343152 -1253876 2102467 4040671 4393162 4183022 4239942 4917407
901 4917407 6295583 7502403 6580304 2504958 -2938418 -6548619 -6807944 -4638953 -1686407
892 -1686407 719201 1361479 -218928 -2678661 -3969988 -3696187 -3006059 -2186450 -244858
883 -244858 2707320 4716168 4663251 3913698 3945553 3883649 2084368 -1027760 -3641681 -5258083
873 -5258083 -6575524 -7037668 -4842728 85238 5026455 7326632 7067224 6037499 5231407
864 5231407 4458624 3515061 2368055 567363 -2236285 -5179822 -6675609 -6268682 -5227638
855 -5227638 -5052100 -6097262 -7838900 -9492377 -9742813 -6870304 -555550 6549670 10393735
846 10393735 9319039 5687725 3234419 3303038 4281946 4327179 3657755 3826458 5304988
837 5304988 6552999 5735851 2987097 336157 -752782 -1082762 -2317773 -4373356 -5351561
828 -5351561 -4175376 -2153848 -1390944 -2551719 -4875505 -7465042 -9494937 -9842307 -7974700
819 -7974700 -5175242 -3651652 -4137697 -5245869 -5376553 -4365244 -3001475 -1963401 -1847479
810 -1847479 -3381572 -6621476 -10238593 -12427406 -12530220 -11299460 -9728054 -8264278 -7167109
801 -7167109 -6794815 -6991418 -6697627 -5024246 -2663056 -1329191 -1512993 -1804432 -1234022
792 -1234022 -1220637 -3619123 -7439863 -9697405 -9668664 -9778524 -11196937 -11237701 -7495262
783 -7495262 -2527535 -1043304 -3214361 -4373540 -1663594 2465465 4580971 4888817 5346284
774 5346284 5614697 3862762 440161 -2128044 -2617320 -2217791 -1978304 -1245502 607407
765 607407 2503632 2851224 1584335 17248 -1008191 -2041484 -4023001 -6773687 -8734413
756 -8734413 -8276380 -5280808 -1381277 1330487 1797945 473986 -1273017 -2294939 -2669389
747 -2669389 -3588721 -5860362 -8692479 -10550478 -10904408 -10148203 -8089691 -4204324 187222
738 187222 1869304 -739775 -5203481 -7814855 -7943040 -7873169 -8749691 -8835560 -6383378
729 -6383378 -2531295 -105422 -387860 -2282945 -4288059 -5911685 -6798475 -5751868 -2062122
720 -2062122 2408613 4108637 1657752 -2201095 -3688705 -2297686 -636903 -617331 -1686423
711 -1686423 -2709643 -3436574 -3592567 -2561382 -895392 -331090 -1236767 -1816843 -1090842
702 -1090842 -771096 -2447203 -4589495 -4510494 -2102616 550519 2277059 3239327 3092021
693 3092021 1306120 -928086 -1536997 -383069 813510 1321443 1950312 2614048 1723216
684 1723216 -1252827 -4550038 -6322492 -6612157 -6398207 -6010479 -5171281 -3590457 -1149272
675 -1149272 1579481 3082580 2417077 718059 -343959 -1193963 -3301283 -5688696 -5281531
666 -5281531 -1459738 2376289 3121670 1676473 855895 1570822 2893167 4327365 5913485
657 5913485 6904638 6172487 3683289 508641 -2214541 -3640330 -3295820 -1629952 88328
648 88328 917777 697596 -596090 -2694058 -4204091 -3651107 -1694860 -486126 -426196
639 -426196 242522 2013395 2955708 2228296 1976698 3739329 5447124 4493435 1736670
630 1736670 -315240 -1643825 -4081519 -7723149 -10911894 -12997058 -14331217 -14219916 -11742224
621 -11742224 -8250992 -6298274 -6151828 -5820217 -4338678 -2533083 -726055 1565214 3504880
612 3504880 3282691 1163529 -248592 466972 1891466 2331793 2010786 1875345 1997774
603 1997774 2016273 1767071 963976 -380728 -1024037 337654 2684746 3294872 1323060
594 1323060 -836890 -386320 2946758 7088700 9478348 8764502 6040304 4157658 4335271
585 4335271 4147775 913466 -3870925 -6370760 -5992988 -5473557 -5512342 -3671690 389203
576 389203 3024038 2061380 283020 749286 2003428 1035286 -1795664 -4120386 -5501130
567 -5501130 -6621999 -6572899 -4533832 -2584098 -3169765 -4944309 -4764940 -2877737 -2234444
558 -2234444 -3082748 -2305033 1362520 5039624 5700227 3664361 1043159 -936035 -2010280
549 -2010280 -2259811 -2344147 -2826793 -2841627 -1110503 1516194 2571373 1421127 82678
540 82678 18532 353822 255659 909749 3577554 7206316 9536314 9634416 8148835 5966119
530 5966119 3818091 2589690 2847282 4094433 4970042 4174380 1396378 -2205807 -4802147
521 -4802147 -5856641 -6684889 -8071565 -8374695 -5869107 -2175650 -757196 -2111686 -3272153
512 -3272153 -2494893 -1428893 -1567242 -1615863 -282323 1002921 630167 -56804 992863
503 992863 2704267 2372478 148426 -1045982 55367 1470878 1080432 -1042917 -3802450
494 -3802450 -6293665 -7160703 -4921664 -181847 4018617 5300178 4266109 2795622 1391966
485 1391966 -320381 -1518992 -623870 2188333 4541489 4516060 2709191 949102 -248599
476 -248599 -1873227 -4271272 -5991771 -5406814 -2862452 -336654 894051 1320122 1692401
467 1692401 1378445 -917712 -5095325 -9167219 -11044240 -10411994 -8687978 -7439087 -7069275
458 -7069275 -6873221 -6019259 -4325723 -2266113 -543246 320888 351690 256648 801547 1776055
448 1776055 2043061 1036972 -345756 -1011263 -1208878 -1775114 -2333508 -1715912 -126772
439 -126772 750968 275288 -51850 1149844 3038377 3788715 2951707 1422932 -182702
430 -182702 -1890724 -3539188 -4689815 -5176013 -5042766 -4363343 -3725432 -4151931 -5671031
421 -5671031 -6793202 -6529957 -6049074 -6777194 -7572867 -5893466 -1838043 1006277 -460020
412 -460020 -5361250 -10056831 -11812563 -10715848 -8998795 -9168896 -11957140 -15381609 -16423151
403 -16423151 -14108162 -10336331 -7454769 -6072103 -5773685 -6645461 -8750437 -10803590 -10929892
394 -10929892 -8892163 -6603779 -6130538 -7660586 -9539318 -9943054 -8480696 -6344286 -4808638
385 -4808638 -3633563 -1503723 1763051 4292910 4161728 1736374 -863270 -2226984 -2619697
376 -2619697 -2833551 -3317428 -4481131 -6554195 -8624790 -8870588 -6567987 -3281954 -1340259
367 -1340259 -1511490 -2749043 -3771553 -4177293 -4252912 -4402775 -4770535 -4995016 -4456597 -3127986
357 -3127986 -1916459 -1713164 -2423561 -3461927 -4730273 -6237606 -7095212 -6091896 -3397253
348 -3397253 -671276 735103 736620 -415406 -2640753 -5017643 -5645099 -3713441 -923859
339 -923859 262364 -753598 -2692224 -4218369 -4667524 -3706615 -1731596 -250326 -457726
330 -457726 -1538124 -1584010 -28332 2011403 3493732 4166025 3799164 2354684 909488
321 909488 799377 1766339 2542087 3165109 4707831 6630442 6860513 5119295 3638659
312 3638659 3542204 3147214 1421999 474129 2289784 5212686 6408364 6079565 6206163
303 6206163 6453711 4785150 1568629 -360848 102690 1085182 1085715 798341 945610 909329
293 909329 456185 536537 1327361 1491440 389879 -816720 -1170627 -1148571 -1057987 -305852
283 -305852 641332 -212516 -3354428 -6227595 -6476500 -4924371 -3474217 -1988457 260682
274 260682 1658911 -29898 -3611836 -5299368 -3863548 -2184558 -2869855 -4754144 -5159607
265 -5159607 -3852233 -2937787 -3674206 -5091524 -5726899 -5484458 -5320764 -5700908 -5968181
256 -5968181 -5252096 -3638887 -2144739 -1608327 -1918779 -2359865 -2410614 -2149273 -2127204 -2793378
246 -2793378 -3725708 -3644339 -1750623 1133035 3455520 4717245 5399994 5390106 3932375
237 3932375 1359012 -666566 -1238143 -1237415 -1692710 -2488123 -3359156 -4577534 -5693654 -5275763
227 -5275763 -3220302 -1738595 -2481710 -4206363 -5071207 -5606471 -7031823 -8042290 -6319569
218 -6319569 -2621074 -222844 -259287 -618774 67554 325274 -1181734 -3170515 -3796274
209 -3796274 -3218572 -2549197 -1852929 -773541 149103 337369 369318 965541 1659788 1689140
199 1689140 1301487 924196 -78316 -2378586 -5028756 -6227931 -5409423 -3467757 -1407248
190 -1407248 55863 101535 -1483429 -3381364 -3965954 -3463413 -3481183 -4235241 -3912634 -1589597
180 -1589597 701182 355280 -2060120 -3260802 -1649552 399496 -259582 -3138308 -4555898
171 -4555898 -2279800 1922453 4737415 4723959 2445035 -1189258 -5047948 -7288728 -6830408
162 -6830408 -5130671 -4726818 -5968587 -6802206 -5822908 -3768354 -1729222 231779 2052017
153 2052017 3036512 3117128 3151383 3047175 1235883 -2748605 -6612060 -7675410 -5882488
144 -5882488 -3258389 -1497138 -1254638 -2491586 -3994536 -3752737 -1473466 387821 -154572
135 -154572 -1607580 -1366696 55830 -55562 -2055166 -3421393 -3061168 -3037661 -4894826
126 -4894826 -6889245 -6635935 -4691836 -3614240 -4516475 -6206538 -7163255 -7081187 -6751864
117 -6751864 -7189402 -8477863 -9092582 -7245772 -3505552 -989361 -1918164 -4807515 -6239385
$$ [...]
##END NTUPLES=NMR SPECTRUM
##END=
