##TITLE=31Pdec_DE-93m_d6
 DMSO-d6, 64 sc
 6.5.2025
##JCAMPDX= 6.0         $$ Bruker NMR JCAMP-DX V2.0
##DATA TYPE= NMR SPECTRUM
##DATA CLASS= NTUPLES
##ORIGIN= UXNMR, Bruker Analytische Messtechnik GmbH
##OWNER= root
$$ XWIN-NMR		Version 3.5
$$ Tue May  6 14:10:18 2025 Russian Standard Time (UT+4h)  she@DPX200
##.OBSERVE FREQUENCY= 81.013821
##.OBSERVE NUCLEUS= ^31P
##.ACQUISITION MODE= SIMULTANEOUS
##.ACQUISITION SCHEME= undefined
##.AVERAGES= 64
##.DIGITISER RES= 17
##SPECTROMETER/DATA SYSTEM= spect
##.PULSE SEQUENCE= zgpg30
##.SOLVENT NAME= DMSO
##.SHIFT REFERENCE= (INTERNAL, DMSO, 0, 198.062)
##AUDIT TRAIL= $$ (NUMBER, WHEN, WHO, WHERE, WHAT)
$$ ##TITLE= Audit trail, XWIN-NMR		Version 3.5
$$ ##JCAMPDX= 5.01
$$ ##ORIGIN= Bruker BioSpin GmbH
$$ ##OWNER= she
$$ F:/spectra/data/she/nmr/P31/2/pdata/1/auditp.txt
$$ ##AUDIT TRAIL=  $$ (NUMBER, WHEN, WHO, WHERE, WHAT)
(   1,<2025-05-06 14:09:17.10 +0400>,<she>,<DPX200>,
      <created by zg, POWCHK disabled, PULCHK disabled
       configuration hash MD5:
       00 E9 B6 7A A2 85 ED C7 34 08 36 98 17 FE 4E 26
       data hash MD5: 32K
       05 0E 09 A0 B2 AB E3 D3 F7 CE E9 B8 70 87 27 3E>)
(   2,<2025-05-06 14:09:19.59 +0400>,<she>,<DPX200>,
      <Start of raw data processing
       efp BC_mod = 2 LB = 1.5 FT_mod = 6 PKNL = 1 PHC0 = 1375.44 PHC1 = 147.2934 SI = 64K 
       data hash MD5: 64K
       79 EC 68 D0 76 1F 72 93 9B 8F 22 9F 89 57 A0 8B>)
(   3,<2025-05-06 14:09:43.46 +0400>,<she>,<DPX200>,
      <pk PHC0 = -17.83949 PHC1 = 0 
       data hash MD5: 64K
       BA 58 4D 84 01 9A 15 94 4D EB 60 F9 CB DA 5C AC>)
(   4,<2025-05-06 14:09:51.07 +0400>,<she>,<DPX200>,
      <abs ABSG = 5 
       data hash MD5: 64K
       55 2F 7F D8 61 D9 E3 B0 E4 4E 7B 6F 4B 6A 16 BD>)
$$ ##END=
$$ 
$$ hash MD5
$$ 84 93 DE E6 49 FB B6 34 8B A9 CA 88 BE 76 63 DC
##$RELAX= 
##$RELAX= 
##$RELAX= 
##$RELAX= 
##$RELAX= 
##$RELAX= 
##$RELAX= 
##$RELAX= 
$$ Bruker specific parameters
$$ --------------------------
##$DU= <F:/spectra>
##$EXPNO= 2
##$NAME= <P31>
##$PROCNO= 1
##$TYPE= <nmr>
##$USER= <she>
##$AMP= (0..31)
100 100 100 100 100 100 100 100 100 100 100 100 100 100 100 100 100 100 
100 100 100 100 100 100 100 100 100 100 100 100 100 100 
##$AQSEQ= 0
##$AQ_mod= 1
##$AUNM= <au_zg>
##$AUTOPOS= <>
##$BF1= 81.014009
##$BF2= 200.13
##$BF3= 200.13
##$BF4= 200.13
##$BF5= 200.13
##$BF6= 200.13
##$BF7= 200.13
##$BF8= 200.13
##$BYTORDA= 1
##$CFDGTYP= 0
##$CFRGTYP= 5
##$CHEMSTR= <none>
##$CNST= (0..31)
1 1 145 1 1 1 1 1 1 1 1 1 1 1 1 1 1 1 1 1 1 1 1 1 1 1 1 1 1 1 1 1 
##$CPDPRG= <waltz16>
##$CPDPRG1= <>
##$CPDPRG2= <waltz16>
##$CPDPRG3= <>
##$CPDPRG4= <mlev>
##$CPDPRG5= <mlev>
##$CPDPRG6= <mlev>
##$CPDPRG7= <mlev>
##$CPDPRG8= <mlev>
##$CPDPRGB= <>
##$CPDPRGT= <>
##$D= (0..31)
0 1 0 0 0 0 0 0 0 0.06 0 0.03 2e-05 3e-06 0 0 0.0002 0 0 0 0 0 0 0 0 0 
0 0 0 0 0 0 
##$DATE= 1746526156
##$DBL= (0..7)
120 120 120 11 120 120 24 19 
##$DBP= (0..7)
150 150 150 150 150 150 150 150 
##$DBP07= 0
##$DBPNAM0= <>
##$DBPNAM1= <>
$$ [...]
##$SUBNAM3= <"">
##$SUBNAM4= <"">
##$SUBNAM5= <"">
##$SUBNAM6= <"">
##$SUBNAM7= <"">
##$SUBNAM8= <"">
##$SUBNAM9= <"">
##$SW= 400.765351723535
##$SWIBOX= (0..15)
0 1 3 0 0 0 0 0 0 0 0 0 0 0 0 0 
##$SW_h= 32467.5324675325
##$TD= 32768
##$TD0= 1
##$TE= 0
##$TE2= 300
##$TE3= 300
##$TEG= 300
##$TL= (0..7)
0 120 53 12 22 120 120 120 
##$TP= (0..7)
150 150 150 150 150 150 150 150 
##$TP07= 0
##$TPNAME0= <>
##$TPNAME1= <>
##$TPNAME2= <>
##$TPNAME3= <>
##$TPNAME4= <>
##$TPNAME5= <>
##$TPNAME6= <>
##$TPNAME7= <>
##$TPOAL= (0..7)
0.5 0.5 0.5 0.5 0.5 0.5 0.5 0.5 
##$TPOFFS= (0..7)
0 0 0 0 0 0 0 0 
##$TUNHIN= 0
##$TUNHOUT= 0
##$TUNXOUT= 0
##$USERA1= <user>
##$USERA2= <user>
##$USERA3= <user>
##$USERA4= <user>
##$USERA5= <user>
##$V9= 5
##$VALIST= <valist>
##$VCLIST= <CCCCCCCCCCCCCCC>
##$VD= 0
##$VDLIST= <DDDDDDDDDDDDDDD>
##$VPLIST= <PPPPPPPPPPPPPPP>
##$VTLIST= <TTTTTTTTTTTTTTT>
##$WBST= 1024
##$WBSW= 4
##$XGAIN= (0..3)
0 0 0 0 
##$XL= 0
##$YL= 0
##$YMAX_a= 6455
##$YMIN_a= -6485
##$ZGOPTNS= <>
##$ZL1= 120
##$ZL2= 120
##$ZL3= 120
##$ZL4= 120
##$ABSF1= 198.0616
##$ABSF2= -202.7028
##$ABSG= 5
##$ABSL= 3
##$ALPHA= 0
##$AQORDER= 0
##$ASSFAC= 0
##$ASSFACI= 0
##$ASSFACX= 0
##$ASSWID= 0
##$AUNMP= <proc_1d>
##$AZFE= 0.1
##$AZFW= 0.5
##$BCFW= 0
##$BC_mod= 2
##$BYTORDP= 0
##$COROFFS= 0
##$CY= -3
##$DATMOD= 1
##$DC= 0
##$DFILT= <>
##$DTYPP= 0
##$F1P= 0
##$F2P= 0
##$FCOR= 1
##$FTSIZE= 65536
##$FT_mod= 6
##$GAMMA= 0
##$GB= 0
##$INTBC= 1
##$INTSCL= 9.790993e-09
##$ISEN= 30
##$LB= 1.5
##$LEV0= 0
##$LPBIN= 0
##$MAXI= 10000
##$MC2= 0
##$MEAN= 0
##$ME_mod= 0
##$MI= 50
##$NCOEF= 0
##$NC_proc= -8
##$NLEV= 6
##$NOISF1= 182.463
##$NOISF2= 159.3651
##$NSP= 0
##$NTH_PI= 0
##$NZP= 0
##$OFFSET= 198.0616
##$PC= 4
##$PHC0= 1357.6
##$PHC1= 147.2934
##$PH_mod= 1
##$PKNL= yes
##$PPARMOD= 0
##$PSCAL= 0
##$PSIGN= 0
##$REVERSE= no
##$SF= 81.0140089999434
##$SI= 65536
##$SIGF1= 159.3651
##$SIGF2= -187.1042
##$SINO= 113.3802
##$SIOLD= 16384
##$SREGLST= <1H.CDCl3>
##$SSB= 0
##$STSI= 65536
##$STSR= 0
##$SW_p= 32467.5324675325
##$SYMM= 0
##$S_DEV= 0
##$TDeff= 32768
##$TDoff= 0
##$TI= <>
##$TILT= no
##$TM1= 0
##$TM2= 0
##$TOPLEV= 0
##$USERP1= <user>
##$USERP2= <user>
##$USERP3= <user>
##$USERP4= <user>
##$USERP5= <user>
##$WDW= 1
##$XDIM= 65536
##$YMAX_p= 104253238
##$YMIN_p= -311846841
$$ End of Bruker specific parameters
$$ ---------------------------------
##NTUPLES= NMR SPECTRUM
##VAR_NAME=  FREQUENCY,     SPECTRUM/REAL,   SPECTRUM/IMAG
##SYMBOL=    X,             R,               I
##VAR_TYPE=  INDEPENDENT,   DEPENDENT,       DEPENDENT
##VAR_FORM=  AFFN,          ASDF,            ASDF
##VAR_DIM=   65536,         65536,           65536
##UNITS=     HZ,            ARBITRARY UNITS, ARBITRARY UNITS
##FACTOR=    0.49542278885378, 1,            1
##FIRST=     16045.7642231865, 0,            0
##LAST=      -16421.768244346, 0,            0
##MIN=       -16421.768244346, -311846841,   0
##MAX=       16045.7642231865, 104253238,    0
$$ Real data points
##PAGE= N=1
##DATA TABLE= (X++(R..R)), XYDATA
$$ [...]
9583 -529848 1232283 1417692 429007 -1256967 -3624405 -6813787 -10158983 -11808809 -10052228
9574 -10052228 -5280675 -57367 3112826 3702009 2840604 1888904 1592069 1773262 1370426
9565 1370426 -462616 -2848609 -3680746 -2216126 -210564 352557 -238905 -212744 1148253
9556 1148253 2898792 3856772 3499179 1721513 -1238181 -4625936 -7529767 -9270391 -9201084
9547 -9201084 -6909622 -3306430 -696565 -691879 -2413070 -3553034 -2822336 -737412 1357821
9538 1357821 2332524 2033387 1722597 2959201 5400003 6795019 5915032 4076527 2769748
9529 2769748 1570916 -39521 -793660 55050 292382 -2334674 -5975766 -6901564 -5145128
9520 -5145128 -4125753 -4836566 -4657931 -2672991 -1726375 -3294750 -4353368 -2273582 376522
9511 376522 -481970 -4049635 -5649957 -3095694 1226747 4182795 4885560 3901289 2042411
9502 2042411 428359 -97842 -119884 -1083706 -3563932 -6978949 -10469088 -12898993 -12791757
9493 -12791757 -9858978 -6037549 -3432859 -1832343 76881 1763567 1232265 -2012818
9485 -2012818 -6430637 -10582294 -13760413 -14955136 -13791481 -12433132 -13662408 -16522675
9477 -16522675 -16646419 -11810581 -4556973 1610305 5645756 7257497 5352576 967439
9469 967439 -1216181 1800382 6104156 5048463 -1896868 -8381452 -9406000 -6421566
9461 -6421566 -3226066 -719915 1738976 2676274 -152265 -5658640 -9811906 -10359707 -8863419
9452 -8863419 -7571007 -6503642 -4906169 -3764166 -4604291 -6319700 -5652831 -1670557 2119756
9443 2119756 1800390 -1843758 -4258839 -2892209 80454 1190708 -208210 -2300581
9435 -2300581 -3536836 -3481876 -2174445 -286392 882820 985765 1308045 2423144 2400051
9426 2400051 -490120 -4205912 -4809537 -1719575 1663957 2835240 2781593 2818748 1765095
9417 1765095 -1756620 -6182490 -8409846 -7421590 -4950684 -3307242 -3706103 -5820859 -7835345
9408 -7835345 -7750626 -5569799 -3331557 -2421656 -2218482 -1988844 -2158690 -2616459 -1985795
9399 -1985795 -239228 243253 -1613438 -3127913 -1948190 -397558 -2068876 -5709697
9391 -5709697 -6850876 -4771033 -3191096 -3975157 -5001744 -5271125 -7084014 -10784361 -11842393
9382 -11842393 -6821960 856719 5021907 4597560 3528566 4109185 4268573 1476933 -3752018
9373 -3752018 -8824555 -11411715 -10454787 -6617690 -2250757 258988 363459 -1037475 -3266482
9364 -3266482 -6003235 -8311860 -8974169 -7708914 -5173047 -2251182 -226549 -644236 -3429997
9355 -3429997 -5819093 -4927765 -1117948 2705730 4657945 4894300 3487314 -221956 -5488670
9346 -5488670 -9454346 -9908145 -7619979 -4827118 -2359903 365830 2934691 3205998 -78927
9337 -78927 -4708647 -6561831 -4306950 -1253965 -1151214 -3177002 -3423892 -991947 576592
9328 576592 -1092449 -3376615 -2652106 500150 3003909 4123588 4983683 4560112 408489
9319 408489 -6425735 -11037290 -10397886 -6711597 -3868629 -2892179 -2201458 -479106 2144676
9310 2144676 4584752 5575901 4828844 3568751 2784608 1374150 -2015501 -5651339 -5979308
9301 -5979308 -2686393 275443 -204515 -2683483 -3761698 -2102664 1459442 5522054
9293 5522054 8147186 7343152 3448912 -446315 -1979469 -1827462 -1321291 -63967 2052558
9284 2052558 2748724 244630 -3126509 -3280230 217196 3876453 5197198 5185439 5628420
9275 5628420 6231026 5551292 3436820 1391943 769030 1043410 224782 -2542828 -5219803
9266 -5219803 -5062617 -2424532 -272411 422425 1964117 5270086 7064325 4373122 -721178
9257 -721178 -4123408 -5470112 -6938638 -7859480 -5312583 12520 3286062 2046634 -649558
9248 -649558 -1204280 -260374 -562883 -2867034 -6160612 -9656783 -12283821 -12061978 -8382065
9239 -8382065 -3643640 -551374 1111834 3108671 5391495 6469908 6384928 6798735 8141234
9230 8141234 8907991 8263836 7462495 7823092 8697569 8489395 6733910 4081074 937967
9221 937967 -2435582 -4605742 -3428880 1143425 5682039 6195631 2359658 -2349306 -4744883
9212 -4744883 -4792838 -4195923 -3901530 -3940812 -4157692 -3812611 -1907813 626019 702287 -2900830
9202 -2900830 -6828476 -7170736 -4961807 -4251038 -5368256 -4363363 186378 4127252 3555442
9193 3555442 188065 -1880325 -2116057 -3015759 -5381180 -7421346 -7787894 -6730964 -4703722
9184 -4703722 -2255658 -941001 -2007325 -4372982 -5992747 -6868085 -8386328 -9981006
9176 -9981006 -9292515 -6089839 -3261554 -2813558 -3284412 -2595201 -1298131 -1013632 -1336840
9167 -1336840 -746950 363438 218810 -915436 -460107 2509810 5142516 4171504 104408
9158 104408 -3605948 -4793391 -4144321 -2809235 -594983 2705910 5887497 7614846 8132187
9149 8132187 8259800 7425203 4424732 -49849 -3421256 -4134799 -3105498 -1762784 -145045
9140 -145045 2063121 3772084 3235739 312610 -2985839 -4241003 -2577136 767887 3394364
9131 3394364 3626494 1843718 -319021 -2074538 -4016845 -6440339 -8356763 -8950664 -8980348
9122 -8980348 -9604774 -10480610 -10249966 -8621973 -6825762 -5944544 -5608116 -4517472 -1945388
9113 -1945388 1170416 2584504 890859 -2402728 -3991380 -2647714 -789650 -1054486
9105 -1054486 -2587363 -2587641 -663247 777720 373192 -469830 -310735 209964 187757 292549
9095 292549 1014825 766384 -1895115 -5107227 -5475039 -2948412 -1286157 -2938056 -5930368
9086 -5930368 -7321835 -7560162 -8939777 -11055267 -10890016 -7380186 -2956300 205172 2662867
9077 2662867 4962442 5178287 1960190 -1777726 -1697772 1912793 4271601 2638891 -391800
9068 -391800 -1224259 -122878 35941 -2060327 -5039973 -6553484 -4725945 549130 6265648
9059 6265648 7926053 4415363 -201005 -1784144 -1406106 -2804256 -5950596 -6973581
9051 -6973581 -4476532 -2003091 -2724836 -4772037 -4228514 -853823 1808220 1287415 -1132863
9042 -1132863 -2672755 -2292733 -1097734 -530360 -953997 -1756757 -2264414 -2328469 -2210456
9033 -2210456 -2233035 -2603382 -3245260 -3674080 -3409262 -2624214 -1863443 -1015589 576936 2666115
9023 2666115 3885718 3724198 3544689 4531672 5710113 5394202 3577561 1230068 -1699404
9014 -1699404 -5349669 -7850661 -7070487 -4478075 -4218917 -7430877 -10187170 -8611710 -3861970
9005 -3861970 -216493 117498 -1605143 -3129223 -2985979 -616329 3216998 6184208 6022800
8996 6022800 2656533 -1941618 -5675377 -7537522 -7601090 -6752095 -6047348 -5643645 -4790904
8987 -4790904 -3281390 -2011163 -1482504 -826801 781309 2802057 4461518 6046136 7725089
8978 7725089 8205802 6343871 3410314 1945312 2677449 4122928 4834318 4472595 3125855
8969 3125855 1335793 407436 807288 706656 -1608434 -4230477 -3466702 480463 2934524
8960 2934524 1129964 -2003049 -2654628 -1891965 -3300555 -6727233 -8418136 -7101932 -6064495
8951 -6064495 -8052653 -11045226 -10933969 -6671324 -1031892 2700925 3381461 2089339 904627
8942 904627 1307128 2903795 3902642 3223163 1661487 792236 1647420 4712552 9663146
8933 9663146 14170580 14686649 10276005 4583048 1923938 2203019 2013169 130934 -1162361
8924 -1162361 -520442 37062 -1352924 -3186586 -3101961 -1532116 -280803 1110490 4647691
8915 4647691 9989233 13892014 13844543 10509894 6533715 4504628 5865138 9941137 13870017
8906 13870017 15055457 13773035 12029007 10426326 8250981 6224068 6307540 8308568
8898 8308568 9433436 8218505 6435635 5973274 6369298 6824699 7876271 9024862 7532454
8889 7532454 2615609 -1417082 -4724 4991643 7525309 5814012 4182297 5747494
8881 5747494 7639603 5881889 1828847 477849 3959646 9747223 14636833 17591429
8873 17591429 18403847 16178579 10584567 3332317 -2976002 -6980763 -8641930 -7833597
8865 -7833597 -4404595 146222 2680337 1523387 -1044442 -1004070 2533944 6128308 6334465
8856 6334465 3957578 2782518 4809685 8169199 9672043 8260248 5626270 4125163
8848 4125163 4449529 5192589 4739427 3613564 4345230 8491603 14315698 18190093 18022380
8839 18022380 14647940 10309578 6812866 5062379 5190574 6495681 7718324 7938814
8831 7938814 7248073 6377914 5574202 3993466 817986 -2739324 -3637349 -605020 3223291
8822 3223291 3504976 431053 -1549449 -481471 156 -3474433 -8157772 -8775213 -4984153
8813 -4984153 -1127149 398585 1027112 1430474 -43606 -2963075 -3291430 1009521 5984033
8804 5984033 6284774 1765902 -3085289 -4573251 -2165901 2914371 8518547 11769258
8796 11769258 11154270 8387569 6384945 5795749 5225657 4135273 3315294 2851072 1970162
8787 1970162 1089485 1836012 4391463 6577538 6450150 4509471 2493970 1061829 -273897
8778 -273897 -1472000 -1357240 969299 4453642 6404288 5012594 1418259 -1461792 -2127794
8769 -2127794 -1529021 -977875 -777843 -1496983 -4375528 -8739165 -10883256 -8122951 -2962725
8760 -2962725 -558603 -2509550 -5810115 -7629919 -8015601 -7508984 -5484809 -2368081 -726231
8751 -726231 -2029175 -4271016 -4923013 -4616612 -5551907 -7498683 -8126524 -6940187 -6224704
8742 -6224704 -7516103 -9133891 -8309232 -4727793 -1019243 -52823 -2115164 -4598229 -4533209
8733 -4533209 -1611620 1713245 3367721 3926824 4877513 5762602 4886375 2357769 122167
8724 122167 -1388991 -4258998 -9434483 -14008505 -14217765 -10168188 -5518550 -2927401 -1870287
8715 -1870287 -914425 41724 476947 403209 -163856 -1489504 -2955962 -3101984 -1997480
8706 -1997480 -1981947 -4311567 -6518844 -5458157 -1968611 352340 589779 1370448 3767827
8697 3767827 4883305 2322863 -1774215 -3707024 -3198545 -2683817 -3008471 -2703339 -882792
8688 -882792 1724855 4365768 6699013 7960875 7690290 6791095 5885139 3561433 -1127994
8679 -1127994 -5476293 -5989944 -4027188 -4442641 -8279601 -11382044 -11490431 -11649645 -13816276
8670 -13816276 -13954902 -8042288 467542 4402206 2138096 -1910705 -4688076 -6988662
8662 -6988662 -8971691 -8819182 -6900624 -6353259 -7822137 -7975582 -5279481 -3068986 -4244989
8653 -4244989 -6818556 -8040901 -9336828 -12711179 -14945922 -10856419 -1549654 5844809
8645 5844809 7424360 6942559 9267113 13302547 14340670 10957767 6165157 2673790
8637 2673790 275432 -1705031 -2117549 91325 2972813 2816197 -1335784 -5876342 -6365156
8628 -6365156 -2302910 2928562 6200932 6989046 5803789 2723347 -1348682 -3943598
8620 -3943598 -3564786 -1943322 -1839473 -3326467 -4300218 -4159809 -4491587 -5835567 -6230564
8611 -6230564 -4109841 -851588 1006407 968129 568998 776554 698310 -1132233 -4829478
8602 -4829478 -8479159 -9260968 -5815454 129331 4986760 6507191 5309205 3204350
8594 3204350 1074532 -909508 -1931652 -791267 2367786 5436670 5972650 3448871
8586 3448871 -185010 -2266656 -1827214 -112484 1268697 2054765 2693634 2780608 1343788
8577 1343788 -1497255 -4317208 -5902508 -6049446 -4936362 -2793526 -195129 2377973
8569 2377973 5139293 8053693 9793169 9305970 7936392 7708180 7804007 5775465 2506705
8560 2506705 2171483 5770951 8623616 7020214 3848676 3765429 5605838 4475678 -115574
8551 -115574 -3395418 -2371654 1116329 4849765 8927406 12645329 13208806 9962561 6368070
8542 6368070 5215051 4920807 3258376 1776654 3079071 5915087 6818660 5454421 4644459
8533 4644459 5515267 6111027 5147549 4074213 4370515 4992786 3744196 -64441 -5046221
8524 -5046221 -8849067 -9519730 -6843029 -2684180 824045 3468692 6412236 9651979
8516 9651979 11375239 10081578 6201001 1360653 -2831509 -5008283 -4318531 -1190423
8508 -1190423 2891856 6738639 9869151 11540440 10681314 7466591 3891302 1874970
8500 1874970 1521513 1973177 2977148 4401637 5073660 3939840 2249614 2600367 5203699
8491 5203699 7013986 5961434 4406954 6028463 10040072 11498356 7883106 2438092
8483 2438092 -669494 -1876387 -4121373 -7068187 -7284905 -4014940 -1036866 -1618663 -4503847
8474 -4503847 -6483047 -6558869 -5637522 -4028315 -1575356 800508 1744463 1107576 -430370
8465 -430370 -2531453 -4645756 -5304147 -3549300 -314135 2940099 5913790 8395184 8933836
8456 8933836 6669555 3407353 1594265 1053135 47593 -1253032 -1109182 486351 1774968
8447 1774968 2376707 3412306 4269719 2594455 -1455483 -4001921 -2183529 2206323 5458894
8438 5458894 6322111 5961913 5326821 4400208 2911128 355919 -3650981 -8029674 -10513703
8429 -10513703 -10192448 -8335113 -5957366 -2605995 1292522 3246408 1781934 -1247038
8421 -1247038 -3464156 -5134906 -7207927 -8241279 -6394600 -3097064 -1419035 -1705203
8413 -1705203 -2206983 -3303723 -7064914 -12365773 -14452268 -10707567 -3779074 2244843
8405 2244843 5762415 6519468 4082723 -113337 -2095154 183121 3669705 4497100 3629805
8396 3629805 4753124 7842503 9040502 6888605 4523007 4568894 5511237 5033127 3827609
8387 3827609 3480204 3022945 855465 -1406369 -589338 2952736 5390844 5004043 4434188
8378 4434188 6051944 7977273 7001959 3549607 1052931 1262574 2635715 3142110 2437194
8369 2437194 1003401 -881459 -2555879 -2797512 -1237147 753057 1239073 -580857 -3985838
8360 -3985838 -7412937 -9423705 -9659025 -8989806 -8343121 -7758458 -7272311 -7910287 -10283868
8351 -10283868 -12717175 -12803564 -10801167 -9176675 -8379157 -5843684 -583050 3965564 4260652
8342 4260652 1988439 1931008 5271153 8218875 7490407 4182994 1182718 -727168 -2316165
8333 -2316165 -3187817 -2084891 386825 1490983 -380905 -3455936 -4811500 -4284443 -4508202
8324 -4508202 -6630931 -7768317 -4577754 1457584 4941332 3278551 -58758 -536021
8316 -536021 1374831 1729302 -600538 -2473477 -1442185 858150 1496816 205979 -1087509
8307 -1087509 -1188595 -332846 1077716 2587397 2918278 879737 -2718367 -5444085 -5970650
8298 -5970650 -5247085 -4396492 -2835218 128266 2744091 2086677 -1719487 -4526299 -2844617
8289 -2844617 1698334 4323427 2872309 -302981 -2000983 -1500551 307488 2947910
8281 2947910 6079088 8547408 9305226 8661660 7616270 6716851 6463524 7718025 10306019
8272 10306019 12044052 10779284 7059816 3459587 1601472 1111424 1101508 1188149 1101365
8263 1101365 616837 29702 -222613 -309186 -550129 -606316 -127876 289897 6876 -340387
8253 -340387 118992 591491 -448717 -2576487 -3635007 -2982197 -2659563 -4497841 -7480406
8244 -7480406 -9035982 -8134228 -6222242 -5419410 -6184678 -6658699 -4571122 -150455 3579602
8235 3579602 4216081 2755231 1625079 993026 -763461 -3378769 -4231222 -2170299 475003
8226 475003 831347 -1252360 -3984171 -6283236 -8397827 -10657415 -12533471 -12617652 -9478556
8217 -9478556 -3333608 3271252 7566333 9171460 9433864 8857544 7240407 5841693 6432638
8208 6432638 7721908 5819831 -332264 -6616518 -8664500 -7032906 -5486105 -5863023
8200 -5863023 -6831606 -6586577 -4735033 -2077583 60020 793174 765662 1352686 2374024
8191 2374024 2280297 1212889 1511753 3834028 5255863 3361332 151657 -550480 2097328
8182 2097328 6203225 10495026 14529245 16836052 16102786 13763587 12584617 12852238 12431288
8173 12431288 10360333 7862720 5742912 3135642 -732876 -5213340 -8818704 -9941607
8165 -9941607 -7534927 -2515686 2266343 4921424 6253839 7125878 6144970 2560516 -684626
8156 -684626 -579668 758478 -1043350 -5280765 -6615470 -3050620 1534135 3822093 4997065
8147 4997065 6323935 5699028 1753873 -2536600 -3986139 -3926085 -5138211 -6609917 -5412764
8138 -5412764 -2150684 -395588 -1308148 -2443473 -1882863 -456816 497206 988627 1296108
8129 1296108 975830 -238248 -1674751 -2324322 -1596793 330226 2274023 2689001 1352301
8120 1352301 -169587 -456966 161764 663319 864787 925135 523787 -232391 -230193 1005129
8110 1005129 2250782 2551091 2913733 4363677 5638709 4922248 2886213 1846235 2645541
8101 2645541 4432187 6608837 8601332 8539208 5124076 598486 -1170281 86315 603824
8092 603824 -1899139 -5094382 -5784155 -4329983 -3405302 -3936156 -4372912 -3377511 -1640551
8083 -1640551 -1038776 -2708129 -5814191 -7981786 -7319882 -4102315 -116405 3143904 4810419
8074 4810419 4025176 755572 -3056453 -5105038 -5549688 -6295706 -7422880 -6857154 -4274974
8065 -4274974 -2606828 -4086798 -7096781 -8947790 -9879353 -11815000 -14426012 -15177420 -12950364
8056 -12950364 -9349960 -6384361 -4674890 -4057134 -4291182 -4851186 -5254132 -5816485 -7069308
8047 -7069308 -8397618 -8311423 -6207383 -3138866 -963617 -1250330 -4258458 -7954751 -8911891
8038 -8911891 -5716932 -857122 2344011 3729294 5075485 5902829 3956523 -33406
8030 -33406 -1945659 -28947 2451472 2483098 1839560 3230580 4989996 4035346 2180533
8021 2180533 4140118 9484757 11984612 8259567 2237295 -1234525 -2624865 -4070320
8013 -4070320 -3510034 2228338 10281829 13242162 8222120 213576 -4586698 -5232018 -4444665
8004 -4444665 -3871763 -3219087 -2080102 -428366 1607631 3049874 2405175 -56604 -1823626
7995 -1823626 -1391311 -485322 -1264095 -2734852 -2284621 68740 1460996 57337 -3034061
7986 -3034061 -5788100 -7171260 -6813834 -4865964 -2838149 -2765316 -4614297 -5959294 -5047510
7977 -5047510 -2729437 -468024 1831527 4452052 5815106 4126662 590225 -1364435
7969 -1364435 -473000 646362 -936488 -4678282 -7662215 -8455597 -8143509 -7776096 -6656044
7960 -6656044 -3960369 -839232 407897 -1042680 -3663511 -5185413 -4288740 -902711
7952 -902711 4003543 8533947 10700830 9958224 7715431 6026819 5947755 7039180 7819654
7943 7819654 6722760 3550090 185830 -1154140 -649640 -551481 -1674185 -2025190 -221170
7934 -221170 1528270 153814 -3543238 -5601993 -4347638 -2655943 -4107145 -8815515
7926 -8815515 -13924601 -16620884 -15710912 -11622636 -6028067 -709803 3808304 7688655
7918 7688655 9844308 8440912 4106203 585703 528445 2159926 2157045 600512 475530
7909 475530 2633168 4045456 1925783 -2398425 -5061581 -4072713 -1019974 1103972 885850
7900 885850 -534490 -934622 581393 2624221 3203612 2190830 1408358 2097649 3046604
7891 3046604 1892966 -1897263 -5873982 -6658230 -3201776 2032288 5343523 5292034 3521398
7882 3521398 2001676 496470 -2125914 -4832088 -4788771 -1365095 2119596 2208678 -289799
7873 -289799 -1712593 -844365 -347665 -2312437 -4843033 -5019647 -3679999 -4444690 -8151027
7864 -8151027 -11076116 -9833079 -5908882 -3497504 -4180149 -5955151 -6916129 -7388895 -7952016
7855 -7952016 -7495573 -4715357 -566100 2170757 1711671 -955128 -3082285 -2767094 -743264
7846 -743264 483896 -366560 -1649090 -1021945 983399 1248562 -1731896 -5634258 -7242627
7837 -7242627 -6133535 -4114315 -2317835 -765645 -84079 -1372684 -4045994 -5549665
7829 -5549665 -4026712 -271422 3573659 6422710 8600833 10263791 10360380 7633137 2641472
7820 2641472 -1785370 -3021295 -1599208 -499918 -1024754 -948791 1909569 5801240 7020928
7811 7020928 5035314 2959697 2841079 3240097 2389250 1095298 703084 208608 -2191746
7802 -2191746 -5736192 -7666844 -6869451 -4942837 -3638687 -3121801 -3177367 -4365793 -6817236
7793 -6817236 -8800750 -7812761 -3266359 2343298 5229339 3532663 -963453 -4417687
7785 -4417687 -4464303 -2084526 35374 395383 -487467 -1409579 -1643380 -1022529 73431
7776 73431 645378 -219473 -2252723 -4089102 -4608143 -3843505 -2648638 -1981313 -2394404
7767 -2394404 -3528526 -4112398 -3248771 -1837497 -1914586 -4241287 -7199622 -8440509 -7107037
7758 -7107037 -4202373 -1414979 87800 354702 548179 1545721 2354004 884182 -2925429
7749 -2925429 -5663155 -3516256 3240365 9867869 11584554 7856812 2253537 -1315514
7741 -1315514 -1883187 -1323302 -1507790 -2010805 -945513 2228377 5626904 6976513 5969870
7732 5969870 4161642 3341059 4568494 7714225 10792299 10696913 6297190 437504 -2805300
7723 -2805300 -2697698 -1951617 -2357503 -2580327 -986156 1562045 3184903 3601495 3591909
7714 3591909 3153734 2073734 1372082 2063726 2958989 1898569 -748163 -1937766 6946
7705 6946 2893798 3278250 547015 -2667357 -3590507 -1911795 583158 2376749 3903724
7696 3903724 6652368 10594094 13289423 12354665 8347624 4195113 2040681 1706039 1897817
7687 1897817 1485791 -322487 -3399744 -5962652 -5979973 -3761563 -1572889 -269157 1613587
7678 1613587 4477336 5830385 3954723 1520951 2566803 6593257 8724896 6082672
7670 6082672 1402627 -664751 1156664 4506324 6936232 7994311 8197663 7369022 4588576
7661 4588576 -317714 -5524530 -8134042 -7005766 -4178341 -2521466 -2415735 -2096139 -956705
7652 -956705 -531435 -1716569 -2997289 -2687165 -1481540 -1241779 -2196652 -2971601 -2860019
7643 -2860019 -2447749 -2070376 -1082685 990547 3458061 4933781 4399708 1919917 -1260172
7634 -1260172 -3645731 -5012821 -6468492 -8398248 -9228545 -7378892 -3718258 -604393
7626 -604393 988858 1691646 1598714 257410 -1030806 504414 5388814 10548141 13003827
7617 13003827 13034808 12184204 10292404 6901820 3866118 3355993 3986912 2272116 -1909539
7608 -1909539 -4516869 -2958391 354895 1631932 520783 -709642 -1012980 -1173997 -1497374
7599 -1497374 -1250983 -344485 213705 -217352 -1181229 -2033384 -2695458 -3440810 -4632740
7590 -4632740 -6599722 -9068592 -10724889 -9898381 -5862604 452708 6634669 9936157
7582 9936157 9439845 7335122 6753255 7964567 8365073 6789617 5477801 6234465 7117660
7573 7117660 5601642 3124593 3082221 5319202 6226039 4049390 659919 -1970901 -3472492
7564 -3472492 -2950028 856329 6125136 8502558 6914723 5355954 6819085 9051059
7556 9051059 9135377 8735459 10806754 13728310 13385694 9806826 7152552 7360609 7957149
7547 7957149 6690516 4755364 4327852 5577981 7178321 7801863 6539184 3660698 1211785
7538 1211785 1002444 2074581 2238704 1732009 2532676 4118237 3406569 -174264 -2964121
7529 -2964121 -2106056 631479 2138612 2424063 3164292 3869259 2653079 -125970 -1919963
7520 -1919963 -1578337 -615033 -694508 -1625703 -2272157 -2218010 -2060833 -2666576 -4232794 -5719912
7510 -5719912 -5514614 -3150181 -42344 1891383 1947616 744390 -679289 -1486106 -1503203
7501 -1503203 -1508804 -2413613 -3970679 -5206921 -6195401 -7973912 -10335875 -11456054 -10636993
7492 -10636993 -9753043 -10629705 -12395640 -12931569 -11717145 -9627554 -7034739 -3974369 -1400359
7483 -1400359 -358396 -335036 -76250 375058 21307 -1205853 -2553575 -3989987 -5911628
7474 -5911628 -7710386 -8478928 -8808639 -9809003 -10487022 -8540536 -4253420 -1236205 -2119417
7465 -2119417 -5295470 -7260438 -6779759 -5284155 -4196320 -3521289 -2720579 -1618485 -358223
7456 -358223 669569 709176 -933507 -4034385 -7190926 -8638824 -7558443 -4794854 -2269031
7447 -2269031 -1546984 -2962559 -5859352 -9050579 -11049586 -10926275 -9529002 -8891791 -9636625
7438 -9636625 -10018260 -8630652 -6806536 -6511482 -6774888 -4671692 189358 4521424 5216831
7429 5216831 2330988 -2342449 -7396685 -11268154 -11660676 -7689380 -1814012 2071096
7421 2071096 2230045 -135348 -2911106 -4631715 -4668680 -3427511 -2384488 -2808690 -4312646
7412 -4312646 -5475717 -5914283 -6867813 -9470575 -13070667 -15684893 -15921571 -14204293 -12092467
7403 -12092467 -10555231 -9247613 -7646869 -6302612 -6103027 -6514130 -5701482 -2742664 1184990
7394 1184990 4205101 5423263 4785181 2411835 -946774 -3610305 -4353262 -3833118 -3677869
7385 -3677869 -4273338 -4269324 -2297882 1384431 4960140 6452229 5348936 3152292 1832486
7376 1832486 1371384 -323540 -4207712 -7641726 -6696354 -864143 5965252 9645531 9720196
7367 9720196 8611692 7991681 7256225 5355561 2844761 1392104 1613145 2150787 1288137
7358 1288137 -798099 -2014985 -827701 1722755 3042768 1866694 -492024 -1845676
7350 -1845676 -1530479 -834702 -1472240 -4022491 -7571715 -10366127 -10914961 -9080580 -6401203
7341 -6401203 -5016655 -5861311 -7870082 -9029039 -8104027 -5427149 -2533229 -1341670 -3073069
7332 -3073069 -7095012 -10946796 -12322143 -11175087 -9341937 -8268795 -7997591 -8237095 -9024375
7323 -9024375 -9872987 -9611233 -7931724 -6075712 -5147909 -4786977 -4322348 -3911032 -3362796
7314 -3362796 -1411893 1965539 3867193 1652476 -2847910 -5017217 -3221430 -195827
7306 -195827 1514819 2516895 4004741 5063162 4365348 2638705 1576579 1588952 2119140
7297 2119140 2920683 3551566 2815432 303633 -2404618 -3488416 -3029453 -2233357 -1490077
7288 -1490077 -490915 669995 1829167 3326827 5086152 6157640 6316085 6703304 7403296
7279 7403296 6068469 1230542 -4327103 -6293331 -4355340 -2282649 -2654657 -4211660
7271 -4211660 -4733761 -3886534 -2273457 165562 3464728 6673114 8702144 9434645 9563569
7262 9563569 10045274 11640124 13919707 14923564 13189616 10000151 8049324 7944340 7752668
7253 7752668 6017818 3265671 332277 -2628570 -4932059 -5357989 -4265261 -3733479 -4596737
7244 -4596737 -5215939 -4202757 -2351467 -693227 1118195 2783650 1971444 -2530970 -7730127
7235 -7730127 -9147631 -5964760 -1304685 1937199 3388611 3909149 4338876 5449392 7131503
7226 7131503 7623675 5336054 1338352 -1787165 -3378527 -4890522 -6717359 -7296030 -5928629
7217 -5928629 -4072309 -2760755 -971552 1952700 4264194 4225847 3139174 3629751 5658148
7208 5658148 6639762 5495907 4309662 5210423 7312798 7924167 5812332 2089796 -1664373
7199 -1664373 -4972526 -8008528 -10408974 -11157330 -9672727 -6818733 -4641112 -4859986 -7371787
7190 -7371787 -10145552 -10735730 -8243515 -4135621 -1125545 -843588 -2321518 -2997239 -1506666
7181 -1506666 790807 1531562 309988 -976678 -930226 -738444 -2545419 -6352453 -9834858
7172 -9834858 -11240578 -11139614 -10726899 -9590420 -6433591 -1557915 2723397 4399625 3624497
7163 3624497 1966490 580376 -311601 -632250 39640 2011809 4837420 7289409 7965151
7154 7965151 6038502 1723485 -3646575 -7884217 -8824953 -5952664 -1554462 624567
7146 624567 -1033252 -3995018 -4219984 -927707 2422931 2476487 272010 67105 4250634
7137 4250634 10562072 14519068 13727984 9438486 4698436 1899990 1820078 3803957 6172436
7128 6172436 7042240 5718717 3345050 1566010 576257 -725382 -2560228 -3393924 -1991992
7119 -1991992 507009 1719771 880868 -510926 -837284 -120434 566480 626606 475210
7110 475210 919270 2148779 3209038 2870410 1477520 1289545 3990430 8281326 11154350
7101 11154350 11304258 9896648 8119467 5797757 2864898 379562 -949665 -1884589
7093 -1884589 -3217863 -4392497 -4691197 -4685229 -5180669 -5651161 -5102780 -3668621 -1892015
7084 -1892015 668189 4218152 6741322 5586731 1200779 -2910121 -4532929 -5043095
7076 -5043095 -6445515 -8154455 -8290833 -6587359 -4031379 -787546 3159655 5938614
7068 5938614 5186684 1840048 -199660 740808 1827300 400310 -1609432 -881403 1568630
7059 1568630 1875365 -117218 -406423 2225931 3599210 996975 -1589193 842741 6323043
7050 6323043 8499922 5558716 1394698 -1461638 -4449073 -7668367 -7546604 -2463603
7042 -2463603 3489299 5611678 4489649 3775185 4606668 5391033 5212041 4404671 3138140
7033 3138140 1976837 2309475 3785085 3199161 -1229940 -6338994 -8011083 -6967198 -6903998
7024 -6903998 -8328432 -8461600 -6392234 -3837619 -1116468 2890008 6468881 5802803 1339319
7015 1339319 -1231926 1471897 6038533 7771737 6892336 6189190 5808098 4142781 1693703
7006 1693703 303718 -148186 -1110023 -2491287 -3306010 -4068516 -5540694 -6023423 -3249360
6997 -3249360 1289526 3223047 985622 -2207729 -2851362 -1066976 1148904 3273159
6989 3273159 5780251 7483363 5693833 -463051 -8089339 -12869937 -13250662 -11461994
6981 -11461994 -10195196 -9459821 -7852233 -5747970 -4904711 -5179800 -4473644 -2580347 -2168422
6972 -2168422 -4525547 -7229787 -8149059 -8834542 -10845659 -11267223 -6197566 2492243 8377002
6963 8377002 8449294 5819872 3946035 2221333 -1161913 -5363858 -8160231 -8886406 -8224327
6954 -8224327 -6656764 -4636972 -2996172 -2139106 -2014407 -3143773 -5745421 -7697199 -6303938
6945 -6303938 -2970707 -2716911 -7141426 -11200366 -9845190 -4987868 -2223225 -2845430 -3451646
6936 -3451646 -2275428 -1240348 -1629851 -2009216 -1444981 -1170694 -1687203 -1388285 265747
6927 265747 1062247 -444558 -2130811 -1332452 1173628 2580488 2007031 713786 -391182
6918 -391182 -934388 286034 3972640 7931348 8954975 7544247 7931575 12159549 16514767
6909 16514767 15864357 10103026 4074517 1650048 2032054 2207024 1204121 653346 1850719
6900 1850719 3678951 3880604 1766599 -1047801 -2535815 -2165328 -605943 1660890 4416872
6891 4416872 6646847 6722649 4250662 982772 -828445 -637415 287676 536279 -202078
6882 -202078 -1175775 -1190705 594389 3821440 6888763 8260691 7864128 6875425 6306967
6873 6306967 6293607 6623994 7254717 8030638 8355538 7607890 5943881 4506735 4468599 5477722
6863 5477722 5328568 2138712 -2823700 -5546413 -3449085 1522181 5014954 4880679 2427543
6854 2427543 -252896 -2232125 -2989399 -1966266 63764 857197 -624360 -2500322 -2339045
6845 -2339045 -333842 1414745 2036784 2445748 3053834 3049468 2417958 2708018 4507197
6836 4507197 5514257 2986640 -2174965 -5513746 -3837635 1059244 4432299 3856637
6828 3856637 1335171 94721 619785 932043 40539 -632790 334018 1960448 2053911
6819 2053911 217531 -1489242 -876921 2163192 5781044 7773324 6936605 3602717 -503283
6810 -503283 -3086199 -2639632 365163 3468275 3950773 1378140 -1574011 -1674598 1124707
6801 1124707 3275622 1584701 -3059920 -6783587 -7139067 -5336926 -4023179 -3905576 -3275860
6792 -3275860 -488369 3795628 7104094 7736214 6472998 5370036 5032405 3829746 207651
6783 207651 -4812693 -8264169 -8372326 -6445165 -5309334 -6170728 -7507146 -7107894 -4566556
6774 -4566556 -1117621 2410052 5925927 8199409 6855508 1882499 -2628921 -2875283
6766 -2875283 -456090 34396 -1933371 -2113616 1431803 4805742 4116701 1173276 29910
6757 29910 707167 377505 -1069804 -1040783 941901 2563413 2840509 3238675 4393440
6748 4393440 5107458 5037467 5159883 5145888 3611373 1507010 1608536 3662881 3878447
6739 3878447 839918 -1899555 -1437995 -163695 -1727509 -5317665 -7488362 -7548826 -7391532
6730 -7391532 -7286876 -5592577 -2292206 339566 838741 70711 -465326 -126555 940809
6721 940809 1919107 1739756 568469 69584 965848 1521495 1685 -2591083 -3930923
6712 -3930923 -3241734 -1067781 2187596 5408609 6266978 4233130 2454266 3648041 5704000
6703 5704000 4788667 1297723 -1386597 -2838961 -5292283 -7702932 -5738433 990879
6695 990879 6758230 7076150 4090774 2232168 2417226 3474609 5668003 9040662 10853253
6686 10853253 8575133 3925839 703818 -61147 174136 1070443 3249982 5369898 4903239
6677 4903239 2010430 -91118 1013249 4659971 8596476 10798935 9991560 6402286
6669 6402286 2122198 -876775 -2901336 -5199131 -7070997 -6429934 -3078820 656638
6661 656638 2710091 2909620 1880342 308498 -527673 454552 2297662 2736369 1345921
6652 1345921 232288 855491 1840353 1062564 -1289800 -2914847 -2017616 1054202 4312723
6643 4312723 5783822 5138939 3999490 4203580 5704264 6699633 5794639 3468387 1540644
6634 1540644 1707303 4192726 7173457 8117113 6518657 4537485 3966308 3821632 2580103
6625 2580103 1415676 2569486 5245034 6244066 4687706 2902732 2097949 566050 -2503287
6616 -2503287 -4686915 -3893184 -1570239 18150 1295138 3291967 4075330 807299 -5396959
6607 -5396959 -9905535 -9883523 -6714931 -3231817 -1004367 -565018 -1881126 -3797709 -4718358
6598 -4718358 -4547897 -4729983 -6083553 -7888123 -9192034 -9535708 -8299611 -5131040 -1466445
6589 -1466445 164863 -787683 -1949336 -996225 1726536 4397163 6086385 6706934 5872971
6580 5872971 3540453 1159390 366315 451804 -1289701 -5992633 -11044992 -12573672 -9862102
6571 -9862102 -6260770 -5303936 -6724831 -7314763 -5363365 -2679820 -1662614 -1943416 -1431831
6562 -1431831 290249 1554554 1266796 -22732 -1865018 -4600337 -7425553 -7661827 -3597354
6553 -3597354 2849136 7740988 8962695 7435318 5073436 2784142 406042 -2332012
6545 -2332012 -4974364 -6128300 -4450457 -361786 3712911 5594866 5508511 5185251 5155003
6536 5155003 4101772 1157238 -2159652 -3105685 -662695 3165968 5203639 4192881
6528 4192881 1934525 1324638 3453344 6775957 8793061 8135864 5357928 2371704 918110
6519 918110 862089 243818 -2126695 -4621748 -4795942 -3103507 -2475625 -3844578 -4591925
6510 -4591925 -2722905 -205041 -45989 -1925654 -3339508 -3729463 -4483782 -5560058 -5329215
6501 -5329215 -3783097 -2781762 -2585037 -1157537 1994601 4067055 2642116 -1054823
6493 -1054823 -4192344 -5664130 -5753809 -4472631 -2298838 -1000403 -1591613 -2727561 -3051477
6484 -3051477 -3614463 -5650318 -7513043 -6847906 -4763265 -4434086 -6018726 -6650179 -5660653
6475 -5660653 -5818313 -8140781 -9310820 -6592463 -2290411 -417814 -1138604 -1680411 -1262956
6466 -1262956 -1709674 -3702166 -5578646 -6035910 -5404983 -3816809 -516630 4074996 7463188
6457 7463188 7411763 4271502 524486 -1138023 567621 4344365 6706812 5235559 1675261
6448 1675261 -32031 913549 1124442 -1768838 -5400122 -6092643 -4083125 -2833017 -4128765
6439 -4128765 -6254284 -6650502 -4385001 -212711 3981216 5934229 4959530 3152969 3092804
6430 3092804 4455625 4579066 2242159 -1063996 -3744730 -5818655 -7398877 -7490672 -5486782
6421 -5486782 -2514103 -282565 421995 -383138 -2145730 -3421348 -2913251 -1667647 -2482006
6412 -2482006 -6039368 -9405505 -9776697 -7973067 -6417977 -5304068 -3153279 -111967
6404 -111967 1947489 2304048 2086577 2139443 2213317 2338181 3058683 4041983 4181069 3392659
6394 3392659 2751131 2619157 2288617 1802215 2439932 4796281 7789031 10096431 11225542
6385 11225542 10790507 8418835 5129084 3141434 3095624 2676246 -604750 -5894705 -9416862
6376 -9416862 -8198832 -2829523 3189810 6548483 6956288 6926906 8410773 10314847 10457385
6367 10457385 9133389 8640027 9495371 9680442 8115138 6264277 5261410 4068366 2082354
6358 2082354 1025574 2015369 2961943 1635503 -370358 159580 3002284 4920031 4666983
6349 4666983 4242560 4924985 5216455 3692524 1316108 -389016 -1548582 -3067952 -5005571
6340 -5005571 -6797137 -7775329 -6690416 -2241486 4809101 11253381 14250389 13643407 10887211
6331 10887211 7132198 3453873 1450152 1727360 2449767 1128060 -2327605 -5717041
6323 -5717041 -7517646 -8221777 -8526782 -7759462 -5051316 -1220011 1617698 2142593 852495
6314 852495 -849318 -1833531 -1556657 -253077 595910 -1108723 -5804289 -10958479 -13325834
6305 -13325834 -12524378 -11068023 -10745854 -10703876 -9784600 -8806983 -8951954 -9429801 -8861428
6296 -8861428 -7965259 -8434070 -9553193 -8547521 -4661261 -587913 1028490 734328 991455
6287 991455 3226942 7001694 10766669 12600934 11498885 8847365 7470492 8392184 9804606
6278 9804606 10076909 10176243 11656882 13635384 13751555 11452604 8400192 5888215 3736303
6269 3736303 1923642 1551693 3333272 6150685 7998145 7920132 6460226 4558974 2682264
6260 2682264 1126953 657094 2130692 5169870 7682758 7572576 5092344 2817613 2869404
6251 2869404 4599840 5453736 3856152 835991 -1230669 -1343653 -1079805 -2514749 -4879012
6242 -4879012 -4524388 587316 7262330 9869974 6668326 1396368 -1709942 -2249249 -1988025
6233 -1988025 -1119599 1546629 5586176 8386364 7820768 4358156 426739 -1587899 -941487
6224 -941487 981398 1723897 -127706 -3728637 -6879986 -7857297 -6471576 -4057520 -2498427
6215 -2498427 -2468296 -2603015 -1366718 393890 243314 -2337606 -5007861 -5653908 -4581595
6206 -4581595 -2896380 -757699 1621875 3351340 4702107 7387740 11184110 12693717
6198 12693717 10128079 7112139 8193685 12039940 13157118 9807917 5950895 4897500
6190 4897500 5241043 4580524 3637458 4250377 5814198 6340818 5533014 4453285 3076951
6181 3076951 337738 -3636959 -6939243 -7698987 -5707972 -2285378 962950 3254804
6173 3254804 4585732 4625344 2527505 -1235583 -3834396 -2857751 82759 722114 -2501675
6164 -2501675 -6573538 -8067482 -7012473 -5429575 -4055673 -2294174 -55851 2115861
6156 2115861 3879480 4685353 3551003 721405 -1466717 -1174449 152444 -487672 -3346048
6147 -3346048 -5257572 -3683717 56604 2362956 1306909 -1722437 -3897853 -3779190
6139 -3779190 -2182553 -713605 -95596 -194311 -985854 -2509937 -4021235 -4294997 -3064566
6130 -3064566 -1341352 -113391 412869 134617 -1247771 -3331941 -4734896 -4375279 -2549653
6121 -2549653 -499053 551380 61978 -1204409 -1492523 -233052 473232 -1581877 -4846685
6112 -4846685 -5286087 -2132554 426212 -1224064 -5420463 -8014386 -7550486 -5136440 -1212671
6103 -1212671 4133515 8626180 9173430 6015197 2695292 1442266 1028188 -213167 -1707709
6094 -1707709 -2157101 -1819028 -1792199 -2181394 -2274107 -1868152 -1411526 -1197595 -1106756 -932519
6084 -932519 -634150 -508262 -1166048 -2893629 -4949861 -5962663 -5206973 -3310869 -1762506
6075 -1762506 -1763655 -3100896 -3985699 -2841415 -713505 -787491 -4467744 -8939400 -10162289
6066 -10162289 -7688164 -4768604 -3887549 -4086517 -3192936 -1127214 63344 -1131292 -3677429
6057 -3677429 -4648140 -2069311 2561763 5161085 3272832 -1028905 -3398451 -1959594
6049 -1959594 1367878 3973443 5513149 7428124 10537735 13686350 14580375 12074857
6041 12074857 7744673 4496985 3328850 2639949 1327078 662648 1554064 1986128 -20219
6032 -20219 -2250844 -644021 4495188 8305099 8060154 6593670 7572188 10361837 11747149
6023 11747149 10594786 8508462 7190179 7090964 7723126 7790520 5911658 2441499 -415775
6014 -415775 -1312620 -1294723 -1613856 -1679361 -708862 189567 -448226 -2028527 -3018745 -3478803
6004 -3478803 -4457899 -5801427 -6753231 -7914621 -10053399 -11404388 -9052402 -3417610 1232888
5995 1232888 1744885 -464001 -1989584 -1699544 -963032 -888465 -1039064 -609809 267872
5986 267872 617790 -171522 -1091387 163092 4657940 10123839 12789868 11669756 9528155
5977 9528155 8904776 8976371 7855369 6279574 6348780 7254375 5505678 271050 -4333537
5968 -4333537 -4254683 -799871 1608734 1666067 1996750 4005971 5482985 4599429 3271092
5959 3271092 4159627 6285712 6361678 3451755 -347322 -3349800 -5764805 -7757203 -8565672
5950 -8565672 -8080095 -7223225 -6228941 -4452406 -2278474 -1017171 -306901 1828691 5137373
5941 5137373 5982287 2102120 -3537445 -6195585 -5288570 -4197048 -4960318 -6033769 -5456384
5932 -5456384 -3747449 -2718968 -2957976 -3523937 -3460461 -2935822 -2994493 -4211426 -5635724
5923 -5635724 -5653024 -4016145 -2027713 -443306 1241808 2645237 1698722 -2141116 -5615294
5914 -5615294 -5283830 -2452081 -1442192 -3195133 -3931809 -1080764 2455007 1960720 -2912665
5905 -2912665 -7751717 -8475220 -5186610 -1122121 944018 822775 21470 -486750 -956913
5896 -956913 -1445012 -965258 952923 2831975 2846914 1307994 -25147 -658486 -1558415
5887 -1558415 -2900863 -3801092 -4439897 -6078278 -8234228 -8203879 -4741571 -224493 2548405
5878 2548405 4044039 6394646 9301959 10088251 7732206 4607049 3390237 3665795 2847600
5869 2847600 58577 -2195025 -1004481 2805301 5067467 3522657 1108848 2100967
5861 2100967 5996414 8112686 6283239 3632224 3398082 4178526 2863016 -93249 -1667017
5852 -1667017 -1294358 -1395489 -3039736 -4303197 -3611477 -2062809 -1278652 -984516 -96839
5843 -96839 1234613 2067393 2266502 2479150 2966160 3262275 2741448 1166833 -940138
5834 -940138 -2389096 -2405237 -1682366 -1587840 -2293789 -2652879 -2017698 -1054759 -491346 -202583
5824 -202583 150998 822739 2596365 6059759 9616625 10170668 7183246 4298198 4925630
5815 4925630 7511196 7610720 3931049 -334309 -2066164 -1430541 -47101 1452484 2838941
5806 2838941 3366363 2998666 3019976 3939815 4208570 2649872 825897 973545 2614122
5797 2614122 3525441 3444840 4146908 5841031 6379736 5023394 4382114 6702992 10043091
5788 10043091 10584994 7965384 5789763 6657070 8881000 9216731 7268100 5450384 5175624
5779 5175624 5080458 3610166 1641172 890718 620233 -1724522 -6266856 -9452989 -8460704
5770 -8460704 -5014446 -2835819 -2795343 -3184135 -3685177 -5556366 -7797413 -6942906 -2196071
5761 -2196071 2351677 2899695 1016225 998819 3871212 6734000 7047300 4949474 1906156
5752 1906156 -539346 -949848 925225 3329626 4402969 4421983 4501620 4116336 2397541
5743 2397541 1124730 3246789 8248328 11946127 11531751 8211373 4290507 586503
5735 586503 -2205909 -2650283 -997485 -53837 -1473979 -3128997 -2331056 79955 1288120
5726 1288120 748708 265156 657875 931145 459355 -266130 -1013367 -1913291 -2148147 -481815
5716 -481815 2610769 5072881 5939137 6316310 7184932 7763802 6970401 5365631 4522843
5707 4522843 4968283 5577315 4807496 2112803 -1502919 -3928101 -3413415 -359882 2439632
5698 2439632 2159285 -1029059 -3818294 -3371242 -752516 316869 -1832155 -4928768 -6451396
5689 -6451396 -7438858 -10409881 -14362279 -14826195 -9566511 -1874277 3073031 3409723 900650
5680 900650 -2239147 -4981278 -6794340 -7120841 -5680544 -2706124 860424 3430875 4147222
5671 4147222 4383610 6347991 9763981 11793385 10933138 8741423 6558711 3208482 -1872550
5662 -1872550 -5654052 -4790557 -503992 2826025 3045392 1386933 -835532 -3528932 -6202288
5653 -6202288 -8117141 -9983408 -12633737 -14152524 -11574600 -5839841 -1849288 -2621483
5645 -2621483 -6052651 -8330714 -7943259 -5448548 -2094740 29637 -988543 -4275599
5637 -4275599 -6749559 -7369223 -8224033 -10145326 -10340241 -6650091 -1529532 1019433 628353
5628 628353 -728 682663 2045110 3200235 3418420 1719864 -1380099 -2726292 152751
5619 152751 5256679 8292259 8045464 6800296 5881697 4109356 1140517 -830457 -150090
5610 -150090 1716047 2226174 916116 -822309 -2003630 -2734545 -3098401 -2360298 507676
5601 507676 5459469 10430537 12392707 10067238 5057349 -348764 -5356247 -9428329
5593 -9428329 -10509787 -7197666 -2116191 -30098 -2064260 -4446711 -3830977 -1303024
5585 -1303024 132621 -422768 -1997622 -3859711 -5238827 -4639893 -1867556 415544 -335000
5576 -335000 -2670422 -2726651 549054 4151065 5222268 4305897 3736405 4598786 6221737
5567 6221737 7434588 7512353 6746929 6466025 7503237 8563816 7601154 5106091 4077026
5558 4077026 5784391 7569755 6511587 3593669 2020708 2590424 3366419 3370258 3678485
5549 3678485 4561517 4267044 1621729 -2323173 -6182302 -9568223 -11441735 -9722671 -4574521
5540 -4574521 109446 1085004 -58198 88834 1132636 -45494 -3335593 -4808279 -2754043
5531 -2754043 -401113 -973261 -3283357 -4361541 -3789508 -2997013 -2388771 -1747472 -1838380
5522 -1838380 -3044397 -3744135 -2590993 -1215041 -1975429 -4025968 -4546854 -3232796 -2382626
5513 -2382626 -2647550 -1975902 586166 2998948 3284086 2120212 1172959 847901 965221
5504 965221 1888736 3539294 4531279 3532381 724968 -2561754 -4603689 -3665048 431567
5495 431567 4659770 4982948 1290856 -1879664 -802301 3238420 6508215 7320875 6159199
5486 6159199 3595241 631501 -663511 302638 779823 -1774509 -5447936 -6386095 -4669809
5477 -4669809 -3952337 -5388895 -5945548 -3613461 -496378 1064139 2183048 4807880 7851609
5468 7851609 8723933 7182405 5029175 2978518 365826 -2520934 -4225895 -4342985 -4059182
5459 -4059182 -4194635 -4221470 -3603755 -2837549 -2632038 -2939545 -3263711 -3316093 -2979989 -2015787
5449 -2015787 -193676 2151760 3611157 2213674 -2408116 -7125787 -7166967 -1253419 5991832
5440 5991832 8420967 4845239 -301632 -2478634 -1419825 184382 425476 -530527 -1686122
5431 -1686122 -2371833 -2481588 -2429332 -2810801 -3691232 -4381942 -4123654 -2716933 -439813
5422 -439813 2089743 3784633 3556706 1509721 -698882 -1243511 208130 2483433 4385580
5413 4385580 5915761 8023202 11175995 14241349 15218054 13475098 10804692 9480789
5405 9480789 9578400 9271557 7707642 6224574 6240357 7173574 7371550 6265300 4607266
5396 4607266 3135086 2049520 1572152 2024769 3192956 4168963 4002820 2355774 -314851
5387 -314851 -2991224 -4745946 -5419313 -5533450 -5561038 -5624509 -5777250 -5915859 -5456829 -3953987
5377 -3953987 -2064740 -844199 9497 1784400 4244182 5241400 3857421 2259759 2895805
5368 2895805 5219483 7019901 7756801 8280489 8077534 5578366 1302887 -1814446 -1895059
5359 -1895059 86242 2599033 5547464 8769267 10303111 8021670 2528346 -2783060
5351 -2783060 -4635188 -2645617 405372 1114951 -1132546 -3545548 -3472195 -1781532 -1099813
5342 -1099813 -1449743 -361647 2506946 4074098 2626439 1082291 2984842 7122836
5334 7122836 8990059 6706441 2887993 988905 2081676 5130155 8178573 8921192
5326 8921192 6105663 1247541 -2244112 -2267919 381260 3534438 5434514 4838053 1017464
5317 1017464 -5201091 -11156650 -14125602 -13293496 -9722371 -4894032 192227 4823874
5309 4823874 8212024 9669677 9089341 7034754 4249684 1322322 -915556 -1240509 673648
5300 673648 2983418 3156888 1198730 -72820 1113806 2809887 2005340 -1226489 -4185725
5291 -4185725 -5473129 -6264018 -7632463 -8620493 -7555594 -3854796 1939200 8530981 13749890
5282 13749890 15501851 13869760 11474315 10997690 12926170 16046534 19082078 21050525
5274 21050525 20947998 18322749 14024474 9668853 6440065 4748667 4580793 5469225 6292605
5265 6292605 5806630 3598809 369268 -2573884 -3865037 -2584767 842959 3982939
5257 3982939 3579450 -1352677 -7615436 -10244428 -7575628 -3061185 -1169124 -2467225
5249 -2467225 -4274775 -5268965 -6844706 -9647249 -11501385 -10211530 -6402527 -1990497
5241 -1990497 2290878 5917662 6986404 4311730 109815 -2102419 -1762443 -941476 -383522
5232 -383522 1132092 3437279 4146288 2175633 -370412 -1045129 98888 1549933 2491360
5223 2491360 2873980 2817027 2842796 3397390 3555537 1749374 -1607075 -3885728 -3320560
5214 -3320560 -694136 2499401 5478538 7060950 5636054 1700753 -1735270 -2887319
5206 -2887319 -3325321 -4762461 -6051523 -5616304 -4644496 -4895312 -4990185 -2333571 2088973
5197 2088973 4355810 3110457 1253347 1457992 2663673 2197768 -516507 -3586433 -4803175
5188 -4803175 -3371771 -412896 1765294 1656372 3480 -1383090 -1872663 -1982955 -1660332
5179 -1660332 -380272 1048012 716965 -1724653 -4216412 -4916077 -4471012 -4775735 -6389751
5170 -6389751 -8128980 -8687928 -7843003 -6157825 -3957695 -837599 3497600 7868786 9950486
5161 9950486 8666195 5528949 2716453 690000 -1048201 -1915270 -1030095 495478 452833
5152 452833 -1188652 -2307471 -2374158 -3531467 -6705978 -9092432 -7640648 -3532780 -940568
5143 -940568 -2045400 -5194443 -7572509 -7936273 -6770322 -5244341 -4296621 -3878220 -3124699
5134 -3124699 -1919686 -1737485 -3789841 -6741348 -7765727 -5993477 -3532402 -2586860 -2712428
5125 -2712428 -1741672 1222314 4606695 6119380 5274690 3921366 3997431 4824935 3557137
5116 3557137 -936411 -5596935 -6241700 -2797871 537471 691718 -988982 -1942729 -2489987
5107 -2489987 -4363538 -6791452 -7238035 -5587057 -4320317 -4166227 -2890098 353472 2715037
5098 2715037 1917513 4544 -272340 -572739 -4396701 -10464461 -13315006 -11049516 -8104669
5089 -8104669 -8480938 -9964155 -8069711 -3098368 468026 558150 -61765 1723428 5149088
5080 5149088 6922719 5290655 1713484 -783953 -196055 3189909 7450487 10559630
5072 10559630 11212888 8859255 4109121 -838753 -3514178 -3523042 -2603417 -1985980 -1078809
5063 -1078809 608343 1953761 1904562 1182836 762925 -18462 -1967686 -3742552 -3217081
5054 -3217081 -545401 2154717 3696299 4353361 3955679 1884320 -913682 -2254786 -1679031
5045 -1679031 -1163682 -2213116 -3951300 -4786917 -4301525 -2688752 21721 3080115 4738749
5036 4738749 4135133 2566120 1924132 2722887 4387491 6212841 6890556 4500239 -1010922
5027 -1010922 -5982992 -6003881 -1112369 3826704 4758908 2774822 1500122 1785826 1512278
5018 1512278 156012 322382 3454515 6719366 6707182 4538975 4129532 6117373 7099998
5009 7099998 5229019 2903913 2433254 2275620 3473 -3406894 -5029378 -4202346 -2754216
5000 -2754216 -2203229 -3051511 -5650459 -9220081 -10971232 -8914616 -5009392 -2976240 -3382405
4991 -3382405 -3428069 -1389353 1262732 2238957 637486 -3302428 -8394293 -12150802 -12218949
4982 -12218949 -8631493 -3417322 1569905 4943280 5114277 2006265 -1191446 -991191
4974 -991191 1769391 3212380 2276296 1868176 3554079 4680327 2450865 -1975312 -5502934
4965 -5502934 -7104915 -7731531 -7742738 -6576638 -4357912 -2173419 -682982 700775 2877150
4956 2877150 5270235 5507333 2163056 -2165067 -2847901 584563 2978789 508386 -3730196
4947 -3730196 -4376773 -1397458 1420333 3369834 6521825 9440860 7592789 974244
4939 974244 -4323649 -4021145 -448811 2280209 3279397 2977840 697667 -2960923 -4772405
4930 -4772405 -2768930 997646 3543119 4409919 4673669 5072622 6199733 7996310 8588576
4921 8588576 6506542 3851419 3593963 4357305 2690941 -53781 798823 4796484 6343958
4912 6343958 4198297 3546795 6578625 8608003 6540401 3715670 2858528 1709412 -466891
4903 -466891 212109 4372760 6311806 3770534 2632476 6282334 8896815 6030752 3145074
4894 3145074 5613101 8584985 5841666 1180181 1506527 5416728 7735086 8300924 7483480
4885 7483480 1524397 -8006599 -10068469 -636645 7748871 5561805 2016451 5458396
4877 5458396 4374517 -10062366 -21027855 -18672955 -40198723 -129058614 -252522307
4870 -252522307 -311846841 -256172103 -145288551 -71227958 -53450113 -47761083 -28599575
4863 -28599575 -12965853 -13481264 -15865279 -9585740 -5313664 -10848539 -16142181 -13431267
4855 -13431267 -10973526 -15656884 -19533167 -14764076 -7677247 -7262902 -11102730 -12386165
4847 -12386165 -11409096 -11309528 -10328155 -6319606 -2548241 -2268589 -3092287 -2183234 -1611681
4838 -1611681 -3692500 -6146908 -6240784 -5025482 -3973094 -2130421 559842 2040517 2411283
4829 2411283 3970043 5378584 2451878 -3194452 -4016679 1610584 5356320 1457502
4821 1457502 -4238587 -3764132 990985 2839596 830612 -214659 1512448 3444460
4813 3444460 4311379 5291271 6389473 6295392 5193666 4239055 3151895 1064957 -1518914
4804 -1518914 -3761777 -5664344 -6427300 -4233475 285397 3293252 2846591 1810793 3169868
4795 3169868 5441221 5558306 3505571 1262314 -238662 -513771 1280194 3941780 3947559
4786 3947559 233668 -3814028 -5792148 -8128005 -13195287 -18139610 -18675982 -15295852
4778 -15295852 -11700913 -9485723 -8218620 -8385566 -10182725 -11371514 -10153009 -8299973
4770 -8299973 -7998307 -7955662 -6394710 -5240273 -6830797 -8769912 -7027001 -2519175 343167
4761 343167 397855 142167 547357 536818 818318 2894506 4486622 1388480 -5547531
4752 -5547531 -10332870 -9783198 -6962379 -5587901 -5595683 -5917409 -7240891 -9519240 -10275070
4743 -10275070 -8142025 -5504678 -5113603 -6133884 -5860005 -3732657 -1507562 -542713 -692156
4734 -692156 -1140879 -1014264 252677 2240927 3783423 4383489 4665956 4976516 4332245
4725 4332245 1421415 -3576347 -8404642 -10205802 -8350424 -5886145 -6717100 -10639359
4717 -10639359 -12968569 -10413334 -5287337 -1768570 15044 2993359 7473379 10197923
4709 10197923 9175210 6285536 4444023 4582703 5871773 6679810 4995936 185557
4701 185557 -5242502 -7743951 -6956626 -5727773 -5807142 -6063470 -5550600 -5644277 -7731189
4692 -7731189 -10674350 -11978482 -10302048 -6117060 -1278955 1451892 61084 -4558774
4684 -4558774 -9106263 -11058550 -10398264 -8147142 -4836637 -1090622 1596185 1645648 -1331688
4675 -1331688 -6009715 -9690474 -9990714 -7238988 -4291288 -2685146 -299064 5216932
4667 5216932 12102222 16346793 16926169 16061474 14974644 13050863 11068860 11150854 12693246
4658 12693246 12241422 8791845 5587857 4876699 4392493 1429831 -2640663 -4744672 -4631203
4649 -4631203 -4169476 -3912740 -3112613 -1860422 -768440 459270 2112492 3285197 3507720
4640 3507720 4214562 6421314 8180025 6822229 3016943 246964 525802 2548041 3883434
4631 3883434 3393581 1641623 135412 -133391 -119213 -1686171 -4363623 -4975113 -2146541
4622 -2146541 816507 202666 -2477661 -2576224 534004 2179810 -934024 -6060317 -8243558
4613 -8243558 -6566375 -4356368 -4331283 -5705548 -6022152 -4271289 -1598784 364835 1118434
4604 1118434 1159030 822654 6689 -975200 -1236024 -560837 -31356 -640626 -1885105 -2540691
4594 -2540691 -2242131 -1342719 213400 2626524 5110770 6350367 6210252 5874735 6012298
4585 6012298 5832653 4501594 2709962 2050783 3088839 4712800 5565976 5735625 6536384
4576 6536384 8522778 10284189 9901245 7427259 5049798 4548267 5320338 5321490 3389260
4567 3389260 267422 -2124992 -2074294 655841 4318648 6230447 4824892 806849 -3440853
4558 -3440853 -5218854 -2884440 2827330 8675006 11264004 10063836 7431167 5617550
4550 5617550 4816034 4223736 3542231 2823660 2067473 1614748 1860235 2164117 1408307 67471
4540 67471 918 1436279 2113751 651577 -1193773 -1285522 -262448 178024 504088 2192247
4530 2192247 4415405 4836369 3412726 2649378 3850228 5600533 6530270 7364655 9268921
4521 9268921 11774170 13301650 12737351 10103205 6749675 4923609 5665072 6982890 5827261
4512 5827261 2212649 -568372 -567913 60655 -1673721 -5309724 -7771544 -7332590 -4754294
4503 -4754294 -1271110 2250692 4252469 3005665 -896196 -4314875 -5074043 -4414409 -4574031
4494 -4574031 -5121949 -3811157 -609552 1703720 1626684 1220813 2742230 4940581 5018886
4485 5018886 2974052 1175752 195492 -1784450 -5059258 -7049654 -6127210 -4142417 -3417466
4476 -3417466 -3452818 -2649768 -1410872 -1160705 -1630557 -1492593 -763190 -399388 -370884 -309227
4466 -309227 -1209739 -4074489 -7485206 -9073070 -9084207 -9933709 -12315594 -14338075 -14656065
4457 -14656065 -13855271 -12360694 -9670593 -6460080 -4869270 -5504807 -6373671 -6058545 -5798204
4448 -5798204 -6849150 -7716185 -5951849 -1414599 3980974 8605252 11502389 11544665 8327830
4439 8327830 3667004 520929 196506 1413876 1883231 105567 -3787546 -7942562 -9859886
4430 -9859886 -8505064 -5245225 -2220386 -299358 840202 1506418 1938022 2839022 4667261
4421 4667261 6499655 6714974 5037186 3206435 3305711 5605556 8086648 8198507 5539825
4412 5539825 2707649 2582324 4593105 4976158 1553300 -2966754 -3864993 72897 5389106
4403 5389106 7983093 6768102 3234992 -970555 -5038597 -8351595 -10017662 -9349057
4395 -9349057 -6571343 -2832176 658812 3437131 5435447 5995718 4125220 200541
4387 200541 -3454019 -4706569 -3959459 -3336100 -3713349 -3742010 -2100888 300801 1089295
4378 1089295 -1055542 -5210056 -9288902 -11832970 -12788169 -12935396 -12822905 -12340164 -11297426
4369 -11297426 -10132986 -9648316 -9988319 -10243739 -9345866 -7236917 -4926848 -3448734 -2993135
4360 -2993135 -3051457 -3027330 -2447326 -932795 1363750 3227000 3047178 663229 -1752308
4351 -1752308 -1348253 2714813 8474279 12936293 14305104 12758763 9844238 7395834
4343 7395834 6475791 6784294 7099332 6531419 5425746 5016721 6133686 8100528 8958252
4334 8958252 7189240 3474097 360885 -257595 870465 1328109 -124626 -2059756 -1729568
4325 -1729568 2190394 7917386 11539690 10311706 5381213 664041 -1365193 -1909041
4317 -1909041 -3318574 -5614375 -6967428 -6781514 -6378702 -6759997 -7450830 -7777668 -7744860
4308 -7744860 -7326166 -6282014 -4962950 -3891969 -2359359 846943 4853618 6758647
4300 6758647 5242278 2439454 1038114 1052170 836710 -124127 -1061946 -1392990 -687106
4291 -687106 1757771 5477965 7920237 7080064 4522259 3614922 5056145 6451848 6342040
4282 6342040 6051333 6724804 6874118 4476349 64149 -3870079 -5684672 -5462805 -3763644
4273 -3763644 -893958 2733041 6458602 9558133 11174040 10691060 8845556 7678688
4265 7678688 8284859 9166173 8153164 5622350 4164734 4893431 5853754 4990916 3204809
4256 3204809 2908310 4350273 5215435 3975107 2057291 1933456 4014938 6387801 7201040
4247 7201040 6454987 5474997 5334925 6107621 7291775 8454058 9255785 9119376 7446037
4238 7446037 4506140 1800719 973752 2270191 4333910 5497413 5051334 3492964 2023843
4229 2023843 1698401 2526851 3406688 3362812 2740577 2686605 3648446 4994516 5896983 5895180
4219 5895180 4864470 3257076 2070082 1672954 1149149 -78311 -735872 445068 2049617
4210 2049617 1569125 -554371 -1269753 454116 2429514 3369295 4710340 6858229 7270610
4201 7270610 4737477 2288435 2769486 4403926 4216499 3192099 3918493 5278910 4178436
4192 4178436 1255187 191349 2027261 4592513 6973395 9863307 11799212 10154134
4184 10154134 6353649 5157520 7729962 10069559 9554394 8395631 8919809 9918313 9830912
4175 9830912 9500794 9453711 8086489 4831460 1820401 490649 -76198 156282 3160968
4166 3160968 8510457 12085208 11394405 8422744 5384874 2151513 -162445 1461672
4158 1461672 6006418 7355691 2892923 -2165375 -2748305 -229561 3377413 10120806
4150 10120806 19041366 22426125 17451824 13495969 16447103 12972903 -13709603 -54953938
4142 -54953938 -80861919 -76172437 -56783369 -45149843 -43560400 -40689672 -32619523 -24925304
4134 -24925304 -20559608 -17517942 -15667158 -16375276 -16941997 -13360671 -7606673 -5255429
4126 -5255429 -6646194 -6886651 -4238873 -2232271 -3040815 -4453985 -4530974 -4376727 -4762861
4117 -4762861 -4087645 -1560535 747321 905277 -144952 -499881 -190450 -622092 -2147844
4108 -2147844 -3486207 -3370897 -2226788 -1887874 -3257304 -4661919 -3920987 -2009154 -2456706
4099 -2456706 -6329235 -10290704 -11251738 -10540562 -11171997 -13078209 -13982391 -13610238 -13883817
4090 -13883817 -15515867 -17225415 -18163662 -18704596 -18844670 -17900917 -15842533 -13239210 -10144266
4081 -10144266 -6719733 -4494745 -4933805 -6861620 -7373133 -5624715 -3987820 -4842550 -7461622
4072 -7461622 -8781274 -6756810 -2623693 194934 -251713 -2146367 -2416995 -1379509 -2684194
4063 -2684194 -7768121 -12723118 -12636354 -7470441 -1663925 812382 -878542 -5247385 -9578862
4054 -9578862 -11169098 -9780882 -8318613 -9198402 -10914151 -10280480 -7210767 -4817192 -5068902
4045 -5068902 -6510299 -6246987 -2614524 3669829 9455073 11046621 7990341 4244400
4037 4244400 3792844 6074058 7743369 7591752 6855814 5585925 2197350 -3198423 -8064740
4028 -8064740 -10716825 -11975533 -13039539 -13863337 -14107734 -13695941 -12072884 -8906997 -5848865
4019 -5848865 -5522309 -8214784 -11313779 -12401957 -11285814 -8941349 -6484532 -5421430
4011 -5421430 -6741419 -9085247 -9563894 -6997230 -2933016 638383 2873115 3448728 2529578
4002 2529578 1645551 2372556 3586262 2263296 -2129267 -6161317 -6546639 -4007475 -1796857
3993 -1796857 -1802684 -3472962 -5575834 -7524168 -9060814 -9484738 -7753595 -3873965 -42723
3984 -42723 1102147 192412 1279763 6513525 12355568 13635218 10099915 5939456 3683484
3975 3683484 2019714 -527740 -3268072 -5213857 -6380986 -6782346 -6688322 -7760509 -10884288
3966 -10884288 -13152207 -10789725 -5207151 -1877178 -2581770 -3510663 -2369262 -2095064 -4798938
3957 -4798938 -7007432 -5033141 -1271356 -525713 -2719811 -3932815 -2997020 -2579149 -4453268
3948 -4453268 -7501636 -10030144 -10917653 -8972045 -4207723 500049 1761710 -474532
3940 -474532 -3571936 -5960176 -7745685 -8394882 -6904551 -4255597 -2894234 -3376784 -3835670
3931 -3835670 -3166049 -2601368 -3503648 -5309507 -6370721 -5693913 -3456226 -644513 1661977
3922 1661977 3098812 3758177 3005528 -80841 -4467784 -7300520 -7602115 -7706714 -9071249
3913 -9071249 -9092763 -5193947 -85854 1166959 -1546696 -3404715 -2016889 -176412 -40541
3904 -40541 954966 5576398 11412410 13545669 10931476 6796879 3488798 305641 -3135707
3895 -3135707 -4472193 -1554888 3611493 6213573 3919212 -980947 -5212377 -8320286
3887 -8320286 -11247676 -12854103 -10956134 -6655813 -4241448 -5525167 -7179820 -5748811
3879 -5748811 -2801857 -2227965 -4114277 -4799994 -2579313 -89700 -403652 -3161371 -5642314
3870 -5642314 -6185700 -5517658 -5269589 -5697202 -5003702 -1530489 3409526 6471659 6702688
3861 6702688 6900894 9018126 10528041 8095576 3141816 301621 1074032 2474449 1940475
3852 1940475 218819 -1156376 -2145686 -2850882 -2361287 -263443 2414053 4630001 6159826
3843 6159826 6515286 4831653 1501218 -1656385 -3427957 -4062978 -3982279 -3314884 -2817969
3834 -2817969 -3326052 -4035454 -3312883 -1480294 -688033 -1679957 -2958832 -3645339 -4679349
3825 -4679349 -6361134 -7232725 -6624197 -5947032 -5964343 -4974567 -1572612 2481949 4038193
3816 4038193 2020219 -2274316 -6968039 -10211736 -10392548 -7614073 -4275493 -2736645
3808 -2736645 -2913327 -3128919 -2541003 -1742452 -1699627 -2924452 -5003207 -6475591 -6193523
3799 -6193523 -5148857 -5524948 -7428904 -8323095 -6592112 -3850406 -2425814 -2237720 -1760692
3790 -1760692 -676719 196696 586263 650273 -98346 -2205785 -5032286 -7229957 -8041024
3781 -8041024 -7388584 -5440870 -2817277 -380430 1716518 3658029 4348210 2121975 -1973497
3772 -1973497 -3835163 -1077105 3584744 5775746 4799689 3246647 2604130 2119774 1477206
3763 1477206 1605176 2379112 1954548 -563559 -3361625 -3922824 -1959107 453999 1217426
3754 1217426 101541 -1573353 -2702148 -3395364 -4114156 -4604506 -4598013 -4871574 -6038272
3745 -6038272 -6671177 -4724987 -945717 1450921 1014046 -501073 -1700942 -3656148 -6878557
3736 -6878557 -9064225 -8191443 -5568399 -3350054 -1214787 1779401 4215583 4472930 4059963
3727 4059963 5138580 6085254 3562923 -1675736 -5238765 -5400493 -4962641 -6171511 -7490407
3718 -7490407 -6691922 -4119420 -1487954 118502 -17141 -2145448 -4707499 -5397364 -4428054
3709 -4428054 -4313217 -5601698 -5779234 -3859517 -3012938 -6142723 -11037663 -12747359 -9602078
3700 -9602078 -4456695 -733641 599896 565225 626733 1567150 2574319 1651593 -1940315
3691 -1940315 -6018779 -7475008 -5758526 -3296526 -2569463 -3831324 -5765979 -7286896
3683 -7286896 -8110155 -8194420 -7527597 -6640667 -6659421 -8086177 -9709705 -9711375 -8044458 -6565609
3673 -6565609 -6313257 -6067491 -4595988 -2783049 -1931664 -1408571 -150123 747481 -245696
3664 -245696 -1550721 8347 4145901 7033742 6966192 6549887 7667562 7638393 3154285
3655 3154285 -4158231 -9144724 -9144231 -6207893 -3813575 -3331383 -3607921 -2646188 337263
3646 337263 3865754 5503889 4366009 1508805 -1897941 -4840611 -4796096 1056964 11098470
3637 11098470 18376050 17434216 10693262 5262445 4412756 5185253 3914527 670973 -2555565
3628 -2555565 -5169746 -7643780 -9508849 -9641733 -8111155 -6237037 -4596619 -2083113
3620 -2083113 2153679 6322483 7099621 3800459 -47961 -927304 67008 -723313 -3649939
3611 -3649939 -5371933 -4596028 -4216117 -6063087 -7324807 -5035796 -951671 1623439 3285322
3602 3285322 6569767 10351313 10978440 8355621 6242383 6357345 6588499 5639430 4963288
3593 4963288 4768930 2556274 -2030093 -4722708 -2117042 3168494 6023540 5396183 4070500
3584 4070500 3619974 3252912 2981721 4314613 7291409 9549613 9248601 7037627 4322637
3575 4322637 1214700 -2695041 -6564419 -8564064 -7811887 -5401836 -3245833 -1899903
3567 -1899903 172348 4567165 10082785 12826080 9986363 3079427 -3351097 -6082573
3559 -6082573 -5655974 -4683967 -4501299 -3901250 -1191924 2734222 4207408 624342 -5816820
3550 -5816820 -9656486 -7819598 -2463770 2222446 4402707 4767075 4144110 3013457 2441075
3541 2441075 3140712 3706838 1915968 -1821347 -4200582 -3027425 25733 1702187 1006282
3532 1006282 -503517 -1459583 -2154555 -3232655 -4145810 -3596809 -1179146 1860705 3514960
3523 3514960 2607181 -333092 -3483462 -4897006 -3614435 -278272 3103510 4508101
3515 4508101 3558036 1701317 443438 -244400 -1274035 -2636168 -3162744 -2142901 -407723
3506 -407723 475247 -349819 -2413622 -4164191 -3805368 -775459 3151532 4918084 3053781
3497 3053781 -678393 -2881924 -1614984 2188298 5780271 6651468 4113587 -297753
3489 -297753 -3977402 -5311237 -4689537 -3362095 -1676400 1021649 4942615 8969833 11354290
3480 11354290 10958283 7871146 3289148 -1068487 -3800884 -4413478 -3217058 -943266
3472 -943266 1335759 2373089 1616862 45257 -421559 1292891 4320047 6571240 6483701
3463 6483701 4246560 1548605 -92436 -980361 -2807460 -6184275 -9287473 -9891279 -8244229
3454 -8244229 -6682298 -6631655 -7445587 -8156785 -8555970 -8064623 -5532049 -1387767 1598071
3445 1598071 1317565 -959511 -2344699 -1803464 -337347 1205148 2538982 2992191 2367402
3436 2367402 2264367 4205826 6703150 6738451 4230978 2259347 2349094 2520561 1156200
3427 1156200 -182940 312719 1590252 1940263 2046027 2993653 3178183 722628 -2166107
3418 -2166107 -1241379 3399282 6830332 6146273 4315806 5399888 8797872 10805175 9982406
3409 9982406 8061383 6353467 4183725 1264968 -669541 110004 2706241 4186397
3401 4186397 2639719 -982793 -4055269 -4771895 -3166461 -57744 4055678 8485307
3393 8485307 11482350 11276884 8311532 5361268 4643587 5422260 5285161 3336874 1107717
3384 1107717 389006 1223523 2379420 2953362 2901453 2649287 2998928 4923896 8299770
3375 8299770 10942716 10267115 6335104 2050971 -262957 -1049227 -1297777 -15165 3856556
3366 3856556 8250495 9747973 8281350 6899747 6570491 4863109 1064783 -1305799
3358 -1305799 245055 2775410 2401141 565638 1348623 4219683 4645700 1553757 -1105522
3349 -1105522 -1108285 -1133071 -3084665 -3902588 -523191 4279241 5118673 1413250 -2112997
3340 -2112997 -1778452 1101749 2558019 211933 -4815406 -8914442 -9239746 -6812235 -5471288
3331 -5471288 -7034409 -9199907 -9385958 -8321540 -7732206 -6815890 -4168256 -1489854 -1581552
3322 -1581552 -3487296 -3626999 -1744721 -1727566 -5646694 -10605822 -13006774 -12891498 -12275336
3313 -12275336 -11814814 -11178961 -10588098 -9859011 -7627819 -3579401 -7108 854281 -231612
3304 -231612 -1235630 -2266418 -4820558 -8347592 -10093547 -8449260 -4529631 -306779
3296 -306779 3070790 4891649 4631165 2883789 1371122 1187816 1645762 1358703 5373
3287 5373 -1348866 -1389396 193296 2448218 4117932 4700921 4172484 2017903 -2057694
3278 -2057694 -6048699 -6116955 -827375 6133833 9460989 8028265 5359313 4691935 5817926
3269 5817926 6995734 7548044 7467460 6318644 3998051 1465655 -362448 -1385176 -1196876
3260 -1196876 1154717 4842089 6299249 2875766 -3312619 -7467249 -7688541 -6147564
3252 -6147564 -4816362 -2961887 76539 2349827 1773714 -479433 -1527839 -865157 -336614
3243 -336614 -294727 1308611 5045502 7787328 6450587 2545999 588232 2375354 5109666
3234 5109666 5498196 3644237 1890757 1458292 1748087 1988463 1872081 895446 -1356714
3225 -1356714 -4097309 -5707685 -5543813 -4497375 -3583688 -2897950 -2181933 -1385854 -236950
3216 -236950 1746795 4159605 5447803 4496674 1915753 -780717 -2575372 -3074732 -2335239
3207 -2335239 -1492830 -2482566 -5716158 -8791375 -9137984 -7430074 -6470675 -6902630 -6390950
3198 -6390950 -3717394 -1344426 -2169231 -5192012 -6589810 -4701803 -1991717 -1666135 -3763240
3189 -3763240 -5470528 -4653065 -2169819 -721899 -2014610 -5380298 -8855119 -10904197
3181 -10904197 -10885319 -8635431 -4571419 -22518 3502040 5596864 6941632 8078537
3173 8078537 8972521 9595518 9752144 8276343 3946004 -2229472 -7171291 -9158580 -9654168
3164 -9654168 -10434863 -10478610 -7855873 -3709873 -1537564 -2374096 -3406200 -2437010 -1363499
3155 -1363499 -3200047 -7154796 -9345038 -8244897 -6812440 -8058541 -10423260 -9733018
3147 -9733018 -5124801 -588403 45305 -2366910 -4173907 -3717341 -2089186 -202016 1995449
3138 1995449 3418443 2080696 -1504721 -3906983 -3460430 -2924034 -5212961 -8680895 -9729372
3129 -9729372 -8647511 -9171937 -12474552 -15104720 -13727346 -9216118 -4950438 -3071261
3121 -3071261 -3377921 -4214009 -3628153 -1170262 952818 166513 -2695987 -3990400 -2215640
3112 -2215640 4343 -59476 -1714707 -2972671 -3842300 -5170292 -5995868 -4864173 -2856204
3103 -2856204 -2595743 -4459830 -6091246 -5780983 -4332465 -3257640 -2924775 -3112621 -3916463
3094 -3916463 -5138137 -5628047 -4243856 -1386007 937910 898728 -1165661 -2830262 -2247708
3085 -2247708 -586564 -803241 -3803675 -7064401 -7671721 -5530673 -2694961 -700951 205164
3076 205164 118412 -778596 -1899940 -2753309 -3379270 -3550536 -2311468 673907 4056806
3067 4056806 6159147 6668606 6002280 4107820 1407759 -113424 1163054 3930587 5364383
3058 5364383 4919600 4627758 5431356 5439959 2739308 -1807405 -5837635 -8371787 -9947344
3049 -9947344 -10514034 -9003219 -5623111 -3369349 -5509316 -11160998 -14911743 -12424937
3041 -12424937 -5692460 -712437 -229294 -1322776 -550568 1692496 3585841 5642680
3033 5642680 9153838 12787754 13911123 12290020 9712651 6939832 3984446 2512559
3025 2512559 4406784 7921614 8613798 4833236 -266596 -2744224 -1624230 1561287
3017 1561287 4434420 4601727 1435825 -2309358 -2952501 -396390 2121061 2869959 3259117
3008 3259117 4196792 4237942 2595510 826487 -129459 -1714451 -4717288 -7152153 -7220191
2999 -7220191 -6036407 -5420239 -5294138 -5307282 -6557539 -9201915 -10589970 -8607516 -5121758
2990 -5121758 -3314475 -3159972 -2435884 -870288 -197810 -959182 -2202551 -3819661 -6363525
2981 -6363525 -8779216 -8883913 -6146982 -1978267 2441095 6521109 8847315 7826180
2973 7826180 4019213 36638 -2115177 -2330426 -1475421 -678541 -1029342 -2341199 -2726662
2964 -2726662 -1036915 978189 831730 -1029698 -1794828 -73788 2935070 5617676 7112519
2955 7112519 6648079 4045306 921483 -664198 -832052 -1326776 -2522446 -2934105 -1544520
2946 -1544520 1353634 5377104 9984562 13413853 13945065 12175341 9983273 7652936
2938 7652936 4458857 1557251 1160740 2837938 3908907 3863347 4926033 7472577 8573583
2929 8573583 6646948 4188466 3823069 4556630 4250713 3274237 3157991 3655651 3653219 3368579
2919 3368579 3324319 2584835 229847 -2663627 -4427975 -4871192 -4338220 -2655626 -1035374
2910 -1035374 -2672283 -8405712 -13692788 -13588387 -9548583 -7325357 -8716322 -9799114
2902 -9799114 -7754765 -4959148 -4591692 -5975698 -6808160 -7066639 -7676856 -7428437 -4675000
2893 -4675000 -1080496 -252563 -2660482 -4908752 -4617694 -3256356 -2954173 -3068550 -1979637
2884 -1979637 -397670 -180295 -843893 -230074 1477547 1497089 -1030451 -3265642 -3048234
2875 -3048234 -2328685 -3755431 -6073409 -6202233 -4477632 -4022198 -5354470 -5654481 -3964466
2866 -3964466 -3149471 -5045965 -7152794 -6624294 -4776466 -4575447 -5631927 -5209870 -3308508
2857 -3308508 -3089502 -5763034 -8027840 -6171429 -1117518 2305252 711381 -4473576
2849 -4473576 -9229335 -11507129 -12281238 -12096559 -8769590 -679480 8740754 13050668 10080540
2840 10080540 4557358 2201736 3527831 5155117 5011935 3780047 2621984 2058929
2832 2058929 2434668 3380335 3365655 1626346 -117194 269955 2229327 3476296 3522717
2823 3522717 4088566 6199929 8802454 10142038 8894774 4475593 -1746358 -6093824
2815 -6093824 -6008548 -3829849 -4543434 -9336084 -13931260 -14124763 -10524100 -6611841 -4439003
2806 -4439003 -3993389 -4935911 -6580990 -6917935 -3798111 2639481 9674402 14082580 14060321
2797 14060321 9846469 3556327 -1853956 -4555336 -5086773 -5202542 -5509003 -4852034 -2302563
2788 -2302563 838098 1921286 70373 -2472794 -3070655 -2152346 -2373252 -4430349 -5912761
2779 -5912761 -5161382 -3926977 -4284450 -4923305 -3401669 -887873 -1068152 -4216172 -5843112
2770 -5843112 -2587669 3244927 6910425 7078996 6280231 6550419 6917873 5382664 1923208
2761 1923208 -1212539 -1861967 -148907 1847104 2436283 1741324 702955 -241595 -790722
2752 -790722 -309404 992961 1532323 692745 633907 3485369 7476297 8656732 6381915
2743 6381915 4166633 4644784 6598003 7879449 8333686 8284026 6803717 3625842 809827
2734 809827 364811 1651595 2917925 3841156 4624458 4170050 1572506 -1577082 -2781061
2725 -2781061 -2059057 -1772836 -3367264 -6002977 -8041769 -8270590 -6121335 -2427893 294727
2716 294727 2344 -2486951 -4566485 -5027207 -4809506 -4948094 -5356610 -5567338 -5246785
2707 -5246785 -4025149 -2106996 -844025 -1257298 -2195514 -1672441 -87802 -171885 -3047666
2698 -3047666 -6095039 -6061888 -3278016 -1252806 -2293507 -4853052 -5734761 -4050261 -1855307
2689 -1855307 -948696 -529913 950126 2845816 3216774 2241164 2303756 4198915 5561880
2680 5561880 4114079 385777 -3983569 -8388962 -12023835 -12837973 -10193651 -6805323
2672 -6805323 -5446177 -5304519 -4399270 -3918321 -6483856 -11071078 -13711182 -13143973 -11793991
2663 -11793991 -10765197 -8140162 -3690347 -1286594 -3972930 -9284760 -12143317 -10752870
2655 -10752870 -7459040 -5126021 -4682255 -5342523 -5618362 -4621344 -3184757 -2892556 -3749595
2646 -3749595 -4310125 -4287349 -4824008 -5680164 -4915868 -2432188 -737148 -466733 1496804
2637 1496804 6716651 11206031 10574835 6820216 5536344 7771698 9427008 8269312
2629 8269312 6586107 6189341 5473850 3235522 1526512 2293557 4123189 4848810 5069149
2620 5069149 6485483 8511191 9171519 8274348 7352389 7183854 7375652 7790499 8486630
2611 8486630 8619555 7067069 3921567 140055 -3666239 -6745689 -7435025 -4860621 -978415
2602 -978415 1156679 1111273 1102776 2274722 3190203 2662954 1933906 2767990 4968566 7146203
2592 7146203 8692878 9553203 9113220 7044512 4708992 4080553 5412377 7306638 8887301
2583 8887301 10364929 11342119 10266786 6469552 1712665 -1312835 -1650919 -667562 -388962
2574 -388962 -1763043 -4186480 -6196037 -6784153 -6341311 -6071045 -6318591 -5988400 -3971647
2565 -3971647 -567805 3110560 6575072 9803968 11868321 11047372 6997963 2040768
2557 2040768 -762317 -810351 -445025 -1894712 -4417571 -5348127 -3778596 -1971883 -2480183
2548 -2480183 -4873295 -6628611 -6759306 -6767068 -7663662 -7894158 -5530060 -1349422 1956574
2539 1956574 3183089 3600921 4615921 6036326 7045969 7438801 7088891 5424699 2693031
2530 2693031 1018772 2608788 6739450 9773810 8820925 4657854 399754 -1967517
2522 -1967517 -2632200 -2089998 -164194 2440877 3446462 1707411 -345671 734969 4565603
2513 4565603 7063077 5897122 3201576 1561168 10250 -3377350 -6845806 -6448835
2505 -6448835 -1760347 3195899 5176797 5008059 4727324 4167901 2171456 -652699 -2404112
2496 -2404112 -2225589 -669308 1547515 3892896 5755449 6971312 8136229 9525324
2488 9525324 10351932 10013220 9365576 9668586 10752573 11258620 10316839 8107306 5243344
2479 5243344 2607892 1441728 2521698 5251246 8141257 9872667 9416485 6012038
2471 6012038 302248 -4941619 -6765269 -5059722 -2724541 -2486335 -4289650 -6222650
2463 -6222650 -7323771 -8531034 -10673241 -12372295 -11215800 -7233424 -3654037 -2893470
2455 -2893470 -3139800 -1192493 2240227 3444935 2096376 2766676 8195376 14574047 16511977
2446 16511977 14003844 11007337 9277681 7637394 5858429 4771190 3132408 -1010323
2438 -1010323 -5683811 -6298279 -2473374 782706 91984 -2276418 -3166963 -3002314 -2873427
2429 -2873427 -1209672 3108134 7497973 9329935 10199375 12632064 14953056 13975700 11015599
2420 11015599 10161391 11336361 10253228 5512946 823903 -911373 -1216711 -2101913 -2619572
2411 -2619572 -1641971 -583480 -680635 -406977 1560990 3158559 1767708 -1473432 -3190883
2402 -3190883 -2386780 -689526 1044950 3419110 6144615 7723833 7592102 6442603 4469635
2393 4469635 1405832 -1710287 -3037843 -2519719 -1971648 -2260618 -2364440 -1572815 -418790
2384 -418790 1212834 4484074 8832056 11034123 8988396 4872464 2479523 2512367 2557516
2375 2557516 792376 -2605966 -7164929 -12498225 -16713131 -17124090 -13814248 -10473795
2367 -10473795 -9947758 -10271177 -7174385 -14279 6880816 9217647 7490578 5620326
2359 5620326 5654470 5363974 1624518 -4747633 -8919488 -7227465 -1490933 2896833 2749909
2350 2749909 -327356 -2981398 -3856951 -3477253 -2204859 -258778 1128325 795476 -176925
2341 -176925 529125 2899433 4053272 2164418 -995936 -2829676 -3487942 -4617568 -5758031
2332 -5758031 -4704902 -1361136 1409245 1674008 1209680 3012203 7235094 11001957 11657643
2323 11657643 9092991 5253069 2391077 1735435 3080368 5404863 7883819 9979648
2315 9979648 10684926 8758283 4368066 -289937 -2898518 -3103061 -2031769 -391587 1963541
2306 1963541 4978362 8016272 10507398 12215883 12972603 12758956 11746856 9622263 5476816
2297 5476816 -595798 -6317091 -8980673 -8251533 -6085117 -4194470 -2951155 -2367954 -2275652
2288 -2275652 -1543211 786630 3243994 3034557 88284 -2363425 -2374334 -1837698 -2554505
2279 -2554505 -2357888 1736877 8196282 12432810 12960157 12360217 11981546 9729773 4761855
2270 4761855 917226 2464790 8175729 12559739 12352420 9263314 6408993 4554046
2262 4554046 2850290 1445412 1453094 2644521 2811971 303034 -3439804 -4986095 -2765070
2253 -2765070 1017807 2805762 1390986 -1405871 -3073941 -2516051 -310353 2006086
2245 2006086 3028238 2737454 2533809 3398002 4667696 5586299 7006456 9713942 11765123
2236 11765123 9953065 4016039 -2901369 -8174001 -11525196 -12551083 -9741641 -3690311
2228 -3690311 1591225 3108116 2649154 3609641 5811266 6345640 4286562 1470160 -734158
2219 -734158 -2402610 -3086940 -1885369 223408 799562 -657636 -1920455 -1273859 364074
2210 364074 1135398 420135 -980509 -1304931 1296286 6307702 9655703 7781227 2938282
2201 2938282 1078272 3801772 6233034 4528833 1475461 1542681 3734754 3666951 843188
2192 843188 -798357 783716 3013017 2894076 597434 -2055989 -3890553 -4120046 -2339817
2183 -2339817 -77874 -114076 -2669610 -4160089 -1622904 2973826 4839303 2018511 -2845703
2174 -2845703 -5956075 -5861550 -3652138 -1326962 -394005 -966009 -1770810 -1757849 -1760035 -3499623
2164 -3499623 -6655866 -8277395 -6150710 -1820736 1132062 1344779 626004 751315 1222551
2155 1222551 994929 728269 1772096 3883482 5580824 6190701 5930701 4442302 1221903
2146 1221903 -2468952 -4207062 -3549182 -2811940 -3863080 -5686779 -6159204 -4878392 -3103353
2137 -3103353 -2055291 -2379196 -4149637 -6257457 -6865152 -5545512 -3728646 -1968814 1392275
2128 1392275 6958763 11480718 11169560 6877736 2936411 1197674 -496118 -3561743
2120 -3561743 -5840154 -5032123 -2240416 65275 1755060 4321620 7450214 8682218
2112 8682218 6575289 2631348 -308703 -743342 675766 2459851 3985932 5685012
2104 5685012 7552398 8274968 6889253 4918943 5229743 8332149 11311319 11364745 9281125
2095 9281125 8205824 9585962 11541335 11148247 7505362 2421880 -1469192 -2996628
2087 -2996628 -2773490 -1517246 948381 4345404 6758136 6552328 5046807 5209824 7494882
2078 7494882 8997991 7333900 3400599 -509378 -3314585 -4658915 -3808357 -848724
2070 -848724 2299620 3738136 3579373 2964172 2373965 2068934 2551457 3110628 1787516
2061 1787516 -1225173 -2124019 1807046 7529372 9429847 6234340 1544971 -1790353
2053 -1790353 -4214727 -6461454 -7746973 -7652932 -6659587 -4261408 130771 3871766 2717109
2044 2717109 -2766284 -6573481 -5412434 -3419322 -5296719 -8456086 -6906109 -736645
2036 -736645 3813872 3314659 997660 784796 1918499 1476849 -1058925 -4023156 -6077981
2027 -6077981 -6398111 -4094212 377788 4254488 4807381 2239543 -905525 -2585457 -2460076
2018 -2460076 -1048999 941286 2743603 4048803 5243014 6437526 6758223 5551373
2010 5551373 3894705 3705375 5284907 6762038 6281355 4008619 1631202 530207 945713
2001 945713 2409326 4173893 5272603 5001462 3793410 3052430 3444963 3719844 2129334
1992 2129334 -1113775 -3916087 -4945773 -4795189 -4026651 -1886456 1583513 3783748 2339869
1983 2339869 -1051142 -2192644 186988 3195589 4415989 4953699 6549690 8302243
1975 8302243 8505084 7879968 8288602 9178087 8023175 4300723 861622 815793 4314279
1966 4314279 8698172 10996965 10348975 8558821 7761733 7140769 3492365 -3718376 -9861665
1957 -9861665 -10249010 -6336684 -3590569 -3958779 -4369218 -2805986 -1402336 -1863279 -1920520
1948 -1920520 735877 4071857 4758589 3581365 4159960 7354946 10383254 11064240 9829206
1939 9829206 7617942 4813487 2675042 3059359 5743658 8047352 8013959 6441961 5262571
1930 5262571 5485947 7108728 9238422 9719248 6463459 126562 -5877419 -8788730 -8811554
1921 -8811554 -7736171 -6815344 -6419989 -6049890 -4115945 387287 5294967 6588620 3512172
1912 3512172 157022 291368 2767488 4235936 4376903 5397397 7485759 8101866 5760707
1903 5760707 1767943 -2126065 -5385007 -7482502 -7324428 -4888658 -1776426 836299
1895 836299 3422047 6350532 8204625 7159559 3514017 -182397 -1565065 -723529 -59300
1886 -59300 -1661682 -4559186 -5220868 -1609953 3902022 6947241 6106892 3946461 3255030
1877 3255030 3987572 4288948 2936870 73121 -3207491 -5273731 -5072009 -3575530 -3248394
1868 -3248394 -5437336 -8980071 -11655451 -12077643 -9999973 -6059489 -1748654 1481831
1860 1481831 3556045 5191026 5985825 4818706 2458296 1554510 2986046 4340368 3492339
1851 3492339 1639585 895525 877606 200436 -343929 722294 1936890 457232 -2753219
1842 -2753219 -3065749 1279140 5985982 6156661 2614821 142533 640695 931626 -2379673
1833 -2379673 -7979844 -10955252 -8086321 -1169195 4776179 6005361 2706354 -2069268
1825 -2069268 -5250198 -5665061 -4320796 -3474970 -4744982 -7390505 -8924191 -7899994 -5292637
1816 -5292637 -2536900 426029 3705958 5295264 2672442 -3612145 -10027092 -13870318
1808 -13870318 -15086778 -14216294 -11022574 -6203735 -2269838 -844466 -276920 2244897
1800 2244897 6697702 9854621 8944017 4715994 646278 -483000 981853 2528172
1792 2528172 2615255 2018478 1699944 837933 -1401394 -3371912 -2934793 -1590922 -3408963
1783 -3408963 -9088099 -14213329 -14972182 -12736370 -10728546 -8719679 -4250251 2281847
1775 2281847 7084950 7396277 4159122 418040 -1197446 180844 3095202 4950150
1767 4950150 5093115 5667808 7869251 9147958 6815572 2858401 1510714 2816952 2780796
1758 2780796 59923 -1952565 -1037730 113340 -1423889 -3804052 -3348302 -256276 1972899
1749 1972899 1609534 150979 -683556 -691777 10864 1621380 3667244 4993439 5212261
1740 5212261 5241175 6218492 8410334 10899445 11883914 10007872 6157781 3196301 3080206
1731 3080206 4992269 7002171 8309470 8676651 7076641 2902025 -2179781 -5531080
1723 -5531080 -6422041 -5997332 -4873920 -2754483 -250534 1143590 1421247 2551191 5725805
1714 5725805 9485168 11503675 11295651 10367218 10396091 11864822 13838371 14483994 12313340
1705 12313340 7600123 2573286 -63516 908025 4200364 6729596 6038151 2653301
1697 2653301 -418864 -989018 296754 1688567 2634335 3066999 1877923 -1662391 -5665465
1688 -5665465 -7149762 -5595854 -2883607 -130940 2721786 4316562 2279619 -2760837
1680 -2760837 -6680110 -7058893 -6141197 -6573915 -6909021 -4295925 293042 3006673 2489900
1671 2489900 1134564 1096522 1856270 1982456 859906 -1814676 -6071776 -10517027 -12939241
1662 -12939241 -12713107 -11099698 -8942145 -6039925 -3261596 -2847517 -5264316 -7780314
1654 -7780314 -7937580 -6865356 -7208771 -9134874 -10752388 -11582821 -12814585 -14160119 -13296423
1645 -13296423 -9373710 -4872086 -2647461 -2805987 -3825160 -5073098 -6415260 -6824293
1637 -6824293 -5855895 -5583289 -8226904 -11871354 -11723851 -6590968 -1179158 -74370 -1830590
1628 -1830590 -1639631 1754532 4843165 4391558 811058 -3462136 -6319572 -6368378 -3442481
1619 -3442481 451440 2587074 2537598 2002171 1448496 -586180 -4160286 -6725367 -6781662
1610 -6781662 -6211249 -7031628 -8168987 -7862080 -7190672 -8256102 -10300583 -10726665 -9032391
1601 -9032391 -6730028 -4217354 -1120690 715840 -1503451 -6662822 -9751549 -8109054
1593 -8109054 -4663046 -3370784 -4202240 -4645587 -3789104 -2459914 -1070687 68606 -545408
1584 -545408 -3929280 -8057876 -9368717 -7025367 -3924547 -3091610 -4393323 -5295044 -3989935
1575 -3989935 -1250316 573046 232052 -940437 -801050 527109 690111 -1311425 -3186874
1566 -3186874 -2277799 909755 3827063 5522542 6944671 8063097 7374544 5029270 4175043
1557 4175043 7438760 13158000 16828178 15974762 12197976 8497516 6219617 5335043 6090745
1548 6090745 8331623 9629053 6771486 367524 -4252629 -3205400 183431 -949388
1540 -949388 -7754843 -13820402 -13748607 -9883165 -7778945 -7993103 -6567142 -2403037 416512
1531 416512 -1594578 -6665723 -10309570 -10120539 -6670291 -1693248 2890244 5482716 6019009
1522 6019009 6102932 7045328 8509215 9684885 10594411 11261228 10747760 8369041 5203805
1513 5203805 3205076 3190650 4514868 6102299 6940017 6282835 4483671 3105340 3154476
1504 3154476 3684806 3175245 1695130 450029 -268467 -1088308 -1727712 -922352 1482529
1495 1482529 3856114 4739759 4236496 2947361 911938 -1541182 -3196791 -3467466 -3555197
1486 -3555197 -4680485 -5882519 -5330986 -3549138 -3286706 -5642315 -8176714 -8172640 -6415544
1477 -6415544 -5887559 -7313627 -8175609 -6574185 -4142585 -3787431 -5712648 -7462550 -7615086
1468 -7615086 -7637593 -9488401 -12681702 -14869917 -14826951 -13717626 -13206810 -12987421 -10786490
1459 -10786490 -5010046 2751327 8341377 8683318 4668226 -164978 -3574052 -6116979
1451 -6116979 -8649693 -10136283 -9328438 -7367911 -6604981 -7154821 -6802154 -4666297 -2840069
1442 -2840069 -3389275 -5518224 -7105108 -7506564 -7029316 -4884449 -130564 5679192 9209328
1433 9209328 9158027 7511874 6455300 5787510 4227896 1678644 -1010375 -3431861 -5654697
1424 -5654697 -7637008 -9410492 -11048289 -11908528 -11113520 -9481177 -9423470 -11719811 -13928260
1415 -13928260 -13608973 -11673196 -10506403 -10056429 -8346590 -5121348 -2218552 -525567
1407 -525567 754367 1728403 1374680 -190004 -1572353 -2559566 -3902013 -4247940 -853379
1398 -853379 5265456 8516060 5560242 39520 -2404349 -1310790 -300712 -935490 -1646731
1389 -1646731 -1653308 -1897075 -2257610 -1439177 80072 152760 -1529934 -2895172 -2899217 -2657357
1379 -2657357 -2643563 -1713276 210610 1358190 1162898 1284979 2186317 1547218 -1901436
1370 -1901436 -5507940 -6156473 -4667650 -4124874 -5263582 -6257986 -6140168 -5621062 -4815291
1361 -4815291 -2807988 76641 1609293 106002 -3534032 -6728404 -7494309 -5806002
1353 -5806002 -3398221 -2268758 -2931202 -4283610 -5290019 -5992578 -6529415 -6380513 -5451902
1344 -5451902 -4692219 -4429029 -3271214 -269283 2780625 3156134 927390 -1029056 -679657
1335 -679657 1180914 2641068 2698861 1250243 -1426302 -4466571 -6613440 -7136774 -6110070
1326 -6110070 -3916498 -1273121 525504 530781 -682306 -1746331 -2288066 -2876960 -3375248
1317 -3375248 -2818293 -1212764 -105397 -751723 -2586167 -3940416 -3653738 -1916624 -247448
1308 -247448 -403159 -2273824 -3231758 -1138098 2158291 2397348 -1496723 -5512272 -5453837
1299 -5453837 -1958213 1075749 1679497 1235283 1273526 1195902 -242800 -2788604 -5046976
1290 -5046976 -6195605 -6358154 -5572029 -3430380 -185561 2479649 2796665 1068234 -559586
1281 -559586 -967172 -1554913 -3735702 -5926044 -4975521 -510684 4051333 5352562 3420148
1272 3420148 548635 -1518143 -2228313 -1438967 468078 2307599 3129794 3119981 2591363
1263 2591363 779446 -3105659 -7907158 -10815770 -9898284 -5889877 -1624537 21039
1255 21039 -1734793 -4721651 -5533195 -2939889 637712 1705317 -596322 -4004365 -5892267
1246 -5892267 -5656212 -4661341 -4729274 -6600332 -9196445 -10536280 -9911255 -8702642 -8286155
1237 -8286155 -7780882 -5230011 -784170 2887373 3728102 2438639 790078 -937439 -3578855
1228 -3578855 -6813651 -8744946 -7971844 -5199142 -2437378 -1189408 -1731498 -3477201 -5241147
1219 -5241147 -5453444 -3247147 212040 2249312 1256652 -1657151 -4185505 -5418750 -5996720
1210 -5996720 -6234917 -5638516 -4392993 -3775420 -4385779 -5167681 -5035440 -4465072 -4487729 -4959812
1200 -4959812 -5021454 -4778200 -5369416 -7502063 -10737778 -14094958 -16727668 -18214854 -18677848
1191 -18677848 -18349073 -16827068 -13561003 -9519800 -7183874 -7716167 -8980944 -7799420
1183 -7799420 -3825877 -7795 510951 -3019160 -8829637 -13780590 -15119679 -12656377
1175 -12656377 -9151655 -7391988 -7167839 -6330146 -4155539 -1821393 72224 2159858
1167 2159858 4222202 4698517 3170504 1524839 1554934 2789415 3699157 3843474 3852407
1158 3852407 4318351 5529400 7323314 8593023 8108875 6436557 5664577 6540235 7513237
1149 7513237 7552985 7937909 9629443 10773674 9247251 6446256 5677159 7107829 7126807
1140 7126807 3271068 -2465254 -6226521 -6583174 -5146114 -3984240 -3499677 -2459658 333796
1131 333796 4074306 5804384 3238363 -2144114 -6039658 -5873508 -3313826 -1560029 -1361195
1122 -1361195 -1107778 -105775 268279 -847385 -1735841 -112939 3428945 5714622 5022625
1113 5022625 3230706 2857954 3285361 1842607 -1870557 -5081387 -5654282 -4503059 -3033348
1104 -3033348 -365654 4698022 10293628 12793769 11314588 8648943 7446478 7495072 7351527
1095 7351527 6692925 5913080 4914307 3792509 3769245 5796322 8516328 9125349 6613491
1086 6613491 3091969 1266542 1315411 1258980 177919 -348298 1205982 3464215 3550515
1077 3550515 1051440 -1415954 -2025466 -1965583 -2577815 -2392274 602340 4968417 6918314
1068 6918314 5189507 2295222 696279 152656 -402626 -542274 817436 3593765 6549525
1059 6549525 8237333 7609286 4920392 2189149 1193158 892095 -1122135 -4339127 -5182687
1050 -5182687 -2229815 1167362 1338717 -1011487 -2835769 -3297146 -3485048 -3295018 -1884243
1041 -1884243 -343422 -654145 -2249678 -2579029 -1096715 92283 -317760 -1539460 -3148298
1032 -3148298 -5886207 -9221931 -10918922 -10268120 -9305197 -9467954 -9379084 -7525355 -4912371
1023 -4912371 -3132721 -1763311 68965 1139990 -272807 -3192354 -4871372 -4540830
1015 -4540830 -3993042 -4502495 -5208960 -4872035 -3655782 -2784938 -3507102 -6386396 -10455430
1006 -10455430 -13149259 -12400827 -8952690 -5542797 -3891431 -3669392 -4185971 -5381110 -6852900
997 -6852900 -7566547 -7266693 -6911631 -7004934 -6722732 -5530604 -4488397 -4824844 -6045293
988 -6045293 -6557132 -5539396 -3201850 53338 3418038 5185118 4104356 1267450 -796693
979 -796693 -1171090 -1333285 -2446619 -3365425 -2384195 184188 2576570 3973124 4730673
970 4730673 4647076 2934225 217096 -1326743 -794519 -55489 -1177648 -3587744 -5338303
961 -5338303 -6156037 -7147033 -7929053 -6510452 -2591028 1035797 1529377 -785606 -3197934
952 -3197934 -3582341 -1825681 609600 1666161 294400 -1997387 -2272478 162226 2428099
943 2428099 1663605 -1369889 -3950652 -5386218 -6955672 -8558096 -8289950 -5776592 -3430924
934 -3430924 -3282359 -4308644 -4110246 -1970486 827460 2715054 2863882 1310489 -988486
925 -988486 -2720973 -3446541 -3772717 -4036846 -3651186 -2184800 -259284 1073038 1075499 -690405
915 -690405 -3910507 -6739320 -7077681 -5442228 -4931585 -7045959 -9054023 -7370453 -2559579
906 -2559579 1111572 740877 -2500157 -5645167 -6992040 -6405387 -4213765 -974152 2225696
897 2225696 4111384 4122797 3048745 2588898 3564776 4408200 2626549 -1480431 -3983578
888 -3983578 -1799600 2977849 5248068 2966017 -1072819 -3384909 -3376709 -2290762 -957274
879 -957274 73651 -132886 -1797524 -3575248 -4080039 -3593458 -3259333 -3274421 -2888284 -1675780
869 -1675780 45470 1598658 2120919 1036577 -936248 -2006242 -1370481 -360480 -681626
860 -681626 -2231980 -3591645 -3921939 -3329135 -2110546 -879862 -746875 -1952148 -2890051
851 -2890051 -2051607 -468606 -414017 -1897631 -2518840 -1068650 744914 838349 -777002
842 -777002 -2891305 -4713581 -5513074 -4347660 -1653709 238212 -177248 -1408678 -1157060
833 -1157060 375575 1248776 850535 -162676 -2299898 -6628444 -11535507 -13204959 -10533121
824 -10533121 -6898603 -5266985 -3926120 365520 6719578 10817242 10732116 8940312 8126351
815 8126351 7786171 6228391 3771362 2119547 1778048 1878558 2020204 2665122 3708909
806 3708909 3954131 2483568 -61158 -1977084 -2107861 -876433 167161 -144717 -1498141
797 -1498141 -2637126 -2940128 -3068004 -3918859 -5361115 -6337057 -6053364 -4865105 -4042370
788 -4042370 -4616694 -6270477 -7511061 -7230620 -5871757 -4722853 -4533196 -5401831 -7284881
779 -7284881 -9389763 -9641576 -6585749 -1895245 899322 667735 -155785 653360 2186578
770 2186578 2429770 1262143 -227256 -1729139 -3062214 -2964326 -745430 1920691 3030867
761 3030867 3047396 3377933 3254584 1042384 -2153405 -3544883 -3067553 -3151802 -3857283 -2212402
751 -2212402 2317880 5487752 3672950 -1281635 -5084340 -6457606 -6930193 -7182624 -6597979
742 -6597979 -5344436 -4306342 -3629481 -3274474 -3928360 -5341658 -5109270 -1667589 2497992
733 2497992 3394781 639249 -2703694 -4857346 -6773726 -8770573 -9019271 -6503999 -3025422
724 -3025422 -913717 -435947 -454043 -134834 818196 2235595 3150916 2805110 2395022 4087567
714 4087567 7687014 10167820 9443691 6788098 4444371 2785244 1394205 1103830 2669037
705 2669037 4462044 3904006 985425 -1652693 -2334020 -2327741 -3598422 -5784583 -6387750
696 -6387750 -3694369 1042157 4521879 4557677 2194502 362718 567162 1564357 1335086
687 1335086 -539202 -2829230 -4169906 -4099763 -3200702 -2631767 -3021463 -3673008 -3557287
678 -3557287 -3002856 -3189212 -3901046 -3493477 -1661121 -363145 -901227 -1951285 -2077737
669 -2077737 -2371130 -4344722 -6630482 -6504222 -3945482 -1389358 187062 1966753 4051562
660 4051562 4787667 4180309 4799786 7591145 9508626 7632678 3558319 1066900 953116
651 953116 1042357 427035 538519 1964970 3025567 2244875 96053 -2492901 -5431597
642 -5431597 -8334047 -9858371 -9378186 -7996880 -6927561 -6259692 -6239930 -7851882 -10445354
633 -10445354 -10668232 -6411492 -789881 775060 -2761725 -7154714 -8814993 -8562990 -8469999
624 -8469999 -8095327 -6003183 -2768456 -5256 2044099 3575860 3356050 619092 -2184760
615 -2184760 -1827876 681692 812098 -3173342 -7608490 -8257535 -5108000 -917172 2480618
606 2480618 4368763 3740286 371639 -3627487 -5590680 -5232279 -4286198 -3970033 -4385870
597 -4385870 -5480338 -6604517 -5872164 -2270442 1934572 3341479 2043486 1652195 4199741
588 4199741 7522722 8834066 8562628 8776475 9454533 8638109 5629704 1965102 -798191
579 -798191 -2627565 -4020954 -4718116 -4058121 -2046059 364892 1803269 1240355 -1342343
570 -1342343 -4839468 -7819637 -9622247 -10633150 -11513904 -12259129 -12033100 -10051571 -6841422
561 -6841422 -4462110 -4875525 -7837851 -10841365 -11469009 -9495680 -6504272 -4058052 -2769210
552 -2769210 -2574445 -2987548 -3163669 -2512228 -1371250 -487928 188820 1419117 3104354
543 3104354 3645951 1660784 -1994101 -4728090 -4841561 -3097307 -1529010 -1241902 -1826786
534 -1826786 -2576603 -3497488 -4836616 -6135295 -6459892 -5668910 -4874997 -5152623 -6014868
525 -6014868 -5786024 -3577373 -330530 2362695 3861882 4325968 3545927 1070228 -2441080
516 -2441080 -5110324 -5680057 -4717736 -3383371 -1789123 421840 2423861 2569092 623037
507 623037 -1464372 -1605223 236296 2402122 3620298 4168184 5092386 6627789 7542007
498 7542007 6291054 3046227 119926 -383774 845301 1074899 -1025637 -3819363 -5088682
489 -5088682 -4888314 -4967970 -5968335 -6474085 -4974110 -1858647 1031200 2500411 3121055
480 3121055 4062212 5120292 4672600 1956163 -1417739 -3237198 -3485158 -3953712 -5136818
471 -5136818 -5196145 -2655445 1258002 3899170 3902560 1914509 -323137 -905451 1007768
462 1007768 3870701 4674116 2216362 -1480547 -3844518 -4502669 -4296048 -3318422 -1843871
453 -1843871 -1724067 -4305542 -7668880 -8426907 -5939327 -2441119 605224 3567161 6032533
444 6032533 6120258 3318369 -337250 -2921456 -4427220 -5078916 -4133114 -1710302 202616
435 202616 247180 -378308 -90522 445137 -313100 -1910639 -2432591 -1420400 -444085 -712922
425 -712922 -1367927 -460726 2818439 6846343 8553121 6446577 2704178 1123524 2777974
416 2777974 5113932 5710086 5091206 4934064 5423962 5857324 6172458 6062766 4005431
407 4005431 -618106 -5276830 -6357130 -3232845 1348102 4532440 5437095 4444965 2294773
398 2294773 -14520 -1755571 -3092559 -4483515 -5882591 -7171498 -8436586 -8964756 -7380874
389 -7380874 -4165889 -2435802 -4177282 -7095312 -7605652 -5697113 -4015549 -3317275 -2397115
380 -2397115 -1896230 -3952793 -7599318 -8728007 -6067613 -3367920 -3625042 -4712816 -3470783
371 -3470783 -959897 -121529 -517006 563573 2909832 3327269 715760 -2239925 -3056832
362 -3056832 -2328954 -1751488 -1608988 -1325657 -692734 535804 2747463 5105433 5471896
353 5471896 2974051 -390040 -2040940 -1984397 -2319527 -4009566 -5635943 -5535877 -3950951
344 -3950951 -2459606 -2040465 -2387830 -2709696 -2485077 -1607611 -497386 -113775 -1143848
335 -1143848 -2907972 -3741725 -2962539 -1885349 -2172895 -3579688 -4224766 -2988732 -765016
326 -765016 750021 716762 -555314 -2170608 -3136490 -2891570 -1753200 -518457 455080
317 455080 1286204 1761884 1368355 382393 13037 857262 1887490 1685891 283026 -884112
307 -884112 -655819 668658 1705880 1287480 -432762 -2058284 -2421149 -1942149 -1967867
298 -1967867 -2717257 -2713922 -662373 2825074 5967781 7789155 8739900 9648539 10604545
289 10604545 10850336 9593999 7053151 4593891 3365311 2853679 1498940 -1124072 -3500042
280 -3500042 -3844260 -1947785 867877 2965126 3393779 2507765 1852762 2627982 4051687
271 4051687 4202834 2641057 901111 19896 -802160 -2169121 -2760022 -1207393 1384269
262 1384269 2583662 1822761 896252 1433520 3073770 4067737 2857069 -585709 -4206288
253 -4206288 -5299017 -3487950 -1575727 -2218327 -4453866 -4994541 -2426964 1516642 4580584
244 4580584 6134805 6611640 6350074 5406239 3544456 404124 -3431084 -5981616 -5823243
235 -5823243 -4089694 -2991641 -2804464 -2284538 -1696146 -2737885 -5018429 -5465009 -2683741
226 -2683741 434343 437849 -2086347 -3848454 -3557581 -2795194 -2695838 -2347599 -1002916 213396
216 213396 80342 -416055 857570 3909404 5734929 3551275 -1606044 -5696558 -6244244
207 -6244244 -4787201 -3994877 -3868718 -2723514 -972149 -1073799 -3402245 -5010599 -3851967
198 -3851967 -1844291 -1768418 -3034389 -3052681 -1547892 -589893 -734404 -122167 2024434
189 2024434 3613344 2672196 193965 -1622282 -2606337 -4137159 -6026661 -5999585 -2829622
180 -2829622 1443700 3541709 2607902 756153 85286 374316 325615 -6242 535225
171 535225 1841133 2137691 558208 -1268380 -1293075 277439 1720962 2485579 3371411
162 3371411 4157173 3072908 -437233 -3894657 -4277645 -1803584 269088 -273523 -2023648
153 -2023648 -2155249 -290543 1043900 -282404 -3364249 -5409739 -4842458 -2636363 -977357
$$ [...]
##END NTUPLES=NMR SPECTRUM
##END=
