##TITLE=31Pdec_DE-93_oil
 CDCl3, 64 sc
 30.4.2025
##JCAMPDX= 6.0         $$ Bruker NMR JCAMP-DX V2.0
##DATA TYPE= NMR SPECTRUM
##DATA CLASS= NTUPLES
##ORIGIN= UXNMR, Bruker Analytische Messtechnik GmbH
##OWNER= root
$$ XWIN-NMR		Version 3.5
$$ Wed Apr 30 14:11:04 2025 Russian Standard Time (UT+4h)  she@DPX200
##.OBSERVE FREQUENCY= 81.013821
##.OBSERVE NUCLEUS= ^31P
##.ACQUISITION MODE= SIMULTANEOUS
##.ACQUISITION SCHEME= undefined
##.AVERAGES= 64
##.DIGITISER RES= 17
##SPECTROMETER/DATA SYSTEM= spect
##.PULSE SEQUENCE= zgpg30
##.SOLVENT NAME= DMSO
##.SHIFT REFERENCE= (INTERNAL, DMSO, 0, 198.062)
##AUDIT TRAIL= $$ (NUMBER, WHEN, WHO, WHERE, WHAT)
$$ ##TITLE= Audit trail, XWIN-NMR		Version 3.5
$$ ##JCAMPDX= 5.01
$$ ##ORIGIN= Bruker BioSpin GmbH
$$ ##OWNER= she
$$ F:/spectra/data/she/nmr/P31/2/pdata/1/auditp.txt
$$ ##AUDIT TRAIL=  $$ (NUMBER, WHEN, WHO, WHERE, WHAT)
(   1,<2025-04-30 14:09:19.43 +0400>,<she>,<DPX200>,
      <created by zg, POWCHK disabled, PULCHK disabled
       configuration hash MD5:
       00 E9 B6 7A A2 85 ED C7 34 08 36 98 17 FE 4E 26
       data hash MD5: 32K
       2B 65 7D 0A 2A 0D 2F FE 6B 99 CC A8 62 DF 8A EB>)
(   2,<2025-04-30 14:09:22.14 +0400>,<she>,<DPX200>,
      <Start of raw data processing
       efp BC_mod = 2 LB = 1.5 FT_mod = 6 PKNL = 1 PHC0 = 1771.634 PHC1 = -935.9069 SI = 64K 
       data hash MD5: 64K
       2F F3 C5 23 93 B5 14 D8 A9 A8 2A B5 F7 8E 00 5E>)
(   3,<2025-04-30 14:09:43.75 +0400>,<she>,<DPX200>,
      <pk PHC0 = 32.87341 PHC1 = 0 
       data hash MD5: 64K
       A5 37 42 8E 7C FC 96 E4 8A 3F 51 6D A1 BC AC 3C>)
(   4,<2025-04-30 14:09:49.29 +0400>,<she>,<DPX200>,
      <abs ABSG = 5 
       data hash MD5: 64K
       AD 18 0C 65 74 6A BE D9 E2 DB CF 51 6B 0B 86 40>)
(   5,<2025-04-30 14:10:22.34 +0400>,<she>,<DPX200>,
      <pk PHC0 = 53.31915 PHC1 = -126 
       data hash MD5: 64K
       11 19 F0 11 F4 94 AD 3C EC C6 F9 55 37 26 8D 01>)
(   6,<2025-04-30 14:10:30.12 +0400>,<she>,<DPX200>,
      <abs ABSG = 5 
       data hash MD5: 64K
       B0 6A F7 43 BA 96 1F 41 AA 48 98 6D 7D 89 1A 12>)
$$ ##END=
$$ 
$$ hash MD5
$$ 44 40 67 D2 F7 9F EE 12 D7 E1 A0 21 FE 24 5D F9
##$RELAX= 
##$RELAX= 
##$RELAX= 
##$RELAX= 
##$RELAX= 
##$RELAX= 
##$RELAX= 
##$RELAX= 
$$ Bruker specific parameters
$$ --------------------------
##$DU= <F:/spectra>
##$EXPNO= 2
##$NAME= <P31>
##$PROCNO= 1
##$TYPE= <nmr>
##$USER= <she>
##$AMP= (0..31)
100 100 100 100 100 100 100 100 100 100 100 100 100 100 100 100 100 100 
100 100 100 100 100 100 100 100 100 100 100 100 100 100 
##$AQSEQ= 0
##$AQ_mod= 1
##$AUNM= <au_zg>
##$AUTOPOS= <>
##$BF1= 81.014009
##$BF2= 200.13
##$BF3= 200.13
##$BF4= 200.13
##$BF5= 200.13
##$BF6= 200.13
##$BF7= 200.13
##$BF8= 200.13
##$BYTORDA= 1
##$CFDGTYP= 0
##$CFRGTYP= 5
##$CHEMSTR= <none>
##$CNST= (0..31)
1 1 145 1 1 1 1 1 1 1 1 1 1 1 1 1 1 1 1 1 1 1 1 1 1 1 1 1 1 1 1 1 
##$CPDPRG= <waltz16>
##$CPDPRG1= <>
##$CPDPRG2= <waltz16>
##$CPDPRG3= <>
##$CPDPRG4= <mlev>
##$CPDPRG5= <mlev>
##$CPDPRG6= <mlev>
$$ [...]
##$SUBNAM3= <"">
##$SUBNAM4= <"">
##$SUBNAM5= <"">
##$SUBNAM6= <"">
##$SUBNAM7= <"">
##$SUBNAM8= <"">
##$SUBNAM9= <"">
##$SW= 400.765351723535
##$SWIBOX= (0..15)
0 1 3 0 0 0 0 0 0 0 0 0 0 0 0 0 
##$SW_h= 32467.5324675325
##$TD= 32768
##$TD0= 1
##$TE= 0
##$TE2= 300
##$TE3= 300
##$TEG= 300
##$TL= (0..7)
0 120 53 12 22 120 120 120 
##$TP= (0..7)
150 150 150 150 150 150 150 150 
##$TP07= 0
##$TPNAME0= <>
##$TPNAME1= <>
##$TPNAME2= <>
##$TPNAME3= <>
##$TPNAME4= <>
##$TPNAME5= <>
##$TPNAME6= <>
##$TPNAME7= <>
##$TPOAL= (0..7)
0.5 0.5 0.5 0.5 0.5 0.5 0.5 0.5 
##$TPOFFS= (0..7)
0 0 0 0 0 0 0 0 
##$TUNHIN= 0
##$TUNHOUT= 0
##$TUNXOUT= 0
##$USERA1= <user>
##$USERA2= <user>
##$USERA3= <user>
##$USERA4= <user>
##$USERA5= <user>
##$V9= 5
##$VALIST= <valist>
##$VCLIST= <CCCCCCCCCCCCCCC>
##$VD= 0
##$VDLIST= <DDDDDDDDDDDDDDD>
##$VPLIST= <PPPPPPPPPPPPPPP>
##$VTLIST= <TTTTTTTTTTTTTTT>
##$WBST= 1024
##$WBSW= 4
##$XGAIN= (0..3)
0 0 0 0 
##$XL= 0
##$YL= 0
##$YMAX_a= 15002
##$YMIN_a= -3129
##$ZGOPTNS= <>
##$ZL1= 120
##$ZL2= 120
##$ZL3= 120
##$ZL4= 120
##$ABSF1= 198.0616
##$ABSF2= -202.7028
##$ABSG= 5
##$ABSL= 3
##$ALPHA= 0
##$AQORDER= 0
##$ASSFAC= 0
##$ASSFACI= 0
##$ASSFACX= 0
##$ASSWID= 0
##$AUNMP= <proc_1d>
##$AZFE= 0.1
##$AZFW= 0.5
##$BCFW= 0
##$BC_mod= 2
##$BYTORDP= 0
##$COROFFS= 0
##$CY= -3
##$DATMOD= 1
##$DC= 0
##$DFILT= <>
##$DTYPP= 0
##$F1P= 0
##$F2P= 0
##$FCOR= 1
##$FTSIZE= 65536
##$FT_mod= 6
##$GAMMA= 0
##$GB= 0
##$INTBC= 1
##$INTSCL= 9.790993e-09
##$ISEN= 30
##$LB= 1.5
##$LEV0= 0
##$LPBIN= 0
##$MAXI= 10000
##$MC2= 0
##$MEAN= 0
##$ME_mod= 0
##$MI= 50
##$NCOEF= 0
##$NC_proc= -8
##$NLEV= 6
##$NOISF1= 182.463
##$NOISF2= 159.3651
##$NSP= 0
##$NTH_PI= 0
##$NZP= 0
##$OFFSET= 198.0616
##$PC= 4
##$PHC0= 1857.826
##$PHC1= -1061.907
##$PH_mod= 1
##$PKNL= yes
##$PPARMOD= 0
##$PSCAL= 0
##$PSIGN= 0
##$REVERSE= no
##$SF= 81.0140089999434
##$SI= 65536
##$SIGF1= 159.3651
##$SIGF2= -187.1042
##$SINO= 113.3802
##$SIOLD= 16384
##$SREGLST= <1H.CDCl3>
##$SSB= 0
##$STSI= 65536
##$STSR= 0
##$SW_p= 32467.5324675325
##$SYMM= 0
##$S_DEV= 0
##$TDeff= 32768
##$TDoff= 0
##$TI= <>
##$TILT= no
##$TM1= 0
##$TM2= 0
##$TOPLEV= 0
##$USERP1= <user>
##$USERP2= <user>
##$USERP3= <user>
##$USERP4= <user>
##$USERP5= <user>
##$WDW= 1
##$XDIM= 65536
##$YMAX_p= 242092052
##$YMIN_p= -294322391
$$ End of Bruker specific parameters
$$ ---------------------------------
##NTUPLES= NMR SPECTRUM
##VAR_NAME=  FREQUENCY,     SPECTRUM/REAL,   SPECTRUM/IMAG
##SYMBOL=    X,             R,               I
##VAR_TYPE=  INDEPENDENT,   DEPENDENT,       DEPENDENT
##VAR_FORM=  AFFN,          ASDF,            ASDF
##VAR_DIM=   65536,         65536,           65536
##UNITS=     HZ,            ARBITRARY UNITS, ARBITRARY UNITS
##FACTOR=    0.49542278885378, 1,            1
##FIRST=     16045.7642231865, 0,            0
##LAST=      -16421.768244346, 0,            0
##MIN=       -16421.768244346, -294322391,   0
##MAX=       16045.7642231865, 242092052,    0
$$ Real data points
##PAGE= N=1
##DATA TABLE= (X++(R..R)), XYDATA
$$ [...]
##PAGE= N=2
##DATA TABLE= (X++(I..I)), XYDATA
$$ plain form
7500 -828714 1028392 1869206 307704 -1711158 -1421972 585755 1143634 -941510 -3351480
7491 -3351480 -3587198 -2086715 -1188330 -2002634 -3290612 -3169483 -1220769 1211294 2403459
7482 2403459 1667997 -323616 -2136726 -2563773 -1628396 -719066 -1077971 -2010633 -1500700
7473 -1500700 987465 3384692 3508203 1746541 242444 236893 1427213 3214698 5114657
7464 5114657 6328343 6340397 5786654 5572297 5449296 4641414 3376378 2344402 1072487
7455 1072487 -1430554 -4540422 -6315533 -6153215 -5571111 -5910975 -6497971 -5513950 -1935184
7446 -1935184 3348671 7690662 8682349 7074456 6569722 8954115 10737778 7367202 -33014
7437 -33014 -5518813 -5925957 -4014202 -3279641 -3357767 -2383698 -702658 314061 881493
$$ packed form
7500h28714J857106Q40814j561502k018862K89186K007727N57879k085144k409970
7491c351480k35718J500483Q98385q14304j287978J21129J948714K432063J192165
7482B403459p35462j991613j813110m27047R35377R09330l58905r32662N09933
7473a500700K488165K397227J23511j761662j504097n551J190320J787485J899959
7464E114657J213686J2054n53743k14357j23001q07882j265036j031976j271915
7455A072487k503041l109868j775111J62318N82104l39864n86996R84021L578766
7446a935184N283855M341991R91687j607893n04734K384393J783663l370576p400216
7437c3014n485799m07144J911755P34561p8126R74069J681040J016719N67432
$$ plain form
7428 881493 1720462 2068633 1075278 -257304 -672673 -817816 -1639653 -2019640 -522084
7419 -522084 1518218 1389676 -916513 -2586176 -1990822 -492834 197829 423419 1378154
7410 1378154 2880495 3508031 2457175 448206 -1230803 -2124369 -2636621 -2723721 -1505905
7401 -1505905 996718 2721274 1910082 144017 746048 3957140 6166825 4753059 1324695
7392 1324695 -1009500 -1331782 -511239 602422 910975 -844988 -3923158 -5593492 -5031093
7383 -5031093 -4667384 -5585728 -4676150 378954 6087638 7317264 4530712 2401777 2679875
7374 2679875 3291814 3617912 5217332 7132202 5934383 1702522 -995496 126801 1928198
7365 1928198 1677831 1516730 3959030 6803636 6385284 3167693 304476 -1296338 -2717109
$$ packed form
7428H81493Q38969L48171r93355j332582m15369j45143q21837l79987J497556
7419e22084K040302j28542k306189j669663N95354J497988O90663K25590R54735
7410A378154J502341O27536j050856k008969j679009q93566n12252q7100J217816
7401a505905K502623J724556q11192j766065O02031L211092K209685j413766l428364
7392A324695k334195l22282Q20543J113661L08553j755963l078170j670334N62399
7383e031093L63709r18344R09578N055104N708684J229626k786552k128935K78098
7374B679875O11939L26098J599420J914870j197819m231861k698018J122297J801397
7365A928198k50367j61101K442300K844606m18352l217591k863217j600814j420771
$$ plain form
7356 -2717109 -3437661 -1958433 597636 1053424 -1534493 -4855285 -6670003 -6774855 -5647668
7347 -5647668 -3610946 -1822933 -1952214 -3915971 -5301223 -3886688 -33838 3784392
7339 3784392 5278311 4124036 1991592 777251 650037 388281 -316673 -290922 700183
7330 700183 691768 -1709159 -4648455 -5246953 -3678444 -2677785 -3262682 -3422380 -1538110
7321 -1538110 1019466 1721851 -114340 -3151107 -5881953 -7760779 -9028640 -10014555 -10355518
7312 -10355518 -8932395 -5242434 -810085 1694540 1043291 -1477324 -3652107 -4226329
7304 -4226329 -3179284 -1209424 488616 692542 -809800 -2776817 -3478821 -2163275 329861
7295 329861 2233804 2348248 1117705 -94275 -958029 -2577924 -5364194 -7632688 -7671231
$$ packed form
7356b717109p20552J479228K556069M55788k587917l320792j814718j04852J127187
7347e647668K036722J788013j29281j963757j385252J414535L852850L818230
7339C784392J493919j154275k132444j214341j27214k61756p04954K5751R91105
7330G00183q415k400927k939296n98498J568509J000659n84897j59698J884270
7321a538110K557576P02385j836191l036767k730846j878826j267861r85915l40963
7312a0355518J423123L689961M432349K504625o51249k520615k174783n74222
7304d226329J047045J969860J698040K03926j502342j967017p02004J315546K493136
7295C29861J903943J14444j230543j211980q63754j619895k786270k268494l8543
$$ plain form
7286 -7671231 -6323315 -5608309 -5240367 -3001836 1034508 3353778 1662984 -1323287 -1092349
7277 -1092349 2662030 5645223 4452354 331746 -3028598 -3721277 -2614057 -1322518
7269 -1322518 -596407 -458641 -787337 -1309363 -1439715 -628915 962461 2260214 2034173
7260 2034173 46881 -2650557 -4664485 -5291981 -4483328 -2257404 1146783 4533304 5876312
7251 5876312 3716225 -1602593 -8149197 -13661013 -16628205 -16705484 -14592102 -11494383 -8419965
7242 -8419965 -5855072 -3976546 -2848687 -2320234 -2120113 -2318495 -3323773 -5062891 -6580524
7233 -6580524 -7041412 -6830719 -6935542 -7460177 -7702802 -7662119 -8231513 -9456219 -9848833 -8440186
7223 -8440186 -6614500 -6590002 -8493783 -10273655 -10424880 -9509637 -8787541 -8606637 -8681861
$$ packed form
7286g671231J347916P15006L67942K238531M036344K319270j690794k986271K30938
7277a092349L754379K983193j192869m120608l360344o92679J107220J291539
7269a322518P26111J37766l28696n22026j30352Q10800J591376J297753k26041
7260B034173j987292k697438k013928o27496Q08653K225924L404187L386521J343008
7251E876312k160087n318818o546604n511816k967192p7279K113382L097719L074418
7242h419965K564893J878526J127859N28453K00121j98382j005278j739118j517633
7233f580524m60888K10693j04823n24635k42625M0683n69394j224706l92614J408647
7223h440186J825686K4498j903781j779872j51225R15243P22096J80904p5224
$$ plain form
7214 -8681861 -8878293 -8899267 -8014191 -6156347 -4900314 -6192408 -9890872 -13362764 -14049692
7205 -14049692 -12113768 -10042292 -9718685 -10490182 -10452975 -9045719 -7417464 -6324214 -4978054
7196 -4978054 -2720370 -774403 -1000947 -3336632 -5810779 -7032322 -7362573 -7471971 -7105098
7187 -7105098 -5933157 -4668849 -4516881 -5908268 -8152122 -9939128 -10087697 -8418903 -6066175
7178 -6066175 -4412634 -3843449 -4189883 -5815547 -8791400 -11285725 -10858006 -7843811 -5464490
7169 -5464490 -5706015 -7006476 -7109138 -6093866 -4963958 -3356453 -989094 379481 -675816
7160 -675816 -2103283 -814112 2334001 3431435 1478553 -69619 1407595 4185185
7152 4185185 5550088 5758968 6482266 7587557 7918738 7602338 7131090 5519138 1999496
$$ packed form
7214h681861j96432k0974Q85076J857844J256033j292094l698464l471892o86928
7205a4049692J935924K071476L23607p71497L7207J407256J628255J093250J346160
7196d978054K257684J945967k26544k335685k474147j221543l30251j09398L66873
7187g105098J171941J264308J51968j391387k243854j787006j48569J668794K352728
7178f066175J653541N69185l46434j625664k975853k494325M27719L014195K379321
7169e464490k41525j300461j02662J015272J129908J607505K367359J368575j055297
7160f75816j427467J289171L148113J097434j952882j548172J477214K777590
7152D185185J364903K08880P23298J105291L31181l16400m71248j611952l519642
$$ plain form
7143 1999496 -1403279 -1831544 192343 1188615 -545736 -3147989 -4526379 -4943162 -5320992
7134 -5320992 -5277865 -4345814 -3424044 -3418534 -3776492 -3944119 -4999350 -7941067 -11303104 -12591294
7124 -12591294 -11589228 -10105414 -8755003 -6481548 -3526092 -2138604 -3126329 -4021076
7116 -4021076 -2480763 310936 1758162 1852507 2440720 3454047 2996654 1222630 961086
7107 961086 3420370 5941534 5717747 3638177 2356405 2191670 1527209 397478 802356
7098 802356 3223173 5312966 5070249 3507329 2772697 2859279 1990048 -16394 -583334
7089 -583334 2533548 7847286 11026745 9228890 3696336 -2116753 -5818195 -6664063 -4277888
7080 -4277888 920804 6016849 6804161 2148354 -4151163 -7264699 -6302656 -4293761 -4158602
$$ packed form
7143A999496l402775m28265K023887R96272j734351k602253j378390m16783l77830
7134e320992M3127R32051R21770N510l57958j67627j055231k941717l362037j288190
7124a2591294J002066J483814J350411K273455K955456J387488r87725q94747
7116d021076J540313K791699J447226R4345N88213J013327m57393j774024k61544
7107I61086K459284K521164k23787k079570j281772j64735o64461j129731M04878
7098H02356K420817K089793k42717j562920p34632Q6582q69231k006442n66940
7089e83334L116882N313738L179459j797855n532554n813089l701442q45868K386175
7080d277888N198692N096045P87312m655807o299517l113536R62043K008895J35159
$$ plain form
7071 -4158602 -6115825 -8434215 -9243327 -7817792 -5229772 -3494449 -3205025 -2666826 -424352
7062 -424352 2341774 3575541 3647217 4680793 6810541 7454244 4849247 501000 -2565936
7053 -2565936 -2690360 -417344 2148035 2663398 750145 -1010141 61477 2920966 3973905
7044 3973905 2180084 283456 244530 503789 -590133 -1587156 -735063 349304 -1042259
7035 -1042259 -4202302 -6013981 -5702844 -5403594 -6181771 -6608607 -5767396 -4878357 -4874560 -4538406
7025 -4538406 -2337771 1381936 5088360 7681931 8529494 7149703 4044881 1081370
7017 1081370 -14713 744584 1971777 2368464 1495249 -257903 -1974238 -2915930 -3263813
7008 -3263813 -3841702 -5060316 -6527954 -7485470 -6993017 -4139897 723343 5126570 6374973
$$ packed form
7071d158602j957223k318390q09112J425535K588020J735323K89424N38199K242474
7062d24352K766126J233767P1676J033576K129748O43703k604997m348247l066936
7053b565936j24424K273016K565379N15363j913253j760286J071618K859489J052939
7044C973905j793821j896628l8926K59259j093922r97023Q52093J084367j391563
7035a042259l160043j811679L11137K99250p78177m26836Q41211Q89039L797L36154
7025d538406K200635L719707L706424K593571Q47563j379791l104822k963511
7017A081370j096083P59297J227193L96687q73215j753152j716335r41692l47883
7008c263813n77889j218614j467638r57516M92453K853120M863240M403227J248403
$$ plain form
6999 6374973 4660164 2933162 3177231 4144229 3484350 778657 -2552949 -5208060 -6636577
6990 -6636577 -6577784 -5279642 -3726015 -2623649 -1634559 -480889 -58040 -1251635 -3291365
6981 -3291365 -4696032 -5391511 -6292311 -7041825 -6082117 -3303785 -826251 -342550 -1183881
6972 -1183881 -2034587 -3175425 -5496839 -8124128 -8789875 -6578708 -3096031 -813407 -1153968
6963 -1153968 -4088454 -8414230 -12146490 -13683707 -13123892 -11776803 -10205123 -7815006
6955 -7815006 -4830716 -3258088 -4532905 -7047774 -7724626 -5895019 -3968569 -3952420 -4955021
6946 -4955021 -5074286 -4437466 -4808626 -6635384 -8033752 -7082487 -4232616 -1914897 -2118010
6937 -2118010 -4629694 -7379911 -8251095 -6713428 -4004403 -1922920 -1497230 -2563993 -4160424
$$ packed form
6999F374973j714809j727002K44069R66998o59879k705693l331606k655111j428517
6990f636577N8793J298142J553627J102366R89090J153670M22849j193595k039730
6981c291365j404667o95479r00800p49514R59708K778332K477534M83701q41331
6972a183881q50706j140838k321414k627289o65747K211167L482677K282624l40561
6963a153968k934486m325776l732260j537217N59815J347089J571680K390117
6955g815006K984290J572628j274817k514869o76852J829607J926450J6149j002601
6946d955021j19265O36820l71160j826758j398368R51265K849871K317719k03113
6937b118010k511684k750217q71184J537667K709025K081483M25690j066763j596431
$$ plain form
6928 -4160424 -5198544 -5197259 -4679685 -4579472 -4993549 -4854013 -3207534 -583237 1268567
6919 1268567 857643 -1945843 -5805550 -8538950 -8373921 -5300238 -1080068 2408607 4517915
6910 4517915 5347619 4876343 3494743 2636942 3458656 5110929 5726964 5113887 4944658
6901 4944658 5968587 6669608 5583584 3602325 2690550 3158510 3574951 2990837 1990245
6892 1990245 1591138 2113668 3197833 4093393 3820472 1855953 -1011449 -3083186 -3417983
6883 -3417983 -2830315 -2939415 -4349556 -5969778 -6154234 -4482264 -2331868 -1543229 -2538519
6874 -2538519 -3985584 -4294039 -3108932 -1324900 -100550 -8329 -720499 -1392865 -1768168
6865 -1768168 -2775486 -5174906 -7644486 -7696822 -5187154 -3323606 -4679236 -7407915 -7528072
$$ packed form
6928d160424j038120J285N17574J00213m14077J39536J646479K624297J851804
6919A268567m10924k803486l859707k733400J65029L073683M220170L488675K109308
6910D517915Q29704m71276j381600q57801Q21714J652273O16035o13077j69229
6901D944658J023929P01021j086024j981259r11775M67960M16441n84114j000592
6892A990245l99107N22530J084165Q95560k72921j964519k867402k071737l34797
6883c417983N87668j09100j410141j620222j84456J671970K150396P88639r95290
6874b538519j447065l08455J185107J784032J224350R2221p12170o72366l75303
6865a768168j007318k399420k469580n2336K509668J863548j355630k728679j20157
$$ plain form
6856 -7528072 -4367101 -1257774 -638883 -1045229 -96504 1726747 2217844 996925 -220203
6847 -220203 -343831 107500 706939 1930992 3739132 4812483 4157231 2648638 2058515
6838 2058515 2869527 3729573 3032546 670836 -1875645 -3206324 -3733913 -5302221 -8584776
6829 -8584776 -11376144 -10669381 -6581623 -2918523 -3009011 -5895575 -7807886 -6883267 -5011916
6820 -5011916 -4934215 -6875694 -8745186 -8723771 -6657106 -3370868 176004 2890378 3794856
6811 3794856 3124627 2707211 4185302 6651261 6967905 3240991 -2440175 -5739061 -4686745
6802 -4686745 -1700767 -621027 -2622833 -5858161 -8297371 -9383650 -8977379 -6549182
6794 -6549182 -2532202 713071 947773 -1162664 -2771721 -2548388 -2233164 -3755103 -5984506
$$ packed form
6856g528072L160971L109327O18891m06346R48725J823251M91097j220919j217128
6847b20203j23628M51331N99439J224053J808140J073351o55252j508593n90123
6838B058515Q11012Q60046o97027k361710k546481j330679n27589j568308l282555
6829h584776k791368P06763M087758L663100r0488k886564j912311R24619J871351
6820e011916P7701j941479j869492K1415K066665L286238L546872K714374R04478
6811C794856o70229m17416J478091K465959L16644l726914n681166l298886J052316
6802d686745K985978J079740k001806l235328k439210j086279M06271K428197
6794f549182M016980L245273K34702k110437j609057K23333L15224j521939k229403
$$ plain form
6785 -5984506 -5789232 -2019598 2911702 5739837 5676718 4497975 4000507 4144535 3520467
6776 3520467 1064433 -2700275 -5778706 -6144392 -3503803 252138 2552110 2132391 -470000
6767 -470000 -3934023 -7071492 -8938521 -8952672 -7359808 -5147514 -3122169 -1428937 -265245
6758 -265245 -422236 -2288846 -4596970 -5266817 -3893592 -2545730 -3265744 -5178720 -5161662
6749 -5161662 -1641885 3197263 5797659 5305873 4154806 4553422 5692511 5205102 2411142
6740 2411142 -1105924 -3528110 -3882469 -1418945 3958492 9893370 12150234 8743385
6732 8743385 2623310 -1348539 -1592551 -527169 -675365 -2038243 -3469994 -4661541 -5798314
6723 -5798314 -6548603 -6483890 -5823922 -5061990 -4485415 -4524206 -5679569 -7485865 -8510280
$$ packed form
6785e984506J95274L769634M931300K828135o3119j178743m97468J44028o24068
6776C520467k456034l764708l078431l65686K640589L755941K299972m19719k602391
6767d70000l464023l137469j867029j4151J592864K212294K025345J693232J163692
6758b65245j56991j866610k308124o69847J373225J347862p20014j912976J7058
6749e161662L519777M839148K600396m91786j151067L98616J139089m87409k793960
6740B411142l517066k422186l54359K463524N377437N934878K256864l406849
6732H743385o120075l971849k44012J065382j48196j362878j431751j191547j136773
6723e798314p50289O4713O59968P61932N76575l8791j155363j806296j024415
$$ plain form
6714 -8510280 -8244669 -8120718 -9607223 -12052077 -13608435 -13690801 -13135137 -12333921 -10853622
6705 -10853622 -9017957 -8319336 -9617196 -11925853 -13542159 -13575846 -11951744 -8824326 -4683076
6696 -4683076 -409119 3382980 6551652 8590730 8453831 6053649 3272224 2352442 3442000
6687 3442000 4565949 3840206 940251 -3191434 -6871516 -8143528 -6409071 -3993923
6679 -3993923 -4323426 -7502633 -9406433 -6945520 -2844609 -2456591 -6222408 -8573435 -5458887
6670 -5458887 -104453 1084078 -3403422 -8973884 -11018429 -9387066 -6719843 -5007687
6662 -5007687 -4789325 -5751101 -6740059 -6352251 -4567677 -2887411 -2182710 -1663930 -849509
6653 -849509 -1092354 -3679929 -7465618 -10051968 -10703708 -10490838 -10012833 -8761937 -6761189
$$ packed form
6714h510280K65611J23951j486505k444854j556358q2366N55664Q01216J480299
6705a0853622J835665O98621j297860k308657j616306l3687J624102L127418M141250
6696d683076M273957L792099L168672K039078j36899k400182k781425r19782J089558
6687C442000J123949p25743k899955m131685l680082j272012J734457K415148
6679c993923l29503l179207j903800K460913M100911L88018l765817k351027L114548
6670e458887N354434J188531m487500n570462k044545J631363K667223J712156
6662e007687K18362r61776r88958L87808J784574J680266P04701N18780Q14421
6653h49509k42845k587575l785689k586350o51740K12870M78005J250896K000748
$$ plain form
6644 -6761189 -5215701 -5099947 -6172038 -7618573 -8658711 -8381248 -6212043 -3059695 -1068319
6635 -1068319 -1606259 -3988007 -6430109 -7682657 -7593983 -6850252 -6473512 -6934290 -7502818
6626 -7502818 -7070862 -5709021 -4620466 -4432457 -4571813 -4708218 -5628862 -7811233 -10057694
6617 -10057694 -10720437 -9778704 -8523015 -7440955 -5718015 -3030656 -632148 57611 -724208
6608 -724208 -1383862 -732871 1129222 3302576 4696489 4421660 2586333 735818 339295
6599 339295 505524 -1367018 -5716730 -9110604 -8280645 -4855295 -3477691 -5367756 -6715270
6590 -6715270 -4367761 -227245 1963718 1912033 2181281 3746261 5093041 5274855 5165461
6581 5165461 5525228 6012466 6396352 6877705 6979276 5915765 4299897 3718180 4391514
$$ packed form
6644f761189J545488J15754j072091j446535j040138K77463K169205L152348J991376
6635a068319n37940k381748k442102j252548Q8674P43731L76740m60778n68528
6626g502818M31956J361841J088555J88009j39356j36405r20644k182371k246461
6617a0057694o62743R41733J255689J082060J722940K687359K398508O89759p81819
6608g24208o59654O50991J862093K173354J393913k74829j835327j850515l96523
6599C39295J66229j872542m349712l393874Q29959L425350J377604j890065j347514
6590f715270K347509M140516K190963n1685K69248J564980J346780J81814j09394
6581E165461L59767M87238L83886M81353J01571j063511j615868n81717O73334
$$ plain form
6572 4391514 5060441 5364188 6247405 7582152 7666913 5988974 4353500 4069953 3971458
6563 3971458 2669324 1016187 632398 1379151 2005489 2139534 1954595 966365 -939407
6554 -939407 -2112054 -855843 1721798 2462605 -71177 -3987130 -6433499 -6414887 -4964126
6545 -4964126 -3509712 -2691365 -2489473 -3048507 -4876396 -7777845 -10021000 -9686879 -6884426
6536 -6884426 -3415586 -183864 3376386 6847546 7931307 5409175 1408700 -947157
6528 -947157 -1048849 -544466 -810070 -2244556 -4805517 -7331851 -7396198 -3978947 416984
6519 416984 2399704 1809968 1053958 924821 -291986 -3477244 -6936939 -8624577 -8159493
6510 -8159493 -6037085 -2643048 1130311 3731237 4311780 3434589 2134145 1165429 1124857
$$ packed form
6572D391514O68927L03747Q83217J334747Q4761j677939j635474k83547r8495
6563C971458j302134j653137l83789P46753O26338J34045j84939r88230j905772
6554i39407j172647J256211K577641P40807k533782l915953k446369J8612J450761
6545d964126J454414Q18347K01892n59034j827889k901449k243155L34121K802453
6536f884426L468840L231722L560250L471160J083761k522132m000475k355857
6528i47157j01692N04383k65604j434486k560961k526334o4347L417251M395931
6519D16984J982720n89736p56010j29137j216807l185258l459695j687638M65084
6510h159493K122408L394037L773359K600926N80543q77191j300444r68716m0572
$$ plain form
6501 1124857 2091331 3091107 3065804 2226490 1208126 -614405 -4077327 -7714438 -8562111
6492 -8562111 -5844365 -1797416 1558586 4155001 5714896 4585806 492559 -3572445
6484 -3572445 -4375785 -2191067 294484 1721562 2680851 3311754 2567059 112336 -2721141
6475 -2721141 -4488959 -5131856 -5416872 -5632966 -5485051 -4991145 -4849402 -5610865 -6658649
6466 -6658649 -6490340 -4300853 -1031212 1395297 1577925 -689727 -4394381 -7387662 -7486886
6457 -7486886 -4659544 -1554640 -717521 -1731522 -2174660 -734317 1909985 4514236 5957788
6448 5957788 5250740 2804879 1138141 2159815 4162108 3854222 1112463 -855490 25631
6439 25631 2789754 5885716 8347998 8287641 3941085 -2690431 -6799170 -6808664 -5947973
$$ packed form
6501A124857R66474R99776k5303q39314j018364j822531l462922l637111q47673
6492h562111K717746M046949L356002K596415J559895j129090m093247m065004
6484c572445q03340K184718K485551J427078R59289O30903p44695k454723k833477
6475b721141j767818o42897k85016k16094J47915M93906J41743p61463j047784
6466f658649J68309K189487L269641K426509J82628k267652l704654k993281r9224
6457g486886K827342L104904Q37119j014001m43138J440343K644302K604251J443552
6448E957788p07048k445861j666738J021674K002293l07886k741759j967953Q81121
6439B5631K764123L095962K462282o0357m346556o631516m108739r494Q60691
$$ plain form
6430 -5947973 -6243728 -5137633 -857963 2926915 2009199 -1674057 -2882093 -898002 2878
6421 2878 -2861653 -7602206 -11167294 -12250439 -10841499 -7963836 -5895454 -6033531 -6776957
6412 -6776957 -5904419 -4171135 -3635898 -3486553 -1297593 2041216 2839111 416322 -1611339
6403 -1611339 -820869 916880 1151948 365542 185155 896816 2197488 3861937 4466605
6394 4466605 2210968 -1732707 -3649759 -2562509 -1984184 -4507056 -7775452 -8303200 -6403669
6385 -6403669 -4431807 -2763006 -945711 -669799 -3523616 -6924335 -6384858 -1824243 1861206
6376 1861206 1105830 -2219705 -3828430 -1968646 1607963 4095521 4060718 2100499 -402865
6367 -402865 -3074484 -6348439 -9312144 -9499985 -6076796 -1553414 1405920 3216782 5244624
$$ packed form
6430e947973k95755J106095M279670L784878r17716l683256j208036J984091R00880
6421B878k864531m740553l565088j083145J408940K877663K068382j38077p43426
6412f776957Q72538J733284N35237J49345K188960L338809P97895k422789k027661
6403a611339P90470J737749K35068p86406j80387P11661J300672J664449O04668
6394D466605k255637l943675j917052J087250N78325k522872l268396n27748J899531
6385f403669J971862J668801J817295K75912k853817l400719N39477M560615L685449
6376A861206p55376l325535j608725J859784L576609K487558l4803j960219k503364
6367d02865k671619l273955k963705j87841L423189M523382K959334J810862K027842
$$ plain form
6358 5244624 6289775 4389337 919327 -866437 -986412 -2419630 -5328814 -5873137 -2275935
6349 -2275935 1827974 2530792 976943 646679 1851990 2362396 1865597 2089348 3004483
6340 3004483 2389522 -324963 -2507358 -1625643 1709151 4851879 5910185 4786202 2730038
6331 2730038 1623672 2716153 5272712 7032601 6412661 3711087 83646 -3620239
6323 -3620239 -6591464 -7801821 -7058516 -5776769 -5646778 -6558537 -6632958 -4581472 -1571940
6314 -1571940 -241889 -1794251 -4528756 -5822277 -5363511 -5345724 -7034641 -8475643 -6968168
6305 -6968168 -2919109 689499 2353871 3323083 4531818 4811119 3487695 2559067 4127039
6296 4127039 7084382 8742871 8931093 9939947 12560901 14578976 13605639 9526729 3845123
$$ packed form
6358E244624J045151j900438l470010j785764j19975j433218k909184n44323L597202
6349b275935M103909P02818j553849l30264J205311N10406m96799K23751R15135
6340C004483o14961k714485k182395Q81715L334794L142728J058306j123983k056164
6331B730038j106366J092481K556559J759889o19940k701574l627441l703885
6323c620239k971225j210357P43305J281747J29991r11759p4421K051486L009532
6314a571940J330051j552362k734505j293521M58766J7787j688917j441002J507475
6305f968168M049059L608608J664372R69212J208735K79301j323424r28628J567972
6296D127039K957343J658489J88222J008854K620954K018075r73337m078910n681606
$$ plain form
6287 3845123 -1472960 -4126210 -2685537 1285235 4083729 3941802 2722462 2668143 3380682
6278 3380682 3418947 2955864 2821404 2413751 930401 -338896 499973 2608485 3034908
6269 3034908 718888 -2265320 -3650639 -3164724 -1517946 755360 2868025 4032275
6261 4032275 4872667 6935311 9990278 11410195 9260120 4740868 615884 -1644879
6253 -1644879 -2317836 -2284075 -2463229 -3308357 -3863444 -2362401 1233912 4393561 4837350
6244 4837350 3136726 1256988 -284594 -2059939 -3450935 -2985286 -925011 459309
6236 459309 -285267 -2152929 -3465813 -4095837 -5095288 -6885546 -8633306 -9136593 -7861807
6227 -7861807 -5334368 -2844564 -1612929 -1950999 -3155139 -4193840 -4530697 -4478761 -4834298
$$ packed form
6287C845123n318083k653250J440673L970772K798494j41927j219340n4319P12539
6278C380682L8265m63083j34460m07653j483350j269297Q38869K108512M26423
6269C034908k316020k984208j385319M85915J646778K273306K112665J164250
6261D032275Q40392K062644L054967J419917k150075m519252m124984k260763
6253a644879o72957L3761j79154q45128n55087J501043L596313L159649M43789
6244D837350j700624j879738j541582j775345j390996M65649K060275J384320
6236D59309p44576j867662j312884o30024r99451j790258j747760n03287J274786
6227g861807K527439K489804J231635l38070j204140j038701l36857N1936l55537
$$ plain form
6218 -4834298 -5980984 -7367688 -8145942 -8125086 -7481275 -5787863 -2581701 884702 2034036
6209 2034036 94776 -2497617 -3243871 -2983755 -4239623 -6882685 -7883247 -5593218 -1998164
6200 -1998164 201686 852276 1294844 1518871 332354 -2042653 -3321719 -1592125 2431468
6191 2431468 5927101 6317002 3111846 -1902882 -5930850 -6971434 -4947452 -1396480
6183 -1396480 1829806 3707465 4328892 4442499 4685360 4986376 4580094 2750649 -195502
6174 -195502 -2667883 -2844912 -399424 2891328 4727400 4589789 4024597 4522886 5799189
6165 5799189 6594098 6432742 5719981 4603007 2931932 1286818 781121 1406094 1591302
6156 1591302 147427 -2036127 -3067210 -2441277 -1492366 -1487463 -2003230 -1531950 548946
$$ packed form
6218d834298j146686j386704p78254K0856O43811J693412L206162L466403J149334
6209B034036j939260k592393p46254K60116j255868k643062j000562K290029L595054
6200a998164K199850O50590M42568K24027j186517k375007j279066J729594M023593
6191B431468L495633L89901l205156n014728m027968j040584K023982L550972
6183a396480L226286J877659O21427J13607K42861L01016m06282j829445k946151
6174a95502k472381j77029K445488L290752J836072j37611n65192M98289J276303
6165E799189P94909j61356p12761j116974j671075j645114n05697O24973J85208
6156A591302j443875k183554j031083O25933R48911M903n15767M71280K080896
$$ plain form
6147 548946 2871827 3111002 404322 -3201113 -4242696 -1291335 3322495 5760495 4534489
6138 4534489 1582376 -339132 -448325 144497 407211 410406 681200 1327404 1908014 1813733
6128 1813733 881895 -45396 450298 2727013 5183815 5901497 5017673 4333660 4536509
6119 4536509 4298249 2684049 888596 402181 744130 634932 518608 1971108 4900064
6110 4900064 7230936 7547561 6473214 5227924 4347943 4125717 4758598 5577912 5563266
6101 5563266 5072397 5526033 6868064 7128332 5373966 3238909 2232582 1332371 -903322
6092 -903322 -3228439 -2965897 254108 3979863 5817015 5105938 2160595 -2078707 -5422076
6083 -5422076 -5380441 -1730033 2673892 4225802 1499926 -3783183 -7955397 -7957141 -3833730
$$ packed form
6147E48946K322881K39175k706680l605435j041583K951361M613830K438000j226006
6138D534489k952113j921508j09193N92822K62714L195K70794O46204N80610r4281
6128A813733r31838r27291M95694K276715K456802P17682q83824o84013K02849
6119D536509k38260j614200j795453m86415L41949j09198j16324J452500K928956
6110D900064K330872L16625j074347j245290q79981k22226O32881Q19314j4646
6101E563266m90869M53636J342031K60268j754366k135057j006327r00211k235693
6092i03322k325117K62542L220005L725755J837152p11077k945343m239302l343369
6083e422076M1635L650408M403925J551910k725876n283109m172214j744M123411
$$ plain form
6074 -3833730 1201224 3796281 3336823 1371444 -867163 -3089376 -4734247 -4832383 -3266119
6065 -3266119 -1090594 509358 928468 233018 -616503 -290498 1111734 1612141 -13802
6056 -13802 -2220760 -3113748 -3796443 -6773896 -11594754 -14989015 -15371010 -14228296 -12606882
6047 -12606882 -9475872 -4833770 -1310658 -522020 -196380 2582111 6914441 9351885
6039 9351885 8527222 6149130 4025457 2378479 1034239 355784 564142 1257854 1928410
6030 1928410 2417588 2944557 3941973 5338762 5813563 3806336 -205952 -3642878 -4834687
6021 -4834687 -4948132 -6009760 -8233997 -10376687 -11510823 -11268045 -9601283 -7673820 -7677123
6012 -7677123 -10146520 -12619619 -12617228 -10725396 -8918733 -7315208 -5052709 -3143599 -3389723
$$ packed form
6074c833730N034954K595057m59458j965379k238607k222213j644871r8136J566264
6065c266119K175525J599952M19110o95450q49521L26005J402232N00407j625943
6056a3802k206958q92988o82695k977453m820858l394261l81995J142714J621414
6047a2606882L131010M642102L523112P88638L25640K778491M332330K437444
6039I351885q24663k378092k123673j646978j344240o78455K08358O93712O70556
6030A928410M89178N26969R97416J396789M74801k007227m012288l436926j191809
6021d834687j13445j061628k224237k142690j134136K42778J666762J927463l303
6012g677123k469397k473099K391J891832J806663J603525K262499J909110k46124
$$ plain form
6003 -3389723 -4983110 -5284747 -3890192 -2766974 -2090184 595337 5891867 10382938 10896463
5994 10896463 8612200 6881388 6779945 6911107 6192223 4688930 2630458 555984 -284402
5985 -284402 445550 671377 -2061668 -7200279 -11512339 -12887731 -12306485 -11748051 -11577101
5976 -11577101 -10779316 -8925397 -6939008 -5971159 -6032139 -6065327 -5356486 -4382010 -3779768
5967 -3779768 -3048379 -1469878 -89752 -904280 -3462201 -4321511 -1493931 2183820 2353168
5958 2353168 -1175760 -4548985 -5192245 -4141234 -2841611 -805558 2102260 3737431
5950 3737431 2409934 -92551 -661948 958129 2533771 3098684 3625781 4144915 3228174
5941 3228174 1153030 808347 3798274 7709529 9155008 7868089 5683489 3069134
$$ packed form
6003c389723j593387l01637J394555J123218O76790K685521N296530M491071N13525
5994A0896463k284263j730812j01443J31162p18884j503293k058472k074474q40386
5985b84402P29952K25827k733045n138611m312060j375392N81246N58434J70950
5976a1577101P97785J853919J986389R67849o0980l3188P08841R74476O02242
5967c779768P31389J578501J380126q14528k557921q59310K827580L677751J69348
5958B353168l528928l373225o43260J051011J299623K036053K907818J635171
5950C737431j327497k502485n69397J620077J575642N64913N27097N19134r16741
5941C228174k075144l44683K989927L911255J445479j286919k184600k614355
$$ plain form
5933 3069134 -431670 -3247858 -2898182 -508201 -724077 -5437222 -10429405 -10777705 -7495826
5924 -7495826 -5559555 -6466740 -6657093 -3744800 -475981 -345247 -2092102 -1827845 735293
5915 735293 1957794 383214 -543365 2208104 5998305 5722767 1024320 -3090325 -2882586
5906 -2882586 32776 2127845 2482879 2001983 642577 -1743029 -3259282 -1748718 1738648
5897 1738648 4014351 4181544 4281400 5289205 5349894 3008231 -268197 -2188328 -2326866
5888 -2326866 -1387043 405749 2705204 4443720 5301135 6258300 7279567 6265592 2290753
5879 2290753 -1726263 -2099140 772291 3051968 2526735 783681 456346 2260049 4897244
5870 4897244 6426982 5718082 3665119 2590210 3414587 4302349 3387674 1517837 346642
$$ packed form
5933C069134l500804k816188L49676K389981k15876m713145m992183l48300L281879
5924g495826J936271r07185j90353K912293L268819J30734j746855K64257K563138
5915G35293J222501j574580r26579K751469L790201k75538m698447m114645K07739
5906b882586K915362K095069L55034m80896j359406k385606j516253J510564L487366
5897A738648K275703J67193R9856J007805O0689k341663l276428j920131j38538
5888b326866R39823J792792K299455J738516Q57415R57165J021267j013975l974839
5879B290753m017016l72877K871431K279677n25233j743054l27335J803703K637195
5870D897244J529738p08900k052963j074909Q24377Q87762r14675j869837j171195
$$ plain form
5861 346642 -909988 -4028117 -7864495 -9058472 -6747470 -3789682 -2882963 -3918452 -5559416
5852 -5559416 -7027381 -7845362 -8044985 -8924893 -11315905 -13105786 -11338108 -6938307 -4006085
5843 -4006085 -3809626 -3235391 -480967 1717435 828231 -1141180 -1125072 74396 -250882
5834 -250882 -1958884 -2657490 -1580060 129059 1657149 2321086 652078 -3386151 -6663397
5825 -6663397 -6363964 -3883401 -2274455 -1427776 607408 2943536 2779659 303330 -1691829
5816 -1691829 -2812017 -5130851 -8066102 -8121291 -4913915 -2706220 -3915343 -5426114 -3999043
5807 -3999043 -1464688 -1271999 -3080618 -4472600 -5536933 -7700478 -9608309 -8416242
5799 -8416242 -4820563 -3087854 -5529642 -9636993 -11359194 -9195872 -4511244 390750
$$ packed form
5861C46642j256630l118129l836378j193977K311002K957788R06719j035489j640964
5852e559416j467965q17981j99623q79908k391012j789881J767678M399801K932222
5843d006085J96459N74235K754424K198402q89204j969411J6108J199468l25278
5834b50882j708002o98606J077430J709119J528090O63937j669008m038229l277246
5825f663397K99433K480563J608946Q46679K035184K336128j63877k476329j995159
5816a691829j120188k318834k935251n5189L207376K207695j209123j510771J427071
5807c999043K534355J92689j808619j391982j064333k163545j907831J192067
5799h416242L595679J732709k441788m107351j722201K163322M684628M901994
$$ plain form
5791 390750 3687085 4722218 4116923 2977271 2097334 2126860 3607283 5969016 7358558
5782 7358558 6654306 5047057 4534255 5530683 7048796 8317640 8839217 7825832 5416410
5773 5416410 3771315 4911888 7769741 9378632 8827526 7871408 7503359 6333973 3280149
5764 3280149 -116620 -1438634 -292804 1647707 2638191 2023499 215340 -1585880 -2146838
5755 -2146838 -1344890 -248017 146524 -322686 -1489535 -3103300 -4236659 -3568249 -973423
5746 -973423 1931489 3474786 3563068 3243135 3438931 4572166 6466010 7911933 7250535
5737 7250535 4345510 1309770 261101 830880 892790 -585735 -2473822 -3180772 -2485094
5728 -2485094 -1440627 -1039338 -1249437 -1243024 -580619 -76520 -986475 -3204761 -5015980
$$ packed form
5791C90750L296335J035133o05295j139652q79937K9526J480423K361733J389542
5782G358558p04252j607249n12802R96428J518113J268844N21577j013385k409422
5773E416410j645095J140573K857853J608891n51106r56118l68049j169386l053824
5764C280149l396769j322014J145830J940511R90484o14692j808159j801220n60958
5755b146838Q01948J096873L94541m69210j166849j613765j133359O68410K594826
5746i73423K904912J543297Q8282l19933J95796J133235J893844J445923o61398
5737G250535k905025l035740j048669N69779O1910j478525j888087p06950O95678
5728b485094J044467M01289k10099O413O62405N04099r09955k218286j811219
$$ plain form
5719 -5015980 -5136200 -4299051 -4039265 -4409486 -3859459 -1255147 2736882 6265151 7779905
5710 7779905 7058715 5277467 3949802 3433052 2785757 1450852 441460 1057634 2858442
5701 2858442 3880731 2773474 -20080 -2976470 -4548668 -3738258 -687005 3104881
5693 3104881 5872481 7053115 7251326 7075345 6766489 6619226 6711214 6367212 4932228
5684 4932228 2891659 1105228 -670948 -2867748 -4006016 -1895540 2510208 4991321
5676 4991321 3292069 321996 57771 2094244 3122557 2684105 3818162 7607976 10507361
5667 10507361 8897231 4029504 215524 -534424 246853 781353 878198 191683 -2704988
5658 -2704988 -7861883 -12160397 -12172234 -8391362 -4642560 -3181470 -2419043 -247732 2483642
$$ packed form
5719e015980j20220Q37149K59786l70221N50027K604312L992029L528269J514754
5710G779905p21190j781248j327665n16750o47295j334905j009392O16174J800808
5701B858442J022289j107257k793554k956390j572198Q10410L051253L791886
5693C104881K767600J180634J98211j75981l08856j47263R1988l44002j434984
5684D932228k040569j786431j776176k196800j138268K110476M405748K481113
5676D991321j699252k970073k64225K036473J028313m38452J134057L789814K899385
5667A0507361j610130m867727l813980p49948P81277N34500R6845o86515k896671
5658b704988n156895m298514j1837L780872L748802J461090P62427K171311K731374
$$ plain form
5649 2483642 3580943 3097349 2919386 3395375 2927540 989345 -979219 -2270932 -3959610
5640 -3959610 -6088512 -6321387 -3352579 366889 1754968 1473702 2423549 4760836 5438604
5631 5438604 2717928 -1527452 -4490973 -5257112 -4455842 -3077733 -2209950 -2198212 -1612271
5622 -1612271 1219036 5357949 7968629 8232934 8164953 8839970 8567201 6195606 3517369
5613 3517369 2334200 1539184 -390493 -2149375 -1890930 -1089720 -2616276 -5891014 -7598156
5604 -7598156 -6921158 -6345850 -6929299 -6559258 -4069924 -1535743 -554676 645294 3804712
5595 3804712 6787679 6243998 2608007 -702476 -2245136 -3508939 -5025901 -4796348 -1687539
5586 -1687539 2022046 3174519 1511076 -472211 -655484 815208 2197094 1779668 -783182
$$ packed form
5649B483642J097301m83594j77963M75989m67835j938195j968564j291713j688678
5640c959610k128902k32875K968808L719468J388079k81266R49847K337287O77768
5631E438604k720676m245380k963521p66139Q01270J378109Q67783J1738N85941
5622a612271K831307M138913K610680K64305o7981O75017k72769k371595k678237
5613C517369j183169p95016j929677j758882K58445Q01210j526556l274738j707142
5604g598156O76998N75308n83449L70041K489334K534181R81067J199970L159418
5595C804712K982967n43681l635991l310483j542660j263803j516962K29553L108809
5586a687539L709585J152473j663443j983287j83273J470692J381886m17426k562850
$$ plain form
5577 -783182 -4089442 -6280530 -7113338 -8050138 -9748005 -10522120 -8558346 -4902173 -2490546
5568 -2490546 -2336368 -2594563 -1920353 -1738936 -3700174 -6323417 -6335001 -2959122 1108246
5559 1108246 3153099 3065639 2059177 654094 -916335 -1795844 -1627500 -1686275 -3198965
5550 -3198965 -5072916 -5118515 -3398270 -2417541 -3535990 -4978749 -4381502 -1897519 488261
5541 488261 1704911 2205538 2446695 2276329 1732202 1214784 815686 459251 590177 1557901
5531 1557901 2413359 1818992 391406 384892 2266588 3477635 2191930 741643 2879723
5522 2879723 8313623 12667173 13086591 11225481 9680703 8004689 4284945 -966257
5514 -966257 -4929983 -5863111 -4334727 -1444786 2189487 5619158 7551872 7581796 6218082
$$ packed form
5577g83182l306260k191088q32808r36800j697867p74115J963774L656173K411627
5568b490546J54178k58195O74210J81417j961238k623243j1584L375879M067368
5559A108246K044853q7460j006462j405083j570429q79509J68344n8775j512690
5550c198965j873951m5599J720245R80729j118449j442759N97247K483983K385780
5541D88261J216650N00627K41157j70366n44127n17418l99098l56435J30926R67724
5531A557901Q55458n94367j427586o514J881696J211047j285705j450287K138080
5522B879723N433900M353550M19418j861110j544778j676014l719744n251202
5514i66257l963726r33128J528384K889941L634273L429671J932714K9924j363714
$$ plain form
5505 6218082 3745302 565661 -1485720 -352093 3111013 5264008 4003666 1167692
5497 1167692 -578645 -1365324 -2840941 -4898590 -6061963 -6219200 -6426285 -6290719 -4169307
5488 -4169307 -413799 1968149 1078304 -1106684 -1116496 1891630 5643389 7640557 7263450
5479 7263450 5375008 3172809 1670877 1379133 1910089 2249681 1885425 1606025 2834332
5470 2834332 6014422 9783620 11874217 10855025 7174115 2938162 698062 1567317
5462 1567317 3759142 3652444 -425435 -5725689 -7812377 -5767075 -2970280 -2372236 -3098840
5453 -3098840 -2909522 -1986315 -2221654 -3995582 -5869918 -6807829 -6689220 -5225198 -2489644
5444 -2489644 -59977 735164 1479272 4891966 10090093 12512835 9763305 5070600 3221601
$$ packed form
5505F218082k472780l179641k051381J133627L463106K152995j260342k835974
5497A167692j746337p86679j475617k057649j163373j57237k07085J35566K121412
5488d169307L755508K381948q89845k184988r812L008126L751759J997168l77107
5479G263450j888442k202199j501932k91744N30956L39592l64256k79400J228307
5470B834332L180090L769198K090597j019192l680910m235953k240100Q69255
5462A567317K191825j06698m077879n300254k086688K045302K796795N98044p26604
5453c098840J89318R23207k35339j773928j874336r37911J18609J464022K735554
5444b489644K429667P95141P44108L412694N198127K422742k749530m692705j848999
$$ plain form
5435 3221601 4885684 6814920 6252763 3194162 -749268 -3764285 -4600790 -3622285 -2863429
5426 -2863429 -3636392 -4329079 -2040553 3551767 9226430 11374703 9224130 4814953 768279
5417 768279 -1486409 -1962033 -1332680 -108440 1360466 2288377 1662032 -431015 -2318728
5408 -2318728 -2506157 -1651012 -1758419 -3334717 -4415937 -3034503 80111 2195069 1715639
5399 1715639 -414136 -2636349 -4832499 -7371023 -9062205 -8096304 -5170919 -3537740
5391 -3537740 -4828887 -6648971 -5954750 -3206011 -891735 763767 3556269 7157141
5383 7157141 8541399 6231467 2274398 -997352 -3495534 -5462287 -5906784 -4951083 -5231264
5374 -5231264 -8365553 -11882456 -12455256 -10810416 -10403299 -11998412 -12689759 -10330608 -6197914
$$ packed form
5435C221601J664083J929236n62157l058601l943430l015017q36505R78505P58856
5426b863429p72963o92687K288526N592320N674663K148273k150573m409177m046674
5417G68279k254688m75624O29353J224240J468906R27911o26345k093047j887713
5408b318728j87429Q55145j07407j576298j081220J381434L114614K114958m79430
5399A715639k129775k222213k196150k538524j691182R65901K925385J633179
5391c537740j291147j820084O94221K748739K314276J655502K792502L600872
5383G157141J384258k309932l957069l271750k498182j966753m44497R55701k80181
5374e231264l134289l516903n72800J644840M07117j595113o91347K359151M132694
$$ plain form
5365 -6197914 -2728304 -800278 30813 321492 523737 798816 609359 -564629 -2079215
5356 -2079215 -2765896 -2607106 -2613027 -3217371 -4027391 -4850174 -5531258 -5134061 -3016532 -529761
5346 -529761 278465 -335949 -164530 1372152 2234212 1046974 -780803 -1370033 -998081
5337 -998081 -1030985 -1581418 -1580377 -250056 2447748 5821484 8144899 7637679 4720603
5328 4720603 2039096 1282827 1412770 1126707 1243616 2792418 4360724 3898531 2236443
5319 2236443 2020585 3414719 3755240 1965775 550495 1895497 4794075 6415148 6105944
5310 6105944 5208050 4237780 2694944 1382217 2361441 5808422 8875319 9042774 7258341
5301 7258341 6121425 5910749 4554556 1411951 -1266223 -1617468 -1058728 -2221108 -5093297
$$ packed form
5365f197914L469610J928026Q31091K90679K02245K75079j89457j173988j514586
5356b079215o86681J58790n921o04344q10020q22783o81084L97197K117529K486771
5346e29761Q08226o14414J71419J536682Q62060j187238j827777n89230L71952
5337i98081l2904n50433J041J330321K697804L373736K323415n07220k917076
5328D720603k681507p56269J29943k86063J16909J548802J568306m62193j662088
5319B236443k15858J394134L40521j789465j415280J345002K898578J621073l09204
5310F105944q97894r70270j542836j312727R79224L446981L066897J67455j784433
5301G258341j136916k10676j356193l142605k678174l51245N58740j162380k872189
$$ plain form
5292 -5093297 -7222860 -7455771 -7465452 -9053098 -11505437 -12662032 -11717349 -9892201 -8656659
5283 -8656659 -8180707 -7673341 -6761805 -6096700 -6363619 -6888190 -6013462 -3362123 -908387
5274 -908387 -663486 -1775474 -1492987 959702 3280123 3587164 3302970 4989708 8338137
5265 8338137 10245698 8820262 5684646 3821571 4314671 5981319 7377255 7989924 7550614
5256 7550614 5354202 1107401 -3909741 -7506484 -8719832 -8653410 -8781295 -9131756 -8914339
5247 -8914339 -8251569 -7923788 -7547818 -5646143 -2151299 536074 180777 -2384764 -4307598
5238 -4307598 -4323191 -3937203 -4837847 -6458716 -6957599 -5807460 -4222978 -3195722 -2382678
5229 -2382678 -1375563 -862219 -1430943 -2096821 -1665283 -1171216 -2799364 -5984462 -7017567
$$ packed form
5292e093297k129563k32911r681j587646k452339j156595R44683J825148J235542
5283h656659M75952N07366R11536O65105k66919n24571Q74728K651339K453736
5274i08387K44901j111988K82487K452689K320421L07041k84194J686738L348429
5265H338137J907561j425436l135616j863075M93100J666648J395936O12669m39310
5256G550614k196412m246801n017142l596743j213348O6422j27885l50461K17417
5247h914339O62770L27781L75970J901675L494844K687373l55297k565541j922834
5238d307598j5593L85988r00644j620869m98883J150139J584482J027256Q13044
5229b382678J007115N13344n68724o65878M31538M94067j628148l185098j033105
$$ plain form
5220 -7017567 -3977735 83967 1137553 -266249 -291771 2291069 4883256 5680490 5973194
5211 5973194 6796707 6489457 3522387 -587426 -3294888 -4199950 -4232741 -3336572 -1237023
5202 -1237023 730328 967177 74629 -138894 549519 1057845 1404889 2464925 3608923
5193 3608923 3043845 715864 -1291342 -1626270 -988574 -268952 560779 1193881 789778
5184 789778 -96080 544565 3071574 4897190 3811096 1070951 -461365 70462 1544231
5175 1544231 3222912 4813684 4888700 1875920 -3050749 -6192638 -5303698 -1992222 568335
5166 568335 1172834 1022683 1513290 2539133 2795109 1385313 -758522 -1363813 579139
5157 579139 3104713 3501494 2159636 2332732 5476140 8859915 9246214 7158599 5369090
$$ packed form
5220g017567L039832M061702J053586j403802k5522K582840K592187P97234K92704
5211E973194Q23513l07250k967070m109813k707462r05062l2791Q96169K099549
5202a237023J967351K36849q92548k13523O88413N08326L47044J060036J143998
5193C608923n65078k327981k007206l34928O37696P19622Q29731O33102m04103
5184G89778q85858O40645K527009J825616j086094k740145j532316N31827J473769
5175A544231J678681J590772P5016l012780m926669l141889Q88940L311476K560557
5166E68335O04499j50151M90607J025843K55976j409796k143835o05291J942952
5157E79139K525574L96781j341858J73096L143408L383775L86299k087615j789509
$$ plain form
5148 5369090 4442981 2560974 -623316 -2891983 -2796561 -1550012 -555114 686153 2706307
5139 2706307 4089392 3392378 1786967 1650667 3148525 4161123 3424965 2114142 2200504
5130 2200504 4338984 7277483 8517880 6073025 654932 -4385139 -6393496 -6091552
5122 -6091552 -5895848 -6706985 -8035015 -10067096 -13008860 -14943855 -13364642 -9156907 -6291599
5113 -6291599 -6794367 -8531662 -8900565 -8115239 -7432313 -6562051 -4814631 -3002331 -2219409
5104 -2219409 -2131006 -2210342 -3196401 -5424468 -7134666 -6646370 -5133451 -4962523 -6080804
5095 -6080804 -6372526 -5069575 -3498383 -2713485 -2609189 -3201234 -4450718 -4742673 -2071262
5086 -2071262 2547876 5075157 3010830 -1666185 -5157592 -5911171 -4858007 -3084673
$$ packed form
5148E369090r26109j882007l184290k268667R5422J246549R94898J241267K020154
5139B706307J383085o97014j605411j36300J497858J012598p36158j310823Q6362
5130B200504K138480K938499J240397k444855n418093n040071k008357L01944
5122f091552J95704q11137j328030k032081k941764j934995J579213M207735K865308
5113f291599n02768j737295l68903P85326O82926Q70262J747420J812300P82922
5104b219409Q8403p9336r86059k228067j710198M88296J512919J70928j118281
5095f080804k91722J302951J571192P84898J04296n92045j249484k91955K671411
5086b071262M619138K527281k064327m677015l491407p53579J053164J773334
$$ plain form
5078 -3084673 -1009776 876918 2207738 3613547 6054072 9004942 10351256 8664770
5070 8664770 5003338 1789036 149300 -836383 -2046773 -2392431 -75195 4412032 7942753
5061 7942753 8135604 6092022 4660061 4598468 3966959 1428856 -1312794 -1380362 1538587
5052 1538587 4378617 3892525 137365 -3749837 -5140226 -4587066 -4524501 -5954347 -7430177
5043 -7430177 -7196284 -5156645 -2345009 455685 2695024 3386586 1695948 -1639768 -4184688
5034 -4184688 -3633238 46142 4260256 5837087 3774524 -92298 -3239832 -4733510
5026 -4733510 -4987561 -4192145 -2221009 267540 1961868 2172520 1099312 -808760 -2702176
5017 -2702176 -3221876 -2135351 -1487825 -3110570 -5385753 -4900736 -1280758 2247245 3390910
$$ packed form
5078c084673K074897J886694J330820J405809K440525K950870J346314j686486
5070H664770l661432l214302j639736r85683j210390l45658K317236M487227L530721
5061G942753J92851k043582j431961o1593o31509k538103k741650o7568K918949
5052A538587K840030m86092l755160l887202j390389N53160O2565j429846j475830
5043g430177K33893K039639K811636K800694K239339O91562j690638l335716k544920
5034d184688N51450L679380M214114J576831k062563l866822l147534j493678
5026d733510k54051P95416J971136K488549J694328K10652j073208j908072j893416
5017b702176n19700J086525O47526j622745k275183M85017L619978L528003J143665
$$ plain form
5008 3390910 3109281 2819872 2318384 1635552 2021274 3429479 3615610 1520955 -802011
4999 -802011 -1363493 -942178 -854577 -555023 512435 1168994 807784 974415 2358103 2841357
4989 2841357 1178639 -32950 1887652 5348499 7036980 6587358 5556967 4164001
4981 4164001 2511828 2609478 5287229 7362139 5931107 3184482 2592559 2820443 604325
4972 604325 -2588320 -2790809 -883574 -1231255 -3722840 -3913100 -1202593 -6233 -1677380
4963 -1677380 -1903810 1808637 5994444 7068815 6149998 5596885 5527091 6186788 9077031
4954 9077031 13092636 14004147 10567689 6967947 6395661 6390424 3764612 253905 -482986
4945 -482986 1421010 2850755 2140983 -101788 -2835475 -5116594 -6340980 -7037020 -7508290
$$ packed form
5008C390910k81629k89409n01488o82832L85722J408205J86131k094655k322966
4999h02011n61482M21315Q7601K99554J067458O56559l61210J66631J383688M83254
4989B841357j662718j211589J920602L460847J688481m49622j030391j392966
4981D164001j652173R7650K677751K074910j431032k746625n91923K27884k216118
4972F04325l192645k02489J907235l47681k491585j90260K710507J196360j671147
4963a677380k26430L712447M185807J074371r18817n53113o9794O59697K890243
4954I077031M015605R11511l436458l599742n72286n237k625812l510707p36891
4945d82986J903996J429745p09772k242771k733687k281119j224386o96040m71270
$$ plain form
4936 -7508290 -5679973 386215 7681996 10306806 7223944 3425958 2246541 1587346
4928 1587346 -495175 -1948239 -1260387 -869407 -2769642 -4930571 -5092593 -4148176 -3104140
4919 -3104140 -851831 2471939 4200708 3646324 3434252 4259646 3481358 1175283 1709985
4910 1709985 6427922 10744813 11591893 11444555 11802311 9761953 4989792 2679077 4919806
4901 4919806 6543598 4469875 3322932 6298968 8759816 7086405 5343041 6497009
4893 6497009 6191229 2577392 2299403 8194247 11760386 7657944 4240299 8325777 11898632
4884 11898632 7505871 3795880 9510752 15410315 11082979 5628837 9077749 8769646
4876 8769646 -7153111 -19703310 -12990905 -26215579 -115780651 -257053384 -341086967
$$ packed form
4936g508290J828317O066188P295781K624810l082862l797986j179417o59195
4928A587346k082521j453064O87852L90980j900235k160929j62022R44417J044036
4919c104140K252309L323770J728769n54384k12072Q25394p78288k306075N34702
4910A709985M717937M316891Q47080j47338L57756k040358m772161k310715K240729
4901D919806J623792k073723j146943K976036K460848j673411j743364J153968
4893F497009l05780l613837k77989N894844L566139m102442l417645M085478L572855
4884A1898632m392761l709991N714872N899563m327336n454142L448912l08103
4876H769646j5922757j2550199O712405j3224674q9565072j41272733q4033583
$$ plain form
4869 -341086967 -298888037 -185120515 -102287109 -79360931 -70815258 -46834848 -26221823
4862 -26221823 -25704152 -30095668 -24585627 -18404106 -21212260 -24080885 -18565509 -12714405
4854 -12714405 -14585858 -17608426 -14437377 -10266867 -11298501 -13082039 -10515796 -7891114
4846 -7891114 -9636297 -11525746 -9773309 -9125918 -13534687 -17765668 -16428853 -13114466
4838 -13114466 -12761271 -12758854 -9463206 -6366714 -7831373 -10797620 -10126660 -6748696 -3932767
4829 -3932767 -1101507 2142412 1625445 -4721693 -10933041 -10832073 -7299629 -6928791 -9761194
4820 -9761194 -11371006 -11298057 -12036289 -12485489 -9562829 -4533721 -1545073 -1368207 -1874922
4811 -1874922 -2781773 -4726336 -5701100 -3722915 -1215261 -1585496 -3279537 -2450832 232092
$$ packed form
4869c41086967M2198930J13767522Q2833406K2926178Q545673K3980410K0613025
4862b6221823N17671m391516N510041O181521k808154k868625N515376N851104
4854a2714405j871453l022568L171049M170510j031634j783538K566243K624682
4846g891114j745183j889449J752437O47391m408769m230981J336815L314387
4838a3114466L53195K417L295648L096492j464659k966247O70960L377964K815929
4829c932767K831260L243919n16967o347138o211348J00968L532444L70838k832403
4820i761194j609812P2949p38232m49200K922660N029108K988648J76866n06715
4811a874922r06851j944563r74764J978185K507654l70235j694041Q28705K682924
$$ plain form
4802 232092 930265 -596064 -1169256 -336994 -788497 -2779204 -3386078 -1852398 -1049012
4793 -1049012 -2632539 -4574533 -4659123 -3514346 -3223997 -5007305 -8517507 -11667110 -11598476
4784 -11598476 -7750682 -3261134 -1486340 -2266973 -3521286 -4746500 -6354720 -7321796
4776 -7321796 -6638349 -5730703 -6308435 -7115288 -6034901 -4051698 -3553500 -3908255 -2678150
4767 -2678150 -454896 -317695 -2612829 -4245305 -3464994 -1716299 -256402 1576741 3945143
4758 3945143 5480016 5565816 4998851 3778426 1009734 -2309808 -3274179 -982820 1918964
4749 1918964 2766121 1872203 940546 431717 -217105 -1176800 -2161780 -2931119 -3375639 -3898853
4739 -3898853 -5573131 -8719163 -11621922 -12188032 -10678826 -9199869 -8732643 -8421523 -7525507
$$ packed form
4802B32092O98173j526329n73192Q32262m51503j990707o06874J533680Q03386
4793a049012j583527j941994q4590J144777K90349j783308l510202l149603O8634
4784a1598476L847794M489548J774794p80633j254313j225214j608220r67076
4776g321796O83447R07646n77732q06853J080387J983203M98198l54755J230105
4767b678150K223254J37201k295134j632476P80311J748695J459897J833143K368402
4758C945143J534873Q5800n66965j220425k768692l319542r64371K291359K901784
4749A918964Q47157q93918r31657n08829o48822r59695r84980p69339m44520n23214
4739c898853j674278l146032k902759n66110J509206J478957M67226L11120Q96016
$$ plain form
4730 -7525507 -6094701 -3869487 -689387 1912008 1794972 -626201 -2357816 -1616953 127449
4721 127449 551753 -740433 -2595845 -4068298 -4941339 -5373823 -5560132 -5295083 -4128845
4712 -4128845 -2628110 -2649736 -5066690 -8094623 -9544075 -9816888 -10602682 -11555068 -10960980
4703 -10960980 -9136041 -8038860 -7577739 -5670561 -2495603 -1176946 -2961984 -4990761
4695 -4990761 -4737191 -3730673 -4441213 -5957595 -5787682 -4313207 -4173528 -5850146 -6947388
4686 -6947388 -6103984 -4996992 -5494780 -6753040 -6649946 -5142979 -4537667 -6290922 -8780449
4677 -8780449 -9158542 -6944502 -4605624 -4410272 -5894885 -7076874 -6963798 -5690549 -3224393
4668 -3224393 282715 3250584 3639779 1444814 -1064246 -1788624 -480743 1829635 3735988
$$ packed form
4730g525507J430806K225214L180100K601395j17036k421173j731615P40863J744402
4721A27449M24304j292186j855412j472453q73041m32484j86309K65049J166238
4712d128845J500735k1626k416954l027933j449452k72813p85794r52386N94088
4703a0960980J824939J097181M61121J907178L174958J318657j785038k028777
4695d990761K53570J006518p10540j516382J69913J474475J39679j676618j097242
4686f947388Q43404J106992m97788j258260J03094J506967O05312j753255k489527
4677h780449l78093K214040K338878J95352j484613j181989J13076J273249K466156
4668c224393L507108K967869L89195k194965k509060p24378J307881K310378J906353
$$ plain form
4659 3735988 3834849 1731559 -1024868 -2272496 -1789590 -1395308 -2372327 -4055369 -5212981
4650 -5212981 -5499906 -5039578 -3667105 -1255547 1733918 4271892 5087194 3513289 680152
4641 680152 -1013927 -776571 -771383 -2961998 -5655929 -5531166 -2484610 290557 997246
4632 997246 1087829 1927281 2524865 1779757 498765 -342614 -1351006 -3173733 -4846154
4623 -4846154 -5147976 -4216729 -2521576 340205 4383343 7944520 9084583 7530725 4338016
4614 4338016 679391 -2121696 -2604336 -531873 2415599 4173053 3956990 2160046 -244673
4605 -244673 -1803226 -1495101 -177611 150478 -1065550 -2574827 -3758622 -5312238 -6882071
4596 -6882071 -6523848 -3849882 -1395533 -1111117 -1605706 -931289 -166338 -1687064 -5178605
$$ packed form
4659C735988R8861k103290k756427j247628M82906L94282r77019j683042j157612
4650e212981k86925M60328J372473K411558K989465K537974Q15302j573905k833137
4641F80152j694079K37356N188k190615k693931J24763L046556K775167P06689
4632I97246R0583Q39452N97584p45108j280992q41379j008392j822727j672421
4623d846154l01822R31247J695153K861781M043138L561177J140063j553858l192709
4614D338016l658625k801087m82640K072463K947472J757454k16063j796944k404719
4605b44673j558553L08125J317490L28089j216028j509277j183795j553616j569833
4596f882071L58223K673966K454349K84416m94589O74417P64951j520726l491541
$$ plain form
4587 -5178605 -7917681 -8281201 -6827549 -4656475 -2854835 -2901162 -5273920 -7824780 -7607948
4578 -7607948 -4435124 -953308 837152 1550457 2734610 4653305 6245684 6501485 5496131
4569 5496131 4240437 3387548 2298562 277584 -1460974 -794451 1930971 3609948 2502823
4560 2502823 529298 -58498 -109637 -1552765 -3879280 -5318227 -6128489 -7841640 -10064733
4551 -10064733 -10826856 -9645258 -7715156 -5479576 -2510285 584065 2710159 4491666
4543 4491666 7319881 10377547 11321548 9913421 8103485 6302664 2760282 -2428405
4535 -2428405 -5712436 -4191366 683691 4972519 6262495 4862707 2711863 2080495
4527 2080495 3668757 5078112 2987179 -2200552 -5981539 -5403704 -2955369 -2795940 -4918547
$$ packed form
4587e178605k739076l63520J453652K171074J801640m6327k372758k550860K16832
4578g607948L172824L481816J790460P13305J184153J918695J592379K55801j005354
4569E496131j255694q52889j088986k020978j738558O66523K725422J678977j107125
4560B502823j973525n87796n1139j443128k326515j438947q10262j713151k223093
4551a0064733p62123J181598J930102K235580K969291L094350K126094J781507
4543D491666K828215L057666R44001j408127j809936j800821l542382n188687
4535b428405l284031J521070M875057M288828J289976j399788k150844o31368
4527B080495J588262J409355k090933n187731l780987N77835K448335J59429k122607
$$ plain form
4518 -4918547 -5795136 -3986657 -2198185 -3341094 -6753588 -9453004 -9929665 -9439071 -9843939
4509 -9843939 -11227950 -12114312 -11570154 -10217851 -8959629 -7621430 -5669516 -3624289 -2616653
4500 -2616653 -2772727 -3117882 -2999832 -2644446 -2458562 -2782403 -4075493 -6167060 -7565248
4491 -7565248 -6874868 -4762538 -3074506 -2172836 -869732 1006569 2022773 1563680 863473
4482 863473 871904 975381 809383 1475523 3566946 5507720 5453819 3784061 2248549 1540904
4472 1540904 1126869 718519 471550 201799 -322654 -660876 -333921 189059 79579 -720446
4462 -720446 -1847206 -3352576 -5034764 -5520737 -3570795 -222776 1913884 1921854 1838705
4453 1838705 3896586 7483094 9928578 9774541 7974434 5893949 3603284 894258
$$ packed form
4518d918547q76589J808479J788472j142909l412494k699416m76661M90594m04868
4509i843939j384011q86362N44158J352303J258222J338199J951914K045227J007636
4500b616653j56074l45155J18050L55386J85884l23841j293090k091567j398188
4491g565248O90380K112330J688032R01670J303104J876301J016204m59093p00207
4482H63473Q431J03477j65998O66140K091423J940774n3901j669758j535512p07645
4472A540904m14035m08350k46969k69751n24453l38222L26955N22980j09480q00025
4462g20446j126760j505370j682188m85973J949942L348019K136660P970q3149
4453A838705K057881L586508K445484j54037j800107k080485k290665k709026
$$ plain form
4445 894258 -1304153 -2018360 -2019622 -2687503 -3354962 -1998031 1099797 2843104 1564597
4436 1564597 -585718 -1021425 -94918 932153 2690217 5485347 6624328 3908946 174010
4427 174010 -197445 1698435 918175 -2789583 -3928170 -162397 3457075 2135330 -1662328
4418 -1662328 -2726276 -817537 434177 -472567 -2379872 -4867540 -7850734 -9222514
4410 -9222514 -7164588 -4013697 -3827435 -6479059 -7951088 -6456037 -4602016 -5007250 -7041294
4401 -7041294 -8736245 -9136546 -7810472 -4465952 -203834 2655750 2994609 1926614 1042053
4392 1042053 888898 1238645 1392075 226383 -2509085 -4947839 -4716043 -1789740 1691673
4383 1691673 4189549 5658348 5994537 4658351 2013839 -700190 -2868597 -4438744
$$ packed form
4445H94258k198411p14207j262o67881o67459J356931L097828J743307j278507
4436A564597k150315m35707R26507J027071J758064K795130J138981k715382l734936
4427A74010l71455J895880p80260l707758j138587L765773L619472j321745l797658
4418a662328j063948J908739J251714r06744j907305k487668k983194j371780
4410i222514K057926L150891J86262k651624j472029J495051J854021m05234k034044
4401g041294j694951m00301J326074L344520M262118K859584L38859j067995q84561
4392A042053j53155L49747J53430j165692k735468k438754K31796K926303L481413
4383A691673K497876J468799L36189j336186k644512k714029k168407j570147
$$ plain form
4375 -4438744 -4636671 -2715968 47667 1162706 -57956 -2079667 -3711131 -5018657
4367 -5018657 -5636714 -4540598 -2031875 176026 1444667 2770312 4347332 4819065 3842303
4358 3842303 3248364 4377665 5946061 5824476 3631988 562545 -2134975 -3654258 -3796214
4349 -3796214 -3387686 -3517352 -3971795 -3596645 -2298188 -1123067 -262141 1113523 2781050
4340 2781050 3369235 2768179 2355684 2287835 1181534 -667917 -797401 1089873 1324105
4331 1324105 -2717960 -8239316 -10572363 -9257674 -7438940 -6537826 -5095874 -2649999
4323 -2649999 -1407998 -3215934 -7065615 -10499029 -12045446 -11761219 -10640247 -9945524 -10095403
4314 -10095403 -9905534 -7815276 -4003451 -405408 1459854 1780057 1468703 879055 -106122
$$ packed form
4375d438744j97927J920703K763635J115039j220662k021711j631464j307526
4367e018657o18057J096116K508723K207901J268641J325645J577020M71733r76762
4358C842303n93939J129301J568396j21585k192488l069443k697520j519283j41956
4349c796214M08528j29666m54443L75150J298457J175121Q60926J375664J667527
4340B781050N88185o01056m12495o7849j106301j849451j29484J887274K34232
4331A324105m042065n521356k333047J314689J818734R01114J441952K445875
4323b649999J242001j807936l849681l433414j546417K84227J120972O94723j49879
4314a0095403J89869K090258L811825L598043J865262L20203l11354n89648r85177
$$ plain form
4305 -106122 -1432516 -2850013 -4146405 -4973783 -4689879 -2919575 -436005 934275 -166505
4296 -166505 -3229883 -6545411 -9213094 -11579380 -13481015 -13446251 -10613539 -6328701 -2653926
4287 -2653926 -306111 762109 195775 -1570667 -2482950 -1656276 -1635015 -4868909 -9130603
4278 -9130603 -10258551 -8833896 -9523338 -13305539 -15282672 -12113297 -7196546 -5550315
4270 -5550315 -7016627 -7913543 -6910781 -5832878 -6108682 -7224425 -7748255 -6102735 -1707884
4261 -1707884 3271591 5316634 4090404 3097319 4269107 5091479 3439366 1730424 2729617
4252 2729617 4200728 2048258 -3227786 -7593588 -9625035 -11237393 -13045209 -13262656
4244 -13262656 -11269380 -8694978 -6661952 -4808375 -3090269 -1974348 -959398 720680
$$ packed form
4305a06122j326394j417497j296392q27378K83904J770304K483570J370280j100780
4296a66505l063378l315528k667683k366286j901635L4764K832712M284838L674775
4287b653926K347815J068220n66334j766442r12283Q26674K1261l233894m261694
4278i130603j127948J424655o89442l782201j977133L169375M916751J646231
4270e550315j466312q96916J002762J077903k75804j115743n23830J645520M394851
4261a707884M979475K045043j226230r93085J171788Q22372j652113j708942R99193
4252B729617J471111k152470n276044m365802k031447j612358j807816k17447
4244a3262656J993276K574402K033026J853577J718106J115921J014950J680078
$$ plain form
4236 720680 2152062 1571632 -1309795 -5419296 -9516276 -11621486 -9475087 -4184912 -1099677
4227 -1099677 -3634531 -8193976 -8929165 -5649157 -2890007 -2861955 -3977290 -5167231 -6785602
4218 -6785602 -7857315 -7119374 -6391328 -8417154 -11853081 -13005283 -11976360 -12067646 -13364624
4209 -13364624 -12285353 -7883864 -3496629 -1457742 -888043 -1177832 -2857717 -4587936
4201 -4587936 -4231936 -3421947 -6035059 -11600153 -15323600 -15166278 -13658091 -12350701 -10185542
4192 -10185542 -7879194 -7862848 -9101887 -8194092 -6324511 -8348391 -13983409 -17240226 -16105433
4183 -16105433 -15177547 -16808846 -17661046 -16474464 -16862234 -19272887 -18690257 -14034112 -11381545
4174 -11381545 -13865111 -17014361 -18181609 -21085642 -26151654 -26552940 -20048219 -14751036
$$ packed form
4236G20680J431382n80430k881427m109501m096980k105210K146399N290175L085235
4227a099677k534854m559445p35189L280008K759150K8052j115335j189941j618371
4218f785602j071713P37941P28046k025826l435927j152202J028923r1286j296978
4209a3364624J079271M401489M387235K038887N69699k89789j679885j730219
4201d587936L56000Q09989k613112n565094l723447J57322J508187J307390K165159
4192a0185542K306348J6346j239039R07795J869581k023880n635018l256817J134793
4183a6105433R27886j631299q52200J186582l87770k410653N82630M656145K652567
4174a1381545k483566l149250j167248k904033n066012m01286O504721N297183
$$ plain form
4166 -14751036 -16394876 -20043404 -21423493 -25052273 -32672374 -35901623 -30885933 -28013700
4158 -28013700 -34975457 -42553378 -40954543 -37395283 -41613786 -47409847 -47266496 -50994743
4150 -50994743 -66878782 -78981341 -72230404 -65592229 -80458803 -83616336 -13469571 124768755
4142 124768755 238778515 251869782 189470768 131436885 110507530 99502111 77364168
4135 77364168 57777132 53323541 53255152 47238532 41853545 42468591 41230088 33460700
4127 33460700 27688384 29783674 32602359 30036507 27327003 28904563 28857363 22537343
4119 22537343 16507350 17680098 21772570 21359828 17562336 15439019 14660755 12818982
4111 12818982 12151228 15231686 18696479 18246684 15801808 15397105 15905671 13986729 10788410
$$ packed form
4166a4751036j643840l648528j380089l628780p620101l229249N015690K872233
4158b8013700o961757p577921J598835L559260m218503n796061J43351l728247
4150e0994743j5884039j2102559O750937O638175j4866574l157533P0146765J38238326
4142A24768755J14009760J3091267o2399014n8033883k0929355j1005419k2137943
4135G7364168j9587036m453591o8389o016620n384987O15046j238503p769388
4127C3460700n772316K095290K818685k565852k709504J577560m7200o320020
4119B2537343o029993J172748M092472m12742l797492k123317p78264j841773
4111A2818982o67754L080458L464793m49795k444876m04703N08566j918942l198319
$$ plain form
4102 10788410 9703468 10257959 9735708 8405417 8031256 7546476 5256523 3329489 5054041
4093 5054041 8999037 10601964 8752267 6610027 6344842 6812823 6456423 5469344 4829174
4084 4829174 5304587 7409370 10753662 13671930 14598775 13371915 10745679 7809116 6180568
4075 6180568 6887216 8446541 8130440 5759332 3893215 3651897 3246352 1692961 799074
4066 799074 1802792 3045452 2980559 2769815 3800405 5167911 5708252 6050432 6607206
4057 6607206 6116194 4350066 3598693 5051013 6392737 5672643 4865983 6494178 9158132
4048 9158132 9900316 8936105 8314402 7518870 4433268 -135670 -2736447 -2001843 25082
4039 25082 1348909 2101494 2992683 3960771 4631304 4501698 2849156 -138074 -2743307
$$ packed form
4102A0788410j084942N54491n22251j330291l74161m84780k289953j927034J724552
4093E054041L944996J602927j849697k142240k65185M67981l56400r87079o40170
4084D829174M75413K104783L344292K918268R26845j226860k626236k936563j628548
4075F180568P06648J559325l16101k371108j866117k41318m05545j553391q93887
4066G99074J003718J242660o4893k10744J030590J367506N40341L42180N56774
4057F607206m91012j766128p51373J452320J341724p20094q06660J628195K663954
4048I158132P42184r64211o21703p95532l085602m568938k600777P34604K026925
4039B5082J323827P52585Q91189R68088O70533j29606j652542k987230k605233
$$ plain form
4030 -2743307 -3686951 -3837433 -4440140 -4844800 -3907206 -2459674 -2113996 -2472898 -1809440
4021 -1809440 126896 2110546 3601561 4862581 5643323 5843054 6681405 8923042 10698391
4012 10698391 9639288 6658384 4877608 4971701 4394833 1570604 -1810886 -3527870 -3680048
4003 -3680048 -3684991 -3983278 -3860702 -2607526 -59824 3386404 6789400 9032846 9353150
3994 9353150 7462279 3684114 -675467 -3832306 -4957603 -4460312 -2679172 369986
3986 369986 3572380 5017944 4827455 5667143 8833015 11755792 11454255 8691323 6242642
3977 6242642 4598143 2343672 -149443 -611697 1556799 4115235 4652122 2788806 14816
3968 14816 -1223091 842345 4842005 6635871 4189024 682110 292894 2502176 3817942
$$ packed form
4030b743307r43644j50482o02707m04660R37594J447532L45678l58902O63458
4021a809440J936336J983650J491015J261020P80742J99731Q38351K241637J775349
4012A0698391j059103k980904j780776R4093n76868k824229l381490j716984j52178
4003c680048m943k98287J22576J253176K547702L446228L402996K243446L20304
3994I353150j890871l778165m359581l156839j125297M97291J781140L049158
3986C69986L202394J445564j90489Q39688L165872K922777l01537k762932k448681
3977F242642j644499k254471k493115m62254K168496K558436N36887j863316k773990
3968A4816j237907K065436L999660J793866k446847l506914l89216K209282J315766
$$ plain form
3959 3817942 3680116 4516763 6612081 7483198 6661240 6638263 8062251 8272031 6253602
3950 6253602 5013777 6642400 8478441 7140698 3779048 2233121 3739478 6309303
3942 6309303 8041878 8341823 6775553 3473216 508045 557306 3713559 7086679 8078924
3933 8078924 7148354 6801552 8231998 9553707 7882318 3150014 -1156056 -1775685 875188
3924 875188 4205456 7023462 9483230 10602258 9006785 6106694 5243940 6890508 7723265
3915 7723265 5687411 3025028 2520832 3500891 3937138 4251954 6112919 8829951 9895539
3906 9895539 8601111 6679668 5509574 4713219 3566022 2088036 558722 -708467
3898 -708467 -978966 333970 2535693 4086329 4409011 4442597 5063959 5615553 4636090
$$ packed form
3959C817942j37826Q36647K095318Q71117q21958k2977J423988K09780k018429
3950F253602j239825J628623J836041j337743l361650j545927J506357K569825
3942F309303J732575K99945j566270l302337k965171M9261L156253L373120R92245
3933H078924r30570l46802J430446J321709j671389m732304m306070o19629K650873
3924H75188L330268K818006K459768J119028j595473k900091q62754J646568Q32757
3915G723265k035854k662383n04196R80059M36247L14816J860965K717032J065588
3906I895539j294428j921443j170094p96355j147197j477986j529314j267189
3898g08467k70499J312936K201723J550636L22682L3586O21362N51594r79463
$$ plain form
3889 4636090 2005565 -220523 227107 3070917 5637416 6233462 6173892 7272900 8503707
3880 8503707 7231770 3336798 -173902 -894335 636251 2663803 4281578 5174942 5239577
3871 5239577 5263680 6298924 7632662 7129685 4366494 1631907 904182 1564149 2003136
3862 2003136 1665337 505852 -1587000 -3554227 -3357339 -1057004 62281 -2615497 -7290450
3853 -7290450 -9758568 -8322301 -5175878 -3594712 -4896195 -7483342 -8166857 -5389131
3845 -5389131 -1486565 -214915 -1774442 -2630036 -964756 670257 -228180 -2049516 -1940557
3836 -1940557 -255575 851652 1357961 2669901 4317998 4549416 3462877 2725884 2762266
3827 2762266 2747464 2710170 3121188 3078113 1462362 -679331 -1420195 -1041537 -1309994 -2256366
$$ packed form
3889D636090k630525k226088M47630K843810K566499N96046n9570J099008J230807
3880H503707j271937l894972l510700p20433J530586K027552J617775Q93364O4635
3871E239577K4103J035244J333738n02977k763191k734587p27725O59967M38987
3862B003136l37799j159485k092852j967227J96888K300335J119285k677778m674953
3853g290450k468118J436267L146423J581166j301483k587147o83515K777726
3845e389131L902566J271650j559527q55594J665280J635013q98437j821336J08959
3836a940557J684982J107227N06309J311940J648097K31418j086539p36993L6382
3827B762266j4802l7294M11018m3075j615751k141693p40864L78658k68457r46372
$$ plain form
3817 -2256366 -2368003 -1615712 -1549249 -2421773 -2681091 -1388890 852192 3021996 3806282
3808 3806282 1597251 -3062882 -6057107 -3898186 1186112 3628971 1614971 -1590467
3800 -1590467 -3057499 -3016853 -2024177 537265 3920961 5520301 4348502 2148093 122171
3791 122171 -2266178 -4332671 -3677675 -244236 2513061 2335239 884227 14003 -1238744
3782 -1238744 -3678680 -5335935 -4639091 -3316589 -3242118 -3113461 -1352319 336259 -212550
3773 -212550 -1555036 -1131395 183516 60251 -406116 1727719 5700028 7618859 6428025
3764 6428025 4955096 4705623 3961187 2078796 1520365 3666033 5963000 5568400 3305639
3755 3305639 1714956 1257430 878689 771964 1953783 3762351 4023771 1659912 -2392944
$$ packed form
3817b256366j11637P52291O6463q72524k59318J292201K241082K169804P84286
3808C806282k209031m660133k994225K158921N084298K442859k014000l205438
3800a590467j467032M0646R92676K561442L383696J599340j171799k200409k025922
3791A22171k388349k066493O54996L433439K757297j77822j451012q70224j252747
3782a238744k439936j657255O96844J322502P4471J28657J761142J688578n48809
3773b12550j342486M23641J314911j23265m66367K133835L972309J918831j190834
3764F428025j472929k49473p44436j882391n58431K145668K296967l94600k262761
3755C305639j590683m57526l78741j06725J181819J808568K61420k363859m052856
$$ plain form
3746 -2392944 -6703649 -10314378 -12132531 -10867198 -6484160 -1221575 1688633 685390
3738 685390 -2730923 -5367024 -5071156 -2016796 2287766 6247259 8285027 7259333 4130409
3729 4130409 2215183 3871710 7193860 7943883 4975981 1797649 2048491 5205719 7871556
3720 7871556 7779746 5086325 974517 -3103064 -5435425 -5370222 -4731474 -6152401 -9419061
3711 -9419061 -10934822 -7832787 -1688045 3013675 3643371 1545438 -424840 -1131290 -1310790
3702 -1310790 -1460166 -866753 1105902 3665353 5197919 4983043 3703155 2166469 55747
3693 55747 -3541481 -8392829 -12390086 -13008264 -9631299 -4341801 -303056 753976 -328678
3684 -328678 -1251453 -485685 1486003 3083653 3591439 3730508 4134839 4101615 2804588
$$ packed form
3746b392944m310705l610729j818153J265333M383038N262585K910208j003243
3738F85390l416313k636101K95868L054360M304562L959493K037768j025694l128924
3729D130409j915226J656527L322150P50023k967902l178332K50842L157228K665837
3720G871556r1810k693421m111808m077581k332361O5203O38748j420927l266660
3711i419061j515761L102035O144742M701720O29696k097933j970278p06450j79500
3702a310790j49376N93413J972655K559451J532566k14876j279888j536686k110722
3693E5747l597228m851348l997257o18178L376965N289498M038745J057032j082654
3684c28678r22775P65768J971688J597650N07786J39069M04331l3224j297027
$$ plain form
3675 2804588 1199536 1153747 2521107 2830201 798220 -1405211 -936565 1810073 3999533
3666 3999533 4436707 4634662 5752425 6696176 6113903 4575242 3588141 3559044 3819435
3657 3819435 3862017 3583103 3007406 2739194 4070834 7522159 11509911 13471971 12425374
3648 12425374 9797194 7633246 6471089 5201182 2775270 -328315 -2602291 -3322984
3640 -3322984 -3232180 -3118618 -2500873 -597562 1849000 2841157 1297993 -1696342 -3727410
3631 -3727410 -2788703 1016934 4673830 4229063 -880613 -6281539 -7241670 -4036678 -641079
3622 -641079 962653 2042377 3058193 2324343 -225597 -1602331 29519 2782582 4711892
3613 4711892 6924960 10404820 12692337 11196099 7641464 5585121 5200779 4390815 3718037
$$ packed form
3675B804588j605052m5789J367360L09094k031981k203431M68646K746638K189460
3666C999533M37174J97955J117763R43751n82273j538661r87101k9097K60391
3657C819435M2582k78914n75697k68212J331640L451325L987752J962060j046597
3648A2425374k628180k163948j162157j269907k425912l103585k273976p20693
3640c322984R0804J13562O17745J903311K446562R92157j543164k994335k031068
3631c727410R38707L805637L656896m44767n109676n400926r60131L204992L395599
3622f41079J603732J079724J015816p33850k549940j376734J631850K753063J929310
3613D711892K213068L479860K287517j496238l554635k056343l84342q09964o72778
$$ plain form
3604 3718037 5728977 9600006 10901985 7677456 3236865 1578632 2796411 4391452
3596 4391452 4898211 4811051 5401279 7435499 9890645 10007096 6363622 1580395 -431293
3587 -431293 254379 4067 -2417388 -3803253 -1667916 1847480 3316974 2660192 2070940
3578 2070940 2378270 2969015 3844051 5317245 6613553 6795887 6270031 5691326 4471649
3569 4471649 2251659 744833 1802453 4207802 4675356 1977833 -1836984 -4386302
3561 -4386302 -5314054 -5443788 -5192576 -4498432 -3357143 -1918361 -572101 7206 -515958
3552 -515958 -1576410 -2376376 -2868036 -3350624 -3432333 -2464057 -1064899 -1183143 -4070725
3543 -4070725 -8618557 -12217972 -13326756 -12934270 -13124979 -14164502 -13796563 -10189639 -4852954
$$ packed form
3604C718037K010940L871029J301979l224529m440591j658233J217779J595041
3596D391452N06759q7160N90228K034220K455146J16451l643474m783227k011688
3587d31293O85672k50312k421455j385865K135337L515396J469494o56782n89252
3578B070940L07330N90745Q75036J473194J296308J82334n25856n78705j219677
3569D471649k219990j506826J057620K405349M67554k697523l814817k549318
3561d386302r27752j29734K51212O94144J141289J438782J346260N79307n23164
3552e15958j060452p99966m91660m82588q1709R68276J399158j18244k887582
3543d070725m547832l599415j108784L92486j90709j039523L67939L606924N336685
$$ plain form
3534 -4852954 -1157194 -201554 33537 1182268 2251207 1881869 929884 1102665 2287736
3525 2287736 2999527 2672870 1858370 725812 -977088 -2689018 -3112040 -1533801 1651971
3516 1651971 5261527 7486140 6754770 3619663 874451 434487 987796 267467 -1368944
3507 -1368944 -1751665 -707635 -583929 -2673907 -5171295 -5425587 -2897560 636970 2746097
3498 2746097 1942689 -1289823 -4782774 -6738119 -7346881 -7569894 -7004651 -4467662 -302614
3489 -302614 3586860 5910368 6701771 6212654 4920118 4335255 5598913 7223416 6536719
3480 6536719 3662542 1628014 1926362 2530059 1332782 -956922 -2808765 -4377211 -6066120
3471 -6066120 -6529451 -4415095 -951629 1204936 931454 -999591 -3394763 -4887845 -3906761
$$ packed form
3534d852954L695760R55640K35091J148731J068939l69338r51985J72781J185071
3525B287736P11791l26657q14500j132558j702900j711930m23022J578239L185772
3516A651971L609556K224613p31370l135107k745212m39964N53309p20329j636411
3507a368944l82721J044030J23706k089978k497388k54292K528027L534530K109127
3498B746097q03408l232512l492951j955345o08762k23013N65243K536989M165048
3489c02614L889474K323508P91403m89117j292536n84863J263658J624503o86697
3480F536719k874177k034528K98348O03697j197277k289704j851843j568446j688909
3471f066120m63331K114356L463466K156565k73482j931045k395172j493082R81084
$$ plain form
3462 -3906761 -383281 3131613 3777858 1451971 -1565379 -3235142 -2877967 -862035 1298698
3453 1298698 1652005 257531 -230465 1774544 3874960 2737575 -1019017 -3592052 -2900460
3444 -2900460 1449 3786952 7938864 10975443 10961676 8702255 7638175 9342202 11355983
3435 11355983 10660260 7289932 3370801 415845 -1240081 -1879728 -2317412 -3119616 -3498069
3426 -3498069 -2594537 -1867441 -3622640 -6658794 -6516121 -1516236 4377064 6637438 5339158
3417 5339158 3064986 708500 -1425311 -952013 3864308 9883744 11721574 8430037
3409 8430037 4134536 2137530 1808918 1531713 1209420 877686 -180177 -1584124 -1411156
3400 -1411156 1188674 4759930 7703561 9714532 10391902 8721882 5154106 2226386
$$ packed form
3462c906761L523480L514894O46245k325887l017350j669763L57175K015932K160733
3453A298698L53307j394474m87996K005009K100416j137385l756592k573035O91592
3444b900460K901909L785503M151912L036579j3767k259421j064080J704027K013781
3435A1355983o95723l370328l919131k954956j655926o39647m37684q02204l78453
3426c498069R03532P27096j755199l036154J42673M999885N893300K260374j298280
3417E339158k274172k356486k133811M73298M816321O019436J837830l291537
3409H430037m295501j997006l28612k77205l22293l31734j057863j403947J72968
3400a411156K599830L571256K943631K010971O77370j670020l567776k927720
$$ plain form
3392 2226386 1733115 2720414 3265796 2670458 1038037 -1425926 -3518840 -3298997 -680716
3383 -680716 1810380 2267042 1830110 2494017 4162837 5553346 6390812 6731674 5570562
3374 5570562 2442689 -634009 -1254603 -90710 6863 -1988085 -4348167 -5480479 -5548218
3365 -5548218 -5061630 -3913714 -2318550 -1017812 3565 1536796 3294523 3409021 677504
3356 677504 -3515901 -6267766 -5745736 -2453250 1535408 4292413 5359350 5618530 5911610
3347 5911610 6161799 6011761 5628917 5379921 5346169 5623383 6237016 6217709 4015944 -105683
3337 -105683 -3299766 -3181769 -704555 1441741 2233172 2365953 1963136 518029 -1344811
3328 -1344811 -2296128 -2374021 -2692606 -3342700 -3612108 -3943403 -5266694 -6466520 -5176021
$$ packed form
3392B226386m93271R87299N45382n95338j632421k463963k092914K19843K618281
3383f80716K491096M56662m36932O63907J668820J390509Q37466L40862j161112
3374E570562l127873l076698o20594J163893R7573j994948k360082j132312o7739
3365e548218M86588J147916J595164J300738J021377J533231J757727J14498k731517
3356F77504m193405k751865N22030L292486L988658K757005J066937K59180K93080
3347E911610K50189j50038l82844k48996l3752K77214O13633j9307k201765m121627
3337a05683l194083J17997K477214K146296P91431J32781m02817j445107j862840
3328a344811r51317p7893l18585o50094k69408l31295j323291j199826J290499
$$ plain form
3319 -5176021 -1541433 1283956 1118667 -941353 -2761692 -3414229 -2525383 102282 3095060
3310 3095060 3996231 2422307 766591 696220 1088183 572405 -260773 -687403 -1543432
3301 -1543432 -3297674 -4550404 -4279525 -3487131 -2819060 -1057465 1661316 1791310 -3130181
3292 -3130181 -9874656 -13020359 -11712727 -9351045 -7784729 -6001714 -4059839 -3787896
3284 -3787896 -4969785 -4904467 -2904434 -1504463 -1700576 -699389 3241941 6948707 6519486
3275 6519486 3312520 2263162 5049702 8105056 7625504 4080226 899227 299590 1568374
3266 1568374 2817274 3327756 3790404 4638305 5079391 4396649 3478955 3772355 4931313
3257 4931313 5050600 3458698 1650851 793468 -38675 -1887155 -3474671 -2471071 1249847
$$ packed form
3319e176021L634588K825389j65289k060020j820339o52537Q88846K627665K992778
3310C095060R01171j573924j655716p0371L91963n15778q33178m26630q56029
3301a543432j754242j252730K70879P92394O68071J761595K718781J29994m921491
3292c130181o744475l145703J307632K361682J566316J783015J941875K71943
3284c787896j181889O5318K000033J399971j96113J001187L941330L706766m29221
3275F519486l206966j049358K786540L055354m79552l545278l180999n99637J268784
3266A568374J248900N10482M62648Q47901M41086o82742r17694K93400J158958
3257D931313J19287j591902j807847q57383q32143j848480j587516J003600L720918
$$ plain form
3248 1249847 5025063 6056975 3860623 387147 -1479184 16195 3894422 7048532
3240 7048532 7295375 5629980 4668830 5305452 6127693 5940767 5286850 5007441 4720216
3231 4720216 3729513 2539013 2289788 3113139 4062527 4438204 4205174 3268654 1479100
3222 1479100 -502724 -1509584 -1522844 -2011231 -3894422 -5994770 -6396621 -4746049 -2352015
3213 -2352015 -590457 -110166 -949024 -2267769 -2537663 -1330453 -377520 -1234591 -2401314
3204 -2401314 -924146 3170697 6540133 7267020 7448148 9691696 13174584 15036134 14119680
3195 14119680 11396286 7885455 4155587 1081936 -778932 -2128954 -3852974 -5659287
3187 -5659287 -7022953 -8444003 -10242664 -11218784 -10348506 -8827454 -8455302 -8945819 -8974541
$$ packed form
3248A249847L775216J031912k196352l473476j866331J495379L878227L154110
3240G048532K46843j665395r61150O36622Q22241j86926o53917k79409k87225
3231D720216r90703j190500k49225Q23351R49388L75677k33030r36520j789554
3222A479100j981824j006860j3260m88387j883191k100348m01851J650572K394034
3213b352015J761558M80291q38858j318745k69894J207210R52933q57071j166723
3204b401314J477168M094843L369436P26887J81128K243548L482888J861550r16454
3195A4119680k723394l510831l729868l073651j860868j350022j724020j806313
3187e659287j363666j421050j798661r76120Q70278J521052L72152m90517k8722
$$ plain form
3178 -8974541 -8860598 -9621910 -10195992 -8640886 -5810841 -4705278 -5999657 -7265946 -6965645
3169 -6965645 -5982663 -4515992 -1032788 4093900 7183695 5839230 2499233 1057164
3161 1057164 2016944 3399702 4435105 5396024 5192510 2477989 -1210590 -2388216 -28570
3152 -28570 3231911 4677776 4283008 3385384 2564399 1870504 1682099 1995206 1697395 -128919
3142 -128919 -2504578 -3363206 -2167977 -678268 -664468 -1822687 -2859684 -3801127 -5586500
3133 -5586500 -7568393 -7488469 -4704597 -1615021 -645514 -1462208 -2639718 -4282582 -6853961
3124 -6853961 -9000001 -9221379 -8489945 -8267580 -7121831 -3000896 1844795 2669455 -673068
3115 -673068 -2945350 -1062507 1957399 2497940 1541037 1588173 2197210 2096293 2669588
$$ packed form
3178h974541J13943p61312n74082J555106K830045J105563j294379j266289L00301
3169f965645R82982J466671L483204N126688L089795j344465l339997j442069
3161A057164R59780J382758J035403R60919k03514k714521l688579j177626K359646
3152b8570L260481J445865l94768q97624q20985o93895j88405L13107k97811j826314
3142a28919k375659q58628J195229J489709J3800j158219j036997r41443j785373
3133e586500j981893P9924K783872L089576R69507q16694j177510j642864k571379
3124f853961k146040k21378P31434K22365J145749M120935M845691Q24660l342523
3115f73068k272282J882843L019906N40541r56903M7136O09037j00917N73295
$$ plain form
3106 2669588 5369995 7824454 6507144 1988284 -1957760 -3399195 -3277674 -2606858 -1934008
3097 -1934008 -2656644 -5590260 -8826667 -9941501 -9521524 -9532461 -9302825 -6768846 -3004035
3088 -3004035 -1456915 -2612764 -3292252 -1796716 -89928 38568 -435453 -249894 64876
3079 64876 -97251 -225765 -332274 -1189108 -1892545 -29176 4298932 7365688 6520100
3070 6520100 3556614 1536251 686115 -210838 -503404 1246265 3917297 4338093 1047922
3061 1047922 -4188690 -8364454 -9417432 -7110317 -3356347 -1348066 -2805141 -5952899
3053 -5952899 -7209391 -4890115 -569095 2944288 4128150 3350946 1768935 -7802
3045 -7802 -2184228 -4736060 -6483928 -5932198 -3092186 225075 2191895 2627677 2842919
$$ packed form
3106B669588K700407K454459j317310m518860l946044j441435J21521O70816O72850
3097a934008p22636k933616l236407j114834M19977j0937K29636K533979L764811
3088c004035J547120j155849o79488J495536J706788J28496m74021J85559L14770
3079F4876j62127j28514j06509q56834p03437J863369M328108L066756q45588
3070F520100k963486k020363q50136q96953k92566J749669K671032M20796l290171
3061A047922n236612m175764j052978K307115L753970K008281j457075l147758
3053e952899j256492K319276M321020L513383J183862p77204j582011j776737
3045g802k176426k551832j747868N51730K840012L317261J966820M35782K15242
$$ plain form
3036 2842919 4178501 6502520 7825941 6030128 1624882 -2051064 -2410826 -528957
3028 -528957 794226 775838 590721 566784 -17791 -695543 -13553 1901834 3396532 3971045
3018 3971045 4331108 3734927 499839 -4148831 -6096212 -3657669 118158 2180663 3568772
3009 3568772 6534958 10208078 11906378 10967132 8679822 5864558 2901178 792600
3001 792600 -188868 -1694351 -4801799 -7515316 -7233967 -4732853 -3098381 -3350652 -3674966
2992 -3674966 -2695296 -1122573 -111673 61459 -395315 -963471 -728724 556839 1733412
2983 1733412 1742035 1050126 257635 -1414115 -4297878 -6224664 -4867829 -1400832 862412
2974 862412 1075247 1373488 2924751 4371777 4652496 4643064 5057044 4970236 3560443 1545851
$$ packed form
3036B842919J335582K324019J323421j795813m405246l675946l59762J881869
3028e28957J323183j8388j85117k3937n84575o77752O81990J915387J494698N74513
3018C971045L60063n96181l235088m648670j947381K438543L775827K062505J388109
3009C568772K966186L673120J698300r39246k287310k815264k963380k108578
3001G92600r81468j505483l107448k713517K81349K501114J634472k52271l24314
2992c674966R79670J572723J010900J73132m56774n68156K34747J285563J176573
2983A733412Q623o91909p92491j671750k883763j926786J356835L466997K263244
2974H62412K12835K98241J551263J447026K80719r432M13980q6808j409793k014592
$$ plain form
2964 1545851 -118131 -1459091 -2538939 -2750525 -2029636 -1582798 -2469228 -4272081 -5752779
2955 -5752779 -6031503 -4812375 -2409651 99403 1656712 2449674 3563732 5351799 7009622
2946 7009622 7652989 6816522 4185081 199069 -3215687 -4080726 -2697747 -1213926 -832130
2937 -832130 -896452 -703331 -427546 47667 1388870 3245649 4019644 3001229 1442524
2928 1442524 809254 1193196 2103374 3527274 5281911 6271702 5379434 2778247 21653
2919 21653 -952840 633447 3062018 3057606 -500483 -4407862 -4472742 -555621 3777409
2910 3777409 6099966 6936768 6975687 5909950 4813271 6180232 9924122 12338318 11065122
2901 11065122 8346184 7028901 6127221 3456910 398770 145572 2261374 2764031 -445533
$$ packed form
2964A545851j663982j340960j079848k11586P20889M46838q86430j802853j480698
2955e752779k78724J219128K402724K509054J557309P92962J114058J788067J657823
2946G009622O43367q36467k631441l986012l414756q65039J382979J483821L81796
2937h32130o4322J93121K75785M75213J341203J856779P73995j018415j558705
2928A442524o33270L83942R10178J423900J754637R89791q92268k601187k756594
2919B1653r74493J586287K428571m412l558089l907379o4880L917121M333030
2910C777409K322557Q36802L8919j065737j096679J366961L743890K414196j273196
2901A1065122k718938j317283r01680k670311l058140k53198K115802N02657l209564
$$ plain form
2892 -445533 -5338155 -9044694 -10504479 -9468905 -5756842 -659744 3061413 4019141 3792824
2883 3792824 4616267 6361440 6702735 3869870 -1131549 -4831411 -4173781 274486 4516756
2874 4516756 5431640 4199758 4197102 6335668 8478720 9079008 8920426 8763931 7619947
2865 7619947 4696238 1477596 310599 1663626 3893595 5219879 5198569 4794950 5546929
2856 5546929 8011836 10599264 10800544 8149907 5015328 3674376 3605986 2855423 1311534
2847 1311534 988738 2989567 5547902 5803271 3031927 -381185 -1148716 1813984 6473276
2838 6473276 9946585 11440413 12237711 12821974 11503532 7068189 1674084 -953824 -161130
2829 -161130 874169 -320727 -2216140 -1996966 38965 1072073 23306 -1331390 -1682339
$$ packed form
2892d45533m892622l706539j459785J035574L712063N097098L721157R57728k26317
2883C792824Q23443J745173L41295k832865n001419l699862O57630M448267M242270
2874D516756R14884j231882k656K138566K143052O00288j58582j56495j143984
2865G619947k923709l218642j166997J353027K229969J326284k1310m03619P51979
2856E546929K464907K587428K01280k650637l134579j340952o8390p50563j543889
2847A311534l22796K000829K558335K55369k771344l413112p67531K962700M659292
2838F473276L473309J493828P97298N84263j318442m435343n394105k627908P92694
2829a61130J035299j194896j895413K19174K035931J033108j048767j354696l50949
$$ plain form
2820 -1682339 -2104507 -3611607 -4923543 -4388381 -2646552 -1396687 -471475 1672919 4921640
2811 4921640 7129175 7020444 5683596 4754959 4643454 4976445 5299452 4801157 2839074
2802 2839074 400827 -483207 331655 286754 -2517766 -6396781 -7958755 -5968816 -1898174
2793 -1898174 2493748 6313087 8604978 8144613 4721224 -227730 -4553227 -6623147
2785 -6623147 -6060973 -4046868 -2531577 -2298626 -2082952 -362986 2435738 4459859 4705821
2776 4705821 3709709 2329677 1026132 138111 -331361 -1120226 -2769887 -4420980 -4773020
2767 -4773020 -4124875 -4025385 -4801753 -4984481 -3595509 -1517426 67584 1213298 2294321
2758 2294321 2782989 2114732 986384 680897 1551299 2943107 4047917 4129429 2664064
$$ packed form
2820a682339m22168j507100j311936N35162J741829J249865R25212K144394L248721
2811D921640K207535j08731j336848r28637j11505L32991L23007m98295j962083
2802B839074k438247q84034Q14862m4901k804520l879015j561974J989939M070642
2793a898174M391922L819339K291891m60365l423389m948954m325497k069920
2785f623147N62174K014105J515291K32951K15674J719966K798724K024121K45962
2776D705821r96112j380032j303545q88021m69472p88865j649661j651093l52040
2767d773020O48145R9490p76368j82728J388972K078083J585010J145714J081023
2758B294321M88668o68257j128348l05487Q70402J391808J104810Q1512j465365
$$ plain form
2749 2664064 166495 -1846864 -2704755 -3564145 -5311094 -6476823 -5229518 -2874352 -2749862
2740 -2749862 -5305828 -7089242 -5937373 -4427330 -5646288 -7658381 -5854648 -116842
2732 -116842 4334637 3978055 1308494 490592 1879568 3348363 4371371 5404914 5001221
2723 5001221 1525115 -2846876 -3818738 -1077818 905496 -760086 -3491831 -3327436 -129999
2714 -129999 3278825 4893019 4294817 1592211 -2072116 -4313783 -3931407 -2436529 -1448363
2705 -1448363 -117370 2684991 5135385 4260960 308999 -3251638 -3819138 -1682321 1467615
2696 1467615 3809508 3692801 1054260 -1718717 -2500592 -2491529 -4148865 -6689401 -6731615
2687 -6731615 -3358135 687178 3235013 4812932 5722690 4503687 1069216 -1580739
$$ packed form
2749B664064k497569k013359q57891q59390j746949j165729J247305K355166J24490
2740b749862k555966j783414J151869J510043j218958k012093J803733N737806
2732a16842M451479l56582k669561q17902J388976J468795J023008J033543m03693
2723E001221l476106m371991r71862K740920J983314j665582k731745J64395L197437
2714a29999L408824J614194n98202k702606l664327k241667L82376J494878R88166
2705a448363J330993K802361K450394q74425l951961l560637n67500K136817L149936
2696A467615K341893j16707k638541k772977p81875R063j657336k540536m2214
2687f731615L373480M045313K547835J577919R09758j219003l434471k649955
$$ plain form
2679 -1580739 -1072013 1024401 1702586 571727 -659844 -1172527 -1318834 -1004127 228455
2670 228455 2158846 4306696 6483859 7862738 7000425 4294490 2729479 4006309 5247256
2661 5247256 2195236 -4889160 -11123641 -12809598 -11015785 -8947966 -7911083 -7061440
2653 -7061440 -5815985 -4930477 -5186784 -5871723 -5249957 -2730090 38678 1047692 504734
2644 504734 236909 721923 591682 -563316 -1144420 -438409 -430288 -2933698 -6582338 -8705017
2634 -8705017 -8870533 -8479229 -8036306 -7181688 -6537189 -7017605 -7765774 -7127407 -5374985
2625 -5374985 -4193967 -3768244 -2842728 -1623121 -1983129 -4336067 -6681485 -7462772 -7265675
2616 -7265675 -6910590 -5848822 -3435463 -188945 3048763 5779505 7159069 6338060 4145871
$$ packed form
2679a580739N08726K096414O78185j130859j231571n12683j46307L14707J232582
2670B28455J930391K147850K177163J378879q62313k705935j565011J276830J240947
2661E247256l052020p084396o234481j685957J793813K067819J036883Q49643
2653g061440J245455Q85508k56307o84939O21766K519867K768768J009014n42958
2644E04734k67825M85014j30241j154998n81104P06011Q121k503410l648640k122679
2634h705017j65516L91304M42923Q54618O44499m80416p48169O38367J752422
2625e374985J181018M25723R25516J219607l60008k352938k345418p81287J97097
2616g265675L55085J061768K413359L246518L237708K730742J379564q21009k192189
$$ plain form
2607 4145871 2706221 2644806 2448449 1330450 618077 1076913 991084 -1245657 -4279285
2598 -4279285 -5614867 -5107827 -4514500 -4341747 -3314281 -777273 2167345 3983424 3894715
2589 3894715 2012495 -422897 -1324331 96043 1608849 191497 -3764662 -6279203
2581 -6279203 -4589466 -531823 2153402 2657820 3374925 5702409 7680431 6740913 3456408
2572 3456408 969327 1027211 2135675 2014901 536241 -735772 -1012425 -1033278 -1707131
2563 -1707131 -3145351 -4976143 -6658794 -7462680 -6919588 -5276031 -2924603 141662 3391454
2554 3391454 4956587 3379552 -2533 -2088703 -1577783 12307 863347 451784 -1575026
2545 -1575026 -5628710 -10202703 -11983818 -9721592 -6270229 -4900561 -5076640 -3981124
$$ packed form
2607D145871j439650o1415j96357j117999p12373M58836q5829k236741l033628
2598d279285j335582N07040N93327J72753J027466K537008K944618J816079q8709
2589C894715j882220k435392r01434J420374J512806j417352l956159k514541
2581f279203J689737M057643K685225N04418P17105K327484J978022r39518l284505
2572C456408k487081N7884J108464j20774j478660j272013k76653k0853o73853
2563a707131j438220j830792j682651q03886N43092J643557K351428L066265L249792
2554C391454J565133j577035l382085k086170N10920J590090Q51040m11563k026810
2545a575026m053684m573993j781115K262226L451363J369668j76079J095516
$$ plain form
2537 -3981124 -898638 2451989 5122273 7645698 9626515 9412043 6986844 5021500
2529 5021500 5749221 8099657 9027922 6814083 2225159 -2773929 -6523278 -8311664 -8368607
2520 -8368607 -7378412 -5968825 -4833056 -5023244 -7273207 -10762603 -13189288 -12657766 -9531627
2511 -9531627 -6295317 -5414591 -6976705 -8392473 -6961217 -2909805 811697 2030853
2503 2030853 1629113 1672245 2471399 2810036 2233362 1446657 775355 -130843 -1023501 -939904
2493 -939904 359902 1933580 2808120 2696138 1680353 224467 -710599 -755051 -1080478
2484 -1080478 -2909276 -5416310 -6803312 -7152902 -8019146 -9130291 -8165233 -4654152 -1471698
2475 -1471698 -883576 -1372265 -409829 1525434 2160472 1256365 430799 -167697 -2118330
$$ packed form
2537c981124L082486L350627K670284K523425J980817k14472k425199j965344
2529E021500P27721K350436R28265k213839m588924m999088l749349j788386n6943
2520h368607R90195J409587J135769j90188k249963l489396k426685N31522L126139
2511i531627L236310Q80726j562114j415768J431256M051412L721502J219156
2503B030853m01740M3132P99154L38637n76674p86705o71302r06198q92658Q3597
2493i39904J299806J573678Q74540j11982j015785j455886r35066m4452l25427
2484a080478j828798k507034j387002l49590q66244j111145R65058L511081L182454
2475a471698N88122m88689R62436J935263O35038r04107q25566n98496j950633
$$ plain form
2466 -2118330 -5477543 -7773225 -7050362 -4143714 -1098189 1260728 3338911 5471258
2458 5471258 7476183 8828749 8748887 6794152 3752752 1195320 -252309 -1384418 -2723734
2449 -2723734 -3300712 -1969414 684152 2751776 3149324 2567609 2307741 2872257 3876927
2440 3876927 4747180 5028659 4266966 2193014 -675136 -2864220 -2854786 -408104 3049166
2431 3049166 5386011 5117214 2156340 -2170505 -5761282 -6985752 -5770722 -3348347
2423 -3348347 -947393 818201 1361236 11175 -2841391 -5329230 -5884324 -5061013 -4673886
2414 -4673886 -5443286 -6461621 -6686733 -5801189 -3774078 -1008002 907954 193975 -2637968
2405 -2637968 -4683589 -4099951 -2459067 -2222392 -2887049 -1750266 1694009 4466847 4067328
$$ packed form
2466b118330l359213k295682P22863K906648L045525K358917K078183K132347
2458E471258K004925J352566p9862j954735l041400k557432j447629j132109j339316
2449b723734n76978J331298K653566K067624L97548n81715k59868N64516J004670
2440C876927Q70253K81479p61693k073952k868150k189084R434K446682L457270
2431C049166K336845k68797k960874m326845l590777j224470J215030K422375
2423c348347K400954J765594N43035j350061k852566k487839n55094Q23311L87127
2414d673886p69400j018335k25112Q85544K027111K766076J915956p13979k831943
2405b637968k045621N83638J640884K36675o64657J136783L444275K772838l99519
$$ plain form
2396 4067328 1823365 759357 1488299 2313693 2739825 4228418 6844468 7568742 3814653
2387 3814653 -2637336 -7250028 -7820009 -6144604 -4760246 -3966601 -2619966 -325991 1997192
2378 1997192 2777769 634075 -4179154 -8746474 -9544397 -6423300 -2951378 -1635054 -632456
2369 -632456 2839965 7423132 8761046 5204787 -409121 -4842169 -7686441 -9765535
2361 -9765535 -10715118 -9722397 -7308338 -4965355 -3657660 -3326518 -3057098 -1399321 2232145
2352 2232145 5964094 6683512 3662760 -303386 -2185566 -1778450 -608629 508179 1329371
2343 1329371 1118798 -246259 -1008858 498671 2995973 3366100 691697 -2462630 -3030650
2334 -3030650 -447006 3376112 5824025 5290648 2378842 -427497 -1290868 -1126063 -2045111
$$ packed form
2396D067328k243963j064008P28942Q25394M26132J488593K616050P24274l754089
2387C814653o451989m612692n69981J675405J384358P93645J346635K293975K323183
2378A997192P80577k143694m813229m567320p97923L121097L471922J316324J002598
2369f32456L472421M583167J337914l556259n613908m433048k844272k079094
2361i765535r49583R92721K414059K342983J307695L31142K69420J657777L631466
2352B232145L731949P19418l020752l966146j882180M07116J169821J116808Q21192
2343A329371k10573j365057p62599J507529K497302L70127k674403l154327n68020
2334c030650K583644L823118K447913n33377k911806k806339q63371J64805r19048
$$ plain form
2325 -2045111 -3980599 -4515503 -2264794 1258727 3746601 4596849 4546779 4138784 3630505
2316 3630505 3545345 4222109 5199363 5678442 5243311 3910349 2194566 1312937 2197266
2307 2197266 3776314 3476503 401685 -3014873 -3781103 -2083248 -920945 -2353996 -5413394
2298 -5413394 -7724883 -8022872 -6717720 -4799782 -2717037 -135289 3301100 6910011
2290 6910011 9068857 8892400 7562116 7249376 8598723 9865019 8931938 5965430 3596186
2281 3596186 4149434 6849114 8462807 7074391 4325299 2876191 2540172 1003662 -1748449
2272 -1748449 -2524470 270894 3419280 2867806 -740014 -3415815 -3769189 -4233205 -6264828
2263 -6264828 -7772753 -6646942 -4086636 -2462825 -1856086 -880875 431126 837938 228435
$$ packed form
2325b045111j935488n34904K250709L523521K487874Q50248n0070m07995n08279
2316C630505q5160O76764R77254M79079m35131j332962j715783q81629Q84329
2307B197266J579048k99811l074818l416558p66230J697855J162303j433051l059398
2298e413394k311489k97989J305152J917938K082745K581748L436389L608911
2290F910011K158846j76457j330284l12740J349347J266296r33081k966508k369244
2281C596186N53248K699680J613693j388416k749092j449108l36019j536510k752111
2272a748449p76021K795364L148386n51474l607820k675801l53374m64016k031623
2263f264828j507925J125811K560306J623811O06739R75211J312001M06812o09503
$$ plain form
2254 228435 -288230 -245522 -9030 526347 1611117 2226614 962695 -1476939 -2466656
2245 -2466656 -671151 2447401 4781166 5647240 5158251 3383120 1310197 1054239 3455205
$$ packed form
2254B28435n16665M2708K36492N35377J084770O15497j263919k439634r89717
2245b466656J795505L118552K333765Q66074m88989j775131k072923k55958K400966
$$ [...]
##END NTUPLES=NMR SPECTRUM
##END=
