##TITLE=31Pdec_DE-93K_TFA
 CDCl3, 64 sc
 5.5.2025
##JCAMPDX= 6.0         $$ Bruker NMR JCAMP-DX V2.0
##DATA TYPE= NMR SPECTRUM
##DATA CLASS= NTUPLES
##ORIGIN= UXNMR, Bruker Analytische Messtechnik GmbH
##OWNER= root
$$ XWIN-NMR		Version 3.5
$$ Mon May  5 14:42:00 2025 Russian Standard Time (UT+4h)  she@DPX200
##.OBSERVE FREQUENCY= 81.013821
##.OBSERVE NUCLEUS= ^31P
##.ACQUISITION MODE= SIMULTANEOUS
##.ACQUISITION SCHEME= undefined
##.AVERAGES= 64
##.DIGITISER RES= 17
##SPECTROMETER/DATA SYSTEM= spect
##.PULSE SEQUENCE= zgpg30
##.SOLVENT NAME= D2O
##.SHIFT REFERENCE= (INTERNAL, D2O, 0, 198.062)
##AUDIT TRAIL= $$ (NUMBER, WHEN, WHO, WHERE, WHAT)
$$ ##TITLE= Audit trail, XWIN-NMR		Version 3.5
$$ ##JCAMPDX= 5.01
$$ ##ORIGIN= Bruker BioSpin GmbH
$$ ##OWNER= she
$$ F:/spectra/data/she/nmr/P31/2/pdata/1/auditp.txt
$$ ##AUDIT TRAIL=  $$ (NUMBER, WHEN, WHO, WHERE, WHAT)
(   1,<2025-05-05 14:40:57.51 +0400>,<she>,<DPX200>,
      <created by zg, POWCHK disabled, PULCHK disabled
       configuration hash MD5:
       00 E9 B6 7A A2 85 ED C7 34 08 36 98 17 FE 4E 26
       data hash MD5: 32K
       DF CF 14 ED 7D 2B EF 78 E0 93 EA DA A1 5F E6 D5>)
(   2,<2025-05-05 14:40:59.82 +0400>,<she>,<DPX200>,
      <Start of raw data processing
       efp BC_mod = 2 LB = 1.5 FT_mod = 6 PKNL = 1 PHC0 = 1857.826 PHC1 = -1061.907 SI = 64K 
       data hash MD5: 64K
       D4 29 1A 1B 5E B0 9F A9 8F 30 53 48 2F 96 EB 19>)
(   3,<2025-05-05 14:41:15.98 +0400>,<she>,<DPX200>,
      <pk PHC0 = -82.36639 PHC1 = 0 
       data hash MD5: 64K
       DD 08 F3 DB 48 32 CD B8 83 EA 19 55 F4 62 22 08>)
(   4,<2025-05-05 14:41:19.95 +0400>,<she>,<DPX200>,
      <abs ABSG = 5 
       data hash MD5: 64K
       65 59 DD 7F C4 AB 48 B0 72 22 DD 25 87 72 7F EA>)
$$ ##END=
$$ 
$$ hash MD5
$$ C7 D2 82 68 DA AE C2 BC 5B EE E3 B0 9A 82 23 23
##$RELAX= 
##$RELAX= 
##$RELAX= 
##$RELAX= 
##$RELAX= 
##$RELAX= 
##$RELAX= 
##$RELAX= 
$$ Bruker specific parameters
$$ --------------------------
##$DU= <F:/spectra>
##$EXPNO= 2
##$NAME= <P31>
##$PROCNO= 1
##$TYPE= <nmr>
##$USER= <she>
##$AMP= (0..31)
100 100 100 100 100 100 100 100 100 100 100 100 100 100 100 100 100 100 
100 100 100 100 100 100 100 100 100 100 100 100 100 100 
##$AQSEQ= 0
##$AQ_mod= 1
##$AUNM= <au_zg>
##$AUTOPOS= <>
##$BF1= 81.014009
##$BF2= 200.13
##$BF3= 200.13
##$BF4= 200.13
##$BF5= 200.13
##$BF6= 200.13
##$BF7= 200.13
##$BF8= 200.13
##$BYTORDA= 1
##$CFDGTYP= 0
##$CFRGTYP= 5
##$CHEMSTR= <none>
##$CNST= (0..31)
1 1 145 1 1 1 1 1 1 1 1 1 1 1 1 1 1 1 1 1 1 1 1 1 1 1 1 1 1 1 1 1 
##$CPDPRG= <waltz16>
##$CPDPRG1= <>
##$CPDPRG2= <waltz16>
##$CPDPRG3= <>
##$CPDPRG4= <mlev>
##$CPDPRG5= <mlev>
##$CPDPRG6= <mlev>
##$CPDPRG7= <mlev>
##$CPDPRG8= <mlev>
##$CPDPRGB= <>
##$CPDPRGT= <>
##$D= (0..31)
0 1 0 0 0 0 0 0 0 0.06 0 0.03 2e-05 3e-06 0 0 0.0002 0 0 0 0 0 0 0 0 0 
0 0 0 0 0 0 
##$DATE= 1746441656
##$DBL= (0..7)
120 120 120 11 120 120 24 19 
##$DBP= (0..7)
150 150 150 150 150 150 150 150 
##$DBP07= 0
##$DBPNAM0= <>
##$DBPNAM1= <>
##$DBPNAM2= <>
$$ [...]
##$SUBNAM3= <"">
##$SUBNAM4= <"">
##$SUBNAM5= <"">
##$SUBNAM6= <"">
##$SUBNAM7= <"">
##$SUBNAM8= <"">
##$SUBNAM9= <"">
##$SW= 400.765351723535
##$SWIBOX= (0..15)
0 1 3 0 0 0 0 0 0 0 0 0 0 0 0 0 
##$SW_h= 32467.5324675325
##$TD= 32768
##$TD0= 1
##$TE= 0
##$TE2= 300
##$TE3= 300
##$TEG= 300
##$TL= (0..7)
0 120 53 12 22 120 120 120 
##$TP= (0..7)
150 150 150 150 150 150 150 150 
##$TP07= 0
##$TPNAME0= <>
##$TPNAME1= <>
##$TPNAME2= <>
##$TPNAME3= <>
##$TPNAME4= <>
##$TPNAME5= <>
##$TPNAME6= <>
##$TPNAME7= <>
##$TPOAL= (0..7)
0.5 0.5 0.5 0.5 0.5 0.5 0.5 0.5 
##$TPOFFS= (0..7)
0 0 0 0 0 0 0 0 
##$TUNHIN= 0
##$TUNHOUT= 0
##$TUNXOUT= 0
##$USERA1= <user>
##$USERA2= <user>
##$USERA3= <user>
##$USERA4= <user>
##$USERA5= <user>
##$V9= 5
##$VALIST= <valist>
##$VCLIST= <CCCCCCCCCCCCCCC>
##$VD= 0
##$VDLIST= <DDDDDDDDDDDDDDD>
##$VPLIST= <PPPPPPPPPPPPPPP>
##$VTLIST= <TTTTTTTTTTTTTTT>
##$WBST= 1024
##$WBSW= 4
##$XGAIN= (0..3)
0 0 0 0 
##$XL= 0
##$YL= 0
##$YMAX_a= 6935
##$YMIN_a= -25519
##$ZGOPTNS= <>
##$ZL1= 120
##$ZL2= 120
##$ZL3= 120
##$ZL4= 120
##$ABSF1= 198.0616
##$ABSF2= -202.7028
##$ABSG= 5
##$ABSL= 3
##$ALPHA= 0
##$AQORDER= 0
##$ASSFAC= 0
##$ASSFACI= 0
##$ASSFACX= 0
##$ASSWID= 0
##$AUNMP= <proc_1d>
##$AZFE= 0.1
##$AZFW= 0.5
##$BCFW= 0
##$BC_mod= 2
##$BYTORDP= 0
##$COROFFS= 0
##$CY= -3
##$DATMOD= 1
##$DC= 0
##$DFILT= <>
##$DTYPP= 0
##$F1P= 0
##$F2P= 0
##$FCOR= 1
##$FTSIZE= 65536
##$FT_mod= 6
##$GAMMA= 0
##$GB= 0
##$INTBC= 1
##$INTSCL= 9.790993e-09
##$ISEN= 30
##$LB= 1.5
##$LEV0= 0
##$LPBIN= 0
##$MAXI= 10000
##$MC2= 0
##$MEAN= 0
##$ME_mod= 0
##$MI= 50
##$NCOEF= 0
##$NC_proc= -8
##$NLEV= 6
##$NOISF1= 182.463
##$NOISF2= 159.3651
##$NSP= 0
##$NTH_PI= 0
##$NZP= 0
##$OFFSET= 198.0616
##$PC= 4
##$PHC0= 1775.46
##$PHC1= -1061.907
##$PH_mod= 1
##$PKNL= yes
##$PPARMOD= 0
##$PSCAL= 0
##$PSIGN= 0
##$REVERSE= no
##$SF= 81.0140089999434
##$SI= 65536
##$SIGF1= 159.3651
##$SIGF2= -187.1042
##$SINO= 113.3802
##$SIOLD= 16384
##$SREGLST= <1H.CDCl3>
##$SSB= 0
##$STSI= 65536
##$STSR= 0
##$SW_p= 32467.5324675325
##$SYMM= 0
##$S_DEV= 0
##$TDeff= 32768
##$TDoff= 0
##$TI= <>
##$TILT= no
##$TM1= 0
##$TM2= 0
##$TOPLEV= 0
##$USERP1= <user>
##$USERP2= <user>
##$USERP3= <user>
##$USERP4= <user>
##$USERP5= <user>
##$WDW= 1
##$XDIM= 65536
##$YMAX_p= 190252986
##$YMIN_p= -190744823
$$ End of Bruker specific parameters
$$ ---------------------------------
##NTUPLES= NMR SPECTRUM
##VAR_NAME=  FREQUENCY,     SPECTRUM/REAL,   SPECTRUM/IMAG
##SYMBOL=    X,             R,               I
##VAR_TYPE=  INDEPENDENT,   DEPENDENT,       DEPENDENT
##VAR_FORM=  AFFN,          ASDF,            ASDF
##VAR_DIM=   65536,         65536,           65536
##UNITS=     HZ,            ARBITRARY UNITS, ARBITRARY UNITS
##FACTOR=    0.49542278885378, 1,            1
##FIRST=     16045.7642231865, 0,            0
##LAST=      -16421.768244346, 0,            0
##MIN=       -16421.768244346, -190744823,   0
##MAX=       16045.7642231865, 190252986,    0
$$ Real data points
##PAGE= N=1
##DATA TABLE= (X++(R..R)), XYDATA
$$ [...]
##PAGE= N=2
##DATA TABLE= (X++(I..I)), XYDATA
7437A420858o95169j999283k236763l93972J709373J533983k92288j047116l12368
$$ 1420858 725689 -1273594 -3510357 -3904329 -2194956 -660973 -953261 -2000377 -2312745
7428b312745k47413j530532k146800q80764P11159Q93431Q5015n65211r66362
$$ -2312745 -2560158 -4090690 -6237490 -7118254 -6407095 -5513664 -5428649 -5993860 -6960222
7419f960222j143060k82237J693902L002234K184796M33079k5100Q47966J173745
$$ -6960222 -8103282 -8385519 -6691617 -3689383 -1504587 -1071508 -1096608 -248642 925103
7410I25103L41518j28537P33217J664587J166949j96729q48029o46387p16430
$$ 925103 1266621 1138084 1871301 3535888 4702837 4506108 3658079 3011692 2295262
7401B295262j213327j008860J50645Q18096o3561j606671k506984k823362k872179
$$ 2295262 1081935 73075 223720 1041816 978255 -628416 -3135400 -5958762 -8830941
7392h830941j629656J664140M996539N210189K330536j13563J80306J449072R32867
$$ -8830941 -10460597 -8796457 -3799918 1410271 3740807 3627244 3807550 5256622 6189489
7383F189489j249870l032847l672466m007298m278674l707351k052248p1193J528375
$$ 6189489 4939619 1906772 -1765694 -5772992 -10051666 -13759017 -15811265 -15882458 -14354083
7374a4354083K507491K684611K090038J273415O74284J45591k40818K13001J533951
$$ -14354083 -11846592 -9161981 -7071943 -5798528 -5124244 -4978653 -5219471 -5006470 -3472519
7365c472519K425086K050510J311716J025182L09706j353472k100875m35136J338479
$$ -3472519 -1047433 1003077 2314793 3339975 3649681 2296209 195334 -239802 1098677
7356A098677q8491l431564m043289j011763J269656j2258j852975o05044K243522
$$ 1098677 1010186 -2421378 -6464667 -7476430 -6206774 -6219032 -8072007 -8677051 -6433529
7347f433529K941809J454128N79498P53448n7959j849032k044555N8090J802685
$$ -6433529 -3491720 -2037592 -1458094 -704646 -762605 -2611637 -4656192 -4598102 -2795417
7338b795417J195596m18402j011516q01352r38031j189722p42642J9539K71919
$$ -2795417 -1599821 -2018223 -3029739 -3831091 -4769122 -5958844 -6701486 -6681947 -6410028
7329f410028L40960Q96375J266766L17256j282985j449735L85820K265952K334035
$$ -6410028 -6069068 -5172693 -3905927 -3588671 -4871656 -6321391 -5935571 -3669619 -1335584
7320a335584J242539P87956R45272p0427k669501m492070l261817k425K172166
$$ -1335584 -93045 694911 1640183 1569756 -1099745 -5591815 -8853632 -8856057 -6683891
7311f683891K092429J573366K191930K905765J928859m46361k318611k568917
$$ -6683891 -4591462 -3018096 -826166 2079599 4008458 3562097 1243486 -1325431
7303a325431j463282K89417J622156J086910j383927l192971j711447J813765
$$ -1325431 -2788713 -2499296 -877140 209770 -1174157 -4367128 -6078575 -4264810
7295d264810L248527R79576j890304j820612P12625K656573K665155J808359Q64132
$$ -4264810 -1016283 -36707 -1927011 -3747623 -3034998 -378425 2286730 4095089 4959221
7286D959221p11303k873091l917164k333013J009524L344397K705890j2889j827571
$$ 4959221 4247918 1374827 -2542337 -4875350 -3865826 -521429 2184461 2171572 344001
7277C44001p89160J734926K603140Q21777j207949r88288Q26757J814621J359261
$$ 344001 -445159 1289767 3892907 4714684 3506735 2518447 3345204 5159825 6519086
7268F519086Q42129O65741m89979k792433l822312j620118K082986L471597J073790
$$ 6519086 7361215 8026956 7536977 4744544 922232 -697886 1385100 4856697 5930487
7259E930487k818500m948370m041874j070481J984514L222392J910795o69449
$$ 5930487 3111987 -1836383 -5878257 -6948738 -4964224 -1741832 168963 -500486
7251e00486k110451j315645L47753Q01564l78886j919607k566547k014753n47434
$$ -500486 -2610937 -3926582 -3578829 -2777265 -3156151 -5075758 -7642305 -9657058 -10204492
7242a0204492J228509K378977K307164J484964P65176P6114j221059k747879l182047
$$ -10204492 -8975983 -6597006 -4289842 -2804878 -2039702 -1963588 -3184647 -5932526 -9114573
7233i114573k179266q56077J30296J428445L031877L195119R75685j463908j276379
$$ -9114573 -11293839 -12149916 -12019620 -10591175 -7559298 -4364179 -3388494 -4852402 -6128781
7224f128781J039780K348525J411809K70214O79167J551742J099699l36350j129232
$$ -6128781 -5089001 -2740476 -1328667 -1058453 -379286 1172456 2272155 1935805 806573
7215H06573q85116o56774j212304k156575k472498j425940N88278J960926J510556
$$ 806573 -78543 -735317 -1947621 -4104196 -6576694 -8002634 -7414356 -5453430 -3942874
7206c942874K25978J0715O42137N831k101391k924168r07526J616284K076781
$$ -3942874 -3716896 -3706181 -3064044 -3058213 -5159604 -8083772 -8991298 -7375014 -5298233
7197e298233J649595K588612L510320J311178l000405m666059j855197J808263
$$ -5298233 -3648638 -1060026 2450294 3761472 761067 -3904992 -5760189 -3951926
7189c951926K521855P71091r31060j614781j219358P42642L398086L732280M50527
$$ -3951926 -1430071 -658980 -1590040 -3204821 -4424179 -3681537 -283451 3448829 3899356
7180C899356l093667k814740M38238K170149M96646k020131k708554j861040q08712
$$ 3899356 805689 -2009051 -1570813 599336 1095982 -924149 -3632703 -5493743 -6302455
7171f302455L09507J455159J387383p36215l414728l998405j658721J650016L193351
$$ -6302455 -5992948 -4537789 -3150406 -3886621 -7301349 -11299754 -12958475 -11308459 -8115108
7162h115108K155806L94781L42445J985089K630286M42158k618466k900024J83808
$$ -8115108 -5959302 -5564521 -5222076 -3236987 -606701 -164543 -2783009 -5683033 -5499225
7153e499225L245522L071926J35942k643734l325507k257035q85861j87130K8939
$$ -5499225 -2253703 818223 954165 -1689569 -5015076 -7272111 -8157972 -8345102 -8316163
7144h316163N88349J529108J630578K33457j089357l59576J543191J648600o73235
$$ -8316163 -7727814 -6198706 -4568128 -4334671 -5424028 -5783604 -4240413 -2591813 -3265048
7135c265048k462738j470709O19527J073100K43701M56332K023926K920929J900302
$$ -3265048 -5727786 -7198495 -6578968 -5505868 -5262167 -4805835 -2781909 139020 2039322
7126B039322k28006k105931k792346j771238P7497K40821k334838m546472k482604
$$ 2039322 1811316 -294615 -3086961 -4858199 -4780702 -4539881 -6874719 -11421191 -13903795
7117a3903795K647607N320060L124927j13080k31293J634962J948397N31447j23050
$$ -13903795 -11256188 -5936128 -2811201 -2924281 -3155574 -1520612 427785 959232 836182
7108H36182L26943j39453j660747j756870M36771K306644J576911l58414p54179
$$ 836182 1163125 1023672 -637075 -2393945 -1957174 349470 1926381 1567967 813788
7099H13788M29627Q36675o75834k668868l363213k729673j845729j191412m25132
$$ 813788 1243415 2080090 1404256 -1264612 -4627825 -7357498 -9203227 -10394639 -10819771
7090a0819771N19708R84295M87157m36933q06947l93765K02304N53907P55157
$$ -10819771 -10300063 -9315768 -8828611 -9265544 -10072491 -10466256 -10263952 -9710045 -8954888
7081h954888O92832j30305j595006k542582j959565o7662K156342L836832M225554
$$ -8954888 -8262056 -8392361 -9987367 -12529949 -14489514 -14557176 -12400834 -8564002 -4338448
7072d338448K967692J039531K19424O53690L00828j856507l589196k466043K04657
$$ -4338448 -1370756 -331225 -111801 541889 842717 -1013790 -4602986 -7069029 -6864372
7063f864372J181089J95135j20669J028702J491598L92151j41445J086786J972325
$$ -6864372 -5683283 -5488148 -5608817 -4580115 -3088517 -2696366 -2837811 -1751025 221300
7054B21300P12087j115794j436983j011257j201767r21190R86780K503182J331856
$$ 221300 933387 -182407 -1619390 -2630647 -3832414 -4753604 -3766824 -1263642 68214
7045F8214o10417K12469K882381L062856j00245k718388k395247j234273j300335
$$ 68214 -542203 -329734 2552647 5615503 5515258 2796870 401623 -832650 -2132985
7036b132985j358467k10851N11819n22578j638800j294248r77020j996409k225739
$$ -2132985 -3491452 -3702303 -3190484 -3713062 -5351862 -6646110 -7623130 -9619539 -11845278
7027a1845278L68627L341908L052949O33441J63881J794771J539361j831435m407948
$$ -11845278 -11476651 -8134743 -5081794 -4448353 -4284472 -2489701 -950340 -2781775 -7189723
7018g189723l066170K08758J975737K018160J838130J110453j217449l713898
$$ -7189723 -10255893 -10047135 -8071398 -6053238 -4215108 -3104655 -4322104 -8036002
7010h036002l487201k63378K876993L197679J183105p47759j262863j072380j263216
$$ -8036002 -11523203 -11786581 -8909588 -5711909 -4528804 -5276563 -6539426 -7611806 -8875022
7001h875022j514501o06055J381781K481300J376507l24527L2416K291708L419158
$$ -8875022 -10389523 -10995578 -9613797 -7132497 -5755990 -6080517 -6048101 -3756393 -337235
6992c37235J634454j191528k063310l20046K281983L623022K507138p37298l895190
$$ -337235 1297219 105691 -1957619 -2277665 4318 3627340 6134478 5397180 1501990
6983A501990m324724j889414O52610J143549N42112P29471J366423Q31194q12753
$$ 1501990 -2822734 -4712148 -4059538 -2915989 -2373877 -1644406 -277983 553211 -259542
6974b59542j935836j864285j265230l61505J181177K589464K199217k07389k782257
$$ -259542 -2195378 -4059663 -5324893 -5686398 -4505221 -1915757 283460 76071 -2706186
6965b706186l749554k966647j208207P26091J885213J509158P0986r64579p86549
$$ -2706186 -6455740 -9422387 -10630594 -9904503 -8019290 -6510132 -6439146 -7403725 -8190274
6956h190274J15345R13575J074099K37434j203856j577409L38370K982527L352266
$$ -8190274 -8074929 -7161354 -6087255 -5849821 -7053677 -8631086 -8292716 -5310189 -1957923
6947a957923J115608p02757j8638J495677J364341P1520k75693L97374L84890
$$ -1957923 -842315 -1545072 -1563710 -68033 1296308 1367828 1092135 1489509 1874399
6938A874399n90664j088632q78696j550214l415344m075040j586949K462123M812116
$$ 1874399 1283735 195103 -683593 -2233807 -5649151 -9724191 -11311140 -8849017 -4036901
6929d036901M538681L310407K083308j36982l539301n613907l929008J38934K620803
$$ -4036901 501780 3812187 5895495 5758513 2219212 -3394695 -7323703 -7184769 -4563966
6920d563966J888095L04461L56915J232507P31614j038748k016975j414735m15608
$$ -4563966 -2675871 -2371410 -2014495 -781988 -50374 -1089122 -3106097 -4520832 -4936440
6911d936440O5510K37622N8289q80127j772321j012170J166372K450208J698399
$$ -4936440 -4870930 -4633308 -4575019 -5455146 -7227467 -8239637 -7073265 -4623057 -2924658
6902b924658M58186J65156o8275j260688k114763r98125R84003J376328J02803
$$ -2924658 -2466472 -2301316 -2369591 -3630279 -5745042 -6743167 -5759164 -4382836 -4280033
6893d280033o40053L8285O47140Q9398o64798m74254J00619n6581o73725m90209
$$ -4280033 -4920086 -4881801 -4234661 -4145263 -4810061 -5284315 -5183696 -5240277 -5914002 -6404211
6883f404211P85532J869462J438539j53095j164780o20256L97689L53133l30365
$$ -6404211 -5618679 -3749217 -2310678 -2463773 -3628553 -4248809 -3851120 -3497987 -3828352
6874c828352R4558J677780K285627P71978j325050k322614k543253k412320p77334
$$ -3828352 -3733794 -2056014 229613 1001591 -323459 -2646073 -5189326 -7601646 -8378980
6865h378980K428274M024988J522762k221983k297841R11063K063338j054566
$$ -8378980 -5950706 -1925718 -402956 -2624939 -4922780 -4011717 -1948379 -3002945
6857c002945m328298l805102j180206m1075k858J720585M844733N966674L566509
$$ -3002945 -7331243 -11136345 -12316551 -12357626 -12360484 -10639899 -5795166 171508 3738017
6848C738017K6023j699171j387232j008902k059832l815975l935486j184308K386246
$$ 3738017 3764040 2064869 677637 -331265 -2391097 -6207072 -10142558 -11326866 -8940620
6839h940620L268435R54561j245764r12412N5497j284764l988416m399924j478369
$$ -8940620 -5672185 -4717624 -5963388 -6875800 -6820303 -8105067 -12093483 -16493407 -17971776
6830a7971776J915292L070626K283544J265761Q89285J265624K314770L324331
$$ -17971776 -16056484 -12985858 -10702314 -9436553 -8547268 -7281644 -4966874 -1642543
6822a642543L173869J765772K88984m32977q61484j536708j994896j591475o38279
$$ -1642543 1531326 3297098 3586082 3153105 2291621 754913 -1239983 -2831458 -3469737
6813c469737K0746J51396K98565J001507K080034K589768J627978m75143k039286
$$ -3469737 -3448991 -3297595 -2999030 -1997523 82511 2672279 4300257 3825114 1785828
6804A785828j692487M3095J451410J663554J186807N58702m77651k174419l933434
$$ 1785828 93341 136436 1587846 3251400 4438207 4996909 4519258 2344839 -1588595
6795a588595m696681l852466j674518P44107K025663J505370j58373j620701k015641
$$ -1588595 -6285276 -10137742 -11812260 -11068153 -9042490 -7537120 -7695493 -9316194 -11331835
6786a1331835j298743J38299J633606K328077J769725M90990l48651J45329K014474
$$ -11331835 -12630578 -12492279 -10858673 -8530596 -6760871 -6269881 -6618532 -6473203 -4458729
6777d458729M165664M656512K368094j135383k701634j423677J8247p90406k276153
$$ -4458729 -293065 4363447 6731541 5596158 2894524 1470847 1489094 698688 -1577465
6768a577465j216814K087058L736002J506214k224559l615797j617576J713650
$$ -1577465 -2794279 -707221 3028781 4534995 2310436 -1305361 -2922937 -1209287
6760a209287L592484K395764j349468m879063n261557k508576L21423Q42972J5536
$$ -1209287 2383197 4778961 3429493 -1449570 -6711127 -9219703 -8898280 -8055308 -8039772
6751h039772J47166J410365J902998P56225l79795N38948L072284M342368K256996
$$ -8039772 -7892606 -6482241 -4579243 -3823018 -4202813 -3663865 -591581 3750787 6007783
6742F007783j667742l614133j910159R58090J721031M42029n38642p37157j797726
$$ 6007783 4340041 725908 -1184251 -226161 1494870 1936899 1398257 661100 -1136626
6733a136626l665864l731130j118404R68470m58029l378280l087382J391341N855068
$$ -1136626 -4802490 -8533620 -9652024 -8683554 -9141583 -12519863 -15607245 -14215904 -8360836
6724h360836O106728K552772j062747k044759q44602M77429P57484M83862N53244
$$ -8360836 -2254108 298664 -764083 -2808842 -3653444 -3176015 -2418531 -1934669 -1381425
6715a381425R00092O79082n06176k087812l138801l022017j665084J72673J151076
$$ -1381425 -481333 197749 -308427 -2396239 -5535040 -8557057 -10222141 -10049468 -8898392
6706h898392O61514k79206j85558J196052L098959M813185N290139K865692k328924
$$ -8898392 -8236878 -8516084 -8701642 -7505590 -4406631 406554 5696693 8562385 6233461
6697F233461o481044n673733j296424J431964P33340J83821K131026L610765J646692
$$ 6233461 -247583 -5921316 -7217740 -5785776 -5052436 -4868615 -2737589 873176 2519868
6688B519868j316562j363618M07032Q9279k178752k651269n20863J032056N30832
$$ 2519868 1203306 -160312 246720 335999 -1842753 -4494022 -5014885 -3982829 -3451997
6679c451997J04984P81480N37083j228264j622865P64985K559600N23684l083132
$$ -3451997 -3347013 -2565533 -2028450 -3256714 -4879579 -4114594 -1554994 -1031310 -4114442
6670d114442l722710j177468Q69046P18217K64076Q73189J282754M75256k41723
$$ -4114442 -7837152 -9014620 -8145574 -7427357 -7163281 -6290092 -5007338 -4532082 -4773805
6661d773805M81781J627826J294901n51101k187938k300841r16095J254556L195622
$$ -4773805 -4292024 -2664198 -1369297 -1920398 -4108336 -6409177 -7325272 -6070716 -2875094
6652b875094L541870J451298k009218m164760l187089o7389K362456K280281L32489
$$ -2875094 666776 2118074 108856 -4055904 -7242993 -7310382 -4947926 -2667645 -2335156
6643b335156j529548j918722o82068J319501K568011J859095k47696j566463q37430
$$ -2335156 -3864704 -5783426 -6465494 -5145993 -2577982 -718887 -966583 -2533046 -3370476
6634c370476M04297k44726k587239l832440k274736N30186J935498J362656L80104
$$ -3370476 -2966179 -3210905 -5798144 -9630584 -11905320 -11375134 -9439636 -8076980 -7696876
6625g696876M21751J359344J945774J054088j153932k943394k563467n44011M68898
$$ -7696876 -7275125 -5915781 -3970007 -2915919 -4069851 -7013245 -9576712 -10120723 -9651825
6616i651825j015278l106531k785632K34864L358756M517785M035505K911147
$$ -9651825 -10667103 -13773634 -16559266 -16324402 -12965646 -8447861 -4412356 -1501209
6608a501209J151253j166018k708657k425931j406649j395916j889659q08616
$$ -1501209 -349956 -1515974 -4224631 -6650562 -8057211 -9453127 -11342786 -12151402
6600a2151402J760904K871177R13240j586309j375359Q26400J650156K98362o49615
$$ -12151402 -10390498 -7519321 -6606081 -8192390 -9567749 -8741349 -7091193 -6792831 -7442446
6591g442446J90863R01006r316p38955O67748K600099K207912Q135j068219n68815
$$ -7442446 -7251583 -6350577 -6359893 -7098848 -6431100 -3831001 -1623089 -1614954 -2683173 -3251988
6581c251988r41425k723215k854786N23241M331081M177422K92624k788149k099441
$$ -3251988 -4193413 -6916628 -9771414 -9248173 -4917092 -739670 -447046 -3235195 -5334636
6572e334636N01700J400277k26361k027697j798940M7499J404298J090889m906
$$ -5334636 -4832936 -3432659 -3659020 -5686717 -7485657 -7438158 -6033860 -4942971 -4947877
6563d947877k78466O39537J635917J621264P91172J43051m3255p39991k780353
$$ -4947877 -5226343 -4586806 -2950889 -1329625 -538453 -395402 -438657 -1178648 -3959001
6554c959001n121371n356852k515473J352211L373530L165297K630263K751925
$$ -3959001 -9080372 -14437224 -16952697 -15600486 -12226956 -9061659 -6431396 -3679471
6546c679471K447895R38832p35893j495545j681184j538928j50492K376693L431181
$$ -3679471 -1231576 -292744 -1028637 -2524182 -4205366 -5744294 -5894786 -3518093 -86912
6537h6912R93385k960394m622687l115628o69182J122015K381904K785606J507807
$$ -86912 906473 -2053921 -6676608 -9792236 -10461418 -9339403 -6957499 -4171893 -2664086
6528b664086m58816r46454p3457j71261j671258k188918o87227P03600M88448
$$ -2664086 -3122902 -4069356 -4142813 -4314074 -5985332 -8174250 -8861477 -8157877 -7669429
6519g669429J18334M98990l84779l391689m845767j259458M561050O568175L704354
$$ -7669429 -7551095 -7052105 -7436884 -10828573 -15674340 -16933798 -12372748 -5804573 -2100219
6510b100219O14047K27884L14233j362453k823940j506088J040712J511206J70635
$$ -2100219 -1486172 -1258288 -944055 -2306508 -5130448 -6636536 -5595824 -4084618 -3913983
6501c913983K30727K338440L142172L51858l383543l661974j38009L022139K409389
$$ -3913983 -3683256 -1344816 1797356 2149214 -1234329 -4896303 -5034312 -2012173 397216
6492C97216p40642k641859j611074O42233J737820J137835j84139j286909j765894
$$ 397216 -343426 -2985285 -4596359 -3954126 -2216306 -1078471 -1262610 -2549519 -4315413
6483d315413j468805n53224M01819R17576J121072J282397J018828l64881k502854
$$ -4315413 -5784218 -6337442 -5935623 -5018047 -3896975 -2614578 -1595750 -1960631 -4463485
6474d463485l555628k007795J128758K920423J971516L34617O62727K210248J867632
$$ -4463485 -8019113 -10026908 -8898150 -5977727 -4006211 -3671594 -3008867 -798619 1069013
6465A069013p82243k259818l98781J878228N83061l288360m930115k281041J744824
$$ 1069013 286770 -1973048 -2371829 -493601 89460 -3198900 -8129015 -10410056 -8665232
6456h665232L686096L310816K277559J439590N85748o87952k548750m219287l831565
$$ -8665232 -4979136 -1668320 609239 2048829 2634577 1946625 -602125 -4821412 -8652977
6447h652977o82718K663367K819732J31774j720156q85062O83090R87544P26309
$$ -8652977 -9335695 -6672328 -3852596 -3720822 -5440978 -6326040 -5642950 -4655406 -3929097
6438c929097J077010J470420J083025K77448p30064k327994l509804k140061J307762
$$ -3929097 -2852087 -1381667 -298642 -21194 -751258 -3079252 -6589056 -8729117 -7421355
6429g421355L172569J713539k0229J193667L869387M336280K009236p51289k343006
$$ -7421355 -4248786 -2535247 -2555476 -1361809 2507578 6843858 8853094 8101805 5758799
6420E758799k724804j974812o29436j62917q87551r07077P18955J797745N50136
$$ 5758799 3033995 1059183 429747 266830 -620721 -1527798 -808843 988902 1539038
6411A539038q48148N00423L207321L391608L91484k636381l097649j140430J623106
$$ 1539038 690890 1191313 4398634 7790242 8181726 5545345 2447696 1307266 2930372
6402B930372L032037J319804k319287l852953j778801P7992j472936l260909q66112
$$ 2930372 5962409 7282213 4962926 1109973 -668828 -590836 -2063772 -5324681 -6190793
6393f190793L225085K924525j398731l255502n56342J444581n77133k632786n61267
$$ -6190793 -2965708 -41183 -1439914 -4695416 -5251758 -3807177 -4384310 -7017096 -7578363
6384g578363L083738L484817Q81808q03432l1437J408421J876446J358836N01721
$$ -7578363 -4494625 -1009808 -128000 -931432 -962869 445552 2321998 3680834 4182555
6375D182555J29959Q00676J798190J804736R10618J67018p45269k837161m979568
$$ 4182555 4312514 5113190 6911380 8716116 9626734 9793752 9048483 6211322 1231754
6366A231754n008906l656802l544737m073970j926462K508119M370715J807885
$$ 1231754 -3777152 -7433954 -10978691 -15052661 -16979123 -14471004 -10100289 -8292404
6358h292404r30554l72494J296113J369912J475085L163262L506106K37551k767503
$$ -8292404 -9222958 -9595452 -8299339 -6929427 -5454342 -2291080 1215026 1452577 -1314926
6349a314926j028365K610260J935164k651346m615556j231026L007664L472446
$$ -1314926 -2343291 266969 2202133 -449213 -5064769 -6295795 -3288131 184315
6341A84315P36965k294121m185594m314078j903272K384033O029603P106122N820702
$$ 184315 921280 -1372841 -5558435 -9872513 -11775785 -9391752 -3362149 3743973 9564675
6332I564675L450214J253593J60526j63521j429800m133992n763346l844607N8036
$$ 9564675 13014889 14268482 14429008 14265487 12835687 8701695 2938349 -906258 -848222
6323h48222J986095P40599j149149j294016J82070J968128K943148K251416k156
$$ -848222 1137873 1878472 729323 -564693 -382623 1585505 4528653 6780069 6777913
6314F777913k196618k878541k467615j924431j011894L11664M90902j140846k184200
$$ 6777913 4581295 1702754 -764861 -2689292 -3701186 -3389522 -2898620 -4039466 -6223666
6305f223666n09847J807267J415105q09273j269924J76063J06345k359351l824307
$$ -6223666 -6733513 -4926246 -3511141 -4320414 -5590338 -5414275 -5307930 -7667281 -11491588
6296a1491588j899066J597705L824521L991573K334322o76622l053006k415126
$$ -11491588 -13390654 -11792949 -7968428 -3976855 -1642533 -2319155 -5372161 -7787287
6288g787287M16461J914096R33651J37725J149010J752595j06690k590755k746121
$$ -7787287 -7370826 -5456730 -4523079 -4385354 -3236344 -1483749 -1590439 -4181194 -6927315
6279f927315q50762M47068q0082j292691j584025l63447J595408K612414J800349
$$ -6927315 -7778077 -7331009 -7411091 -8703782 -10287807 -10651254 -9055846 -6443432 -4643083
6270d643083L71863n490L04098l0464m81174L60944J549663R55038n60995j57814
$$ -4643083 -4271220 -4276710 -3972612 -4003076 -4484250 -4123306 -2573643 -1618605 -2179600 -2337414
6260b337414J606103J072475j920672k915402k60331J685695j16772k058479k37841
$$ -2337414 -731311 341164 -1579508 -4494910 -4755241 -3069546 -3186318 -5244797 -5482638
6251e482638K484043J345576j913360j877925J394459K661544K62641j811415
$$ -5482638 -2998595 -1653019 -3566379 -5444304 -4049845 -1388301 -1125660 -2937075
6243b937075j178676m47082j679754k702621j471541J50266L8901j29029K063482
$$ -2937075 -4115751 -4562833 -6242587 -8945208 -10416749 -10266483 -10227582 -10356611 -8293129
6234h293129M947260M667714R22737k416463k394021k27184R71124m5728j910351
$$ -8293129 -3345869 1321845 2244582 -171881 -2565902 -2793086 -1821962 -1867690 -3778041
6225c778041k591544j338326Q79174K354248K152889Q65755q6067J32368J039814
$$ -3778041 -6369585 -7707911 -6828737 -4474489 -2321600 -1455845 -1541912 -1409544 -369730
6216c69730J437190O89513o11338j358261j264265j163595j794910k644326k495108
$$ -369730 1067460 1756973 1145635 -212626 -1476891 -2640486 -4435396 -7079722 -9574830
6207i574830j073569L87940N70401k04209k74619J066438K209523J090447j774025
$$ -9574830 -10648399 -10260459 -9690058 -9894267 -10168886 -9102448 -6892925 -5802478 -7576503
6198g576503l451753k233535L21064J943490K745820M001613N050583L962906
$$ -7576503 -11028256 -13261791 -12940727 -10997237 -8251417 -4249804 800779 4763685
6190D763685J007543j157999j207141o97329j097030j514146p15121M71879M55968
$$ 4763685 5771228 4613229 3406088 2708759 1611729 97583 -617538 -145659 310309
6181C10309p24265j944306k898492l746074l562178j090208K821115N077263L485189
$$ 310309 -413956 -2358262 -5256754 -9002828 -12565006 -13655214 -10834099 -5756836 -2271647
6172b271647n02836k974302j630495J833934L921543L321389J424721p47706l602802
$$ -2271647 -2774483 -5748785 -7379280 -5545346 -1623803 1697586 3122307 2374601 -1228201
6163a228201o138953n215197k41392M033139L136155n83278j373115J328818K929720
$$ -1228201 -7367154 -12582351 -12823743 -8790604 -5654449 -6237727 -7610842 -6282024 -3352304
6154c352304J741905R48008J786504J227169j404116j909255J150351K383697
$$ -3352304 -1610399 -662391 1124113 2351282 947166 -962089 188262 2571959
6146B571959k009259p082419o352149j772376K71415m88741O45692L632618L441796
$$ 2571959 562700 -6519719 -12871868 -14644244 -14372829 -14861570 -14215878 -10583260 -7141464
6137g141464m86855k440804K92399L236238K274247o31657k275716l343928m998240
$$ -7141464 -7628319 -10069123 -9776724 -6540486 -4266239 -4897896 -7173612 -10517540 -15515780
6128a5515780m916182j157982L267270M092940J878169M45300R25700J272242
$$ -15515780 -20431962 -21589944 -18322674 -14229734 -12351565 -11906265 -10980565 -9708323
6120i708323O85413O57203J643455J986814Q50174j95024M71630K087498K448621
$$ -9708323 -9022910 -8365707 -6722252 -4735438 -3885264 -4080288 -3608658 -1521160 927461
6111I27461O41331j796280k426481o55999J248429N78784k346672m242984k844918
$$ 927461 1568792 -227488 -2653969 -3309968 -2061539 -1482755 -3829427 -8072411 -10917329
6102a0917329L59467K243672J805050N36995k44403q03522j578648j776167l54759
$$ -10917329 -10557862 -8314190 -6509140 -5972145 -6216548 -7020070 -8598718 -10374885 -10729644
6093a0729644K047391L283254K193476J20227r51074j091587j724502k519589
$$ -10729644 -8682253 -5398999 -3205523 -3085296 -4036370 -5127957 -6852459 -9372048
6085i372048j355557J854523L821413K197184q39687j707058m19474L74483j5359
$$ -9372048 -10727605 -8873082 -5051669 -2854485 -3694172 -5401230 -5820704 -5446221 -5461580
6076e461580p1131L10988m22767k077410k493866j169885Q4939N74955J487815
$$ -5461580 -5532711 -5221723 -5644490 -7721900 -10215766 -11385651 -11300712 -10725757 -9237942
6067i237942K602845J855787n94952j492601N37595K517333J796368M357k76515
$$ -9237942 -6635097 -4779310 -5374262 -6866863 -6329268 -3811935 -2015567 -2011210 -2287725
6058b287725J59089p38199k191418k029559n43746L40542N62059J575133L332861
$$ -2287725 -2128636 -2866835 -5058253 -7087812 -7631558 -7291016 -6728957 -5153824 -1820963
6049a820963M231469L328036N87242l638999p125629n944290M10888N859172M125684
$$ -1820963 2410506 5738542 6325784 2686785 -4438844 -10383134 -9972246 -4113074 12610
6040A2610k504905n625158k052565K334266J623611k080588k786739O14522L663912
$$ 12610 -2492295 -8117453 -10170018 -7835752 -6212141 -8292729 -11079468 -10464946 -6801034
6031f801034K913600l14854k566104k138003L1414J823361J827988M62911o38375
$$ -6801034 -3887434 -4202288 -6768392 -8906395 -8874981 -7051620 -5223632 -4760721 -5399096
6022e399096m37634P43211K139481L091378K529163m19301m402428n967881l223835
$$ -5399096 -5836730 -5093519 -2954038 137340 2666503 2247202 -2155226 -8123107 -11346942
6013a1346942J529704M250700L559828J384301o1609l09876k3876k5087r52976
$$ -11346942 -9817238 -5566538 -2006710 -622409 -684018 -993894 -1017770 -1042857 -1995833
6004a995833k457822k699207j79757L682888N441038L699954Q23581l33327L5804
$$ -1995833 -4453655 -7152862 -7332619 -3649731 1791307 5491261 6314842 5981515 6017319
5995F017319k46361j855458l253008k958950r68650J813404M007947L853348P44841
$$ 6017319 5770958 3915500 662492 -2296458 -3265108 -1451704 2556243 6409591 7154432
5986G154432l033370m008591j724974M57504j80489k164058k318678l78871J088996
$$ 7154432 4121062 112471 -1612503 -1154999 -1335488 -3499546 -5818224 -6197095 -5108099
5977e108099O43017n09461r10745n56064K84437J892496L709824L796238J238213
$$ -5108099 -4465082 -4974543 -5885288 -6441352 -6156915 -4264419 -554595 3241643 4479856
5968D479856j844931k370771j66503J669294O55865j891148k514511r7707K533012
$$ 4479856 2634925 264154 97651 1766945 2422810 531662 -1982849 -2080556 452456
5959D52456K151826o08284k033031k95097K169987K106216l71876k543182k799559
$$ 452456 2604282 1995998 -37033 -332130 1837857 3944073 3572197 1029015 -1770544
5950a770544j678202j700J755873K488744J146199j287116k495026j968232j538813
$$ -1770544 -3448746 -3450446 -1694573 794171 1940370 653254 -1841772 -3810004 -5348817
5941e348817k202337k383298m25341K734643M524984L360028l00808m303375n804975
$$ -5348817 -7551154 -9934452 -10359793 -7625150 -3100166 259862 -40946 -4344321 -10149296
5932a0149296l528536L52447K182958J240747K88677J134689K198112J808374
$$ -10149296 -13677832 -13325385 -11142427 -9901680 -9613003 -8478314 -6280202 -4471828
5924d471828J114659J402058J024886j747416m545080l396088J109580L881194
$$ -4471828 -3357169 -1955111 -930225 -2677641 -7222721 -10618809 -9509229 -5628035
5916e628035K036068j640167k982545j491301M64000J426454J864589K392685
$$ -5628035 -3591967 -5232134 -8214679 -9705980 -9241980 -7815526 -5950937 -3558252
5908c558252K672975J979347Q7037k255436l576742k997817j442789p03907j058293
$$ -3558252 -885277 1094070 1181107 -1074329 -4651071 -7648888 -9091677 -9795584 -10853877
5899a0853877q80483P80381K353945J707342n92622j521617N13606L256166L188979
$$ -10853877 -11734360 -10953979 -8600034 -6892692 -7485314 -9006931 -8493325 -5237159 -2048180
5890b048180L8389k746567k289539L58714K082210J604416o2993k024122l970089
$$ -2048180 -2009791 -4756358 -7045897 -6687183 -4604973 -3000557 -3063550 -5087672 -9057761
5881i057761m565505k225961J750363L490553J439579j293277j223957R39051
$$ -9057761 -13623266 -15849227 -14098864 -10608311 -9168732 -10462009 -11685966 -10746915
5873a0746915K143742J548422O30709J58640q4058N02879K399634L716652J943151
$$ -10746915 -8603173 -7054751 -6424042 -6265402 -6349460 -5846581 -3446947 269705 2212856
5864B212856k045453m592901m091543k423036j293349k14853J041879J099551
$$ 2212856 167403 -4425498 -8517041 -10940077 -12233426 -12448279 -11406400 -10306849
5856a0306849m37547j702680j511187j108548j241234j84766K859812M920692
$$ -10306849 -10744396 -12447076 -13958263 -15066811 -16308045 -16492811 -13632999 -8712307
5848h712307L120785l69681j055323J089252J665776j110850l540107k046313
$$ -8712307 -5591522 -5961203 -7016526 -5927274 -4261498 -5372348 -8912455 -10958768
5840a0958768J812815M201190M150503L103428J415709j272637l226454j903606
$$ -10958768 -9145953 -4944763 -794260 2309168 3724877 2452240 -774214 -2677820
5832b677820J698421L310038J077271j858435k046166m03851Q7286p32182o83877
$$ -2677820 -979399 2330639 3407910 1549475 -496691 -900542 -813256 -1545438 -2229315
5823b229315N09200Q24869l02102r76903k46409L01616n26240j482117j276026
$$ -2229315 -1720115 -895246 -1197348 -2174251 -2420660 -2119044 -2645284 -4127401 -5403427
5814e403427q13440j142285j057311Q99534L352135L559596J351471q03425j428501
$$ -5403427 -6216867 -7359152 -8416463 -7516929 -4164794 -605198 746273 -57152 -1485653
5805a485653j407341j558738j180827J06123R35062L3663j538776j456345Q16499
$$ -1485653 -2892994 -4451732 -5632559 -5526436 -4591374 -4557711 -6096487 -7552832 -6736333
5796f736333L147142L164146R01050j491614k380929k209537k161907k175047
$$ -6736333 -3589191 -425045 476005 -1015609 -3396538 -5606075 -7767982 -9943029
5788i943029j297995M17406J719260J889096J438812R16522K65243m07667p25742
$$ -9943029 -11241024 -10823618 -9104358 -7215262 -5776450 -4859928 -4594685 -5002352 -5728094
5779e728094r44534j595413k141599j659822q44629j071673j317136R44662M902932
$$ -5728094 -6672628 -8268041 -10409640 -12069462 -12914091 -13985764 -15302900 -14358238 -9455306
5770i455306O001420K310930k071411k719370q42793j74174q07647m26576N35284
$$ -9455306 -3453886 -1142956 -3214367 -5933737 -6776530 -6950704 -7758351 -8184927 -7649643
5761g649643j29941j515796p18680J625455J888888l54450j611657n84118n0872
$$ -7649643 -7779584 -9295380 -10014060 -8388605 -6499717 -6854167 -8465824 -9049942 -9100814
5752i100814j341852j775772K90508K252647J770843O78623J343933K353283J180631
$$ -9100814 -10442666 -12218438 -11927930 -9675283 -7904440 -7225817 -5881884 -3528601 -2347970
5743b347970j271361k093958o52489J320544K436786K129210N8723k658062l300659
$$ -2347970 -3619331 -5713289 -6365778 -5045234 -2608448 -479238 -420515 -3078577 -6379236
5734f379236r60234J533741J402020j77434m94134K82777K22852m35695m0252
$$ -6379236 -7339470 -5805729 -4403709 -4581143 -5075277 -4792500 -4569648 -5005343 -5045595
5725e045595P88771j4708j771812j453351J313279L069027J385406j954961l894003
$$ -5045595 -4256824 -4271532 -6043344 -7496695 -6183416 -3114389 -1728983 -3683944 -7577947
5716g577947l767014k604384r13867J030768K171523J776477P43495L30561K63639
$$ -7577947 -11344961 -13949345 -14863212 -13832444 -11660921 -9884444 -9140949 -8810388 -8546749
5707h546749m82952j531159j298746N98138K495638K692676J333643k76101j368555
$$ -8546749 -9029701 -10560860 -11859606 -11261468 -8765830 -6073154 -4739511 -5015612 -6384167
5698f384167j923821j925122j548343j605774k385658k383244j14413K773130
$$ -6384167 -8307988 -10233110 -11781453 -13387227 -15772885 -18156129 -18270542 -15497412
5690a5497412K823673J53549n36269L371657P535125O090567Q5912l994299l339744
$$ -15497412 -12673739 -12520190 -13056459 -9684802 -2149677 3940890 4026802 32503 -3307241
5681c307241j508234j639478k149887j038662J81557j68564l53482J551011L661856
$$ -3307241 -4815475 -6454953 -8604840 -9643502 -9461945 -9630509 -9983991 -8432980 -4771124
5672d771124L143799R76658K22228R67520N87852j669753l577724l231592j028863
$$ -4771124 -1627325 -650667 -428439 539081 1126933 -542820 -4120544 -7352136 -8380999
5663h380999J404868K375816Q85925j949626l209164j660022M24477Q65271R89919
$$ -8380999 -6976131 -4600315 -3714390 -5664016 -8873180 -10533202 -10108725 -9243454 -8253535
5654h253535K659419L980413J940650j941717l099016p64884J152100M51620o66775
$$ -8253535 -5594116 -1613703 326947 -1614770 -4713786 -5478670 -4326570 -3874950 -4541725
5645d541725n12366r47996l172414m433113k281791Q34760J073566o33649r3601
$$ -4541725 -5054091 -6002087 -9174501 -13607614 -15889405 -15054645 -13981079 -14614728 -14708329
5636a4708329L179255M820472K268384j186555j193583J420941K267202J7019
$$ -14708329 -11529074 -6708602 -4440218 -5626773 -6820356 -5399415 -3132213 -3115194
5628c115194k051157j377989M12150J015433J406702L243341M397180J338198
$$ -3115194 -5166351 -6544340 -6132190 -5116757 -3710055 -466714 3930466 5268664
5620E268664m463368p039870l908200N18259J449583r9736m89833M42062K56845
$$ 5268664 805296 -6234574 -10142774 -9624515 -8174932 -8274668 -8764501 -8322439 -8065594
5611h065594j206671j802171r03788J87500R75940J843109K111571J063123J62248
$$ -8065594 -9272265 -11074436 -11978224 -11790724 -10814784 -8971675 -6860104 -5796981 -5634733
5602e634733J117692K403187J127148k045731l476996k040072l23782K3840L94016
$$ -5634733 -4517041 -2113854 -986706 -3032437 -6509433 -8549505 -8873287 -8849447 -8455431
5593h455431J721091K456561J540292L76240J61219k05009j826573l560281l703459
$$ -8455431 -6734340 -4277779 -2737487 -2361247 -2200028 -2405037 -4231610 -7791891 -11495350
5584a1495350k271270l41297J329710K137306J722862R54510J114702J686237
$$ -11495350 -13766620 -14107917 -12778207 -10640901 -8918039 -7963529 -6848827 -5162590
5576e162590J017904m35542j67402K203579L508679J230360l091326o029627n816254
$$ -5162590 -4144686 -4580228 -4747630 -2544051 964628 2194988 -896338 -6925965 -12742219
5567a2742219k629990K209922N877335N379742J263333k049909j560405O13069
$$ -12742219 -15372209 -13162287 -7284952 -1905210 -641877 -2691786 -4252191 -3639122
5559c639122Q09886r60305j945985j267295o95662j344710k049436j271357Q51712
$$ -3639122 -2829236 -3789541 -5735526 -7002821 -7698483 -9043193 -11092629 -12363986 -11512274
5550a1512274K605272K308588J30685j661977j251313J34157n1323j481591j262905
$$ -11512274 -8907002 -6598414 -6467729 -8129706 -9381019 -9246862 -9298185 -10779776 -12042681
5541a2042681J013037J934867l08298k559763j495750J110753J451861j69357
$$ -12042681 -11029644 -9094777 -9403075 -11962838 -13458588 -12347835 -10895974 -11065331
5533a1065331l21790J643303K878857K015023Q79222O63248p3798k237715l869183
$$ -11065331 -11387121 -9743818 -6864961 -4849938 -3970716 -3307468 -3381266 -5618981 -9488164
5524i488164k832182l7591J766358J387325l5437j005119j134471p06161K56179
$$ -9488164 -12320346 -12357937 -10591579 -9204254 -9239691 -10244810 -11379281 -12085442 -11829263
5515a1829263J843239L311513L131382Q56364j499620j419320O78527J713853
$$ -11829263 -9986024 -6674511 -3543129 -2686765 -4186385 -5605705 -4927178 -3213325
5507c213325K63990j403763r36581M50723J17800j574052j717254N91866K740666
$$ -3213325 -2949335 -4353098 -5289679 -4838956 -4721156 -6295208 -8012462 -7420596 -4679930
5498d679930K188663l18741k035726j567463O097R09152Q05473Q10751J448512
$$ -4679930 -2491267 -2810008 -4845734 -6413197 -6407100 -5497948 -4692475 -3881724 -2433212
5489b433212J423342n26125l071936l429948j232140Q21623R12044M23876R46359
$$ -2433212 -1009870 -1535995 -4607931 -8037879 -9270019 -8448396 -7536352 -7112476 -6166117
5480f166117J253509m53024k934467l207755o82892K287207L525815K742455O39814
$$ -6166117 -4912608 -5365632 -8300099 -11507854 -12190746 -9903539 -6377724 -3635269 -2995455
5471b995455j698459k797595j939473k10300Q49633J078690R59317J24912j677659
$$ -2995455 -4693914 -7491509 -9430982 -9641282 -8791649 -7712959 -6753642 -6628730 -8306389
5462h306389l146127k925709j678375o47904P24749L219358M873891K875800j679060
$$ -8306389 -11452516 -14378225 -16056600 -16704504 -15979755 -12760397 -7886506 -5010706 -6689766
5453f689766m138945k078123J909036L975572L230372J327079M0518L14155J912098
$$ -6689766 -10828711 -12906834 -10997798 -7022226 -3791854 -2464775 -2424257 -2110102 -198004
5444a98004K997726J559038j932467m646521m708413k925337q59623R67836K280918
$$ -198004 2799722 4358760 2426293 -2220228 -6928641 -9853978 -10713601 -9745765 -7464847
5435g464847K348163J169963m9515n09155n78561l49768Q82480K769784L302103
$$ -7464847 -5116684 -3946721 -3996236 -4505391 -5083952 -5433720 -4551240 -1781456 1520647
5426A520647J429697j103622k010154j372486p86315o29018o210J105672J532727
$$ 1520647 2950344 1846722 -163432 -1535918 -2322233 -2951251 -2957461 -1851789 -319062
5417c19062Q35033P1708J55761N20554J36314q00262j102496m36080k5815r91451
$$ -319062 515971 587679 743440 1263994 1400308 600046 -502450 -938530 -964345 -1955796
5407a955796k585814l062414k100207j149552j174284j426340j053059m52481
$$ -1955796 -4541610 -7604024 -9704231 -10853783 -12028067 -13454407 -14507466 -14959947
5399a4959947j9707R76842K800980L859101K750800O42915m50517p72205j726002
$$ -14959947 -14979654 -14002812 -11201832 -7342731 -4591931 -3949016 -4399533 -5171738 -6897740
5390f897740k411339l91435L829176O204182M265699M63461j229691l40378K83312
$$ -6897740 -9309079 -9700514 -5871338 332844 4598543 5062004 3832313 3491935 3775247
5381C775247j238585l434649l522841r88741J550195J524284L9030O17640L742424
$$ 3775247 2536662 -897987 -4420828 -5409569 -3859374 -2335090 -2296060 -1678420 2064004
5372B064004N163316J847327k728116k929637P32943K248842j005871m880467
$$ 2064004 7227320 9074647 6346531 3416894 4149837 6398679 5392808 512341
5364E12341n139196k823184o42759J622519M676751O130513L612593o70118k651126
$$ 512341 -4626855 -7450039 -8092798 -6470279 -1793528 4336985 7949578 7279460 4628334
5355D628334k367862l123946n369972n673920k333340J656626K718715J212150
$$ 4628334 2260472 -863474 -6233446 -11907366 -14240706 -12584080 -9865365 -8653215
5347h653215J15845P88252J750642J148664p55527j794995m67039J994261K882230
$$ -8653215 -8537370 -7749118 -5998476 -4849812 -5605339 -7400334 -7867373 -5873112 -2990882
5338b990882J508343J12634N04899J397950P24330p97922q76080K44295k55607
$$ -2990882 -1482539 -1369905 -865006 532944 1257274 459352 -416728 -172433 -428040
5329d28040l280530n852107m843325r12417K669681L894004L305501K243206J345485
$$ -428040 -3708570 -9560677 -14404002 -15316419 -12646738 -8752734 -5447233 -3204027 -1858542
5320a858542P17915L56475k8777r58342k386444l146346j803577J557342M682953
$$ -1858542 -1140627 -784152 -812929 -1771271 -4157715 -7304061 -9107638 -7550296 -2867343
5311b867343M952152K028762j736667l762524l611669k663145k053936j602232
$$ -2867343 2084809 4113571 2376904 -1385620 -4997289 -7660434 -9714370 -11316602
5303a1316602n47178J205867K714180K888271J878172J199010J831823K632925
$$ -11316602 -11863780 -10657913 -7943733 -5055462 -3177290 -1978280 -146457 2486468
5295B486468J888896K50764J91526K012498K652353O7218l158767l070945l7817
$$ 2486468 4375364 4626128 4817654 6830152 9482505 9549723 6390956 3320011 3282194
5286C282194J768267L07113k014100k624213k399797l243073m318948l260694
$$ 3282194 5050461 5357574 3343474 719261 -1680536 -4923609 -9242557 -12503251
5278a2503251j32569K272078K056519K54109j080295j291552j033590q61566o79706
$$ -12503251 -12635820 -10363742 -8307223 -8053114 -9133409 -10424961 -11458551 -12320117 -12999823
5269a2999823o6625J261869K902422L639269K620370P51667q6202M92025Q79177
$$ -12999823 -13066448 -11804579 -8902157 -5262888 -2642518 -1890851 -1977053 -1485028 -605851
5260f05851K0241r36339o16454L10023M77598L34838J169091K296877J730702
$$ -605851 -585610 -1521949 -2138403 -1828380 -1350782 -1015944 153147 2450024 4180726
5251D180726m56030k054464k326784k864766l984872l333869M7884K960667K025792
$$ 4180726 3724696 1670232 -656552 -3521318 -7506190 -10840059 -10792175 -7831508 -5805716
5242e805716j349609k791447o63243K635516M339554L865548K136143M75503j40193
$$ -5805716 -7155325 -9946772 -10610015 -7974499 -3634945 230603 2366746 2842249 2702056
5233B702056l11342j832689m526570n110480j637635K648280L140615K21502j940996
$$ 2702056 2390714 558025 -3968545 -9079025 -10716660 -8068380 -4927765 -4706263 -6647259
5224f647259j864716j551488j271171J200213N230396O412129L108748o00899
$$ -6647259 -8511975 -10063463 -11334634 -10134421 -4904025 1508104 4616852 4015953
5216D015953j160383n42546j759394l221951j853598R52904J280949q44506j577361
$$ 4015953 2855570 2313024 553630 -2668321 -4521919 -3569015 -2288066 -3132572 -4709933
5207d709933M65294K216264J137357j189081j839716o49281J13516r10683k540038
$$ -4709933 -4244639 -2028375 -891018 -2080099 -3919815 -4569096 -4455580 -5366263 -7906301
5198g906301k734744j232286J47239O2317m24890L12255J584158J503707N56191
$$ -7906301 -10641045 -11873331 -11726092 -11663775 -12088665 -11776410 -10192252 -8688545 -8132354
5189h132354J139580L198984L603061J077630j468446j391465r3908j33349j360636
$$ -8132354 -6992774 -3793790 -190729 886901 -581545 -1973010 -2066918 -2200267 -3560903
5180c560903k438263l449286m147691k388147K240865N691623M315852M47417
$$ -3560903 -5999166 -9448452 -13596143 -15984290 -13743425 -8051802 -3735950 -3288533
5172c288533j064830j35544m72535k483606k551761M30473K925479K393614P83431
$$ -3288533 -4353363 -4488907 -4961442 -7445048 -9996809 -9566336 -6640857 -4247243 -3463812
5163c463812P03589J646311J862040J154526R4503j250558k446219k593444j997333
$$ -3463812 -2760223 -1113912 748128 1902654 1997157 746599 -1699620 -4293064 -6290397
5154f290397j794482j391636J021505M609854N591503K275844k277613m275932
$$ -6290397 -8084879 -9476515 -8455010 -3845156 1746347 4022191 1744578 -2531354
5146b531354l413833j465271P00512K551190K713668R56940l98726M18356J635450
$$ -2531354 -5945187 -7410458 -6709946 -4158756 -1445088 -488148 -886874 -468518 1166932
5137A166932O61026j521986j701291N32919K253481J757005O68647O91614Q81640
$$ 1166932 1827958 305972 -1395319 -862400 1391081 3148086 3816733 4508347 5389987
5128E389987l04342k151497k822260k234538j740644j379350L20116L329987M981634
$$ 5389987 5085645 2934148 111888 -2122650 -3863294 -5242644 -4922528 -1592541 3389093
5119C389093L225584l52895k565486k742939k670254k964754k345548q67459p50515
$$ 3389093 6614677 6261782 3696296 953357 -1716897 -4681651 -7027199 -7894658 -8645173
5110h645173k482626k972496o3578L381420L076213m29407k532590j033285J590527
$$ -8645173 -11127799 -14100295 -14163873 -10782453 -7706240 -8135647 -10668237 -11701522 -10110995
5101a0110995K424985J415032j73247j633322k151618q46797J265067J574260
$$ -10110995 -7686010 -6270978 -6444225 -8077547 -10229165 -11075962 -9810895 -8236635
5093h236635m86008k097955q75700J702482K384155L64068k278002l442245k746091
$$ -8236635 -8722643 -10820598 -11696298 -9993816 -7609661 -7245593 -9523595 -12965840 -15711931
5084a5711931j008583O22186J350136J516355K288765L772747M138309J836572
$$ -15711931 -16720514 -16098328 -14748192 -13231837 -10943072 -7170325 -3032016 -1195444
5076a195444j693933k966528m61075L283063M367942J956187r41444j354695l9106
$$ -1195444 -2889377 -5855905 -6316980 -3033917 1334025 3290212 2348768 994073 954967
5067I54967p0627k192915l541861j811634J132625J660334n64425k113594l75283
$$ 954967 884340 -1308575 -4850436 -6662070 -5529445 -3869111 -4433536 -6547130 -6922413
5058f922413L248808N252733L839481K09668l038239m095102k962976r03384Q98008
$$ -6922413 -3673605 1579128 5418609 5628277 2590038 -1505064 -4468040 -5371424 -4473416
5049d473416K004518K362166K026961J381560P95208r9539j774615l313198l009564
$$ -4473416 -2468898 -106732 1920229 3301789 4096997 3997458 2222843 -1090355 -4099919
5040d099919r38977P05381O16567J5453L26329J051495J235090J216365J427508
$$ -4099919 -5038896 -4333515 -3716948 -3701495 -3375166 -2323671 -1088581 127784 1555292
5031A555292J204844L66484J70140J085938J585822Q46034L42908P48205o8264
$$ 1555292 2760136 3126620 3296760 4382698 5968520 6814554 7157462 7905667 7837403
5022G837403l204846n549974l886926k2309J868591J187979M06528L13313j21472
$$ 7837403 4632557 -917417 -4804343 -4826652 -2958061 -1770082 -1363554 -1050241 -1171713
5013a171713m94704K05877N74592j259963l601782l279533q68166M12773Q0424
$$ -1171713 -1666417 -1460540 -885948 -2145911 -5747693 -9027226 -9895392 -9482619 -9402195
5004i402195K53248J086432J025160P43517J912500K888123Q77652k401349k884766
$$ -9402195 -9148947 -8062515 -7037355 -6293838 -4381338 -1493215 -615563 -3016912 -5901678
4995e901678j195381j244545k483681q41014K554662J825381l035775m533591
$$ -5901678 -7097059 -8341604 -10825285 -11666299 -9111637 -7286256 -10322031 -14855622
4987a4855622L30999M618202K377662k378218l064743n88398J38170j148179j170171
$$ -14855622 -14524623 -9906421 -7528759 -9906977 -12971720 -13560118 -13421948 -14570127 -15740298
4978a5740298N68874K168388L374491M509433L920413P96579j945014j549634
$$ -15740298 -15171424 -13003036 -9628545 -5119112 -1198699 -402120 -2347134 -3896768
4970c896768K41077L63213o74001o32299L47134J019157J881208L331829L468229
$$ -3896768 -3655691 -3292478 -3966479 -4598778 -4251644 -3232487 -1351279 1980550 5448779
4961E448779J020729j844839k590863j775944r83663j34346P64886M24459q16003
$$ 5448779 6469508 4624669 2033806 257862 -725801 -860147 -95261 329198 -486805
4952d86805m62514J485228J570122r61399j944264N87202K305851l41846m040075
$$ -486805 -949319 535909 2106031 1144632 -799632 -212430 2093421 1751575 -2288500
4943b288500m210191j978667o04028M84632K707181L619271R47769k142034j362536
$$ -2288500 -6498691 -8477358 -9081386 -8596754 -5889573 -2270302 -1322533 -3464567 -4827103
4934d827103K075668M028474L470825J593132j419525m258625l358285J370773
$$ -4827103 -2751435 1277039 4747864 6340996 4921471 662846 -2695439 -1324666
4926a324666M124353J430507k013368r31075K299644K740418R05942m40631k058463
$$ -1324666 2799687 4230194 2216826 1285751 3585395 6325813 7231755 6791124 4732661
4917D732661m355985l496909J687795M879102J780456j909884j58344K589198
$$ 4732661 376676 -3120233 -1432438 3446664 5227120 3317236 3158892 5748090
4909E748090l51919n468167n391952j774064p98595j336446J050456L608130J645291
$$ 5748090 5396171 -71996 -5463948 -7238012 -8036607 -9373053 -8322597 -4714467 -3069176
4900c069176j030567R93952L159003q62254n593447k653726L013871J472907l766768
$$ -3069176 -4099743 -3105791 53212 -809042 -6402489 -9056215 -6042344 -4569437 -8336205
4891h336205k768372J344829j179621o324483l077294M230733K846756l508982
$$ -8336205 -11104577 -9759748 -10939369 -17263852 -20341146 -16110413 -13263657 -16772639
4883a6772639j277710N500664K045325o393518k484203O693274j310087j8346387
$$ -16772639 -18050349 -12549685 -10504360 -16897878 -19382081 -12688807 -13998894 -32345281
4875c2345281j4743668j885071k9446685r5109641j15385761l4633858Q1381976
$$ -32345281 -47088949 -48974020 -78420705 -173530346 -288916107 -323549965 -242167989
4868b42167989J21423923P0613308J2235525K839504J5127088R595407m028592
$$ -242167989 -120744066 -50130758 -37895233 -35055729 -19928641 -10333234 -14361826
4861a4361826k213235O132072K423398n594811j680139P831436P534820M37587
$$ -14361826 -16575061 -10442989 -8019591 -13614402 -15294541 -7463105 71715 509302
4853E09302j169336J350718n54871m488109l305309J4085q15914k463429M05376
$$ 509302 -660034 690684 135813 -4352296 -7657605 -7643520 -8459434 -10922863 -10517487
4844a0517487L238434J64907l960839k309676J343261O51118q53692K598924O590215
$$ -10517487 -7279053 -7114146 -11074985 -13384661 -12041400 -11390282 -12243974 -9645050 -3054835
4835c054835M071063j355470j878267P54196p4824k695862q17564L798571M084187
$$ -3054835 1016228 -339242 -2217509 -1463313 -1538137 -4233999 -5051563 -1252992 2831195
4826B831195J16220j954111r72353q53160j846270j083016J99913j271671l546876
$$ 2831195 2947415 993304 20951 -832209 -2678479 -3761495 -3561582 -4833253 -8380129
4817h380129k427096O11828J391630J135416L344425N494931K781518k238819
$$ -8380129 -10807225 -10195397 -8803767 -7668351 -4323926 1171005 3952523 1713704
4809A713704k979355K720N48386j666155j027420K852832L662825o31650m191586
$$ 1713704 -1265651 -1262931 -714545 -2380700 -3408120 -555288 3107537 2475887 -1715699
4800a715699k850981L68780J617302J348830P64197q38438k808202k503322K4543
$$ -1715699 -4566680 -4197900 -2580598 -1231768 -467571 -1306009 -4114211 -6617533 -6592990
4791f592990J370386L02993o34161k07989l59864j656806j705459J85759J215981
$$ -6592990 -5222604 -4919611 -5553772 -5761761 -6121625 -7778431 -9483890 -9298131 -8082150
4782h082150j40192j513725o38900J483440L004112L631406L306565J514568r20725
$$ -8082150 -8222342 -9736067 -10374967 -8891527 -5887415 -2256009 1050556 2565124 1644399
4773A644399k120538j954086j788860j305515R43705L464444K435325k311579
$$ 1644399 -476139 -2430225 -4219085 -5524600 -4580895 -1116451 1318874 -992705
4765i92705n729289l943950P81731L469791K428679n0381j132170J64548K777259
$$ -992705 -6721994 -10665944 -9884213 -6414422 -3985743 -4036124 -5168294 -5003746 -2226487
4756b226487M501722L727026P84546k775499n631955o628814m702883o48331K379946
$$ -2226487 2275235 6002261 6786807 4011308 -1620647 -8249461 -12952344 -13600675 -11220729
4747a1220729K317675R42991R56038J900846J779320J027616J350537J908635
$$ -11220729 -8903054 -7960063 -7004025 -5103179 -3323859 -2296243 -945706 962929
4739I62929O35577j457116j407070O59046J685184P11170l55975r32199k352493
$$ 962929 1598506 141390 -1265680 -606634 1078550 1789720 1433745 501546 -1850947
4730a850947l929087k916786O06125L021561K603062J726734K234288K464360
$$ -1850947 -5780034 -8696820 -8090695 -5069134 -2466072 -739338 1494950 3959310
4722C959310P91711j289683j726203q07960K64525J241657J801428J109545l32003
$$ 3959310 4751021 3461338 1735135 927175 1191700 2433357 4234785 5344330 5012327
4713E012327p94775k54481o22768k248000l135988k575077k282364k726496j748108
$$ 5012327 4217552 3963071 3340303 1092303 -2043685 -4618762 -6901126 -9627622 -11375730
4704a1375730J466069M300694M544561L291817K098526L56412k270371l795998
$$ -11375730 -9909661 -5608967 -1064406 2227411 4325937 4682349 2411978 -1384020
4696a384020k871183j208930o13325j62870J139124J641614j0088j635592n98505
$$ -1384020 -4255203 -5464133 -6077458 -6240328 -5101204 -3459590 -3469678 -5105270 -5703775
4687e703775J784498K352554J096807N11708J006817N85766j208427k290527j243036
$$ -5703775 -3919277 -1566723 -469916 41792 1048609 1634375 425948 -1864579 -3107615
4678c107615R97647K941136L959717L742316K196564J53596j244829j904555k397810
$$ -3107615 -2109968 831168 4790885 8533201 10729765 10883361 9638532 7733977 5336167
4669E336167k600918k014652j063305p44072j258252k077031k850179l136193
$$ 5336167 2735249 720597 -342708 -1086780 -2345032 -4422063 -7272242 -10408435
4661a0408435j998727O31696K740960K054690r62953l248492k384228J142575
$$ -10408435 -12407162 -11775466 -9034506 -6979816 -7942769 -11191261 -13575489 -12432914
4653a2432914M733696N903103L990955N71718j853685k063910r34685q0841l67091
$$ -12432914 -7699218 -1796115 2194840 2766558 912873 -1151037 -2085722 -2166563 -2533654
4644b533654j757533l467212l955703k106334J020682K891866K488557J191083
$$ -2533654 -4291187 -7758399 -11714102 -13820436 -12799754 -9907888 -7419331 -6228248
4636f228248K85790m41498q52048L58533K951141L868428J088130k816868l608297
$$ -6228248 -5942458 -6383956 -7236004 -6877471 -3926330 -57902 1030228 -1786640 -5394937
4627e394937r21002J678697J602845k84215j927790k433897j820727l74901J065536
$$ -5394937 -6315939 -4637242 -3034397 -3318612 -5246402 -7680299 -9501026 -9875927 -8810391
4618h810391J438110O10310m89954r81160p16808j31595Q9251k85367k47210J509273
$$ -8810391 -7372281 -6761971 -7251925 -8233085 -8949893 -9081488 -8992237 -9277604 -9524814 -8015541
4608h015541M212799N010397K552544p69995j740465k98403J117328J118639K80335
$$ -8015541 -3802742 1207655 3760199 2990204 1249739 951336 2068664 3187303 3467638
4599C467638o67352j459018j572405p63757O9411J62657K89640J146938J388447
$$ 3467638 2800286 1341268 -231137 -994894 -925483 -762826 -473186 673752 2062199
4590B062199l84271k541002k202072K11467J246227m65184k295410j701562L64430
$$ 2062199 1677928 -863074 -3065146 -2853679 -1607452 -2072636 -4368046 -6069608 -5705178
4581e705178J389434O35897p64871j561714j138720K95278J528868J462958P90183
$$ -5705178 -4315744 -3679847 -4444718 -6006432 -7145152 -6849874 -5321006 -3858048 -3067865
4572c067865J271945L103235M518267M265128K800411Q17981j422739k941066
$$ -3067865 -1795920 1307315 5825582 10090710 12891121 13709102 12286363 9345297
4564I345297k529799j209141j794909m711160o456134m015581R45162M177035
$$ 9345297 6815498 5606357 3811448 -899712 -7355846 -11371427 -10426265 -6249230
4556f249230L790727J339938q46359j576808q80619J38443M3160j153661j647245
$$ -6249230 -2458503 -1118565 -1964924 -3541732 -4422351 -4283908 -4240748 -5394409 -7041654
4547g041654k39317J962019L252301L423068K938267J590927l78068j384988p67898
$$ -7041654 -7280971 -5318952 -2066651 1356417 4294684 5885611 5507543 4122555 3354657
4538C354657m99976k226867l915749k470176J101403K561989N46852j596187q70728
$$ 3354657 2854681 627814 -3287935 -5758111 -4656708 -2094719 -1547867 -3144054 -4014782
4529d014782J537694K867301K583033J780125Q44977l05559j079468j117897j273692
$$ -4014782 -2477088 390213 2973246 4753371 5598348 5292789 4213321 3095424 1821732
4520A821732k154094k767558k132764j134297j115982j641394j481000r08972
$$ 1821732 -332362 -3099920 -5232684 -6366981 -7482963 -9124357 -10605357 -11514329
4512a1514329r05824p60959J055698L769621M620627K768909N04782k57875l79157
$$ -11514329 -12420153 -13181112 -12125414 -8355793 -3735166 -966257 -461475 -719350 -1098507
4503a098507j142617j771024j176262l01882l40533q2880K056574M259157L017640
$$ -1098507 -2241124 -4012148 -5188410 -5490292 -5830825 -5913705 -3857131 402026 3419666
4494C419666j224817l740464k032704O87735P02790o23930J78460K362797K078366
$$ 3419666 2194849 -1545615 -3578319 -2890584 -2187794 -2811724 -2633264 -270467 1807899
4485A807899q45812k028831M84821K729344P98295l068630l857153j111989R93518
$$ 1807899 962087 -1066744 -581923 2147421 2945716 -122914 -3980067 -5092056 -4098538
4476d098538O3287j885169k414650j800526j059615J98738K134958L063668J650393
$$ -4098538 -4035251 -5920420 -8335070 -10135596 -11195211 -10996473 -8861515 -5797847 -4147454
4467d147454n86662j065801K95931J230124M92817p19862q80457j62524J77773
$$ -4147454 -4734116 -5799917 -5503986 -4273862 -3781045 -4500907 -5381364 -5543888 -5366115
4458e366115m34387j251207r78150Q34213K875473K991778P24878j539263j075558
$$ -5366115 -5800502 -7051709 -8029859 -7195646 -4320173 -1328395 -603517 -2142780 -3218338
4449c218338J720170L659043K650181q4494k061702k350429j511071j29827J157186
$$ -3218338 -1498168 2160875 4811056 4726562 2664860 314431 -1196640 -1326467 -169281
4440a69281J142509o30436k360400j682550R50510K450341J320246j89732M64221
$$ -169281 973228 342792 -2017608 -3700158 -2749648 -299307 1020939 831207 1295428
4431A295428K154095J796249p94404k454015j330731N55910N35083j091359k378571
$$ 1295428 3449523 5245772 4451368 1997353 666622 1222532 1757615 666256 -1712315
4422a712315k964901l622466l636906j468152J968360L409176J572769p74650
$$ -1712315 -4677216 -8299682 -11936588 -13404740 -11436380 -8027204 -6454435 -7229085
4414g229085n18362J622976K393319O19461j311070o22995K460501M945593M216739
$$ -7229085 -7747447 -6124471 -3731152 -3111691 -4422761 -5045756 -2585255 2360338 6577077
4405F577077P25926k476064l029752j766987j224084k023141k223322n70725J370009
$$ 6577077 7303003 4826939 1797187 30200 -1193884 -3217025 -5440347 -6011072 -4641063
4396d641063J486951J75104m59187L16930J162394P64244o55015j833887j551546
$$ -4641063 -3154112 -2979008 -3438195 -3121265 -1958871 -1194627 -1849642 -3683529 -5235075
4387e235075M86662K941206L465596J147902j932312k646820k47282K903147L814181
$$ -5235075 -4748413 -1807207 1658389 2806291 873979 -1772841 -2020123 883024 4697205
4378D697205J496785k410526m975472m456610k001061j90218K75465R23171K120824
$$ 4697205 6193990 3783464 -1192008 -5648618 -7649679 -7839897 -7564432 -6641261 -4520437
4369d520437J852973m92060j772366N49422L756333L353368j6733j408651Q79840
$$ -4520437 -2667464 -3159524 -4931890 -4382468 -626135 2727233 2710500 1301849 2181689
4360B181689K996507J613996j713700l849062m220138l645037j981815O61597
$$ 2181689 5178196 6792192 5078492 1229430 -2990708 -6635745 -8617560 -7955963
4352g955963K599271K737992K349601K680756K443411j82470m236218o685402
$$ -7955963 -5356692 -2618700 -269099 2411657 4855068 4672598 436380 -6249022
4344f249022n877404k967677m05858K85800j76104L23963K257571L107926J097628
$$ -6249022 -12126426 -15094103 -15499961 -15214161 -15390265 -15066302 -12808731 -9700805 -8603177
4335h603177r76868O72196L984788K913998k900406o038131j732492M905400O406572
$$ -8603177 -9580045 -8907849 -4923061 -2009063 -4909469 -10947600 -12680092 -7774692 -1368120
4326a368120L239034J183589J738185J411646r75148k459485j462975o1166k8443
$$ -1368120 1870914 3054503 4792688 6204334 5229186 2769701 1306726 1245560 1217117
4317A217117o07154q65701r53685o26272N03687J185807q6111k076503k146069
$$ 1217117 609963 -255738 -1209423 -1835695 -1332008 -146201 -232312 -2308815 -4454884
4308d454884l16730R85198Q30598L12171k90844j495420k286624j391578l31314
$$ -4454884 -4771614 -3786416 -2955818 -2643647 -2934491 -4429911 -6716535 -8108113 -8439427
4299h439427j308449k644906q44017L060274M340037K172797R03769K439927L108201
$$ -8439427 -9747876 -12392782 -13236799 -10176525 -5836488 -3663691 -2759922 -319995 2788206
4290B788206N76644j535371K85290L203235K359244j629534m066985l168417j346196
$$ 2788206 3364850 1829479 2114769 5318004 7677248 6047714 1980729 -1187688 -2533884
4281b533884m50602L43324J741120K400033P51237k601133m951539l867304J25962
$$ -2533884 -2984486 -2641162 -900042 1499991 2251228 -349905 -5301444 -9168748 -9042786
4272i042786L422818K982999j05643k146821j497701K71240J375130J340601j50338
$$ -9042786 -5619968 -2636969 -2742612 -4889433 -6387134 -6115894 -4740764 -3400163 -3550501
4263c550501k782032m007252j534641K314232K813096M2926q35410K020428L725189
$$ -3550501 -6332533 -10339785 -11874426 -9560194 -6747098 -6704172 -7539582 -5519154 -1793965
4254a793965N32746l859030m043950r30590Q63762O63613J432348L521599M029599
$$ -1793965 -1261219 -5120249 -9164199 -10094789 -9231027 -8567414 -7135066 -3613467 416132
4245D16132K048181L6874l88425l95202j098357j810213j879005j890750k225897
$$ 416132 2464313 2501187 2112762 1717560 619203 -1191010 -3070015 -4960765 -7186662
4236g186662k157267j086849M55581J450401J352237M42208l30043j74617O42828
$$ -7186662 -9343929 -10430778 -9975197 -8524796 -7172559 -6730351 -7060394 -7235011 -6592183
4227f592183J305874J705632K103256J874688L62004j188653p80249J109765J875644
$$ -6592183 -5286309 -3580677 -1477421 397267 759271 -429382 -1209631 -99866 1775778
4218A775778N98012j071163j980870k388499j598217J576543N246294N384529
$$ 1775778 2373790 1302627 -678243 -3066742 -4664959 -3088416 2157878 7542407
4210G542407J659428j678535k226145k374083l867610m195450j430611J664234
$$ 7542407 9201835 7523300 5297155 2923072 -944538 -5139988 -6570599 -4906365
4202d906365K008932J027777J410291K347697J780326N13771L91954Q50837O18024
$$ -4906365 -2897433 -1869656 -459365 1888332 3668658 4182429 4574383 5425220 6043244
4193F043244M31669J092816J343382L64000l90930k40175q89589k678546l023914
$$ 6043244 6474913 7567729 8911111 9275111 8884181 8644006 7754417 5075871 2051957
4184B051957j097895J79603n34867m43229J683947K485010J80941j699706o40742
$$ 2051957 954062 1133665 598798 155569 1839516 4324526 4505467 2805761 2165019
4175B165019M71373o49336j354970q4569j12460k501280k522769J535853L852046
$$ 2165019 2636392 1987056 632086 547517 435057 -2066223 -4588992 -3053139 798907
4166G98907J360772r9887L099694M649325P1978l801631j024738K126823o86688
$$ 798907 2159679 2059792 5159486 9808811 9880789 6079158 5054420 7181243 6494555
4157F494555l153816J248353N272299J225293l280145L11704L892248j065287
$$ 6494555 3340739 4589092 9861391 11086684 7806539 8118243 12010491 10945204
4149A0945204l642324O184871J2508243n64989j3228779j137291R134660k9518378
$$ 10945204 7302880 13487751 25995994 25431005 12202226 11064935 20199595 -9318783
4141i318783r5698361j03487417k0952511P1650915Q3802312L0086285p562617
$$ -9318783 -105017144 -208504561 -229457072 -157806157 -74003845 -43917560 -51480177
4134e1480177J150023J5351764O141914n692714l48197P300282K194874l519077
$$ -51480177 -50330154 -34978390 -28836476 -34529190 -34877387 -27577105 -25382231 -28901308
4126b8901308K324726Q422561L086532m040110j465938L677367J545058j947661
$$ -28901308 -26576582 -18154021 -15067489 -19107599 -20573537 -16896170 -15351112 -17298773
4118a7298773J267093M855693P81706m647467k263135L654308M227751J235797
$$ -17298773 -16031680 -11175987 -10394281 -15041748 -17304883 -13650575 -9422824 -8187027
4110h187027Q86201J469063q35230k300370Q17989L156110l75687l991891r01685
$$ -8187027 -7300826 -5831763 -6666993 -8967363 -8149374 -4993264 -5368951 -9360842 -10262527
4101a0262527L859958K113922k811472k329330K071607K223978j877776k756590
$$ -10262527 -6402569 -4288647 -7100119 -9429449 -7357842 -5133864 -7011640 -9768230
4093i768230J228139M250973L601143K237752J453389m37004k515717j932217
$$ -9768230 -8540091 -4289118 -687975 1549777 3003166 2566162 50445 -1881772
4085a881772K77684O14090n27729n2500J508290R05037j705504l133044k494710
$$ -1881772 -1604088 -989998 -1517727 -1570227 -61937 843100 -862404 -3995448 -6490158
4076f490158j224580N51475K860446L308118N45219k171978j704838k35084o39694
$$ -6490158 -7714738 -7163263 -4302817 -994699 -449480 -2621458 -4326296 -4561380 -5201074
4067e201074n27381K856823N650907K836905k372779k880706O04024R07440l411474
$$ -5201074 -5728455 -2871632 2779275 5616180 3243401 362695 966719 1874159 -1537315
4058a537315n945051l122060R85040K119945J266012P22991N36770N97588J444403
$$ -1537315 -7482366 -10604426 -9619386 -7499441 -6233429 -5510438 -4973668 -4376080 -2931677
4049b931677J874911K60886j442023R9602L315023L097214j139121m352850l601481
$$ -2931677 -1056766 -795880 -2237903 -2138301 1176722 4273936 3134815 -1218035 -4819516
4040d819516j367082j85127N39014J045376n0253j893153j323220J574057K667606
$$ -4819516 -6186598 -6371725 -5832711 -4787335 -4837588 -6730741 -8053961 -6479904 -3812298
4031c812298L06641k029255j433569N95071J823086K305578J964902k70419k979000
$$ -3812298 -3505657 -5534912 -6968481 -6373410 -4550324 -2244746 -279844 -550263 -3529263
4022c529263k537299R59489K699449M13368k078453j273771P78756R01537L3844
$$ -3529263 -6066562 -5107073 -2407624 -1994256 -4072709 -5346480 -4567724 -3666187 -3632343
4013c632343L67289J070955O08663p4896j63466j281662l683918l906927l14066
$$ -3632343 -3265054 -2194099 -1585436 -1660332 -1823798 -3105460 -6789378 -10696305 -11010371
4004a1010371K763413J259856j639875l87403L686268M384327N87716k331616
$$ -11010371 -8246958 -6987102 -8626977 -9014380 -5328112 -943785 -356069 -2687685
3996b687685j174379J021096Q59612o04439r93767m88124k38853P4631Q89156
$$ -2687685 -3862064 -2840968 -1981356 -2585795 -3579562 -4067686 -4306539 -4231908 -3342752
3987c342752J227244M40378l10657O6752P63631N12714m72771j251628j644556
$$ -3342752 -2115508 -1675130 -1985787 -1919035 -1155404 -642690 -1115461 -2367089 -4011645
3978d011645j806673j393731l45103L38089k30186j343260j365825K75006K307381
$$ -4011645 -5818318 -7212049 -7557152 -7219063 -7449249 -8792509 -10158334 -9883328 -7575947
3969g575947K771736Q96807j918937l205417k027612j39927K93653l33743K38850
$$ -7575947 -4804211 -3907404 -5826341 -9031758 -11059370 -11199297 -10905644 -11239387 -11000537
3960a1000537K606062M549484L933700J302489j145395j946893j053915N29324
$$ -11000537 -8394475 -3844991 88709 1391198 245803 -1701090 -2755005 -2225681
3952b225681R17949j340272m828028n623017j916902K994465M624990L167713
$$ -2225681 -1307732 -2648004 -7476032 -13099049 -15015951 -12021486 -7396496 -4228783
3944d228783K458675L538373L140145l66671l488282k749920k49622l03156k452737
$$ -4228783 -1770108 1768265 4908410 4541739 1053457 -1696463 -1946085 -2249241 -4701978
3935d701978k273644J339646M286862L594957J474357R59557R67732j168641m499696
$$ -4701978 -6975622 -5635976 -1349114 2245843 3720200 4679757 5647489 4478848 -20848
3926b0848n386681k809107M74018K121803K786361L721605M095153K304604j087971
$$ -20848 -5407529 -8216636 -7742618 -5620815 -2834454 887151 4982304 7286908 6198937
3917F198937l432064l118994j541552j168458k158078k192981n9258K148961J856196
$$ 6198937 2766873 -352121 -1893673 -3062131 -5220209 -7413190 -7472448 -5323487 -3467291
3908c467291j21156p70157N25083J222065k80023k410627l081477k126267j85569
$$ -3467291 -3588447 -4358604 -3833521 -2611456 -2891479 -5302106 -8383583 -10509850 -10695419
3899a0695419K268948L682049K059146j506439k863832m09263K334811K216925
$$ -10695419 -8426471 -4744422 -2685276 -4191715 -7055547 -7464810 -5129999 -2913074
3891b913074J225281K308536L609821J570152k397075l622648j517571O7617n14201
$$ -2913074 -1687793 620743 4230564 5800716 3403641 -219007 -1736578 -1668961 -2183162
3882b183162r78525l63353o86934k143889j721264J350889L295827J532551j167304
$$ -2183162 -3161687 -3525040 -4211974 -6355863 -8077127 -6726238 -3430411 -1897860 -3065164
3873c065164j184696N73342R61795l41164j234971p77898M28493J914178L047789
$$ -3065164 -4249860 -3676518 -2714723 -3055887 -4290858 -5068756 -4640263 -2726085 321704
3864C21704K592676O62376n44438l433Q3739k133047m500831l710558l22740K100974
$$ 321704 2914380 3576756 3032318 3028885 3112624 979577 -3521254 -7231812 -7554552 -5453578
3854e453578J882750L19292j260101k450068k260381J65984L156296L641729J162682
$$ -5453578 -3570828 -3251536 -4511637 -6961705 -9222086 -9056102 -5899806 -2258077 -1095395
3845a095395j633353k832854l091232l080795j880575O82754K431824J633815
$$ -1095395 -2728748 -5561602 -8652834 -11733629 -13614204 -12931450 -10499626 -8865811
3837h865811j18821l0500J773002K606517J575199J057642K798515M519719K595842
$$ -8865811 -8984632 -9015132 -7242130 -4635613 -3060414 -2002772 795743 5315462 7911304
3828G911304k593050o395789n515735j906972K21217k49423q70593L16993K331898
$$ 7911304 5318254 -1077535 -6593270 -8500242 -8279025 -8528448 -9399041 -9082048 -6750150
3819f750150K900306J049162k057238l803107k040234K319425N203143L654820
$$ -6750150 -3849844 -2800682 -4857920 -8661027 -10701261 -8381836 -3178693 476127
3811D76127k84659k101848p59519N93221j90499j605006j817378j353018q76919
$$ 476127 191468 -1910380 -2669899 -2076678 -2267177 -3872183 -5689561 -7042579 -7919498
3802g919498O95236L621712N318852L537366j45882k428799k458444j640218o99456
$$ -7919498 -7224262 -3602550 1716302 5253668 5107786 2678987 220543 -1419675 -2119131
3793b119131N23914J336196P73180n66768j305644j312402j100028r4614K231958
$$ -2119131 -1595217 -259021 514159 -52609 -1358253 -2670655 -3770683 -3865297 -1633339
3784a633339M104155K825989j433156n198597n417029k365496J158071K457639
$$ -1633339 2470816 5296805 3863649 -1334948 -6751977 -9117473 -7959402 -5501763
3776e501763R75052j300190j745050j8375J731346J953712J324238N33758j057703
$$ -5501763 -4526711 -5826901 -7571951 -7590326 -5858980 -3905268 -2581030 -2047272 -3104975
3767c104975k812754j685371L180932O984804M576857j826606m700895j075238
$$ -3104975 -5917729 -7603100 -4422168 2562636 7139493 5312887 611992 -463246
3759d63246L897400M253509L50857l153528l586405k162411j128608j053699p60419
$$ -463246 3434154 7687663 8038520 4884992 1298587 -863824 -1992432 -3046131 -3806550
3750c806550P14226K168326J165747k207292m203709k197555J060264J229691
$$ -3806550 -3092324 -923998 241749 -1965543 -6169252 -8366807 -7306543 -6076852
3742f076852q70541o48494K500302L923430J250556j886261j989270r40985j787071
$$ -6076852 -6947393 -7595887 -5095585 -1172155 78401 -1807860 -3797130 -4738115 -6525186
3733f525186l143468j954800R05609K146059J423355J038069J395078Q43613m48219
$$ -6525186 -9668654 -11623454 -10717845 -8571786 -7148431 -6110362 -4715284 -3871671 -4319890
3724d319890l81948J109396J449858n58072k951304l616942k671909j125443N73314
$$ -4319890 -4701838 -3592442 -2142584 -2700656 -5651960 -9268902 -11940811 -13066254 -12492940
3715a2492940J821864J765092R15173J136319K950877M277618K944792n35279
$$ -12492940 -10671076 -8905984 -7990811 -6854492 -3903615 374003 3318795 2783516
3707B783516l577613m206400k590027n08250M32667M68304J217836K915112L193998
$$ 2783516 -794097 -5000497 -7590524 -8098774 -7666107 -7197803 -5979967 -3064855 129143
3698A29143L69148l042800k868511P31465K998002J175184j814709k076182j54458
$$ 129143 498291 -2544509 -5413020 -4681555 -1683553 -508369 -2323078 -4399260 -4553718
3689d553718R72414R51760J573022K540645J604223j190092k943441k286233j211593
$$ -4553718 -3581304 -2629544 -1056522 1484123 3088346 1898254 -1045187 -3331420 -4543013
3680d543013j441782j870806j235177o27888j059889p81151J951147M877053M020626
$$ -4543013 -5984795 -7855601 -9090778 -9718666 -10778555 -11559706 -9608559 -4731506 -710880
3671g10880l06780l230838j791052J344946K178228Q05862J32482Q05826M78220
$$ -710880 -1017660 -4248498 -6039550 -4694604 -2516376 -1710514 -1578032 -772206 -293986
3662b93986k015637m399049l883716p81320K045807K574742J391016L88160O36124
$$ -293986 -2309623 -6708672 -10592388 -11373708 -9327901 -6753159 -5362143 -4973983 -4337859
3653d337859J665725K289300J823437O91565o827L76424J235017J192950l52073
$$ -4337859 -2672134 -382834 1440603 2132168 2125341 2501765 3736782 4929732 4577659
3644D577659k257676k659622j143029N98526P46458l95048q81138K89680J959874
$$ 4577659 2319983 -339639 -1482668 -884142 -137684 -532732 -1413870 -1124190 835684
3635H35684K359324J065738r26683k401603k772123k361311k216795k978927l620592
$$ 835684 3195008 4260746 3334063 932460 -1839663 -4200974 -6417769 -9396696 -13017288
3626a3017288k340859O33772K414147R66654j755549k142173J12942J791377J207615
$$ -13017288 -15358147 -14724375 -12310228 -11343574 -13099123 -15241296 -15128354 -13336977 -12129362
3617a2129362Q16203L170327O392362O352212K551956j034445j367315o483q2329
$$ -12129362 -11313159 -8142832 -1750470 4601742 7153698 6119253 4751938 4745455 4663126
3608D663126j702708k552134j897102j356858j727892j587164J5463J543623J218809
$$ 4663126 2960418 408284 -1488818 -2845676 -4573568 -6160732 -6145269 -4601646 -3382837
3599c382837j40758l54060R09343K029152K061955J522871O83480q66678k629214
$$ -3382837 -3523595 -3877655 -2968312 -939160 1122795 2645666 3329146 2462468 -166746
3590a66746l105182k009788r06626q08070p83887J1933O31452J65047j74688J213939
$$ -166746 -3271928 -5281716 -6188342 -6996412 -7780299 -7768366 -7136914 -6971867 -7146555 -5932616
3580e932616L387370L786704J842605k94374p74438j02303K62204q4487n90472
$$ -5932616 -2545246 1241458 3084063 2789689 2015251 1912948 2175152 2090665 1500193
3571A500193q37008p32915k09923O03540J165358R18155j53740j500977k461762
$$ 1500193 663185 -69730 -279653 323887 1489245 2407400 2253660 752683 -1709079
3562a709079k726632k408469j621064j86944J818688L415501L431242J979217
$$ -1709079 -4435711 -6844180 -8465244 -8652188 -6833500 -3417999 13243 1992460
3554A992460L07890r89785k346034l352448k279418J155473M018186L292625Q4349
$$ 1992460 2300350 1310565 -1035469 -4387917 -6667335 -5511862 -1493676 1798949 1883298
3545A883298j602797k20307J539383R67557q16697q30633J245978K545627J010910
$$ 1883298 280501 60194 1599577 2567134 1750437 919804 2165782 4711409 5722319
3536E722319j716566k351109j45173K335205K736071J705069J038285M02252j751703
$$ 5722319 4005753 1654644 1509471 3844676 6580747 8285816 9324101 9726353 7974650
3527G974650m412495m253578p38497J892403j024m198208n568571k926886K15852
$$ 7974650 3562155 -691423 -1429920 462483 461459 -3736749 -9305320 -12232206 -12016354
3518a2016354J128902P19550O14297N76377P4489m5217Q49739J554281O90184
$$ -12016354 -10887452 -10167902 -9553605 -8977228 -8902739 -8947956 -8098217 -6543936 -5853752
3509e853752r91541j495253l12251R53509O77200q22290j656375n39504J625854
$$ -5853752 -6845293 -8340546 -8652797 -7699288 -7022088 -7844378 -9500753 -10040257 -8414403
3500h414403K659479J592000l82597j604788j654545r34664K28337J229886J174751
$$ -8414403 -5754924 -4162924 -4545521 -6150309 -7804854 -8739518 -8511181 -7281295 -6106544
3491f106544K94746J16880J050409J350879j3624j277840p09481L67020M0962
$$ -6106544 -5811798 -5694918 -4644509 -3293630 -3307254 -4585094 -5294575 -4927555 -4886593
3482d886593n25561P01110K286624J309141j176277j233204J438100K793166R53139
$$ -4886593 -5412154 -4711044 -2424420 -1115279 -2291556 -3524760 -2086660 706506 1659645
3473A659645j244089j519284j382356k113285j904807K98225J939279Q61196j077028
$$ 1659645 415556 -1103728 -2486084 -4599369 -6504176 -6205951 -4266672 -3405476 -4482504
3464d482504j390749r00198j156880r63765J015683K855579K352559J106601J697187
$$ -4482504 -5873253 -6773451 -7930331 -8894096 -7878413 -5022834 -2670275 -1563674 133513
3455A33513K814577J430410j683558k930386j466704K62653Q98006J134786Q56892
$$ 133513 2948090 4378500 2694942 -235444 -1702148 -1439495 -541489 593297 1450189
3446A450189p04542k184542j375774P37536J091556l32563o08067O91606O84933
$$ 1450189 745647 -1438895 -2814669 -2077133 -985577 -1318140 -1926207 -1234601 -549668
3437e49668j235029j686510Q91094K979079J292847k121326l223314j644204K58514
$$ -549668 -1784697 -3471207 -2580113 398966 1691813 -429513 -3652827 -5297031 -5038517
3428e038517J731359L347372L857676J261912l122161n049356k584340J477185
$$ -5038517 -3307158 40214 3897890 5159802 2037641 -3011715 -5596055 -4118870
3420d118870L413679K925863K352084K783031K752385Q39026j838290k803649
$$ -4118870 -705191 2220672 4572756 7355787 10108172 10947198 9108908 6305259
3412F305259j494180p849j63668j136429j151023m00203m30417j173627q20002
$$ 6305259 4811079 4803230 4639562 3503133 2352110 1951907 1521490 347863 -472139
3403d72139J127090K750556K367854N10059j525867l286775m223058k997275M47971
$$ -472139 654951 3405507 5773361 6283420 4757553 1470778 -2752280 -5749555 -5301584
3394e301584L371163K901866j89739k230663j141061J378172K401299J119297
$$ -5301584 -1930421 971445 781706 -1448957 -2590018 -1211846 1189453 2308750
3386B308750r84226k224890k053127q37691O49447J439714Q55003o64624j575089
$$ 2308750 1324524 -900366 -2953493 -3791184 -3141737 -1702023 -847020 -1511644 -3086733
3377c086733p58010R76805J648445O19204m36238K93428K264558L218803J997973
$$ -3086733 -3844743 -2867938 -1219493 -600289 -1036527 -743099 1521459 4740262 6738235
3368F738235l10881j995279k434636j948830q91997M62302J602606J941857J258935
$$ 6738235 6427354 4432075 1997439 48609 -843388 -381086 1221520 3163377 4422312
3359D422312j53580j582346k095862j073669J099209K974894L059698J168240
$$ 4422312 4268732 2686386 590524 -483145 616064 3590958 6650656 7818896
3351G818896j263620k497719k223726j626186j600991j631084j008319k64710
$$ 7818896 6555276 4057557 1833831 207645 -1393346 -3024430 -4032749 -4297459
3343d297459j52836P2309J518068L064533K162691j320444m246022m124094j910279
$$ -4297459 -4450295 -4377986 -2859918 204615 2367306 1046862 -3199160 -7323254 -9233533
3334i233533J60759J398696J878758J068605o89603j207655O14576K406196J466492
$$ -9233533 -9072774 -7674078 -5795320 -4726715 -5416318 -6623973 -6009397 -3603201 -2136709
3325b136709j029635j840853o40425M2469o39345q18167L35185J119584N20333
$$ -2136709 -3166344 -5007197 -5647622 -5605153 -6244498 -7062665 -6727480 -5607896 -5087563
3316e087563J26314J437552L367772L901577K741437J035059l74690j281124j497439
$$ -5087563 -4961249 -3523697 -155925 3745652 6487089 7522148 7147458 5866334 4368895
3307D368895r33027n9132K03892p65577k348565k676118o95588J674088J412669
$$ 4368895 3435868 3376736 3580628 2815051 466486 -2209632 -2905220 -1231132 181537
3298A81537r32331j221287J941275M124169J512673k628317k586597Q87861K027810
$$ 181537 -750794 -1972081 -30806 4093363 5606036 2977719 391122 1278983 3306793
3289C306793n38514k161496m67698J162329L76325K9053K277025L737550R18724
$$ 3306793 2768279 606783 139085 1301414 1677739 1706792 3983817 7721367 8640091
3280H640091l404506l943161m58694K766800L229087K015805N90774o23901j143053
$$ 8640091 5235585 1292424 833730 3600530 6829617 8845422 9436196 8812295 7669242
3271G669242p80501n47008j106995j430427p97355m09732r58276p84845R45831
$$ 7669242 6888741 6341733 5234738 3804311 3006956 2597224 1638948 854103 1799934
3262A799934J660031o75570l202857j895001J851933K894277M6578k413559j263931
$$ 1799934 3459965 2784395 -418462 -2313463 -461530 2432747 2479325 65766 -1198165
3253a198165J760376L497429L194925J545402j010565l409047l786389j820474
$$ -1198165 562211 4059640 7254565 8799967 7789402 4380355 593966 -1226508
3245a226508L62473P66632l09829j333323j328623j33955J656477K586643J616853
$$ -1226508 -864035 -97403 -407232 -1740555 -3069178 -3203133 -1546656 1039987 2656840
3236B656840k12066q59741j28615K63719m56082j169143j155029j283619k171524
$$ 2656840 2444774 1585033 1456418 1720137 1264055 94912 -1060117 -2343736 -4515260
3227d515260k942630k678813j574389K5147K083563L659822L109969O54228r72303
$$ -4515260 -7457890 -10136703 -11711092 -11685945 -9602382 -5942560 -2832591 -2178363 -3150666
3218c150666O6092K025886K010970J409j496376j255495o48170r43548j237124
$$ -3150666 -3084574 -1058688 952282 953691 -542685 -1798180 -2446350 -3389898 -4627022
3209d627022j62477J534543J653734m71447k965292l668962k313694N1905K522328
$$ -4627022 -4789499 -3254956 -1601222 -2072669 -5037961 -8706923 -11020617 -10968712 -8446384
3200h446384M079199L100528p83379m733632m976148j448329J985148K637246
$$ -8446384 -4367185 -1266657 -2050036 -6783668 -11759816 -13208145 -11222997 -8585751
3192h585751K002736K458139L352484K512911K1971j839407j592169K87390K389311
$$ -8585751 -6583015 -4124876 -772392 1740519 1762490 -76917 -1669086 -1381696 1007615
3183A007615L051505J134433k285534m188292l160907j225511m78191O230J498152
$$ 1007615 4059120 5193553 2908019 -1280273 -4441180 -5666691 -6144882 -6138652 -4640500
3174d640500K195158R2889k503489j778010J178843J644197j010077k090900O52742
$$ -4640500 -2445342 -2352453 -4855942 -6633952 -5455109 -3810912 -4820989 -6911889 -6259147
3165f259147L170066J628999j587636k020338L9519J041280L51339M84199J979184
$$ -6259147 -3089081 -1460082 -3047718 -5068056 -5028537 -3987257 -3635918 -3151719 -1172535
3156a172535K288794K24982j968793k188741j447817j635790k239839j386674
$$ -1172535 1116259 1341241 -627552 -2816293 -4264110 -5899900 -8139739 -9526413
3148i526413Q19314K208091J815967J286281K174106L408885K942875R47299n36048
$$ -9526413 -8707099 -6499008 -4683041 -3396760 -1222654 2186231 5129106 6076405 5540357
3139E540357o67140l58850J15516J356753K169885p8984m768586o931684l656970
$$ 5540357 4873217 4514367 4629883 5986636 8156521 8077537 3308951 -3622733 -7279703
3130g279703J205227K331713N12393L37096J946688R00684l517847n781664k082230
$$ -7279703 -6074476 -3742763 -3230370 -2893274 -946586 -45902 -3563749 -9345413 -11427643
3121a1427643L912585O329091M584793K268048J173452J47898j442783k400235
$$ -11427643 -7515058 -1185967 3398826 5666874 6840326 6988224 5545441 3145206
3113C145206j679809L09079K172147K220528l49777l833221m835372k105558J633254
$$ 3145206 1465397 1774476 3946623 6167151 5817374 1984153 -2851219 -4956777 -3323523
3104c323523L042731K040377P65054P3575q21923k027221k484201j788118q68749
$$ -3323523 -280792 1759585 2524639 2598214 1776291 -250930 -2735131 -4523249 -5391998
3095e391998o37448r44298r57165j0866J670670K703089J621824j180808l250728
$$ -5391998 -6029446 -6973744 -7930909 -7941775 -6271105 -3568016 -1946192 -3127000 -6377728
3086f377728k515171M80789L228809L727208K114763M05873N97328K359185K946796
$$ -6377728 -8892899 -8412110 -5183301 -1456093 658670 1064543 1661871 4021056 6967852
3077F967852M97439l112459m408614k960717j609963j922178k050916j03019K719096
$$ 6967852 7465291 4352832 -55782 -3016499 -4626462 -6548640 -8599556 -8702575 -5983479
3068e983479L843701K544728J33956j678465j631381M27975K835460L445245K220781
$$ -5983479 -2139778 404950 538906 -1139559 -2770940 -2342965 492495 3937740 6158521
3059F158521Q58255l29216k626657n443271n771549k660178P13544J503528J025330
$$ 6158521 7016776 6687560 4060903 -1382368 -7153917 -9814095 -9100551 -7597023 -6571693
3050f571693J678659K560789J259531j674097l231575k135853j615J173319Q38060
$$ -6571693 -4893034 -2332245 -1072714 -2746811 -5978386 -8114239 -8115854 -6942535 -6104475
3041f104475j30463k9743J930323L652001K014690k188875m152840j809153P52924
$$ -6104475 -6234938 -6264681 -4334358 -682357 1332333 -856542 -5009382 -6818535 -6065611
3032f065611l65712k528332q65176L696625N816519L749907Q51246l87117q53920
$$ -6065611 -6431323 -8959655 -9824831 -6128206 -311687 3438220 4289466 3902349 3048429
3023C048429j267260q18315r7687j121333l348511l485461n42794K310668K274463
$$ 3048429 1781169 962854 865167 -256166 -3604677 -7090138 -7632932 -5322264 -3047801
3014c047801K51001j540764k318379j901025q2846J778463J354331j002213j918906
$$ -3047801 -2796800 -4337564 -6655943 -8556968 -8639814 -6861351 -5507020 -6509233 -8428139
3005h428139P1805J982352P66215k117047k937871p98043J910295L116496K973139
$$ -8428139 -8356334 -6373982 -5607767 -7724814 -10662685 -11460728 -9550433 -6433937 -3460798
2996c460798K520410K074955J136625o61030k515347k709243o71303J741424K328858
$$ -3460798 -940388 1134567 2271192 1610162 -905185 -3614428 -4285731 -2544307 -215449
2987b15449J368693O64398M59464l36789j281232p41284O65068J43327k822494
$$ -215449 1153244 1817642 2277106 1940317 659085 -82199 582869 726196 -2096298
2978b096298n007691l806775n46665J970412K888913K770081J858428N35817l14970
$$ -2096298 -7103989 -10910764 -11457429 -9487017 -6598104 -3828023 -1969595 -1433778 -1748748
2969a748748p50013j746604k776176j790926J124783K861511J840495O40568J711416
$$ -1748748 -2498761 -4245365 -7021541 -8812467 -7687684 -4826173 -2985678 -2345110 -633694
2960f33694L196132K111283n23306j313822J69153J292473Q17378k2976n85097
$$ -633694 2562438 4673721 4150415 2836593 3005746 4298219 5115597 5092621 4507524
2951D507524j576011k564940j921890L1326O10000j349456l479592l129607q45276
$$ 4507524 2931513 366573 -1555317 -1523991 -913991 -2263447 -5743039 -8872646 -9717922
2942i717922Q94266J119685R27448J252471J640865J351571O54072M82905J110773
$$ -9717922 -8823656 -7703971 -6776523 -5524052 -3883187 -2531616 -1877544 -1394639 -283866
2933b83866J672649J177506l00711j779306k482830k318839j492017l93612K70865
$$ -283866 1388783 2566289 2265578 486272 -1996558 -4315397 -5807414 -6201026 -5930161
2924e930161J96486L12121J776418L958832M639996K639965q62682l961473n625386
$$ -5930161 -5733675 -5421554 -3645136 313696 4953692 7593657 6730975 2769502 -2855884
2915b855884n235245k304602K065371M804512L679514L1780k570532k227377l46474
$$ -2855884 -8091129 -10395731 -8330360 -3525848 153666 185446 -2385086 -4612463 -4958937
2906d958937M79955m83901j415630k77021K258035L153586J070352j226821m65049
$$ -4958937 -4478982 -4962883 -6378513 -6655534 -4397499 -1243913 -173561 -1400382 -1865431
2897a865431K133937K396240m70254k672713j837598m66685j342699k861750k023287
$$ -1865431 268506 2664746 2194492 -478221 -2315819 -2782504 -4125203 -6986953 -9010240
2888i010240M07378J277794J21986o12652K90240J580406K240840K678553L061948
$$ -9010240 -8602862 -7325068 -7203082 -7815734 -7525494 -5945088 -3704248 -1025695 2036253
2879B036253K683030J287548m69286j827806k092353p97482R63497O20188k616642
$$ 2036253 4719283 6006831 5537545 3709739 1617386 819904 1783401 2403589 -213053
2870b13053n800596n674723k845208k36573J197511K342524K832343J658284J22949
$$ -213053 -6013649 -11688372 -14533580 -14770153 -13572642 -11230118 -8397775 -6739491 -6616542
2861f616542L57444J186097m11143l491093l329435J340147N598280N011462J313094
$$ -6616542 -6259098 -5073001 -5484144 -8975237 -12304672 -10964525 -5366245 -354783 958311
2852I58311j202548j696193k035770k595666k304951j319159m91379O66689K650033
$$ 958311 -244237 -1940430 -3976200 -6571866 -8876817 -10195976 -10687355 -10020666 -7370633
2843g370633L739795K151275m43774p53425J158717K021152O00343n73360L92062
$$ -7370633 -3630838 -1479563 -1923337 -2676762 -1518045 503107 1103450 530090 922152
2834I22152J760193J232345n08876j401887j301915j419112j750371j413100p55543
$$ 922152 2682345 3914690 3405814 2003927 702012 -717100 -2467471 -3880571 -4636114
2825d636114p69613p89444P26738K991198L094314L31727k080967j276426J140872
$$ -4636114 -5405727 -6195171 -5468433 -2477235 617079 948806 -1132161 -2408587 -1267715
2816a267715J378937j298798l907994l812115j343497J456110K741927J553303
$$ -1267715 111222 -1187576 -5095570 -8907685 -10251182 -8795072 -6053145 -4499842
2808d499842j413679l527592k615884R6942J333825K21225q72508l90250K13148
$$ -4499842 -5913521 -9441113 -12056997 -11960055 -10626230 -10405005 -11277513 -11667763 -11454615
2799a1454615n13340j399068q53848M42063J069227J338531K200008L229390L690917
$$ -11454615 -11967955 -13367023 -14220871 -13778808 -12709581 -11371050 -9171042 -5941652 -2250735
2790b250735M093250M669407L926487R99881k083733k989686k478101k569414
$$ -2250735 1842515 6511922 10438409 11438290 9354557 6364871 3886770 1317356
2782A317356k787557j339896J121889K288777J958019J650617J188915o81029
$$ 1317356 -1470201 -2810097 -1688208 600569 2558588 4209205 5398120 4717091
2774D717091k708567k198954K32671R84093r23634k509526j940331r98323j215507
$$ 4717091 2008524 -190430 42241 1026334 102700 -2406826 -4347157 -5345480 -6560987
2765f560987j455008r66523j083131j948531j216182J743349L866421L149185
$$ -6560987 -8015995 -8982518 -10065649 -12014180 -13230362 -11487013 -7620592 -4471407
2757d471407J910495K394886K547393j74716l658652l964732j289995R58154J525109
$$ -4471407 -2560912 -166026 2381367 2206651 -1452001 -5416733 -6706728 -5748574 -4223465
2748d223465J750937J840690Q01590m95606j18551J235273R83774r04371j798065
$$ -4223465 -2472528 -631838 169752 -325854 -444405 790868 1774642 870271 -927794
2739i27794j005187q76063k442315l266462j144093K525168M588975L645112O68220
$$ -927794 -1932981 -2809044 -5251359 -8517821 -9661914 -7136746 -2547771 1097341 1765561
2730A765561k303547l345711j995488k3699M46006k82667k05860R31887J150747
$$ 1765561 -537986 -3883697 -5879185 -5902884 -5456878 -5739545 -5945405 -5013518 -3862771
2721c862771l44013j554225n41651J911845L577476L318466J554964m69129j267970
$$ -3862771 -4206784 -5761009 -6302660 -4390815 -813339 2505127 4060091 3590962 2322992
2712B322992l40174P37439j9345j907839k029899N63600L337841L772229K254859
$$ 2322992 1982818 2720257 2700912 793073 -1236826 -673226 2664615 6436844 8691703
2703H691703L61732j488063l059074l123008j354883K35922r2564j191033j151325
$$ 8691703 9053435 7565372 4506298 1383290 28407 264329 171765 -1019268 -2170593
2694b170593o22347j392673k739073k193475L66839K285167K021943R24027N85657
$$ -2170593 -2792940 -4185613 -6924686 -9118161 -8751322 -6466155 -4444212 -3520185 -2934528
2685b934528P88018Q49645R21401R29888M5712j685950k746948k299250j520490
$$ -2934528 -2146510 -1296865 -375464 554424 600136 -1085814 -3832762 -6132012 -7652502
2676g652502j636040j965770j237271L21885J575228K151624K174520J342138
$$ -7652502 -9288542 -11254312 -12491583 -12169698 -10594470 -8442846 -6268326 -4926188
2668d926188j90849r71214o5825J062076N08357q30242l55468K001136L276839
$$ -4926188 -5117037 -6088251 -6154076 -5092000 -4583643 -5413885 -5769353 -3768217 -491378
2659d91378J815862m00229r89939n21638q23336j648282j287914L37610J385175
$$ -491378 1324484 924255 -65684 -587322 -1410658 -3058940 -4346854 -4009244 -2624069
2650b624069P58110o00476j198144n77659O46095J425956J044920q0384p39147
$$ -2624069 -1865959 -2466435 -3664579 -4242238 -3596143 -2170187 -1125267 -1205651 -1944798
2641a944798o42196q87164j816955j777869L13277K471607K156236M01798L87313
$$ -1944798 -2586994 -3474158 -5291113 -7068982 -6755705 -4284098 -2127862 -1726064 -1338751
2632a338751K097541J969123j303644m181276l435317q56895p5310r37218l57732
$$ -1338751 758790 2727913 1424269 -2757007 -6192324 -7049219 -7124529 -8061747 -8419479
2623h419479K401889M591367L939060J138636j771351l382193l126581j443288
$$ -8419479 -6017590 -1426223 2512837 3651473 1880122 -1502071 -4628652 -6071940
2615f071940M9447J71168n9635J028988K728455K687717P65159m01472O21799
$$ -6071940 -6022493 -5851325 -5910960 -4881972 -2153517 534200 1299359 897887 1519686
2606A519686J983167J645256K89646m88880q46682j538474j837747r95828m15448
$$ 1519686 3502853 5148109 5437755 4948875 4102193 2563719 725972 -269856 -685304
2597f85304j603986k860135j222766K386276L443314K26245l253979k664599Q31428
$$ -685304 -2289290 -5149425 -6372191 -3985915 -542601 -316356 -3570335 -6234934 -5403506
2588e403506K731554J428053o24145j086819j73336R22416J394914M76164j796115
$$ -5403506 -2671952 -1243899 -1868044 -2954863 -3128199 -2205783 -810869 -334705 -2130820
2579b130820l203847j432774J920794K499736m21278k014625J285447O026600
$$ -2130820 -5334667 -6767441 -4846647 -2346911 -2768189 -4782814 -3497367 2529233
2571B529233O168228J184252m060571o189823n955045m618180k155251M22800
$$ 2529233 8697461 9881713 5821142 -368681 -6323726 -10941906 -13097157 -12674357
2563a2674357J086884L56408J247318M231574N732173L394842n44131l197363
$$ -12674357 -11587473 -11231065 -9983747 -5752173 -20000 3374842 2830711 -366652
2555c66652m778523n773712m109530R10134M856346L299989j044862j512309K791245
$$ -366652 -5145175 -10918887 -15028417 -14118283 -9261937 -5961948 -7006810 -8519119 -5727874
2546e727874N776957L522647m67779j164945J022126K152195P32456j457083k836924
$$ -5727874 49083 3571730 3103951 1939006 2961132 5113327 5845783 4388700 1551776
2537A551776l233530k344433K26499L241862M228190K262251r07241l097649m019230
$$ 1551776 -1681754 -4026187 -3799688 -557826 3670364 5932615 5025374 1927725 -2091505
2528b091505m570604m627988k984526L12176K960171K888178R84955j02800M79154
$$ -2091505 -6662109 -11290097 -14274623 -13962447 -11002276 -8114098 -7129143 -7231943 -6752789
2519f752789J148082P15872j29277n06806m23421L19409J884083K405025o07478
$$ -6752789 -5604707 -4888835 -5018112 -5524918 -5948339 -5628930 -3744847 -1339822 -1947300
2510a947300n404976o196516r46180M529572M145235J66135p56872K076609L143971
$$ -1947300 -7352276 -13548792 -14494972 -9965400 -5820165 -5654030 -6410902 -4334293 -1190322
2501a190322R7968k897100k224824L83604J951600K341855K065021L14027k364174
$$ -1190322 -1092354 -3989454 -6214278 -5830674 -3879074 -1537219 527802 841829 -1522345
2492a522345l198009j401866K23378J13707O32504L381271N620255M515387J560111
$$ -1522345 -4720354 -6122220 -5898842 -5785135 -5152631 -1771360 3848895 8364282 9924393
2483I924393n21156j976962l618296l598009q28518J341998l88307l453553l040617
$$ 9924393 9403237 7426275 3807979 209970 -618548 723450 335143 -3118410 -6159027
2474f159027L20661K019744R40008K69971J221146J473710L38030K94049K201809
$$ -6159027 -5838366 -3818622 -2878614 -2608643 -1387497 86213 424243 718292 2920101
2465B920101L473792K460031P02426n55414k217344m078800l571010l3459K956667
$$ 2920101 6393893 8853924 9556350 9000936 6783592 2704792 -866218 -899677 2056990
2456B056990K089547j198724l062911k192705l82774L71536l17673j255466o42238
$$ 2056990 4146537 2947813 -115098 -2307803 -2690577 -2319041 -2636714 -3892180 -4534418
2447d534418J694150K964676N50433l429047l875468R6334L335798J861150j606678
$$ -4534418 -2840268 124408 674841 -2754206 -6629674 -6533340 -3197542 -1336392 -2943070
2438b943070k057845P75660L147434K982966J348566m93390k187192l037399k444360
$$ -2943070 -5000915 -4225255 -1077821 1905145 3253711 2760321 573129 -2464270 -4908630
2429d908630j271181o31366L5445J604730K960124K518910J250387J372670K431885
$$ -4908630 -6179811 -6811177 -6775732 -5171002 -2210878 308032 1558419 2931089 5362974
2420E362974J656630j518191m058555l340093l97711J894627K291016J719261
$$ 5362974 7019604 5501413 1442858 -1897235 -2294946 -400319 1890697 3609958
2412C609958J401434J455641J099497j19122j383636j437125m78315l1827l92822
$$ 3609958 5011392 6467033 7566530 7447408 6063772 4626647 4148332 4116505 3723683
2403C723683J2190J496286J557801j255555l991592l086219o57R53375m33730
$$ 3723683 3735873 5232159 6789960 5534405 1542813 -1543406 -1544063 -590688 -1024418
2394a024418k89133K141912K656283o77702l471054j547444K466990L274630P41025
$$ -1024418 -1313551 828361 3484644 2806942 -664112 -2211556 255434 3530064 4271089
2385D271089j007928m66051J11875l31203l32724K06073p44990l093956l468040
$$ 4271089 3263161 2797110 2908985 2577782 2245058 2451131 1706141 -1387815 -4855855
2376d855855j03551M135897N576887M127517J986467K48487j067574j525532j158096
$$ -4855855 -4959406 -823509 4753378 8880895 10867362 11115849 10048275 8522743 7364647
2367G364647j436624l110682m277178k872885m6057J378609R61120N38293O34917
$$ 7364647 5928023 2817341 -1459837 -4332722 -4378779 -3000170 -2039050 -1500757 -865840
2358h65840O692j166199q34443J214435K134194K22756k032389j391106J316703
$$ -865840 -859148 -2025347 -2859790 -1645355 488839 711595 -1320794 -2711900 -1395197
2349a395197K437297P80269j016467n63967J160018J714289N75074p90252j389753
$$ -1395197 1042100 1822369 805902 241935 1401953 3116242 3691316 2901064 1511311
2340A511311j644363j790743q35003J788210M228238L610488j58776l539613l494493
$$ 1511311 -133052 -1923795 -2758798 -970588 3257650 6868138 6709362 3169749 -324744
2331c24744j220963k559l48894J13485K046637K784951M99238k596044l158975
$$ -324744 -1545707 -1548266 -1897160 -1783675 262962 3047913 3547151 951107 -2207868
2322b207868j104962R43664J318579M55424o03433r75887r8026J136161M79003
$$ -2207868 -3312830 -2369166 -1050587 -595163 -1198596 -2174483 -2272509 -1136348 -657345
2313f57345k462443m385910k222801K095302L872266K151321N23250J197263J915368
$$ -657345 -3119788 -7505698 -9728499 -7633197 -3760931 -1609610 -1086360 110903 2026271
2304B026271J14204k915601m051274k454932J88429K078819K497359J855899J562897
$$ 2026271 2140475 -775126 -4826400 -7281332 -7092903 -5014084 -2516725 -660826 902071
2295I02071K485562K993779N69916l880818n957042l473022M14222J836258J331745
$$ 902071 3387633 6381412 6951328 3070510 -2886532 -6359554 -5945332 -4109074 -2777329
$$ [...]
##END NTUPLES=NMR SPECTRUM
##END=
