##TITLE=31Pec_DE-93K2_TFA
 CDCl3, 24 sc
 9.6.2025
##JCAMPDX= 6.0         $$ Bruker NMR JCAMP-DX V2.0
##DATA TYPE= NMR FID
##DATA CLASS= NTUPLES
##ORIGIN= UXNMR, Bruker Analytische Messtechnik GmbH
##OWNER= root
$$ XWIN-NMR		Version 3.5
$$ Mon Jun  9 14:25:02 2025 Russian Standard Time (UT+4h)  she@DPX200
##.OBSERVE FREQUENCY= 81.013821
##.OBSERVE NUCLEUS= ^31P
##.DELAY= (6, 6)
##.ACQUISITION MODE= SIMULTANEOUS
##.ACQUISITION SCHEME= undefined
##.AVERAGES= 64
##.DIGITISER RES= 17
##SPECTROMETER/DATA SYSTEM= spect
##.PULSE SEQUENCE= zgpg30
##.SOLVENT NAME= CDCl3
##.SHIFT REFERENCE= (INTERNAL, CDCl3, 0, 243.863)
##AUDIT TRAIL= $$ (NUMBER, WHEN, WHO, WHERE, WHAT)
$$ ##TITLE= Audit trail, XWIN-NMR		Version 3.5
$$ ##JCAMPDX= 5.01
$$ ##ORIGIN= Bruker BioSpin GmbH
$$ ##OWNER= she
$$ F:/spectra/data/she/nmr/P31/2/audita.txt
$$ ##AUDIT TRAIL=  $$ (NUMBER, WHEN, WHO, WHERE, WHAT)
(   1,<2025-06-09 14:19:38.57 +0400>,<she>,<DPX200>,
      <created by zg, POWCHK disabled, PULCHK disabled
       configuration hash MD5:
       00 E9 B6 7A A2 85 ED C7 34 08 36 98 17 FE 4E 26
       data hash MD5: 32K
       9F B7 F0 5D AB B5 B1 D0 31 09 F1 2D 0D 8C C7 84>)
$$ ##END=
$$ 
$$ hash MD5
$$ B8 FF CB 6C 1D FE D2 DC 4B 7F 8B B2 0D CB 23 3D
##$RELAX= 
##$RELAX= 
##$RELAX= 
##$RELAX= 
##$RELAX= 
##$RELAX= 
##$RELAX= 
##$RELAX= 
$$ Bruker specific parameters
$$ --------------------------
##$DU= <F:/spectra>
##$EXPNO= 2
##$NAME= <P31>
##$PROCNO= 1
##$TYPE= <nmr>
##$USER= <she>
##$AMP= (0..31)
100 100 100 100 100 100 100 100 100 100 100 100 100 100 100 100 100 100 
100 100 100 100 100 100 100 100 100 100 100 100 100 100 
##$AQSEQ= 0
##$AQ_mod= 1
##$AUNM= <au_zg>
##$AUTOPOS= <>
##$BF1= 81.014009
##$BF2= 200.13
##$BF3= 200.13
##$BF4= 200.13
##$BF5= 200.13
##$BF6= 200.13
##$BF7= 200.13
##$BF8= 200.13
##$BYTORDA= 1
##$CFDGTYP= 0
##$CFRGTYP= 5
##$CHEMSTR= <none>
##$CNST= (0..31)
1 1 145 1 1 1 1 1 1 1 1 1 1 1 1 1 1 1 1 1 1 1 1 1 1 1 1 1 1 1 1 1 
##$CPDPRG= <waltz16>
##$CPDPRG1= <>
##$CPDPRG2= <waltz16>
##$CPDPRG3= <>
##$CPDPRG4= <mlev>
##$CPDPRG5= <mlev>
##$CPDPRG6= <mlev>
##$CPDPRG7= <mlev>
##$CPDPRG8= <mlev>
##$CPDPRGB= <>
##$CPDPRGT= <>
##$D= (0..31)
0 1 0 0 0 0 0 0 0 0.06 0 0.03 2e-05 3e-06 0 0 0.0002 0 0 0 0 0 0 0 0 0 
0 0 0 0 0 0 
##$DATE= 1749464377
##$DBL= (0..7)
120 120 120 11 120 120 24 19 
##$DBP= (0..7)
150 150 150 150 150 150 150 150 
##$DBP07= 0
##$DBPNAM0= <>
##$DBPNAM1= <>
##$DBPNAM2= <>
##$DBPNAM3= <>
##$DBPNAM4= <>
##$DBPNAM5= <>
##$DBPNAM6= <>
##$DBPNAM7= <>
##$DBPOAL= (0..7)
0.5 0.5 0.5 0.5 0.5 0.5 0.5 0.5 
##$DBPOFFS= (0..7)
0 0 0 0 0 0 0 0 
##$DE= 6
##$DECBNUC= <off>
##$DECIM= 4
##$DECNUC= <off>
##$DECSTAT= 4
##$DIGMOD= 1
##$DIGTYP= 9
##$DL= (0..7)
0 0 52 120 120 21 21 25 
##$DP= (0..7)
150 150 150 150 150 150 150 150 
##$DP07= 0
##$DPNAME0= <>
##$DPNAME1= <>
##$DPNAME2= <>
##$DPNAME3= <>
##$DPNAME4= <>
##$DPNAME5= <>
##$DPNAME6= <>
##$DPNAME7= <>
##$DPOAL= (0..7)
0.5 0.5 0.5 0.5 0.5 0.5 0.5 0.5 
##$DPOFFS= (0..7)
0 0 0 0 0 0 0 0 
##$DQDMODE= 0
##$DR= 17
$$ [...]
##$SUBNAM1= <"">
##$SUBNAM2= <"">
##$SUBNAM3= <"">
##$SUBNAM4= <"">
##$SUBNAM5= <"">
##$SUBNAM6= <"">
##$SUBNAM7= <"">
##$SUBNAM8= <"">
##$SUBNAM9= <"">
##$SW= 400.765351723535
##$SWIBOX= (0..15)
0 1 3 0 0 0 0 0 0 0 0 0 0 0 0 0 
##$SW_h= 32467.5324675325
##$TD= 32768
##$TD0= 1
##$TE= 0
##$TE2= 300
##$TE3= 300
##$TEG= 300
##$TL= (0..7)
0 120 53 12 22 120 120 120 
##$TP= (0..7)
150 150 150 150 150 150 150 150 
##$TP07= 0
##$TPNAME0= <>
##$TPNAME1= <>
##$TPNAME2= <>
##$TPNAME3= <>
##$TPNAME4= <>
##$TPNAME5= <>
##$TPNAME6= <>
##$TPNAME7= <>
##$TPOAL= (0..7)
0.5 0.5 0.5 0.5 0.5 0.5 0.5 0.5 
##$TPOFFS= (0..7)
0 0 0 0 0 0 0 0 
##$TUNHIN= 0
##$TUNHOUT= 0
##$TUNXOUT= 0
##$USERA1= <user>
##$USERA2= <user>
##$USERA3= <user>
##$USERA4= <user>
##$USERA5= <user>
##$V9= 5
##$VALIST= <valist>
##$VCLIST= <CCCCCCCCCCCCCCC>
##$VD= 0
##$VDLIST= <DDDDDDDDDDDDDDD>
##$VPLIST= <PPPPPPPPPPPPPPP>
##$VTLIST= <TTTTTTTTTTTTTTT>
##$WBST= 1024
##$WBSW= 4
##$XGAIN= (0..3)
0 0 0 0 
##$XL= 0
##$YL= 0
##$YMAX_a= 21560
##$YMIN_a= -37086
##$ZGOPTNS= <>
##$ZL1= 120
##$ZL2= 120
##$ZL3= 120
##$ZL4= 120
##$ABSF1= 60
##$ABSF2= -190
##$ABSG= 5
##$ABSL= 3
##$ALPHA= 0
##$AQORDER= 0
##$ASSFAC= 0
##$ASSFACI= 0
##$ASSFACX= 0
##$ASSWID= 0
##$AUNMP= <proc_1d>
##$AZFE= 0.1
##$AZFW= 0.5
##$BCFW= 1
##$BC_mod= 2
##$BYTORDP= 1
##$COROFFS= 0
##$CY= 9.86611175537109
##$DATMOD= 1
##$DC= 1
##$DFILT= <>
##$DTYPP= 0
##$F1P= 182.462994727601
##$F2P= 168.069089081705
##$FCOR= 0.5
##$FTSIZE= 0
##$FT_mod= 0
##$GAMMA= 1
##$GB= 0
##$INTBC= 1
##$INTSCL= 1
##$ISEN= 30
##$LB= 1.5
##$LEV0= 0
##$LPBIN= 0
##$MAXI= 11.51145
##$MC2= 0
##$MEAN= 0
##$ME_mod= 0
##$MI= 1.244541
##$NCOEF= 0
##$NC_proc= 0
##$NLEV= 6
##$NOISF1= 0
##$NOISF2= 0
##$NSP= 1
##$NTH_PI= 0
##$NZP= 1
##$OFFSET= 243.8632
##$PC= 1.4
##$PHC0= 1526.257
##$PHC1= -278.9066
##$PH_mod= 0
##$PKNL= yes
##$PPARMOD= 0
##$PSCAL= 0
##$PSIGN= 0
##$REVERSE= no
##$SF= 81.0140731611343
##$SI= 65536
##$SIGF1= 0
##$SIGF2= 0
##$SINO= 80
##$SIOLD= 65536
##$SREGLST= <31P.CDCl3>
##$SSB= 0
##$STSI= 0
##$STSR= 0
##$SW_p= 25641.0256410257
##$SYMM= 0
##$S_DEV= 0
##$TDeff= 0
##$TDoff= 0
##$TI= <>
##$TILT= no
##$TM1= 0
##$TM2= 0
##$TOPLEV= 0
##$USERP1= <user>
##$USERP2= <user>
##$USERP3= <user>
##$USERP4= <user>
##$USERP5= <user>
##$WDW= 1
##$XDIM= 64
##$YMAX_p= 0
##$YMIN_p= 0
$$ End of Bruker specific parameters
$$ ---------------------------------
##NTUPLES= NMR FID
##VAR_NAME=  TIME,          FID/REAL,        FID/IMAG
##SYMBOL=    X,             R,               I
##VAR_TYPE=  INDEPENDENT,   DEPENDENT,       DEPENDENT
##VAR_FORM=  AFFN,          ASDF,            ASDF
##VAR_DIM=   16384,         16384,           16384
##UNITS=     SECONDS,       ARBITRARY UNITS, ARBITRARY UNITS
##FACTOR=    3.08e-05,      1,               1
##FIRST=     0,             0,               0
##LAST=      0.5045964,     0,               0
##MIN=       0,             -37086,          0
##MAX=       0.5045964,     21560,           0
$$ Real data points
##PAGE= N=1
##DATA TABLE= (X++(R..R)), XYDATA
0@%%%%%%%%%%%%%%%%%%%%%%%%%%%%%Nj4J7j7K0k4K7k8L0l5M5n1N4n8O4p2P6q8
47d9J00j07J21j28J37j59J80j99K21k49K81l26L81m46N43o83R10j329K364l8649
67c7086K9222M959M962M781l274m407m936R6M992M277K705l342n522l384J563
82d394O836K741p98k993o896J93L240M417K979l129n800j264J905L522L347K36
98D142m598l105j346M783L898J403l921l191k739J458N061K123k78m455l015J444
114b336J763L530J026m638k405j282K688J750M762j873k736m393l40N222J033
129A771L412l716m660j042K859L958J840j051l414l168n80K344M667l35j145l862
145b122l702L061K964L778m08m021m615J625L403K678L038m247l288j565J185
$$ plain form
0 0 0 0 0 0 0 0 0 0 0 0 0 0 0 0 0 0 0 0 0 0 0 0 0 0 0 0 0 0 0 5 -9 8 -9 11 -13 14 -14 16 -19 26 -25 29 -29 35 -37 39 -49
47 -49 51 -56 65 -63 74 -85 95 -104 117 -132 149 -177 204 -242 301 -382 528 -801 1563 -37086
67 -37086 -7864 -2905 2057 6838 3564 -843 -5779 -5683 -691 3586 6291 2949 -2573 -5957 -4394
82 -4394 2442 5183 4385 1392 -5504 -5311 -2071 2346 5325 2196 -3604 -4868 -2963 559 3906 4142
98 4142 -456 -3561 -4907 -124 3774 5177 1256 -1935 -4674 -3216 1845 3968 3690 -765 -3780 -2336
114 -2336 -573 2957 3983 -655 -3060 -4342 -1654 96 4858 2985 249 -4144 -4484 738 1771
129 1771 5183 1467 -3193 -4235 -1376 2582 4422 3371 -43 -3211 -3791 -1447 3220 2885 1740 -2122
145 -2122 -5824 -2763 201 3979 3571 -450 -5065 -3440 -37 2641 5679 1432 -1856 -3421 -2236
160b236L628O75K536m532m714J875K474M035j676k35l374k706K253J209N264l152
176A324j220j800k492L239K526J960k440l664n73Q74M182J291j991j175k466p44
192c169L731K337j263L57m798Q5J300L227J970k688j155l060R91K989O95J722
208C271m587j76j535J337K413J585n11l377K64j039K223K252J476k223l783j95
224b605J003L889l26M30k031k488R70l15M093p52k015n57j439Q66J856J179m02
241A356j305k804R38J75L233o38K03l125J664o77L033j271O93j759r56N31J129
258D20J880j305q51r44j099K056j489K579k09k224M22r53J758J269N17j625j885
275a683j52J471K445J36j426k276o94K402m63J440j593l04q18J30J442J939k8
$$ plain form
160 -2236 1392 2067 4603 71 -4643 -2768 -294 3741 2065 1830 -1544 -4250 -1997 -788 4476 1324
176 1324 104 -1696 -4188 -949 1577 3537 1097 -2567 -3140 -2266 1916 3207 1216 41 -2425 -3169
192 -3169 562 2899 1636 1993 -2805 -2720 -1420 1807 3777 1089 -66 -3126 -2135 854 1549 3271
208 3271 -1316 -1492 -3027 -1690 723 2308 1797 -1580 -1316 -2355 -132 2120 3596 1373 -2410 -2605
224 -2605 -1602 2287 1961 2391 360 -2128 -1158 -1473 2620 1868 -147 -704 -2143 -1277 579 1758 1356
241 1356 51 -2753 -1815 -1640 1593 955 1158 -1967 -303 -980 2053 782 1475 -284 -1240 -709 420
258 420 2300 995 144 -800 -1899 157 -1332 1247 1038 -1186 -764 -1717 41 1310 1827 202 -1683
275 -1683 -1835 -364 2081 2217 791 -1485 -2179 223 -240 1200 -393 -697 -1515 -1385 57 1996 1968
292A968j749j192Q51q71P01O80R28j427n58p72N68J970j40r95j02p27j49J386
310C70J393n82j619j648R08K357j87j25l29j536j62k05J440Q44J38j832L48N36
328A09m32J876j418J47j527R75j18L82Q57j971J068n58k37J437m20J047j619m19
346h21J75K230j679K3K60r98O10n3J454L69j521j423l69O45J951O09j117n58k460
365b673J497K14K193k330L146k760k09%J761q87J482J72l826J332M60J735m81
382H26j009q74J38J236N70J395q14k731o36O18R66L22j32M37k317J196P17P51
400F59O43L19k521J0J590j739L214j558j610J229l629K772J250Q14o14k376q45
417b392J370J546N15J367j456l520J774Q1K054L10p33j422k427L046N31J086q54
$$ plain form
292 1968 219 -973 -122 -993 -292 388 1316 -111 -669 -1441 -873 1097 957 -38 -140 -867 -1016 370
310 370 1763 1181 -438 -2086 -1178 1179 992 867 538 -998 -1160 -1365 75 919 1057 -775 -427 109
328 109 -323 1553 135 282 -1245 -270 -388 -6 851 -1120 -52 -610 -847 590 170 1217 -402 -821
346 -821 -646 1584 -95 -72 188 -810 -200 -253 1201 1570 49 -1374 -1743 -1098 853 1462 345 -213 -2673
365 -2673 -1176 -962 1231 -1099 2047 -713 -922 -922 839 -48 1434 1606 -2220 -888 -428 1307 826
382 826 -183 -1057 -919 317 887 2282 1468 -1263 -1899 -1281 -315 7 -125 312 -2005 -809 -92 659
400 659 1302 1621 -900 -890 700 -1039 2175 617 -993 236 -3393 -621 629 1443 829 -1547 -2392
417 -2392 -1022 524 1039 2406 950 -2570 -796 -715 1339 1649 916 -506 -2933 113 644 1730 876
434H76j449j677J747k38J744J590j883j425j649P5K704N17K031l252j601J070
450h20j38L151n30o08j394j810J135M77L566j232k712r75J094J682r39K668k092
467E23j267j981J777K959o41L88k075j085m8J155J333j070J615k575j249J917
483c24P25J066j722l4k153j78L228j53J816k137r76j740J651J369O13J072l218
500a095L00j074R93L007P63j665l319J93M8K009L179j770j763j121q58K137J435
517A399J420j704j693j764P88L079q68O69k285K79k97M1K427J163j052l378L99
534a377l3K418J872k392Q86l516J200r07K657J191p73j388k354J319K770N36j916
551A93o29n42q1P73K488j249R76m359J364o10J249K364l46k271N73j327K22K704
$$ plain form
434 876 -573 -2250 -503 -741 1003 2593 710 -715 -2364 -2289 415 932 2963 -289 -1890 -820
450 -820 -958 2193 1663 1055 -339 -2149 -1014 -537 3029 1797 -915 -1890 -796 886 -53 2615 523
467 523 -744 -2725 -948 2011 1370 1758 -317 -1402 -1450 -295 1038 -32 1583 -992 -2241 -324
483 -324 401 1467 -255 -289 -2442 -2620 608 455 2271 134 -842 -2582 -931 438 1051 2123 -1095
500 -1095 -795 -1869 -876 2131 2894 1229 -2090 -1897 -1849 160 3339 1569 -194 -1315 -2173 -36 1399
517 1399 2819 1115 -578 -2342 -1554 1525 657 1326 -959 -680 -977 -936 1491 2654 1602 -1776 -1377
534 -1377 -1410 1008 2880 488 1374 -2142 -942 -1849 808 1999 1226 -162 -2516 -1197 1573 2109 193
551 193 -436 -978 -1059 -286 2202 953 1929 -2430 -1066 -1676 -427 1937 1591 -680 -107 -1434 -1212 1492
569A492J217j393j594k775K580Q89O34M06r88j601n60K224L11J499k669o5k468
586b861Q35K970M64J253k123l347P22J306J272M42o43j282j40R19j057L310o26
603A414o36j572q35J706J244p7m51j122j072j138L637j7P63j695k408J17K106
620c6J771p23L03j256k116O14J006L266j063k011j322j51J510r27K917j765J963
637A980m704P97K993q57K007j852k703K532j742L101M58j175q54j393J098k55
653e69K764o29j983k150J572Q56l61K006p56j477P3M03P84r92K446k151l43l41
671h48l33J307J986q7j926k256J577J054J261j508j313l64K13R57O56R70j305
688D1P2j495Q4J200J357M7k231J5j02O05J458j29n96p71q76J455n59J493j244
$$ plain form
569 1492 2709 1316 -278 -3053 -473 416 1050 1456 468 -1133 -1693 531 842 2341 -328 -393 -2861
586 -2861 -2026 944 1408 2661 538 -2809 -2087 -781 491 933 290 -992 -1132 -213 -1270 2040 1414
603 1414 778 -794 -1629 77 1321 1244 793 -329 -1401 -2539 1098 1081 1844 149 -2259 -2142 -36
620 -36 1735 1012 1315 59 -2057 -1443 -437 2829 1766 -245 -1567 -1718 -208 -1135 1782 17 1980
637 1980 -2724 -1927 1066 209 2216 364 -2339 193 -1549 1552 2010 835 -19 -1412 -314 -569
653 -569 2195 1566 -417 -2567 -995 -139 -500 1506 750 -727 -654 -251 533 -459 1987 -164 -507 -848
671 -848 -1181 126 2112 2025 99 -2157 -580 474 1735 227 -1086 -1450 -1237 -280 376 1346 41
688 41 113 -1382 -1298 -98 1259 1306 -925 -910 -1012 -407 1051 922 326 -445 -1321 134 -425 1068 -176
707a76Q40q67o47N44O8P87J456j770j615R38J71m38K349j960N96j145r71K539
725F99j612J908j737J279j147Q7N65J051l09j638l84R44Q18L78j276m41j131K263
743C17Q35l3j021k748K612j103J397J393j252L74k678J420P42j139J335p19j88
760d56k61N30R30o10L20j140O69k56p10M71J172J0k024J887k04r14Q40K66l07
779B13j56n26l95L61m3K258k356n11L039k973K066p17j020J382j7K49k276K329
797I07r34r25J124j104J171q82K087q51q69L27j21J457p91j096J602j750O70N32
815E54Q4j034L2M99l83N34j538J515j052O42p17O49l79j114K743k353J903q96
833c11%J106j976K315m39m81M73j199J942j974j3J206R37k163L20r57J691L11
$$ plain form
707 -176 664 -203 -850 -306 -238 549 2005 235 -1380 -442 -271 -709 1640 -320 276 -869 -1840 699
725 699 -913 995 -742 537 -610 -523 42 1093 784 -854 -1238 -294 524 902 -374 -815 -1946 317
743 317 1152 1119 98 -2650 -38 -1141 256 1649 397 771 -1907 -487 255 -884 451 -268 -456
760 -456 -717 -187 743 133 453 -687 -18 -274 -984 -513 659 669 -1355 532 328 -586 254 520 213
779 213 57 -469 -864 -503 -546 1712 -644 -1155 1884 -1089 977 260 -760 622 605 854 -1422 907
797 907 -27 -952 172 -932 239 -643 1444 593 -276 51 -70 1387 596 -500 1102 -648 22 554
815 554 638 -396 -364 135 -248 286 -1252 263 -789 -147 -864 -215 -594 -1708 1035 -1318 585 -311
833 -311 -311 795 -1181 1134 695 214 687 -512 1430 -544 -557 649 1586 -577 -257 -1214 477 788
851G88j575k70J457pK89l73K71L02j442J416j322J830j807N90p66O30Q7q27M95
870b34m35N73R63q15l39r98K328o8p70O06j880J054k78p3J76M53R27j416O3L97
890B34N90l60q51J129j049J017j910J164k91J0R33j447J073j45l38j80n8P21r56
909g14J847k307K049M49j407p2M33M69n88n3L6M72n88r89L23J126j089J197r12
928c18j7n39R97n29J63L48j315K719k526L254j399j441J372k650J887j088P09
945c73j29l16k08J076K72M83m14r68M43K38o85J081l35L04m38j091K03J20K297
964A560k113K6M56N95j168j41L78J80Q1j102N10J018K17o7P57j147o04l15K217
983A338k229m11Q82L27K67j153J299r76N92M84p76J472j911K099l065K043j633
$$ plain form
851 788 -787 -1057 400 393 682 309 580 882 -560 856 -466 1364 -443 147 -619 11 98 -729 -234
870 -234 -669 -96 867 52 -287 -1285 1043 975 205 811 -1069 -15 -293 -366 -190 263 1190 -226 -163 234
890 234 824 464 -387 742 -307 710 -1200 -36 -327 -317 616 -831 242 97 -241 -421 -479 242 -714
909 -714 1133 -1174 875 1324 -83 -155 278 747 159 106 142 614 26 -963 -640 486 -603 594 -318
928 -318 -335 -874 123 -406 -243 105 -1210 1509 -1017 2237 838 -603 769 -1881 6 -1082 -373
945 -373 -502 -818 -1026 50 322 805 391 -577 -134 104 -581 500 165 469 31 -1060 -857 -737 1560
964 1560 -553 -527 -71 524 -644 -785 -407 -227 -146 -1248 -738 280 497 430 1187 40 -564 -879 1338
983 1338 -891 -1302 -420 -93 174 -979 320 -656 -64 420 -356 1116 -795 1304 -1761 282 -1351
1000a351J145J081p86P84j450J257l08m77j40r1J784q64j475Q77j215K956j141
1017E86J46j520J413M1p1P68k097NM18m5J673j929P53p43P61K76kJ75j375P49
1037a8n50P44j141J803n54N65l49J01q13P70m98J525j80p4l205Q35O67K91J248
1056A167j606K50j436K533M12j207K90o45n8p10K220o19j765K640j386p28k30
1073h78R05o7J257j05j695k41M79J53P32j150K179j942j61K403k407K537k875
1090h76Q83o45K343j78k138J483j25j222k83J233O3p29J138l206K108m34J244
1107F59O63j209j01j10L55j439J633j66r97J68o08J306L0J003o10n72O09j551
1125i37L72L9m5J041j744J321m36J314O33j561R73r14J24j806K608j57q61L75
$$ plain form
1000 -1351 -206 875 89 873 -577 680 372 -105 -245 -336 1448 584 -891 -14 -1229 1727 586
1017 586 732 -788 625 666 595 1363 -734 -729 -311 -356 1317 -612 141 -602 159 435 433 608 -767 -18
1037 -18 -568 176 -965 838 284 849 500 601 -212 558 60 1585 1405 1331 -1874 -1039 -372 -81 1167
1056 1167 -439 -189 -1625 908 1320 113 403 -242 -300 -1010 1210 591 -1174 1466 80 -648 -878
1073 -878 27 -40 1217 1112 -583 -824 -345 -192 540 -610 1569 -373 -534 1869 -538 1999 -876
1090 -876 7 -638 1705 1527 -611 872 747 -475 -758 475 538 -191 947 -2259 -151 -585 659
1107 659 1322 113 12 -98 257 -1182 451 285 -712 -544 -1152 154 184 1187 577 5 614 -937
1125 -937 -565 -526 -571 470 -1274 47 -389 925 1558 -3 970 56 180 -1626 982 825 -36 339
1143C39m52J47j064K058q4j877O04l40J885j70k28j268j32m28M98L85j588L082
1161A367p46j667P98j35L62k83N3J53M78k63n89N61P69r52J562k841K255j577
1179f95J768j106m11J546j708J628J46j622M38j457J096N24J081j867R7k64R10
1196A04p26PN23J330j254l78N12o47R66J93p37o27J047j546M81Q38p37k97q48
1215a796K79l47L301j742J273j876J319m90M45n83M32J4j497P10n88Q24M28l03
1233a97Q96j449Q6M92J83O90j470R20m50k37J026q73Q32k99l01M65K02j209O54
1252c9J885k322l15P27m38K146k221P34m30M6J224j689J114j445Q86j404J852
1269C11o74R76M9J33o78J02j18N71N74k6j977k37j28J260O55l01k06j044J724
$$ plain form
1143 339 -113 34 -1030 1028 944 -933 -329 -669 1216 1046 818 -450 -582 -1010 -512 -127 -1715 1367
1161 1367 621 -1046 -248 -383 -21 -304 -251 -98 380 117 -472 89 858 -94 1468 -1373 882 -695
1179 -695 1073 -33 -444 1102 -606 1022 1168 -454 -16 -1473 -377 147 1228 -639 -542 -806 104
1196 104 -622 -615 -92 1238 -16 -394 118 -529 437 630 -107 -734 313 -1233 -752 86 -651 -948 -1796
1215 -1796 -1517 -1864 1437 -305 968 -908 411 -79 366 -217 215 229 -1268 -558 -1146 -322 106 -197
1233 -197 699 -750 -664 -172 11 701 -769 151 -299 -536 490 -383 449 150 -151 314 516 -693 -39
1252 -39 1846 -476 -791 -64 -502 1644 -577 157 -273 -227 997 -692 422 -1023 -137 -1541 311
1269 311 -363 613 662 795 117 219 101 672 1246 1220 -757 -994 -1122 138 793 492 286 -758 966
1288I66o38j93N69j571J477j380J008l19Q12M69k021R90n24O49m38J015L14j947
1306g62l6K06J887o76j548J212j567N79J299k023Q90r52J833q7R19j339L86n28
1324c07k71J389j675J316o14Q47k87q98J021j74N1o87J196J77j108M04q92J324
1342H12j073j50O26r57J469j291o0N39K36p13m18K269j932R10q14K00j17J02L058
1361B696m106R37M82j331J365j134P63N96O22j578q86K043j775L44J38K215j734
1378c43N2P25k2M8M27p15P02j287j68MQ5O23J04l77j210K949q16n47k3o6L06K24
1400F75j0j86m39r38N32J426l562K910j67Q16j063k51J94j005J880P84j801N64
1418C59j221J973l122K835j631l10P09K31J380j800K60k51Q3j75J058K15j705
$$ plain form
1288 966 328 135 704 -867 610 -770 238 -81 731 1200 -821 169 -355 294 -144 871 1185 -762
1306 -762 -798 -592 1295 619 -929 283 -1284 -705 594 -1429 -539 -1491 342 255 1174 -165 221 -307
1324 -307 -578 811 -864 452 -162 685 398 -500 521 347 398 -289 907 1084 -24 380 -512 812
1342 812 -261 -411 215 -742 727 -564 -624 -85 151 -562 -980 1289 -643 267 -547 -347 -464 -362 2696
1361 2696 -1410 -473 9 -1322 43 -1091 -328 268 890 -688 -1574 469 -1306 -962 -824 1391 -343
1378 -343 -291 434 412 460 887 172 874 -413 -581 -577 -492 131 235 -142 -1352 1597 781 234 211 145 451 675
1400 675 665 479 40 -898 -366 1060 -2502 408 241 1057 -6 -257 -63 -1068 812 1596 -205 359
1418 359 -862 1111 -2011 824 -807 -1117 -408 -177 1203 -597 -337 -588 -505 -680 378 593 -1112
1435a112R15N29j977J758L08n38j79O41N97J01j020P50k01r24rm69k77K110O9
1454A072j276o22O48J41j320J636o33J27L34J5N8j224J568j970K463q93P17m81
1472C60k90L05P78o28j026M16K71m55J674k211J015L96p30r64J22K012j795Q64
1490A14Q13n32N40k306L045j123j91J29j216J517j747J406j559J641q22n26J407
1507E90j595J25R87j158L81O83J82q33n46J670k90l69p98K444j934J047q19j86
1525d19N03j187K518m86q58m50M65l28q85K083n32J405j238q14j70k47Q99j232
1543i73P22L93O48J014l153K490n40m21m62P94j18J2k4k002J134R06j308K8J79
1562f81J810k221P73l24N63L34j569J816n44j008O85j026J563l52n24J131j287
$$ plain form
1435 -1112 -197 332 -1645 113 421 -117 -296 345 942 1043 23 773 572 -352 -361 -830 -1107 1003 1072
1454 1072 -204 -826 -178 -37 -1357 279 -354 -227 107 122 180 -1044 524 -1446 1017 124 841 360
1472 360 70 375 1153 525 -501 -85 186 -269 1405 -806 209 605 -125 -1089 -967 1045 -750 114
1490 114 927 395 935 -1371 1674 551 360 489 -727 790 -957 449 -1110 531 -291 -817 590
1507 590 -1005 -880 107 -1051 -670 13 195 -638 -1184 486 196 -173 -971 1473 -461 586 -233 -419
1525 -419 84 -1103 1415 929 71 -379 86 -242 -1127 956 424 1829 591 -223 -393 -640 259 -973
1543 -973 -251 142 790 1804 -1349 1141 601 180 -282 512 394 406 382 -1620 -486 420 -888 -860 -681
1562 -681 1129 -1092 -319 -643 -80 254 -1315 501 -43 -1051 -366 -1392 171 -181 -705 426 -861
1579h61O55j90Q50o28N43Q46j013O36q5J74p68o65n90J413j63p32O44j991K417
1598D92n69J11Q58j125M28k60N99O91j331k42j449K955j064J08J376k143j02J13
1616e54Q44n45J204l56R56j347n60J229j566k31K067k227J668r03N56J97j98o44
1634d10K8J227j313J400l02L11q43q09P58p74J418r3q8o14j670K889o35J090j995
1653d25N13R40q28K79q17J723r00o90j86P19k4k91J031J8j300o01N09Q88M20r46
1673C2o01J474k670J404P10j25R65q70j047J063M97P3j578M16L64j815K189n70
1691h9P9l74j184K164o77m42N18K188k848J119j5p45O04L75j110J163j228O00
1709I8j60P28j059J264r51n66J541j051R88j45j381j18L09J520j710J157j02J2
$$ plain form
1579 -861 -206 -396 454 -174 369 1215 202 838 753 927 159 -506 -1096 317 154 -578 66 -1925 492
1598 492 -77 34 892 -233 195 -65 534 1225 -106 -348 -1797 1158 94 202 1578 -565 -667 -554
1616 -554 290 -255 949 593 1549 202 -358 871 -695 -926 1141 -1086 582 -321 235 432 234 -410
1634 -410 -382 845 -468 932 630 941 98 -711 47 -727 691 598 510 -104 -1774 1115 480 1570 -425
1653 -425 88 1028 200 479 -338 1385 485 -205 -391 328 304 13 1044 1062 -238 -839 -330 558 978 32
1673 32 -569 905 -1765 -361 349 224 1189 319 -728 335 832 905 -673 -257 107 -1708 481 -89
1691 -89 -10 -384 -1568 596 -81 -523 -5 2183 -665 454 439 -306 298 673 -437 726 -502 98
1709 98 -62 666 -393 871 -80 -646 895 -156 832 687 -694 -812 -503 1017 -693 464 362 374
1727C74m37j054J629j378J932o02m88l7P82P6j155P11j946R52p72P51J173j53
1745C58L30j869L69J224J25J196j838l11K67K56N13n80m50o48N17O45R58j47k047
1764a132J649r02n30N4J955j06j629J243j644j94R89J387j215k56l49j75Q08N95
1782E48j392J946j534J96j015R46k16P77J221k503J238P9m10R3J21L51p16L97
1800A27J030j438M70L99J395k472J458m08j97J065j629J049j771J738l17j293
1816g94k8J521m33l21J33J170k689N67J285j140O14J151m33j552R78l75P31j83
1834B02r71J868j827Q95j897J372N82j216N75q98O97J071k25k57P15M27k285J720
1852E48Kp93Q86l84j005k92J320j047P02N62m73O69j287J366j642J823j616O60
$$ plain form
1727 374 -63 -1117 512 -866 1066 464 -24 -61 721 797 -358 353 -1593 -641 -1413 -662 511 358
1745 358 688 -1181 -812 412 537 1733 -105 -416 -149 107 620 40 -410 -1058 -541 104 1062 915 -1132
1764 -1132 517 -385 -915 -861 1094 988 -641 602 -1042 -1236 -247 1140 -75 -331 -680 -855 -47 548
1782 548 -844 1102 -432 -236 -1251 -305 -521 256 1477 -1026 212 291 -119 -26 95 446 -270 127
1800 127 1157 -281 189 588 1983 -489 969 561 364 1429 -200 849 -922 816 499 -794
1816 -794 -822 699 266 -55 78 1248 -1441 -874 411 -729 -115 1036 603 -949 29 -346 385 202
1834 202 -769 1099 -728 167 -1730 -358 224 -992 -417 -1315 -618 453 228 -29 686 1113 -1172 548
1852 548 550 -243 643 259 -746 -1038 282 -765 -63 499 26 695 -592 774 -868 955 -661 -1
1870aO87j740J177m77Q47Pj792K888r41Q42o79j294K64M40J94j156K62J314n13
1889C29p93J06J287j55p38r9p07M74L99l03l55L16L03J44O62k126J604j802J256
1908a98Q50j45j49q17P8J034k6j597j9J828l13p55J18n37J627j795J455p89M1
1927a09K13j468J489j432J286k3J1J72K12r73k31J914j362k47J5j71P50n92J76
1946c70K55l54J20M24k54l87j26o8J663m03j048l18m67J720L90l88R30j282Q06
1965H43p04p9j335K7J274k17P30j948J107N60o6K11j652K012j022J722k047P42
1983A58J628r38P90k648K969k208N31M21k93l98M2n04K004k537J08l3J010k03
2001a01k64J427j248k27k93m30J198k13o7K6o89m91N34J442l2L39j261J945k023
$$ plain form
1870 -1 686 -1054 123 -354 493 500 -1292 1596 655 1497 818 -476 -212 228 422 -734 -472 842 329
1889 329 -464 -358 929 774 36 -63 -770 -296 103 -200 -555 -239 64 208 870 -1256 348 -1454 -198
1908 -198 652 507 358 -459 -381 653 627 -970 -989 839 526 -229 -111 -648 979 -816 639 -150 -109
1927 -109 104 -1364 125 -1307 -21 -44 -33 139 351 -622 -853 1061 -301 -548 -533 -704 46 -546 -370
1946 -370 -115 -469 -349 75 -179 -566 -692 -760 903 500 -548 -866 -1333 387 777 389 1319 37 843
1965 843 139 60 -1275 -1248 26 -191 539 -1409 -302 258 192 403 -1249 763 -259 1463 -584 158
1983 158 1786 848 1638 -1010 1959 -249 282 703 410 12 54 -450 1554 -983 -875 -908 102 -101
2001 -101 -365 1062 -186 -413 -706 -1136 62 -151 -218 -192 -881 -1372 -838 604 572 911 -350 1595 -428
2020d28K03K2j02J567j601J34O56l88N95k028K401r13m52l31o4L67M2J515j357
2039a62P39j024P45k61j472J283o71k13Q64R40J93j534R57r3J00m11n69J144n64
2058ikm5O79j707K068j005l9J365k441J301j581L83J041j660J489o74J02R70o69
2077d34J515j484J012j597J049O11j146N29j63P28o44Q56j705J554K20j273J445
2094A073j046K32j19p3L1q8L49j791K135j456J331n16m21J963k260J33K35R9j75
2113c64N81q6j832K843o78p56P21k157K544j567K21R97j693J394j243J772p9r94
2131c76J641o83Rj758J756N7J50K97k614J228k40J280k193J723q79J49J102j584
2149i35J48N71L76R56j773J96o10J949M3j140O71j378O62j679J514P83m9l5p14
$$ plain form
2020 -428 -225 -203 -305 1262 -339 -205 451 63 658 -1370 1031 118 -334 -665 -729 -362 -320 1195 -162
2039 -162 577 -447 298 37 -1435 -152 -823 -1036 -172 768 961 -573 384 291 391 -20 -589 555 -9
2058 -9 -11 -56 623 -1084 984 -21 -60 1305 -1136 165 -1416 -1033 8 -1652 -163 -837 -735 235 -434
2077 -434 1081 -403 609 -988 61 672 -474 55 -108 620 -24 832 -873 681 901 -372 1073
2094 1073 27 259 140 67 98 10 359 -1432 703 -753 578 62 -359 1604 -656 -523 -288 -189 -364
2113 -364 217 131 -1701 1142 464 -292 429 -1728 816 -751 -530 467 -1226 168 -1075 697 618 -376
2131 -376 1265 582 591 -1167 589 646 796 1093 -1521 -293 -533 747 -1446 277 -602 -453 649 -935
2149 -935 -787 -216 160 1116 -657 -461 -1071 878 921 -219 452 -926 -264 -1943 -429 354 305 270 -444
2168d44Q02N40r64R45r09O76p58J90j144K100j79j391Q23q57J02J007n91J030
2186I78r67O59o19P78j359J58L06p60J767j179J048r44j40L97r43J843j705J7
2204f65P13Q2L93o72J428l050K079j152M10p7j027J885j43O78p02j102J329j247
2222h40L99m85J360n51j159J534j626J038K99l42l23L18J147j751J323j1n6m35
2240a61p04K066j204J265j195L76M05o98j644o3O64J17o0J492n51O20k063P66
2258e72M67k095K691N4r68M33M4k11j55j6l18R64m15m39p0K27P91o52Q30k75j25
2279A90k56j015K236k624K222q29N0N35j246J860k486J001J539j438L36p1J998
2296B002k870K59J082p3P5j346J388j063J064M75m53o21j802K112J76j029J158
$$ plain form
2168 -444 358 898 -66 879 -30 646 -112 78 -1066 1034 855 -536 287 -570 -468 539 -52 978
2186 978 11 670 51 829 -530 -372 -66 -826 941 -238 810 -134 -274 123 -820 1023 -682 -665
2204 -665 48 130 523 -149 1279 -1771 308 -844 -434 -511 -1538 347 204 882 180 -922 407 -840
2222 -840 -441 -926 434 -117 -1276 258 -1368 -330 -31 -373 -696 -378 769 -982 341 330 274 -161
2240 -161 -865 1201 -3 1262 67 443 848 150 -1494 -1557 -893 -776 -836 656 105 725 -1338 -572
2258 -572 -105 -2200 491 545 -423 10 54 -157 -312 -328 -646 318 -97 -536 -606 -379 412 -240 590 315 190
2279 190 -66 -1081 1155 -1469 753 -76 -26 509 -737 1123 -1363 -362 1177 -261 75 4 2002
2296 2002 -868 -609 473 400 475 -871 517 -546 518 993 540 -81 -1883 229 405 -624 534
2313E34O01m90l08J49j499N10k75Q78M85n37k69R57K40n90l23P87r27J495j432
2332a4L71q72q38L009j629k00o28P80N65j313O51q68J645m03J30O84j600K96j053
2351a287K721L71j853j35o99P90O0Q12j122J84Q90j027J22p77K341j362q05J418
2369F42j778N82R2J335n18m02O12j467K023j799J459r29K68j179J287K86r96m91
2387i73P49J55O78j715K55R85l92n08J62J723q45L05q90j304K616j271L44r39
2405h65K38J48N27J530k309K169r54O89k208m11J743j185O7L66R19p87N92L32
2423F01o85q67J228j321J055k259L473j167L24j500J34O63j95J653m69j036L94
2440B6K30l08o55J378q60Q40L67j315p6j64J385j178J156j21j524L19j93Q52j542
$$ plain form
2313 534 1135 645 337 486 -1013 -503 -778 100 585 48 -221 736 976 386 63 850 -77 1418 -14
2332 -14 357 -515 -1353 1656 27 -173 -801 -21 544 -769 -118 -986 659 256 386 1070 -530 -234 -1287
2351 -1287 1434 1805 -48 -183 -882 -92 -32 780 -342 -158 732 -295 -173 -950 1391 29 -776 642
2369 642 -1136 -554 -462 873 355 -47 565 -902 1121 -678 781 -148 120 -1059 228 514 -482 -973
2387 -973 -224 -69 609 -1106 -851 134 -258 -766 -604 1119 274 579 -311 -1615 1001 -270 74 -865
2405 -865 -627 -479 48 1578 -731 1438 484 1173 -1035 -1446 297 -888 -821 -455 464 -323 269 601
2423 601 -84 -951 277 -1044 11 -2248 1225 58 382 -1118 -984 -321 -516 1137 668 -368 26
2440 26 256 -52 -707 671 -189 651 1018 -297 -373 -537 848 -330 826 705 -819 -500 -693 159 -1383
2459a383J821k28j483M38J603o63p28R73J42j060R31j659J080K02q8J704k092
2476d90Q81n71j005R30m64K349k118N17k5m90k41K13O24J17K87j185k20J086j562
2495a367K069j791J631n76r67J766o95Q95j649L00O48m21O73j678J165q07K005
2512A201j158r29Q72J06J759j367J94l68J29r89l60O55n05J294n3L59r79r86J861
2531G36p97j80R21j096J472j476Q11q74K93l43R27k49j463J147o99J652n29j347
2549a094L63m15L06Q52J583q07o20p4K37o26m92R47Q53l01M84q57j24M34q97R6
2569a52j785J792j377J480n89J173q7k83O03j498J511j764Q08m28j12O50Mj82
2587b36n0J00j5K10j356J078J109j837K77J61k44r1J060L58o82P0j03j301J804
$$ plain form
2459 -1383 438 210 -1273 -835 768 105 -623 350 492 -568 363 -1296 -216 -14 -102 1602 -490
2476 -490 391 -180 -1185 -255 -719 1630 -488 29 4 -486 -727 -514 110 227 514 -671 -891 195 -1367
2495 -1367 702 -1089 542 -34 -1001 765 70 965 -684 -384 264 -157 516 -1162 3 -804 1201
2512 1201 43 -886 -14 92 1851 484 678 310 439 -550 -910 -255 -760 534 481 840 -139 -1125 736
2531 736 -61 -241 680 -416 1056 -420 391 -483 -190 -533 394 145 -1318 -171 -870 782 253 -1094
2549 -1094 -731 -1146 -840 12 1595 788 168 94 331 -295 -787 160 1013 712 1196 339 215 649 -248 -152
2569 -152 -1937 -145 -1522 -42 -631 542 455 172 775 -723 788 -976 -168 -596 -708 -58 -54 -236
2587 -236 -286 -186 -201 9 -1347 -269 840 -997 -720 -559 -803 -894 166 524 -158 -88 -191 -1492 312
2606C12j072L83O65j221J343j794J736m28j33J05m41L80R36K83j209m27M57j145
2624a270K105k056J343r18Q92r9m11P87j056K77Q84K60j456K84N40k01M35J003
2642A343j569l4q13K309j993K203o58j409K486j810j054M12J88J681o94o2j65
2659C61Q98j967N98k73P48L86r17k66j23k64K153j528L90L30L01j546j2K590j540
2678C19j45j19j61o02R28K68p94J587k222J111j86Q5N98r52l36j099K169p8k214
2697a843J340l47O89R2J58L19m08M22j452J416K29j4j209j89J699j908K194j683
2715d95K31L22l9J706j048l05j94J73m95r21J861j799M04Q7N41O34k56q33p66
2734a192L30Q91J82K60j073J210k17k26K55k35K73j492J04K70O18j73L81j69r84
$$ plain form
2606 312 -760 -377 288 -933 410 -1384 352 -76 -209 -104 -545 -165 771 1054 -155 -582 -125 -1270
2624 -1270 835 -1221 122 -796 96 -3 -414 373 -683 -406 478 738 -718 -434 106 -95 340 1343
2642 1343 -226 -260 -1073 1236 -757 1446 788 -621 1865 55 -999 -587 -399 1282 588 526 361
2659 361 1259 -708 -110 -383 365 751 -166 -432 -555 -819 1334 -194 196 526 827 -719 -731 1859 319
2678 319 174 55 -106 -708 220 488 -306 1281 -941 170 -16 69 667 -285 -621 -1720 449 371 -1843
2697 -1843 -503 -850 -161 -69 89 408 0 422 -1030 386 615 601 -608 -797 902 -1006 1188 -495
2715 -495 -264 58 19 1725 677 372 178 351 -144 -1065 796 -1003 -599 -512 29 663 407 -426 -1192
2734 -1192 -862 29 211 471 -602 608 391 165 420 185 458 -1034 -930 -660 -42 -215 166 -3 -987
2753i87M91J452j373Q71j294Q57q40J061q95p5J761j199L10l73N74n31o91o0R15
2772b6J385j124J069j917L40P28p00J380j189m7M70K35k70k181K079J1J124j659
2790b92r82J68O14J034j191q6M45O80o80n95J895j846J511m92r29J326m10M57
2808F27m06k70l50R27j014N64J49n20K38O47j985K511j707J51J314j953O41j180
2826a616J315j340K765o86P86R6q81n11J20k3n82N47j450R83k99K12OJ020J15
2845E77P2j926P55J42K60P84l68k68O03j200K21o76K288n85Kj691R34K66j661
2864a471J158q91J105j023J852k79j737K559j665J356j464J504j720J230q43R1
2880b38J41j15R32p20m22R31o78Q06o17k88J423k301R14J51N42j882J845J84q39
$$ plain form
2753 -987 -496 956 -417 454 -840 17 -823 238 -657 -732 1029 -170 140 -233 341 -190 -881 -941 -26
2772 -26 1359 235 1304 -613 -273 455 -245 1135 -54 -101 369 604 334 -1847 232 243 1367 -292
2790 -292 -1274 -1106 -492 542 -649 -735 -290 390 -290 -885 1010 -836 675 183 -746 580 170 627
2808 627 221 -49 -399 528 -486 78 227 -293 -55 592 -1393 1118 -589 -438 876 -1077 -436 -1616
2826 -1616 -301 -1641 1124 438 1224 1320 439 -72 48 25 -557 -10 -1460 -477 -776 -564 -558 462 577
2845 577 649 -1277 -522 -380 -120 664 296 28 631 -569 -348 -1024 1264 679 681 -1010 -76 190 -1471
2864 -1471 -313 -1204 -99 -1122 730 451 -1286 1273 -392 964 -500 1004 -716 514 -329 -238
2880 -238 -97 -212 720 0 -422 509 -169 637 20 -268 1155 -1146 -232 -81 461 -1421 424 608 -231
2899b31J04M31J34k78j265J229K99M70q35M93k98j4j404J116q36L41J342O75j837
2918c64M66j702J882j106R41n88M6R43r64J517j875Q04Q63j922J399O57j169L72
2936B00P13K31k435K021j365K11P4J07J91N45n01m70J180j120L19j695J728N58
2954D92j038J383j396N03J56n03J263j909O43R93r84K42L8N88n06J82p6P5P16
2973H62o92M64j893J094N25j030J377o87Q86k248j12J800j032P92Q04R5j689J306
2991F22q83J35j70n9K41r24K496j074K65k04j439O05M40n71J199q55K87o19J555
3010A047r22O10l57q66J182p9q53k78m42J761j142K63n81J435k6j35K54j161P88
3029D98m90J026l76o39l29mJ145r51l6j009J819K19j729J677k91m84k20M08o60
$$ plain form
2899 -231 -127 304 438 160 -1105 124 423 893 58 551 253 239 -1165 -49 -885 -544 798 1473 -364
2918 -364 102 -1600 282 -824 117 -471 -425 518 -446 1071 -804 0 863 -1059 340 997 -172 200
2936 200 913 1144 -1291 730 -635 -424 -350 -243 -52 493 -8 -478 702 -418 -99 -1794 -66 492
2954 492 -546 837 -559 -56 100 -403 860 -1049 -406 587 -397 -155 -117 471 -35 147 71 146 862
2973 862 170 634 -1259 -165 360 -670 707 20 906 -1342 -1454 346 -686 106 910 1005 -684 622
2991 622 -261 -126 -296 -355 -114 -1038 1458 384 649 445 -994 -389 51 -520 679 -176 111 -508 1047
3010 1047 125 735 378 -488 694 615 -238 -516 -958 803 -339 -76 -657 778 752 617 871 -290 498
3029 498 8 1034 658 19 -310 -314 831 -120 -156 -1165 654 873 -856 821 530 46 -174 234 -426
3048d26M63m41k60J618q48q09R40j005M27k73L82p55M05J970p38j69l60q13J93
3067d99N05N38m49J55l76L93l60r9M81m1M03r62J065l6j390N92n77m24J043p68
3087h06P55k84R04J131j699M64q65K61o52J359j246J153k67r21J035j232J332
3104D22P7o94J135l49p35j313N50K02J722j292j97L03j78M34j471J599M0n19R76
3123G12j793J406q3M8j034l04K308j029q43m92P1K586j407N59n97O81o02j248
3141a061K120n84q69j93N19R08k4q34L94k19R45J26j43j440K62O30j137J425j268
3160d43M74m7o6o76J479j887J168j21J76j17l6k35L21j621K145K83j550M86R85
3179G18l99J94o84n4Q78j997L25J366m34Q27j375Q05j303J403N71j977K055n91
$$ plain form
3048 -426 37 -404 -664 954 106 -703 237 -768 -341 -614 -232 -987 -582 1388 650 481 121 -692 -499
3067 -499 6 544 95 250 -126 267 -93 -192 289 248 651 -311 754 718 -672 -80 -657 -1081 -38 -806
3087 -806 -51 -335 569 1700 1 465 -400 -139 -791 568 -678 475 208 -713 322 -910 422
3104 422 499 -195 940 591 -144 -1457 -907 -705 1017 -275 -472 -169 -347 87 -1384 215 255 -264 712
3123 712 -1081 325 242 290 -744 -1048 1260 231 -612 -1104 -1033 1553 146 705 108 789 187 -1061
3141 -1061 1059 475 -394 -587 -68 840 816 -18 376 157 1102 1228 1085 -355 -93 537 -600 825 -443
3160 -443 31 -16 -82 -758 721 -1166 2 -119 57 -60 -96 -331 -10 -1631 514 797 -753 -267 718
3179 718 319 513 -171 -225 653 -1344 -1019 347 -87 740 -635 170 -1133 270 841 -1136 919 328
3197C28j012j73P17J170j828Q02l49k56J156n22Pk96N62o10O99j60j31j02n69
3216e67J921m17j170J014o14l63j54K033l578K514r99J838m47j528J211j742J662
3233F14n13N97o05r59O02P78J352j846j892K825j176R13n47l00k31J040k73o95
3251c16J024j174J477j532P79R37k315J253o64p96J052l17J028p23m90J43k61
3268h95J414j352J395n8n63m17j68K199n27j504m59P27J123j709J232k70p88O9
3286e51N70M52j415J473l51M39k09j239N33j499J352J471r20K06r75O08p92K189
3304A342k021J264n92n77K499j164j269j08O91n79N22p01l17J764j101J106p64
3321eP80q04L6L15J227j455j20o45J824J04j112o10J719j902J114m2j823J821
$$ plain form
3197 328 -684 -857 -140 1030 -798 4 -345 -601 555 33 40 -256 306 -304 395 235 104 2 -567
3216 -567 1354 937 -233 781 167 -196 -350 1683 -1895 619 -380 1458 1011 -517 694 -1048 614
3233 614 101 698 93 -866 -264 514 1866 20 -1872 953 -223 690 143 -157 -388 652 379 -316
3251 -316 708 -466 1011 -521 258 1195 -1120 133 -531 -1327 -275 -592 436 -287 -777 -634 -895
3268 -895 519 -833 562 504 -59 -476 -644 1555 1028 -476 -935 -208 915 -794 438 168 -620 -551
3286 -551 19 471 -944 529 178 617 408 -831 -298 -1797 -445 1026 106 312 -663 -55 -847 1342
3304 1342 -679 585 -7 -584 1915 751 -518 -626 65 -514 8 -693 -1010 754 -347 759 -5
3321 -5 775 -29 7 322 1549 94 -26 -671 1153 1257 145 -465 1254 -648 466 424 -1399 422
3339D22j55M27n44p84J285J64p24n50O70p78K34K65m80P28N60m72j87l0K68j127
3359h08J922p08p52J149q52n15P01j3q99J202L68j402J508j633J233p87J422p70
3377C66j376K167j766L91J161k609J784j92J130j547J041L3r41K355k652O91j1
3394B5l76P46m09m63n00J000o92J537q25j50K68j835K276j44j48N2m50M55K35
3413F02j215r83J684q57J011J348k664R36P70K07p89l0M42o49J56n3k27Q74m32
3432A31o77q7M09O3j154K017o35O06r15J436j020n93J63O30J234k160O21K04o99
3451d26j28j43P37l37K39P19p63p79K076p31O91l75j556K81N73q64J023k076J345
3470d94J276q6l2j745J566j133J03J793j623R48o78Q18nJ2K97J66k218N53M62
$$ plain form
3339 422 267 694 150 -634 651 815 91 -459 211 -567 -333 -68 -548 180 740 268 81 51 319 -808
3359 -808 1114 406 -346 803 -49 -564 137 124 -775 427 795 -607 901 -732 501 -286 1136 366
3377 366 -1010 1157 -609 -218 943 -1666 118 -74 1056 -491 550 583 -358 1997 -655 36 25
3394 25 -351 395 -14 -477 -977 23 -669 868 43 -107 161 -1674 602 458 310 362 -88 367 602
3413 602 -613 -1596 88 -769 242 1590 -1074 -138 632 839 50 20 462 -187 -31 -84 -311 563 131
3432 131 -546 -633 -224 -161 -1315 702 67 673 -242 1194 174 -419 -256 374 1608 -552 69 273 -426
3451 -426 -554 -697 40 -297 -58 661 -102 -881 1195 464 1155 780 -776 -495 78 -786 237 -1839 -494
3470 -494 782 696 664 -1081 485 -648 -545 1248 -375 573 -105 713 708 720 1017 1183 -1035 -482 -20
3489b0o31P25P77M47l95n33K17j83m1J12j608J695m46o60l33N19O13r58J598o79
3509B16j252K319q80j729O45O00O93q93L62M29j138k10Q31j382K033p94r55R93
3527a12q93O86J451j669J804j288L66J72q63o77K653k244l59J576o16q33R79q78
3545g45O50p95k02J018J14R11j402J6p49J029J517j455l83j22J327n59l00P36
3563F06r84J339p65R16K96r12m21J36n9j91O9j591J725O06j074M22P7O0j237O47
3583c35K99j151J690j379J063l500L581k92o28J806j880n84J148q32J123k75N94
3600D48m06j60j37o36M00J653j95j924J42Q77K04J375l079J649M78p56l28k27
3618f22j28R46L00q34J562j071o28J470K9j739N24Q29j348R47K93k97N36q94j126
$$ plain form
3489 -20 -651 74 851 1298 903 370 587 404 363 475 -1133 562 116 -544 -877 -358 255 -703 895 216
3509 216 -1036 1283 403 -1326 -681 -81 612 -281 81 510 -628 -838 -7 -1389 644 -150 -1105 -112
3527 -112 -1005 -319 1132 -537 1267 -21 345 517 -346 -1023 1630 -614 -973 603 -13 -846 133 -745
3545 -745 -95 -890 -1092 -74 40 951 -451 -435 -1184 -155 1362 -93 -476 -598 729 170 -130 606
3563 606 -378 961 196 1112 1408 496 75 211 152 -39 30 -1561 164 770 -304 118 195 255 -982 -335
3583 -335 -36 -1187 503 -876 187 -3313 268 -24 -652 1154 -726 -1310 -162 -994 129 -146 448
3600 448 42 -118 -255 -891 -491 1162 967 -957 -815 62 266 1641 -1438 211 689 -67 -395 -622
3618 -622 -750 196 496 -338 1224 153 -475 995 1024 -715 -191 638 -710 237 530 233 769 -125 -1251
3637a251J584n78O36k13L43l40o70M07P5L42N71P41l266J821q56J739j432l07
3655f54J438j120o34J957j010N06j351J020J50l69j260J304N18j704K178j138
3671a69l11P40k370L054j013m3o80Q01M06j255N84K66N24l98M83l11k191J959
3689G6L54q51J681j048J88p49J742j024j22j762R03J031j83o1j458J136K81j160
3707a026J317q34j8j39R55p31M15J262p07j078j85J766m81p7k66p52m50N00M15
3726a14J585M4j726j483K092r19J136k57j589J985n31K56Q19j330N55j849J597
3743B71p45J075o92J243q38j614L157l053Q44m25J044K54p06L83p02J226K71j162
3761a69N23q49K69J201k488J275k52J369j965J670o97O79M45k176J754j610J150
$$ plain form
3637 -1251 333 -245 391 178 521 181 -489 -82 -7 335 906 1647 -1619 202 -654 1085 -347 -654
3655 -654 784 -336 -970 987 -23 483 -868 152 302 -67 -1327 -23 495 -1209 969 -169
3671 -169 -480 260 -2110 944 -69 -112 -792 9 415 -840 -256 10 534 136 619 308 -1883 76
3689 76 430 -421 1260 212 400 -349 1393 369 247 -1515 -612 419 236 175 -1283 -147 134 -1026
3707 -1026 291 -543 -561 -700 255 -476 -61 1201 494 -584 -769 997 516 439 173 -579 -1029 -529 -114
3726 -114 1471 1515 -211 -1694 398 -521 615 358 -1231 754 223 479 1298 -32 523 -1326 271
3743 271 -474 601 -91 1152 314 -1300 1857 -1196 -352 -777 267 521 -185 198 -504 722 993 -169
3761 -169 354 -495 -226 975 -1513 -238 -490 879 -1086 584 -113 566 1011 -1165 589 -1021 129
3778A29n56M45M05j500J901n24n98l6N52P58j385l99J41K043q07j008M93j694
3796a640J662J302p24J67j011r4Q50M01q33O17j77j40k32qp72O81r6PN91qj782
3817a239K057q93O02q36J477K08j815l72J037j259J261o48J340m85n63p3J027
3834H26m26j873J787J47n40R85n33j12n08R18j644J61J876k220K540j722L86j88
3852a40K76R75j398K85j060K330l8m12l33o52J320j929j65J511j543p5K353r54
3870C51J52L98j194L53O21q39l6P99j928J455j33P12n37J211k236J893n04k138
3888a600K406j945J872r83J860j565m25Q32n36M51j12L96q31J60L3J31m3O3J190
3907A354n93j148O93m94L30n1j072J096j326K154j255J027o33J152q42o14J307
$$ plain form
3778 129 -427 18 423 -1077 824 300 -298 -334 218 976 -409 -808 -667 1376 569 -439 54 -1640
3796 -1640 22 1324 600 767 -244 -338 512 913 80 697 520 380 148 140 -632 49 -47 -40 551 543 -1239
3817 -1239 818 -75 527 -309 1168 1376 -439 -811 226 -1033 228 -420 920 435 -128 -201 826
3834 826 400 -1473 314 461 -79 906 373 261 -247 671 -973 -812 1064 -1156 1384 -338 48 -140
3852 -140 136 1111 -287 -2 -1062 1268 1230 818 485 -167 1153 -776 -941 570 -973 -1048 1305 351
3870 351 503 901 -293 60 681 -158 -194 605 -1323 132 -1 711 174 1385 -851 1042 538 -1600
3888 -1600 806 -1139 733 -250 1610 45 -380 452 -84 367 255 651 -180 -20 13 144 101 164 1354
3907 1354 761 -387 306 -188 142 91 -981 115 -1211 943 -312 715 82 1234 392 -222 1085
3924A085j768J658k03j091J340r03k3j936K268j443Q83Q91k059N32J296q48k29
3941e50J252n53j253K214j478J32r49O50J265j354P79K92j164J113k120J496N95
3958C67j41J133j557J012N2K49j684R6J144l41L02l19M99k013N66M23P62n10p18
3977f78J340o04J178j383n85J265l32j145k04R83k06j61J439k138J086N77J18
3994E50M83k481K626p60m96R0r72J926k277M97L01J911k056j130K848k468K471
4011A063q62L78p46m39J390k002J343J97O38j390n90P43l7j13j097J716l11j44
4029b63J263k366K939j300j50m74k33J229j469J944j28m00J46j623K185j662k82
4046f44J080K9P49j194O12j959M13O23l28J048l79O56r33q6K96P5l89m53N77%
$$ plain form
3924 1085 -683 975 772 -319 1021 118 95 -1841 427 -1016 -133 758 -1301 -769 527 -321 -550
3941 -550 702 149 -1104 1110 -368 -236 -1185 -535 730 -624 155 447 -717 396 -1724 -228 367
3958 367 226 1359 -198 814 866 1115 -569 -473 671 330 632 313 812 -1201 -635 -212 550 40 -678
3977 -678 662 58 1236 -147 -732 533 201 -944 -1148 -165 -371 -532 907 -1231 -145 432 550
3994 550 1033 -1448 1178 418 -78 12 -960 966 -1311 -814 -513 1398 -658 -1788 1060 -1408 1063
4011 1063 201 579 -167 -606 784 -1218 125 322 960 -430 -1020 -277 -314 -427 -1524 192 -119 -263
4029 -263 1000 -1366 1573 273 123 -351 -584 645 -824 1120 992 592 738 -885 1300 -362 -644
4046 -644 436 465 1214 20 632 -1327 -914 -291 -619 429 50 706 -227 -313 -17 58 -331 -784 -207 -207
4066b07J764j394q05K92J36P52n62M09m66j72k41o4L87K31n3n35P65P07j219J210
4086I35j129J628j562k61R67r25J716j248J174n94p09J575j735K93j051K31J181
4103D86p10J328j406J929j592j64Q78j935J044J211r17L97r84k11N83K90l8j096
4121i07J103r41P06j054J531j411P42K74n06P70m63J70J47P17j793P81J632j679
4139a81o63K10J04J371j127J265j247K41j653K342q71j84K107j622k9l66l0Q29
4157D96j403J178L56k91l72l18p0J190o12j269J374q38R93J069k449R26J101o92
4175C69j62j232J073q57Q83j77m80M65M48M41k08P53o84k85j049J0N76R1q08K61
4195e72J783r62j298K814k023P40l82o26J221k094J907o08P21n16m17Q65j187
$$ plain form
4066 -207 1557 163 -642 -350 -214 538 -24 385 -81 -253 -494 -558 -171 60 7 -528 237 944 -275 935
4086 935 -194 1434 -128 -389 578 -347 1369 121 1295 701 -8 1567 -168 125 -926 -695 486
4103 486 -224 1104 -302 1627 35 -129 749 -1186 -142 1069 152 549 -435 -646 -63 227 189 -907
4121 -907 196 -745 -39 -1093 438 -973 -231 43 -463 307 -156 14 161 878 -915 -134 1498 -181
4139 -181 -844 -634 -530 841 -286 979 -268 -27 -1680 662 -209 -393 1714 92 63 -303 -333 496
4157 496 -907 271 627 336 -36 -354 -424 766 154 -1115 259 -579 414 1483 -966 -40 1061 369
4175 369 207 -1025 48 -809 74 -103 -583 -118 330 771 563 1316 632 347 -702 -692 -116 -25 -833 -572
4195 -572 1211 249 -1049 1765 -258 482 100 -526 695 -1399 508 -100 621 105 -312 553 -634
4212f34J636j502P49o49L8J267j772N81m02j14O44j07j83M05p07M36R01j49m63
4231b5j15q13P94K96j267J192l10P69k30R03k193o82J110L37Oo22N45L06p39K39
4251d99k73K012j477O90k31m61J259j379J88J20R32p47j93R84j348K17M61L6j470
4270a179J70J230p1l66L37P56l36o47J015j016J502j222k49J436k105J284j146
4287f07J076l75O21l41j301k97P41Q20o2k02K91j728K036K34o45j037O83J042
4305I49j098R87k108J273l96k37O55n40K526l367J183J328p81j139J72J382j544
4322g55K192m43j042L3m11N77r77L06N51j741K602l49q3j03J63K31m72N56k44
4341E91n08m45M24JM46m03l81k07p86N84J649j967J134n50J007j160L43L68k6
$$ plain form
4212 -634 1002 -500 249 -400 -362 905 -867 -286 -688 -802 -158 -265 -448 -43 -750 -314 587 438 -25
4231 -25 -140 -953 -159 137 -1130 62 -248 521 291 1194 -999 -1681 -571 -234 -228 -850 -305 1 -738 -499
4251 -499 -772 1240 -237 453 222 -239 1020 -359 -171 -51 881 134 -59 925 -423 -206 255 291 -1179
4270 -1179 -1009 221 150 -216 121 877 541 -106 909 -107 1395 173 -76 1360 -745 539 -607
4287 -607 469 94 715 374 -927 -1224 -483 337 275 73 364 -1364 672 906 261 -776 -93 949
4305 949 -149 838 -1270 3 -393 -630 25 -515 2011 -1356 -173 1155 374 -765 -593 789 -755
4322 -755 1437 994 -48 -15 -426 151 -826 -520 31 -1710 892 543 460 357 520 751 279 835 591
4341 591 83 -362 62 63 509 106 -275 -482 -1268 -684 965 -1002 132 -418 589 -571 -228 140 114
4360A14k05j941K354n61l05K126j640L15n57J286j492l28J543o46K53m67Q44r39
4378b46p87n01N55J913n30N31q73k75r68k74J538j366K734j012J2J2k398J514
4396d21k57k21J958j033n70J042j107k41J101J239m66k057J287r76J184q58O46
4413B50j439K005r05R55j443R04O48p74L69K80j172L17M49j877J150J099k629
4430a813J068P62j88J396k313K187j009M46j428K55J179j73P15r06j77K13j53
4447F1N31n24m52p36J943j036r74J798n17p11O35J71J85j522K244j619K135j358
4465B54q27J351j297K41J78n4m70K011q38k156J922q55M08N70j024Q39l72K03
4483H4N5j83L11j865J653J110r79j042J72P20n10J361j214R53r63J326p6j297
$$ plain form
4360 114 -91 -2032 322 -239 -544 1582 -58 257 -300 986 -506 -834 709 63 316 -151 693 -246
4378 -246 -1033 -1534 -979 934 404 935 62 -213 -1181 -1455 83 -1283 1451 439 451 463 -1935 -421
4396 -421 -678 -899 1059 26 -544 498 -609 -850 251 1490 1024 -1033 254 -722 462 -396 250
4413 250 -1189 816 -89 866 -577 327 975 201 570 850 -322 -5 444 -1433 -283 816 -1813
4430 -1813 -745 17 -171 1225 -1088 1099 90 536 -892 -637 542 369 1084 178 1 214 61
4447 61 592 68 -384 -1120 823 -213 -1187 611 94 -617 18 189 374 -1148 1096 -523 1612 254
4465 254 -573 778 -519 -278 -100 -154 -624 1387 549 -1607 315 -540 -132 438 -586 253 -119 84
4483 84 139 -44 267 -1598 55 1165 186 -856 -684 36 -474 887 -327 626 -337 989 913 -384
4501c84J347l14n74p57Q14R65k979J917R4P93j028L56J199k194O09r72O85n55
4519i78R06K85j078P97l47J83O05r38L64J114j294j86r77J901j682J802j497N75
4537d45m31q20J846K95Q39m02p90p94Q97l45m77J233j947R23r2M10R39j578J189
4556D50j588J785k09j654J380Q5J479j996J38P97j064K024l704K804j183J236
4572G80q19J194r35p33L52O02j000M96m76J508q96N7o11k07K2M12j52J10Q52n07
4592D9Q46m96o41J145q22L98k035J270J378j717J107M28l76o80RO39q51M82q40
4611g07J618p92j106L044l504J025K82q4j87p97J986q34o09L32N59q84N73M20
4629C35j276J089o47n51J712r39j46O66m70J221j575L75J75L62o86J26q87J658
$$ plain form
4501 -384 963 649 75 -682 132 1097 -1882 35 129 922 -106 250 1449 -745 -136 -1108 -423 -978
4519 -978 -72 213 -865 -68 -415 -232 373 -565 -201 913 -381 -567 -1544 357 -1325 477 -1020 -445
4537 -445 -876 -1696 150 445 1284 882 92 -702 195 -150 -627 606 -1341 -418 -510 -100 839 -739 450
4556 450 -1138 647 438 -1216 164 249 1728 -268 -130 667 -397 1627 -2077 727 -456 780
4572 780 -39 1155 220 -513 -161 441 -559 -63 -539 969 73 130 -481 -688 -666 -254 -406 -296 556 49
4592 49 895 399 -242 903 81 479 -1556 -286 1092 -625 482 910 534 -146 -137 502 -349 133 -707
4611 -707 911 119 -987 2057 -1447 -422 -140 -224 -411 -1208 778 -56 -665 -333 226 -658 -85 335
4629 335 -941 148 -499 -1050 662 -277 -423 243 -227 994 -581 -206 -31 331 -355 -229 -1116 542
4647E42L83q22m91k36P45r5p31Q38j94j16p14k75J515p02M4k95J099o52j47j22
4667d26p4N39j730J911q03O8K048k680J547j473K436o53q18J27l58K055j948J621
4685A389j133Q05j265n64Q42q36J226m87J17K24j421J814j945J560L88p02J233
4702A245k395K329k101J015P9o39j24K68R62j622J123q59J598N9k052J667j012
4719d59M67J03N20o98q49J068m42P37j390N17L99r90J438j183J045k33l12Q90
4737F28j223J322j512l61J391j036J285j703J810j559J382k62j099J331q33Q52
4753D13k262Q47N58m71Q22j35K77L9L44j50j07J266j439r0N04O47q83O4J59j732
4773a329J648r07o02J453M9Q68k111J382J17j625J610j429J705j448J608o20l63
$$ plain form
4647 542 925 103 -388 -624 121 26 -705 133 -61 -177 -891 -1166 349 -353 -309 -604 495 -157 -304 -426
4667 -426 -500 39 -1691 220 -583 -515 1533 -1147 400 -1073 1363 710 -108 19 -339 1716 -232 1389
4685 1389 256 1061 -204 -768 74 -762 464 -23 94 318 -1103 711 -1234 326 714 12 1245
4702 1245 -1150 1179 -922 93 172 -467 -591 -323 639 -983 140 -719 879 938 -1114 553 -459
4719 -459 8 111 631 -67 -916 152 -290 447 -943 -426 -27 -1017 421 -762 283 50 -262 628
4737 628 -595 727 -785 -1146 245 -791 494 -1209 601 -958 424 162 -937 394 -439 413
4753 413 -1849 -1002 -444 -915 -93 -228 49 88 432 282 175 1441 2 -88 416 1063 180 244 403 -1329
4773 -1329 319 -588 -1190 263 312 1180 -931 451 568 -1057 553 -876 829 -619 989 369 6
4790FO40K61j738k61J823K9j945P10L40O6n23R18k75m59J021J3j127l18L90J457
4810A028p33o60j2M65m81K8P1K35Q41j120R05l78j042K315j604J123o41j99j96
4829e5o01J838j440Q85k039J431n91k98Q55j413J197r48K551j575o56K295j857
4846d21J82P94m69J636j603p6o08j36l83J300l7o21J306o61m93K90j9J541m02
4865A120m86j552J345m72p75K08J24J240j199J273r13p83P24l75L48k65J628j208
4883a8k27N35m10R53k071Q77J388k022P28J311k194Q11o36O0p45R17P17q8J56
4902D2j062Q54L80j31k45P34o28m59J235o03O01j357P87J437k175J510q34J54
4920B40n02P04l28j188J536j114J185O77r54P82q75j31r79P54j649K118k10J046
$$ plain form
4790 6 646 907 -831 -1092 731 760 -1185 -475 -135 -69 -592 326 51 -408 613 626 -501 -819 -429 1028
4810 1028 295 -365 -377 88 -393 -365 -294 -59 782 -338 567 189 -853 1462 -142 981 340 141 -55
4829 -55 -656 1182 -258 627 -1412 19 -572 -870 -15 -1428 -231 -1179 1372 -203 -859 1436 -421
4846 -421 -239 555 86 1722 119 43 -565 -701 -1084 216 179 -442 864 203 -290 0 -19 1522 1120
4865 1120 634 -918 427 -45 -820 -612 -488 752 -447 826 -87 -870 -146 -521 -173 -438 1190 -18
4883 -18 -245 290 -120 833 -1238 -361 1027 -995 -267 1044 -1150 -339 -975 -915 -1660 -743 -26 -114 42
4902 42 -1020 -166 214 83 -162 572 -56 -515 720 117 718 -639 148 1585 -590 920 86 240
4920 240 -262 442 114 -1074 462 -652 533 1210 256 1038 163 32 -947 -193 -1842 276 66 1112
4938A112j188o4k29Q64l36L30j904K779j391J51P68j543O68P15q61L19J62m83
4956a31R25o94K79m04j108J867j304M6L59J207l46k034K223k042P97R1o84J598
4974F45j545J226k82p14J968j874M28m78p61J087N13Q94k180m9J141r06J353L1
4992D97k00j643K222k375K808j202j309k12J688l12p27J756p59o10O81R6j700
5009a301J089N71o88L51n99q58K057p60P24p89P56j000k70O76J87J52J43l03M07
5028E45j328J458q7q42O47r19K111k602J400k160K83K505j199J372k134Q00M18
5045B68k56Q61j824p9J760j790L73J342j055o00K328k141K05L51Q98l31l38j11
5063a39Q52j070J342j724J236L66J98j645Q46Q86j150J029k301J403N98j985K120
$$ plain form
4938 1112 -76 -140 -369 495 159 489 -1415 1364 -27 124 892 -651 17 732 -129 190 352 -131
4956 -131 794 100 379 -25 -1133 734 -570 -524 -165 1042 696 -1338 885 -1157 -360 -269 -953 645
4974 645 -900 326 44 -670 1298 -576 -148 -626 -1387 -300 213 1107 -1073 -1122 19 -887 466 497
4992 497 297 -1346 876 -1499 1309 107 -1202 -1414 274 -38 -765 991 232 -378 303 399 -1301
5009 -1301 -212 359 -329 22 -577 -1435 622 -138 586 -203 553 -447 -717 -41 146 298 441 138 545
5028 545 -783 675 588 -254 393 -526 1585 -1017 383 -1777 -1494 1011 -188 1184 -950 -150 268
5045 268 12 873 -951 -1030 730 -1060 -687 655 -400 -1000 1328 -813 -608 -257 641 310 -28 -139
5063 -139 713 -357 985 -739 497 863 1061 -584 262 1148 -2 1027 -1274 129 727 -1258 862
5080H62r09j001O88O79l06m98R33k081K294j684N97j8n56J130m52j406J954q57
5098f31J507j839Q72n08j15MQ3K8O40J151j203J231j074p31N34j02k8J25J40o2
5118B2j180J119p5J475k874P99J330m74q74Q50K85j089J470k1j991J932j226L97
5136a25J41J25k3n02J395o13l2J067j117N72j017j97L90o4J55n09Q21j065J446
5155H48q70M98m58Q8M39p43m98O11K41l33K69J241k362O47J7J036l13r92O24r69
5175i79J470j029J37L01n96R53j180L132k377M99O53j317p6l22R80O49r69j052
5193a123K095j36p45M80N6m99J93l93p60K12k52p27J917j351K137j204m38J001
5211D63K21J06r37m47O70N19K44k011K48J300j226K67K93r78J691n68j42q84M96
$$ plain form
5080 862 -47 -1048 -360 319 13 -485 448 -1633 661 -1023 -426 -444 -1000 130 -322 -1728 226 -631
5098 -631 876 -963 -91 -599 -714 -710 -627 -599 41 1192 -11 1220 146 -585 -51 -153 -181 -56 84 22
5118 22 -1158 -39 -114 1361 -1513 -714 616 142 -732 118 403 -686 784 763 -1228 704 -522 -125
5136 -125 16 141 118 -384 1011 398 366 1433 316 888 -129 -326 64 0 155 -354 467 -598 848
5155 848 -22 476 18 106 545 -198 -696 -85 156 -177 92 1333 -1029 -382 -365 671 358 -634 -10 -979
5175 -979 491 -538 -401 -100 -696 257 -923 2209 -168 331 984 -333 -409 -731 249 898 -71 -1123
5193 -1123 972 836 91 571 627 128 321 -72 -832 -620 -872 -1599 318 -1033 1104 -100 -538 463
5211 463 684 790 -147 -594 76 595 839 -1172 -924 376 -850 -583 -290 -1268 423 -145 -287 -1171 -675
5230f75o66J225J762k786L237j456j149M3M87N78j856J765r46k27K95J01P01j342
5248i09N66Q07n49K31n39J117o01L32m02l83L10l7J039k219J43K725k509J022
5266A44k050K445j300O19l57m45J185j228K279j827O61j624K466p91o01J566k244
5283a102J298M93m78J475k231J053p22J203j513k20J030p34O66m87q1oo11J354
5301C87n64o28P9N27N15n36Q75l93m90l68J269j69l50J93j806K512k021N56j206
5320a618J400K245k282K711k211l73K85j610K471j643J074O91j527M40n61J333
5336H25j104l55P76R46j335k90J920k558J201n0Q4N84k317J216q88J811q58P5
5354c17J596j535qr9M09nj658K229k07K27j736J340k26J034j681N60K178k094
$$ plain form
5230 -675 -1341 -116 1646 -1140 2097 641 -508 -465 22 600 -1256 509 -437 -664 -369 -268 433 -909
5248 -909 -343 464 -85 146 -393 724 123 455 53 -330 -20 -57 982 -1237 -1094 1631 -878 144
5266 144 -1906 539 -761 -142 -499 -944 241 -987 1292 -535 126 -1498 968 177 -424 1142 -1102
5283 -1102 196 689 211 1686 -545 508 -214 989 -524 -744 286 -448 218 -269 -350 -356 -967 387
5301 387 -177 -805 -726 -199 316 -220 655 262 -228 -596 673 504 154 347 -1459 1053 -968 -412 -1618
5320 -1618 -218 2027 -255 2456 245 -128 157 -1453 1018 -625 449 1140 -387 53 -508 825
5336 825 -279 -634 142 1088 -247 -537 1383 -1175 26 -24 60 644 -1673 -457 -1345 466 -392 -317
5354 -317 1279 -256 -264 -363 46 41 -1617 612 405 632 -1104 236 10 1044 -637 -77 2101 7
5372GR69j131j016J475M4J65p07M83L00j122J281n65M86K48j603M76J94L5o8N13
5392D64k063K007l36K8n67N39L08r93N55j07O8Q06l55l72m47o55J003K10P65m04
5412D54m12k11l78J232j584J039n98j054K042p03j6l92O32k89L46m00J92J458
5430A358k396J660n71n50m54m49L040j345l66m37o39O02j75J066l43J609k591
5447i81K42J262l74m57j125K287j193L38r1m76R63j114J021j80j15Q95r39J565
5465A528k908K594r30o1J02j177J085m67J353j073N3J104j573P51qo61M77o35
5483d46J174r62M95j28o40J487j294L36O26k98m01p62J874j863K150k55j572k89
5501g68j25J875k361J424J29J551q34K21j176j078J227j136J321m42m46J264j204
$$ plain form
5372 7 976 -155 -1171 304 348 513 -194 289 589 -533 748 183 669 917 -686 -210 -16 19 -49 464
5392 464 -1599 408 72 100 -467 72 380 -613 -58 -165 -97 709 354 -18 -465 -1120 -117 93 858 454
5412 454 42 -169 -547 685 -899 140 -458 -1512 530 -173 -189 -581 51 -238 108 -292 -100 1358
5430 1358 -1038 622 51 -499 -953 -1402 1638 293 -73 -510 -1149 -547 -722 344 1 1610 -981
5447 -981 -739 523 149 -308 -1433 854 -339 -1 -92 -568 395 -719 302 122 7 902 -37 1528
5465 1528 -1380 1214 284 223 325 -852 233 -234 1119 46 99 1203 -370 381 373 -288 189 -446
5483 -446 728 -234 261 133 -507 980 -314 22 648 350 -51 -813 1061 -802 1348 1093 -479 -768
5501 -768 -893 982 -1379 45 174 1725 891 1112 -64 -1142 85 -1051 270 -172 -618 646 -558
5518e58R89k246K728l67j09Q97j014K20j374N48J704l096J192Q74J73j970M29
5535i80P13m7R35j895N19O37n40Q72J32L75r63P77l67N85j71j804K502j865P21
5554A36m57P2J214o18J226j891L2k2L6j14m67J660r14O68j63j549J074j152K312
5573A083q31n06M22J070j354k87J413l41j125j67M52k74j12J193j229J385r90
5590a98N78o32n39J67k64J044J47r08J55M2R87P62j018N43o13P45k22P23j090
5609D09j584K029j115N87m27L02m97L26Q80j671M62n68J201j161K44M42k26J271
5627I04j136k16N16j537K124k245K352o74n86N89rP15j883M82N32J166j091P69
5645G72r84M78m75r68J613j140J029l98j59R96j030n72P05M89J5j935J590M43
$$ plain form
5518 -558 431 -1815 913 546 437 1334 320 540 -834 -286 1418 -1678 -486 388 561 -1409 -980
5535 -980 -267 -314 621 -1274 -755 -118 -658 214 346 721 -242 535 168 753 582 -1222 1280 -585 136
5554 136 -321 -249 965 347 1573 -318 -286 -308 -272 -386 -853 807 -107 561 398 -1151 -77 -1229 1083
5573 1083 252 -254 168 1238 -116 -403 1010 669 -456 -623 -171 -445 -557 636 -593 792 -198
5590 -198 380 -252 -791 -624 -888 156 303 -605 -450 -408 579 1341 323 866 253 998 776 1499 409
5609 409 -1175 854 -261 326 -101 201 -296 30 910 -761 -299 -867 334 -827 -583 -141 -367 904
5627 904 -232 -448 68 -1469 655 -1590 762 88 -498 91 82 797 -1086 -604 -72 1094 3 772
5645 772 -212 266 -209 -1177 436 -704 325 -73 -232 764 -266 -838 -133 356 371 -1564 26 469
5663D69j493J125q57Q35n7J395o83q75l48p77J925j32j060J361j034Q85k154K058
5681E83j698j128K894n61M29j088L85l26J594n85j737J663j147P44o20J508N43
5698A453j718q87l18J037J357j017J08k46J89m99J093q40O58j09j576J207mr97
5716a109J550q18j049Q83R52r33O42Q8j409J580k45nm11J62Q51j583P30n34R05
5735B47j078J024K28n31k26n22J386p32K2N48j042K187j752J343r70o68J088J28
5753F80k4r25J169r37M7Q17j165j66J44M3n35m93N15J45J310j255n51J241n01
5772d41K160j547n85k30K35M98n64q4j25O75r71J161O50j673J710j521P20j190
5790a122J448L99q73m27J292j221J606p99O77p94o92p67J203M57K58o6k426K051
$$ plain form
5663 469 -1024 101 -756 79 22 1417 734 -141 -489 -1266 659 527 -533 828 -206 679 -1475 583
5681 583 -1115 -2243 651 90 519 -569 -184 -510 1084 499 -1238 425 -722 22 -598 910 1453
5698 1453 -265 -1152 -1470 -433 924 -93 15 -231 -42 -541 552 -288 370 261 -1315 -108 -112 -1109
5716 -1109 441 -377 -1426 -543 409 -524 118 206 -1203 377 132 127 -284 -122 729 -854 -124 -658 247
5735 247 -831 193 421 -110 -336 -858 528 -204 -182 366 -676 1511 -241 1102 132 -536 552 680
5753 680 656 -269 900 -37 10 827 -338 -504 -360 -317 -852 -1345 -830 -685 625 -630 -1181 60 -441
5772 -441 1719 172 -413 -643 -408 90 -474 -558 -683 -8 -979 182 832 -841 869 -652 68 -1122
5790 -1122 326 725 -148 -575 717 -504 1102 303 980 186 -506 -1273 -70 387 645 579 -1847 204
5808B04k87R74p84r8Q46k447L005j810qJ156j929J702j134J475o27j893J197O02
5826A44k84k97O78L72J30j022k57K146j519k7m44k76J360k940L086j584P36M73
5844D75N87k085N98N80M94j044J034O46k37j260J398j460J81j210J40J682j044
5861e25J250m52J15j924K724o21N44j665J820j927P24O55K09q73Q45l48n11l58
5879c18K04J200r25j240m30J306nn59J364j084M58L63j351J860r11M99o02P32
5897E61j197R67j124Q12J007q66p17K35O20K10j46J28n86m69N25k93J384j274
5915b23L55j692J596l6M6j53l37J919k701J532m53m67Q68j104J298j028Q24O81
5933I25m38k48q90J073n81J386j594J63J415j089o51J567j230o36k98J648K22
$$ plain form
5808 204 -83 891 107 9 855 -1592 1413 -397 -405 751 -1178 524 -610 865 238 -1655 -458 144
5826 144 -140 -437 241 613 743 -279 -536 1610 91 64 -380 -656 704 -2236 850 -734 2 475
5844 475 1062 -1023 -425 155 649 -395 639 1285 1048 -212 1186 -274 -93 -1303 -1163 519 -525
5861 -525 725 273 388 -1536 1188 567 1111 -554 1266 -661 63 718 927 54 899 551 40 -318
5879 -318 -114 1086 161 -1079 -1509 -203 -208 -767 597 -487 -29 334 -1017 843 -68 431 -171 561
5897 561 -636 331 -793 19 1026 160 -557 -322 298 508 362 490 -96 -565 -40 -333 1051 -223
5915 -223 132 -1560 36 0 46 -107 -444 1475 -1226 306 -147 -614 254 -850 448 -580 244 925
5933 925 487 239 -651 422 -159 1227 -367 -204 1211 122 -529 1038 -192 -828 -1126 522 744
5950G44o93m72J601o64m12N28n35P33r10k88M60l00K99K95J91j60j817P42Q60
5969B02m06q25J445l86p61Q12m05L19N7j054J855j859J392K25N9k141J292J069
5987H90j365J450j426K14K06r37J003j61J026j361J236J78r68K45o35J545k288
6004a148J712J93m67M42j85j11j212N50Q10P2n40K28k56J87j96K89j303O94k1
6023b62Q76k563Q72L42M16l06M62j42p2O88K35j502J131j142k80M18L98N55Q39
6042I63r29l07J803j87k046K498k017p1l71m32K822k849J079M01m49K96m76N20
6060B48M00J378j581J84p23P74q89j724K660o60P93j139J47K28k501K348k82O78
6078C39j003j44K327k273J257j447K151p70j092O90K80L07k040J584K61j064N28
$$ plain form
5950 744 51 -421 1180 516 104 632 97 830 -80 -368 92 -208 91 386 577 417 -1400 -658 202
5969 202 -204 -1029 416 30 -731 81 -324 -5 52 -1002 853 -1006 386 611 670 -1471 -179 890
5987 890 -475 975 -451 -237 -31 -968 35 -126 900 -461 775 953 -15 230 -405 1140 -1148
6004 -1148 564 757 290 732 547 436 -776 -226 584 656 116 344 88 275 79 368 -935 -241 -262
6023 -262 614 -1949 -1077 -735 -319 -625 -163 -305 -377 311 546 -956 175 -967 -1247 -829 -431 124 963
6042 963 34 -273 1530 1343 -703 1795 -222 -293 -664 -1096 1726 -1123 -44 357 -92 204 -272 248
6060 248 648 2026 445 629 -94 680 -209 -1933 727 67 860 -279 -132 96 -2405 -57 -339 339
6078 339 -664 -808 1519 -754 503 -944 1207 437 -655 35 315 622 -1418 166 427 -637 -109
6095a09J26N4O16l53o96K90O9p84N17j094K075n07p74J231j558P9K7R07O51j231
6115d64Q76j91K87k252L070k19j221M18J1J138j787k04K279k261P51l85q84Q15
6133b23M97m45o43J846o21l16j298P94j1J87J560j683N12m04k26J372j02n49r85
6152g38J557j599l67J707o92O62j788J287J42q50K319j845K61R6P0L36k57J130
6170A431k027M01m62J516M66k597J909k120J816O4j00N9k32J251q08J36q24P55
6188F34J54r03L62M97m40m61k58J336k39Q98k326L63j79QM80p63O14o83J174r88
6208g20l26K010j969K110q40n78l27P51N50j393J113L4M68l82m08l15j43J875
6226A510j492J47P02j265J352k428R97o71J188Q8p19Q70n30J85l05K51J538k502
$$ plain form
6095 -109 17 71 687 334 -362 -72 -3 -787 -270 -1364 711 204 -570 661 -897 -818 -791 116 767 -464
6115 -464 412 221 508 -1744 1326 1107 -114 304 315 1453 -334 -538 1741 -520 231 -154 -1038 -223
6133 -223 274 -171 -814 1032 411 95 -1203 -409 -420 -233 1327 -356 156 -248 -474 898 796 247 -738
6152 -738 819 -780 -1147 560 -132 530 -1258 29 171 -679 1640 -205 56 152 222 558 301 1431
6170 1431 -596 -195 -657 859 1325 -1272 637 -1483 333 397 297 356 124 1375 567 703 -121 634
6188 634 788 -115 247 744 304 -157 -415 921 682 1580 -746 -383 -562 -554 -74 -837 -223 -906 268 -720
6208 -720 -1046 964 -1005 1105 265 -313 -640 111 661 -732 381 415 883 501 93 -222 -365 1510
6226 1510 18 165 867 -398 954 -1474 -477 -1148 40 128 -591 279 -251 -66 -371 -120 1418 -1084
6244a084R81p85J924j81k79j154N76J660r41j033N03r20J046m79J40K53J82L76
6262G85j50n39n35P67M29L34j545l79K266l278L550k613J160L07r18N07k48J530
6280A430j083J338k654O66R93k374K285p31K73M52j973J328j273J688k042Q91
6296g86J748j402O38K7q23J277j013P83k723K786n30j069N54j01J153j317J107
6313C09j852K098K56J55m66k44q24J543p17N26j251J401j492J322j094j35Q92
6330D27p61J064j208K129k421Q3J903j212J599j644q92m1p56K320q04J087j067
6347a94Q19o66J13k23Q5K76p68P11j077m3K41P01J021k572J660o45O83M58k169
6366a589L869k557p82J417N3k72k94Q28j400O00o69J070L94j271P21L47k82O52
$$ plain form
6244 -1084 -103 -888 1036 855 576 -578 -2 1658 717 -316 187 -733 313 -166 -26 227 409 785
6262 785 635 96 -439 328 757 1091 -454 -833 1433 -1845 1705 -908 252 559 -359 148 -100 1430
6280 1430 347 1685 -969 -303 690 -1684 601 -130 143 595 -1378 -50 -1323 365 -1677 -786
6296 -786 962 -440 198 225 -598 679 -334 449 -2274 512 -18 -1087 -533 -634 519 -798 309
6313 309 -1543 555 811 966 500 256 -568 975 258 784 -467 934 -558 764 -330 -465 427
6330 427 -334 730 -478 1651 -770 -687 1216 4 1603 -41 -933 -974 -1730 590 -214 873 -194
6347 -194 625 -41 72 -151 -66 210 -558 153 -924 -967 -726 -25 996 -1576 84 -561 122 580 -1589
6366 -1589 2280 -277 -1059 358 411 139 -155 673 -727 -127 -796 274 668 -603 118 465 183 835
6384H35m41p91l46J015j018J92j144K132n81k12Q45j100m58J096J99k9M25l52
6402B67L31j55j87j345K316j711N34n73pJ136J30p47p71O16J22n94J224n52l36
6421c02N7Q82O12k248Q34n72J565j429LJ539k391L330k930L11J440k85O35j810
6439g59P34o97J701j883J042O05k551J987l75J300k312N46J210p37P47q50l3J142
6457H17j272J866j451m78o60J354K01q26m84L71M77p31J509no65O79r6k51k21
6476A34n05J66r77K086j773R07P94j509J443j123J199j571J124j553J036j83K173
6493A868k018j014J650q73J041q52n79J712m36J85mo17K65q62J371j167k47k00
6511g77l36K746j709n3j028J480J302k930J409j061J256M21j426L34l52L87J49
$$ plain form
6384 835 394 -397 -743 272 -746 -554 -1698 434 -147 -359 486 -614 -1072 24 223 194 619 267
6402 267 598 443 256 -1089 1227 -484 50 -523 -530 606 736 -11 -782 -166 -44 -638 586 34 -302
6421 -302 -245 637 1249 -999 -165 -737 828 -601 -598 941 -1450 1880 -1050 -739 701 416 1051 -759
6439 -759 -25 -722 979 -904 138 743 -1808 179 -196 1104 -1208 -662 548 -189 558 -292 -325 817
6457 817 -455 1411 -40 -518 -1178 176 377 -449 -933 -562 -85 -816 693 688 23 702 606 355 134
6476 134 -371 -205 -1182 904 -869 38 832 -677 766 -357 842 -729 395 -1158 -122 -305 1868
6493 1868 -150 -1164 486 -387 654 -198 -777 935 499 684 680 63 328 -534 837 -330 -577 -777
6511 -777 -1113 1633 -76 -129 -1157 323 1625 -1305 104 -957 299 720 -706 -372 -724 -337 -188
6528a88J327j009j281J671j04M32m96j272J008j159J121J27R3j844J939j0j97
6545A58L68n55J77m57q98J768k04J36n49N62M2O35j881J492j998L02M73Q65j04
6564C32q76n97R83j17K13N17l6N91k145N36M2J283j710l42J494p84m75P93N36
6583B38J011j211Q42j297O13p18R5O86n91M3o79Q39K34J52j033J014J357l072
6601a477J522k19m15J097j362J963j520N78k30P33j567N50M86j525J396k69p29
6618i88K226l33m86j207J704k332J566K38l56r64R65o36J252M41j746O97L22K63
6636F26k09O39q74J64k72J013k320J731K79q8j56m32J243j364n92J750j075K04
6654B67r17J083j105Q16N61k253J696N81r53k88P88L38j603J795j543J15N13K
$$ plain form
6528 -188 1139 130 -1151 520 416 848 352 -920 88 -1071 50 177 270 -1574 365 355 158
6545 158 526 -29 148 -309 -1207 561 357 493 -56 506 548 1183 -698 794 -1204 -902 -429 436 332
6564 332 -544 -1141 -158 -275 -62 455 419 1010 -1135 -599 -557 726 -984 -1326 168 -616 -1091 -298 238
6583 238 1249 38 880 -417 196 -522 -427 259 -332 -289 -968 -129 105 257 -776 238 1595 -1477
6601 -1477 45 -174 -589 508 -854 1109 -411 167 -63 670 -897 -347 139 -1386 10 -259 -988
6618 -988 1238 905 419 -788 916 -1416 150 388 32 -932 33 -603 649 1090 -656 41 363 626
6636 626 417 1056 182 346 74 1087 -1233 498 777 689 533 101 1344 -20 -612 1138 63 267
6654 267 -650 433 -672 144 705 -1548 148 729 -224 -512 276 614 -989 806 -737 -622 -109 -107
6672a07J44K26R12k770M14O60R81j39n32J44q32J860p37k35O15j379J322k18n32
6691b03L93j8J257k215Q48j768L312j957L21J122j709n05J881o20m43j162P20
6708g46J411j84j082J065K49k350Q45k01J342r98N37o62l77J579k111J90P46O42
6726a05m68l38J007q78P24k68q69J514J9q1j150K106m78j099J282j418K81l54
6744e73Q85k1k99N45j153K615j503r29M25m20K115j914P45j106O47J246j391N34
6762D48O90o71l75j270J902j723J767j378J166P12j379J451j967J604j412O37
6778B02r15J34K483j662L02j334J468K17j489J124k733K910j502J460k83j218
6794h36J337j392J276Q14l59j99j172l39L54J312m00k05j90m84J715j966P37l84
$$ plain form
6672 -107 37 263 1175 -1595 -1181 -521 460 321 -211 -67 -899 961 224 -11 604 -775 547 329 -203
6691 -203 190 172 1429 -786 62 -1706 1606 -351 -30 1092 -617 -1122 759 139 -304 -1466 -746
6708 -746 665 481 -601 464 713 -1637 -792 -993 349 -649 -112 -774 -1151 428 -1683 -1493 -747 -105
6726 -105 -573 -911 96 -782 -58 -326 -1195 319 338 257 -893 1213 735 -364 918 -500 -219 -573
6744 -573 312 291 -8 537 -616 1999 496 -433 -8 -428 1687 -227 518 -588 59 1305 -86 448
6762 448 1138 467 92 -1178 724 -999 768 -610 556 1268 -111 1340 -627 977 -435 202
6778 202 -713 -579 1904 242 544 -790 678 895 -594 530 -2203 707 -795 665 382 -836
6794 -836 501 -891 385 1199 840 641 -531 -870 -516 796 396 191 1 -483 1232 -734 3 -381
6812c81J450l48j022R35j530J454p68J690j253q31k8L98mN92j110L70q1M88j309
6831a288J828j180J108j189o58J501o59J674J11p95J666k555R9Q80n00p82Q97
6848A58P05k148J377M26l58O4K10j313M43J609q80j665J248p6L14j547K076j724
6866a081J324N2j305J797j502J468j525P18rq46J814j707K321k373Q76l51j356
6883a685J662j620J362Q9j210J109l82R84m45J709r44j077J443j067L95j240N81
6900c36R50q10P4m49K392j447j88l97n05K39j97P61q76m37J44K381o94j76J72
6919F01o09M08O08k056Q42J51O00l51N1N22j401P35q48j12N09L9P59j692J981
6938G37k72q95M2K37J650j036k39q0j309J997p62n31N08P50j261R50N20r21J03
$$ plain form
6812 -381 1069 721 -301 634 -896 558 -210 1480 227 -604 -632 -234 -238 354 -756 -386 -467 21 -1288
6831 -1288 540 -640 468 -721 -1379 122 -537 1137 1248 453 2119 -436 -337 543 43 -739 158
6848 158 863 -1285 92 518 160 224 434 -879 -436 1173 293 -1372 -124 -200 114 -1433 643 -1081
6866 -1081 243 295 -1010 787 -715 753 -772 -54 -63 -909 905 -802 1519 -854 22 -329 -1685
6883 -1685 -23 -1643 -281 -192 -1402 -293 -675 309 -136 1573 629 -448 995 -72 323 -917 -336
6900 -336 614 -196 -122 -571 1821 374 186 -211 -716 -477 -674 87 -789 -1226 -1082 1299 605 429 601
6919 601 -8 400 1008 -1048 -206 -55 545 194 245 767 -634 101 -747 -859 -350 -311 448 -1244 737
6938 737 465 -430 -388 -151 1499 463 224 144 -1165 832 70 -461 47 797 -464 486 1006 85 188
6957A88j109J225j59l89J704j131k15K14j007R68j289M45j234K122k057K658j688
6974g54N32N49Q96j45k082K152j873K041j185k43L78j491J551j263l5J598k515
6991a889K100j051J012j143K57J586k029J354q34P55J50Q88j028L2R1j377L06
7008h20J515K25n40m92N87j264j363K273Q48R32k653J825p88o5J937k531L20p64
7026h18J191j64k41K09p13J905j997o68J169o20J253p24m8Q3N64Q09j789K28L95
7045B4J059k066n29J639J510r03j355N89j474O71J806j995J228j440J892n39P08
7062H25l35O8q20J089k32k85l27P62j533N01p29K134p77L22k6n36Q02k309L552
7081B146l191M86J87J83K36m22O67L36r78Q54r46J531j164n4R88p98q43R1j0P92
$$ plain form
6957 188 -921 304 145 -244 1460 329 114 328 -679 289 -1000 -555 -1789 333 -1724 934 -754
6974 -754 -222 327 1223 1078 -1004 1148 -725 1316 131 -112 266 -1225 326 -937 -972 626 -1889
6991 -1889 211 -840 172 -971 -714 872 -1157 197 -637 118 268 1156 128 160 251 -1126 -820
7008 -820 695 920 380 -112 475 -789 -2152 121 969 1901 -752 1073 285 220 2157 -374 -54 -818
7026 -818 373 209 -32 177 -536 1369 -628 -1296 -127 -747 506 -218 -266 -183 381 1190 -599 -371 24
7045 24 1083 -983 -1512 127 1637 734 -621 -32 -1506 -835 971 -1024 204 -1236 656 117 825
7062 825 490 558 -262 827 595 310 -17 745 -788 -287 -1016 1118 341 663 637 101 903 -1406 2146
7081 2146 -1045 -559 -372 -189 47 -375 292 628 -350 504 -442 1089 -75 -129 859 61 -782 -691 -701 91
7101I1L69J95L92j480J024q84K10j430J941n46Q56j385J122r13N31K16j195R78
7119I2L72J97k532K169l84j417J080J05O2Q52j730L94R21J051j682N12J112r73
7137B01P60j407J327j210M87n95J66N55j346J296o14m2J011o80n6N91L07q18J260
7156A193j044m34O22k006K249q73k58N59l16M11j266Q48N21J2j55K42J828k979
7174h46J888k298O52J087j306K269q01k033L58N50j4K154j557J95L06k9r60J193
7192H08k035K636j028j191Q93j76Jm07K0J461n17k96j31K43j822O85J63K354k082
7211d21K045l028J270k11L28J088n35o45O63q35Q77j364q8J750l41j23r19J030
7229E41J199j587L46q17L97J65k90m23n63O93P93r07j045K065k81l6N81j207J640
$$ plain form
7101 91 460 655 1047 -433 591 -293 -83 -1513 428 -118 738 -647 475 -438 93 309 -886 92
7119 92 464 661 -1871 298 -86 -1503 -423 -318 -256 596 -1134 -740 181 1232 -450 62 1174 201
7137 201 961 -446 881 -329 158 -437 -271 284 -1062 234 -380 -422 589 -91 -147 444 751 -67 1193
7156 1193 149 -285 337 -1669 580 -293 -551 8 -308 103 -1163 -315 206 218 63 305 2133 -846
7174 -846 1042 -1256 -604 483 -823 1446 645 -1388 -1030 -480 -494 1660 103 298 604 575 -385 808
7192 808 -1227 1409 381 -810 83 -93 -92 -499 -479 982 465 169 38 281 -1541 -856 -693 1661 -421
7211 -421 1624 -1404 -134 -345 -17 1071 536 -109 554 -281 596 -768 -856 894 553 430 -489 541
7229 541 1740 153 499 -318 79 244 -46 -469 -1032 -339 454 -453 -1498 567 286 250 831 -376 1264
7248A264j737N06k35M04J261k130O93p39J155N7j702J970n17q84N62K51j92r76
7266i89K222l006J231J314Q29j723K88J031j896R43l72P35J24j020N02j032K67
7283e52q96O74J392p98O9J081p12K40r33r51P82J148o97Q34n84K38j632R90R76
7302F69l74J105j385o84J349r38P10j051K03j87J621k58q85k36J737k221M31K92
7320a02J0p27J838j182m12P3R01J098k189O06j87J370j306j219J618P96o43j37
7338B06N73p42J79J122j130k5J03j844J315J021o40o25k48k7O91m45L42J363j446
7357b57O41n21k86O99j226J357o01m20L79l21J404p95n8M42j550J644k490L088
7375A129j153r86J202p14p5O92j71j239k24J947m63R42p88M34l89r20K12J129
$$ plain form
7248 1264 -473 33 -202 202 1463 -667 26 -713 442 499 -1203 767 250 -634 -72 179 -13 -989
7266 -989 1233 -1773 -542 772 1601 -122 166 1197 -699 244 -128 607 731 -289 213 -819 -552
7283 -552 -1448 -774 618 -180 -111 970 258 498 -435 -1386 -604 544 -153 681 97 335 -1297 -307 669
7302 669 295 1400 15 -669 680 -258 452 -599 -396 -583 1038 780 -105 -341 1396 -825 -394 -102
7320 -102 -92 -819 1019 -163 -575 -502 399 1497 -692 -86 -273 1097 -209 -1428 190 986 343 206
7338 206 779 37 216 1338 208 183 286 -1558 -243 778 138 -487 -735 -762 -71 -516 -174 1189 -257
7357 -257 384 -137 -423 276 -950 407 -194 -614 -235 -556 848 53 -5 437 -1113 531 -1959 1129
7375 1129 -24 -1010 192 -522 -597 95 -76 -1315 -1539 408 -55 887 99 533 144 -776 -564 565
7393E65K69j977J066j09Q77M63j598M95P09P31k176J375j631k87N87j90J296j183
7411g18J606m85j034O57o21N35m15P26n06M73R31j832K225k738R42O28r95P79
7429A58j22o29p86J844J280k312Q43q92P17k30l6J126l84J103j796M84j074O35
7447g1J44m01J413q49m35L99o23N1j408P63R94l24L9M17R09k577J831k98L10q38
7467e54J37M28J35o90j69J000K99p68j92J942r87n58l57N20j935J515k23Q71j758
7486a344R97L63p27k09q07K038l14K2J657k175M52O27n2o16M2J047j437M41j73
7505a68N2L10m9P91r95M76q85Q13K85j613J106m43L56j920J569J495k256J616
7523E40l70N03n34K2L04L04N53j369o83j151R89P69j45R69q44k0J273j090N59
$$ plain form
7393 565 834 -1143 -77 -186 691 1154 -444 51 760 1491 -685 690 -941 -1228 -641 -831 465 -718
7411 -718 888 403 -631 26 -595 -60 -475 251 -255 218 1149 -683 1542 -1196 -254 374 -621 158
7429 158 36 -593 -1379 465 1745 -567 276 -616 101 -129 -165 961 577 1680 -116 368 -706 -71
7447 -71 73 -328 1085 236 -199 200 -423 -372 -1780 -1017 -23 -347 -308 109 1018 -1559 272 -26 284 -554
7467 -554 -417 11 146 -544 -713 287 586 -182 -374 1568 581 23 -334 186 -1749 -234 -457 414 -1344
7486 -1344 -347 16 -711 -920 -1727 311 -3 19 1676 -499 -47 580 528 -88 -46 1001 -436 5 -168
7505 -168 -116 194 145 936 -59 417 -468 345 630 -983 123 -320 36 -1884 -315 1180 -1076 540
7523 540 170 673 139 161 465 769 1322 -47 -730 -1881 -892 -123 -268 701 -143 -163 1110 20 579
7542E79m67O27j269J587j241J18r46J498q47k0o26J111n43J763j500j25L47q52
7560h06J69L64K88R5k01m59J161R77j218q45O35M13o59o15J228m5O06k609k0K136
7580E95J29p21OJ320r36L90m97m54J81r49J612l90K4j090l95J294N5J415k708
7599a119Q00J174m9o4k233K844j697m06J133l6M46j408j35o4P17n33J348p92j205
7618a279R31K7p37N03J85J337j034L68n66M42M92N66O11k791J414k680K478O98
7636I65j366l94Q77J743k358k89J697j850O89j010j008L109j575K69J771k86p99
7653A85j51M01M3P63k517J933n77L39Q04j943J164n53n59l12J207M13j744J426
7671C22j021J767j799J699M21k621K159k063R21J390k060J848k959K364j251O77
$$ plain form
7542 579 112 739 -530 1057 -184 -66 -1012 486 -361 -381 -1007 104 -439 1324 -176 -301 46 -806
7560 -806 -637 -273 15 110 -91 -550 611 1588 370 -475 160 573 -86 -701 527 482 1088 -1521 -1541 595
7580 595 724 3 9 1329 393 783 286 -168 13 -936 676 286 310 -780 -1175 119 174 1589 -1119
7599 -1119 -319 855 806 742 -1491 1353 -344 -750 383 347 793 -615 -750 -814 -97 -630 718 -74 -1279
7618 -1279 -348 -321 -1058 -555 -370 967 -67 301 -265 177 669 1235 1846 -945 469 -2211 267 965
7636 965 -401 -795 82 1825 -533 -822 875 -975 -286 -1296 -2304 805 -770 -501 1270 984 185
7653 185 34 435 478 1241 -1276 657 80 419 1223 -720 444 -109 -668 -980 227 640 -1104 322
7671 322 -699 1068 -731 968 1389 -1232 927 -1136 -215 1175 -885 963 -1996 368 -883 -206
7687b06o03Q85m72k70M99m1K78j37Oj69K23J421j346J821r01j093M34r4J08j928
7707a585J422J44N88m18k63l61k95J628p90L00P52j922J451j607R28l80n94J373
7725C71j088M84K88j87L92m02r78Q75P43j683J405K2m14J223l162K480Q92j870
7743f09P67K01O38j515J127K67k602K511j121r24J851o65O37j746J795o33J349
7760A328p22o98J46K88j66j81K31q41r87J313o33K070k411J990m04n66Q59p47
7778a31J033k078Q78J073p94M21j147J209m29k1Q16p27Q51j371N18p24J171m67
7796H1m69r35L09O54q73J931j057J297r20j11P23p69j05j457J835J253j037J436
7814A786j798m49N96M31K98j667J298n4k374K269k35P38j661J315k31l48J439
$$ plain form
7687 -206 -809 76 -396 -666 -167 -208 70 -67 -61 -230 -7 1414 68 1889 988 -105 329 235 343 -1585
7707 -1585 -163 -19 569 151 -112 -473 -768 860 70 370 1122 -800 651 -956 -28 -408 -1002 371
7725 371 -717 -233 55 -132 260 -142 -1120 -245 498 -1185 220 242 -172 1051 -2111 369 1261 -609
7743 -609 158 359 997 -518 609 876 -1726 785 -336 -1260 591 -74 563 -1183 612 -21 1328
7760 1328 606 -92 54 342 176 -5 226 -615 -1602 -289 -922 1148 -1263 727 323 -243 616 -131
7778 -131 902 -1176 -298 775 -19 402 -745 464 35 14 830 103 954 -417 101 -623 548 81
7796 81 -388 -1323 -1014 -360 -1233 698 -359 938 18 -93 630 -139 -244 -1701 134 1387 350 1786
7814 1786 -12 -461 135 566 864 -803 495 441 -1933 336 101 839 -822 493 262 -86 1353
7831A353j294J496j026P24j657N2J495j367k84k35O50m75n48J285o64Q45l99p18
7849g67R06k203K827j513k5M12J803j401N26R03j240R8j92Q51q22P25o06j145
7867h63J552j879J223N56k09j97o44P67o22O78M81l28Q79k117J863j371L0K75
7885G4p13J643j714J884j358J693r84r86J400k351J967j346J195j818J644j2Q4
7902C02J6l13n89J345R0j948P3N05O98j003K079j610K53J84k26K14j343O78K76
7921c19oo9J589j187o06R5K44J256j092J195j687k20K304j618O0J034j346N02
7939A29L7P97j999Q83r83N06R47j443J031l10K47J212o83p54n8J185p61j56N66
7958C93o89J093q88J002j343o73J111J47O88q61q1o69J333J539l569J395j029
$$ plain form
7831 1353 59 1555 529 1253 -404 -352 1143 -224 -508 -743 -93 -568 -1116 169 -495 350 -49 -767
7849 -767 139 -2064 763 -750 -775 -363 1440 39 565 1468 228 326 134 985 163 888 282 -863
7867 -863 689 -1190 33 589 380 183 -461 306 -316 362 843 515 1394 -723 1140 -231 -201 74
7885 74 -639 1004 -710 1174 -184 1509 525 -461 939 -1412 555 -791 404 -1414 230 218 302
7902 302 318 5 -584 761 851 -1097 -1024 -519 179 -824 1255 -355 -102 82 -144 70 -1273 -595 -319
7921 -319 -325 -394 1195 8 -598 -503 -259 997 -95 1100 -587 -807 1497 -121 -61 973 -373 129
7939 129 166 963 -1036 -153 -1136 -630 317 -1126 -95 -405 -158 1054 371 -383 -441 744 -17 -173 393
7958 393 -296 797 -91 911 -432 -1105 6 153 841 -20 -101 -770 563 2102 -1467 -72 -1101
7975a101N90J0j05J184j112J551k68O13n15q46Q38n31O26j111l78n92J517L26
7993F96j690J152j831J292J213p88jl62J338j621L96Q6m04J6J16M56j308M86J843
8012A085j344L94o85L14R28n48N95j307J686r07j181J994j585J137m99k89O42
8029D30m66L70Q06q58q44J868l053R59J450j059K38j451J773k95R96K86j346R76
8047G80j860J810j985K034M97k135J602j390Q37j375J082l13m49J051m10O14l39
8064E1k47J250j853J083n07J231j223j25R10m85rn77k93P37o16O16J003j004j357
8083a415J792j604J533O34q96K37m39j30P85q72O8Q03P15j098n13R46k28l02P16
8102G32J61j114k0J306k186J967k824K140k15P75j080m49Q63l56M69L19n05o3
$$ plain form
7975 -1101 -511 -501 -606 578 -534 1017 749 1362 847 1 839 308 934 -177 -555 -1147 370 696
7993 696 -994 158 -1673 -381 832 44 43 -319 1019 -602 -206 -120 -524 -508 -392 64 -1244 -758 1085
8012 1085 -259 135 -550 -236 692 144 739 -568 1118 211 -970 1024 -561 576 77 -212 430
8029 430 -36 334 1140 282 -562 1306 -1747 -788 662 -397 -159 -1610 163 -132 864 1150 -196 780
8047 780 -1080 730 -1255 779 1276 -859 743 -647 190 -1185 -103 -416 -865 186 -224 390 51
8064 51 -196 1054 -799 284 -223 1008 -215 -340 570 85 76 -501 -794 -57 -673 -57 946 -58 -1415
8083 -1415 377 -1227 306 940 44 281 -158 -288 497 -375 -307 496 1211 113 -400 546 318 16 732
8102 732 893 -221 -241 1065 -1121 846 -1978 162 -53 722 -358 -807 56 -300 169 488 -17 -80
8120h0j60K31o0n22K8m9J615j832J636k217R00p06P64L79j33J764k327L63J336
8139I30j913J648j154J313j582K040j217j380K450k404L044j820p26J198j98p5
8155A54L17q86j41P0j120J397R62p29L00j221O47J55L58P91j068L26J018M04j160
8174E74k823K329N85j250O15j008K59R3J16J69N65k90P18l84j08M26q90L92k26
8193a38p3J02m61O59j72Q89K97k48o5j179J810j152p05J291j887J051k40J55J344
8212A278k623J367q57K510k712J891j20k409J604k4J3m19L82M95r2p57k14K68
8230d19O8K41M83j15J08m28O04m17J074p3j585L11o18J528p21O54m01m87m15j98
8250h06J680j368j286J430j14O22o28J113k30m64l26M75J98P37j334rj22K26J65
$$ plain form
8120 -80 -240 -9 -69 -591 -563 -612 1003 -829 807 -1410 -510 -1216 -452 -73 -206 1558 -769 -406 930
8139 930 -983 665 -489 824 -758 1282 65 -1315 1135 -1269 1775 -45 -771 427 229 154
8155 154 471 -415 -556 -486 -1606 -209 753 24 324 -897 -250 -95 263 1054 -14 312 1330 1734 574
8174 574 -2249 80 665 -585 30 -978 -719 -626 -510 -341 224 -66 652 268 160 586 -304 88 -138
8193 -138 -211 -109 -570 89 -83 806 1103 855 790 -389 1421 269 -436 855 -1032 19 -221 -66 1278
8212 1278 -1345 22 -835 1675 -1037 854 734 -1675 -71 -95 -82 -501 -119 376 284 -473 -687 -419
8230 -419 -351 -110 373 258 366 -62 542 125 1199 1126 -459 -148 -766 762 41 695 294 -193 -608 -806
8250 -806 874 -494 -1780 -350 -464 158 -470 643 413 -51 -377 98 296 1033 -301 -310 -432 -206 -41
8269d1P68j361J392k99p48J533k380J744q55o01J404q03O47O34j211n95J244Q38
8287A310k202J443j042J126o50m91J42J265j247r13J567j099Q12J05K57J45m76
8304E2P60k026J245l46q08K009j288N10J57p94J1J47O81n55Q32J33k3l03q24J146
8324G16o82J259j599o37j64L01l31R75M6Q77r88Q1R67M87n02p92k33M8r4N24Q31
8345A090q32n46J57J3R42q23J870j749j234M99K28J21J43J08O9n30Q45k76r6j12
8365a13L31o03l54M66N97P76k040K187j048o25N26n06Q50j296J613j175M33Q47
8383H66j158J1O03m89m85n9j20M91J199j216J209j139j216J507j359K404p18k77
8401E4J64n91J301j593R56q58K70J083j704J080n00J509j204J40m87l75J832j032
$$ plain form
8269 -41 727 -634 758 459 -289 1244 -1136 608 -247 -848 556 -247 400 1034 -177 -772 472 1310
8287 1310 -892 551 -491 635 -15 -506 -364 901 -346 -1259 308 -791 21 126 383 528 52
8304 52 812 -1214 31 -315 -1123 886 -402 108 265 -529 -518 -371 310 -245 587 720 697 394 -430 716
8324 716 34 1293 -306 -943 -1107 -806 -1137 -162 -116 761 -227 -146 821 1308 806 14 -219 -171 -265 259 1090
8345 1090 258 -288 -131 -118 824 1 1871 122 -1112 -613 -385 -264 -121 -13 56 -474 371 95 -1 -113
8365 -113 218 -385 -739 -273 324 1100 -940 1247 199 -426 100 -406 444 -852 761 -414 19 866
8383 866 -292 -281 322 -167 -652 -711 -831 -340 859 -357 852 -287 -1503 4 -1355 1049 331 54
8401 54 218 -373 928 -665 291 -567 -297 786 -918 162 -338 1171 -33 107 -380 -755 1077 45
8419D5Q10r69q58J384r44P31j236J271m48n42R76j960K313n40N40j11o87N87k118
8438a756K031P70k54j224N18m40K50p18k85Q39k93J567j17q78J23p85p2M4O11
8457f9j55J06N92p16r86N95n6J943j974Q6N99r32J116j096J158r5J72J03j192
8476h01O73j017J677K59q27j64j96N53j791J730p43R21J24j402J482q44M07J489
8494A530j026N19n77j278Q63Q92k331K365o72m91J05J4L42L41K71j933K4O90L41
8513a1L94j42M91L34q64J488j730p58M01l17MJ52J881j394n84Q08n26O04r57M11
8533c15N21L83m96K77J578k326O58r31r00J735N20K78j325J151j585Q98K21r77
8551f35P48k74R97Mj266J121j209Q52n33P80n52m9L77r49J487j526N41K30M80
$$ plain form
8419 45 855 -114 -972 412 -532 199 -1037 234 -214 -756 220 -1740 573 33 573 462 -225 362 -1756
8438 -1756 275 1045 791 -433 85 -355 -105 -823 -1108 -269 -562 1005 888 10 133 -652 -724 -680 -69
8457 -69 -224 -118 474 -242 -1228 -633 -689 1254 -720 -634 -35 -967 149 -947 211 116 288 391 -801
8476 -801 -128 -1145 532 791 -36 -200 -396 157 -1634 96 -647 274 398 -1004 478 -366 41 1530
8494 1530 504 1023 446 -832 31 923 -1408 957 285 -206 -101 -87 255 596 867 -1066 -1042 -352 -11
8513 -11 383 241 732 1066 202 1690 -40 -798 -397 -714 -710 -558 1323 -71 -655 153 -373 231 -726 -315
8533 -315 206 589 93 370 1948 -378 280 -651 -1551 184 704 982 -343 808 -777 121 342 -635
8551 -635 113 -161 836 840 -426 695 -514 338 -195 585 33 -16 361 -588 899 -627 -86 144 624
8570F24p57o44N40j279J595K46J32K12j219M27m0O95m69K75rl00N69k25r03J036
8590E06o05p78R0J090Q28j533J005m62k6j097J676q00L02l65q29J752k080J289
8608c7j61l5O11j609J309j00j087P70J33j238J149Q01r52k25J785k028P32k40
8626d22k06J199J2l63j74p42r73J63J751L41O57j297O82j198R91k25l76q11M85
8645e06O08K71L37m69r4p98k72J277p91J170j363P44J35K70j32j404J735n76k56
8664a14j34m76R37o20R28L5p74j69J050j84p83Q74p31q72K088j966J859j866J054
8683A36J91n98J128n15Q50j078K1Q0j521J573r80K214j917M55q4k61M46O60j496
8702f96J674j73l41o26O57p13Q39l63K8l29J03K95j363J927o90n92J601j994K97
$$ plain form
8570 624 -133 -777 -237 -1516 79 325 457 669 -550 -123 -163 532 63 338 329 29 598 373 -530 506
8590 506 -99 -877 -787 303 1131 -402 603 141 115 -982 694 -106 196 -169 -998 754 -1326 -37
8608 -37 -198 -233 378 -1231 78 -22 -1109 -339 -206 -1444 -295 506 -446 -671 1114 -914 -182 -422
8626 -422 -628 571 583 220 46 -696 -1669 -1506 245 586 1243 -54 628 -570 421 196 -180 -991 -506
8645 -506 102 373 710 241 147 -651 -923 354 -437 733 -630 114 249 519 387 -1017 718 142 -114
8664 -114 -248 -724 213 -407 521 556 -218 -387 663 479 -304 570 -161 -1033 1055 -911 948 -918 136
8683 136 327 -271 857 342 1192 114 135 215 -1306 267 -713 1501 -416 39 -45 -306 140 800 -696
8702 -696 978 805 464 -162 495 -218 621 258 286 -43 60 355 -1008 919 229 -363 1238 -756 -459
8721d59J011j07l47q67J202J10J35j520N02o62J683o40q20J945r03j364J78R5
8739h28M85p80J436r43K044j461J28J114r35N66p93J89J80j360K519j583n88L29
8757b81P7m57l0K527l401K923j994P19K6R10o7r74J197j809L45j67J84P68j548
8776a052J935j455J0O80j04J406j395L07l87j014P35M80k17n40J246m27K67k81
8794A94o96J222q74J37N94r43R48j077J603p12j429J027R39k78j475J673k083
8811a230J346J50j120J442O23j829O54K37R25j484J078j471P27J748j977J027
8827H46j694J098J070k008L76L88qQ88k376M68P46O85j914J869j565K41M5L39
8845e06R57l99L50j369K058j848J081K45j408J672j548J857j519P63n59j333K747
$$ plain form
8721 -459 552 445 98 -769 433 543 678 -842 -340 -1002 681 41 -779 1166 263 -1101 -923 -828
8739 -828 -343 -1123 313 -630 1414 -47 81 1195 260 826 33 222 402 -958 1561 -22 -610 -281
8757 -281 -204 -661 -691 1836 -1565 1358 -636 83 109 1019 952 -22 1175 -634 -289 -456 -272 496 -1052
8776 -1052 883 -572 -562 118 14 1420 25 332 -55 -1069 -334 146 -71 -611 635 208 475 194
8794 194 -502 720 -154 -17 577 -366 582 -495 1108 396 -1033 -6 933 655 -820 853 -1230
8811 -1230 116 266 -854 588 1211 -618 36 273 1198 -286 792 -679 48 1796 -181 846
8827 846 -848 250 1320 -688 -312 76 68 956 -1420 -952 -206 479 -1435 434 -1131 -890 -845 -506
8845 -506 451 52 402 -967 1091 -757 324 569 -839 833 -715 1142 -377 386 -173 -1506 1241
8862A241j919Q95l51j088K076r54r17q04L450k295L2L84o63J679j590J587j962
8879a199M23J200r79J013q15M08m78L1N92p13R94o65m72J454n62m12o65J833j759
8898g71r6J374j736N00J109j2J348r71p8l60Q3k75R14o76q2J29J16L16N40q84
8918D88P05j055J227j375N95j143J641k702L55K135k378J779l99o80J303q57K45
8935a16m44J811p61p47r3j16J148o63J855j296l88N41j610K224k745J909l74K01
8953C36K50q36J161o58j559N96O25K06N43m68k56J521j065Q9M10j208M1m02O08
8972f6p80L52R05r22N13j70O2J0n80J832k773J303N60M84l21L37mp12J094o74
8992D50k00k003J301J132r41L31n64m8O25p68L63J00J525j269j455K158n35J151
$$ plain form
8862 1241 -678 217 -134 -1222 854 -100 -1017 -1821 1629 -666 -634 -250 -913 766 -824 763 -1199
8879 -1199 -776 424 -555 458 -357 51 -427 -396 196 -517 477 -188 -660 794 232 -180 -845 988 -771
8898 -771 -867 507 -1229 -729 380 368 1716 745 667 307 390 115 1029 353 271 400 516 832 1372 488
8918 488 1193 138 1365 -10 585 -558 1083 -1619 -1264 871 -1507 272 -127 -807 496 -361 -116
8935 -116 -560 1251 490 -257 -350 -466 682 19 1874 578 190 731 -879 1345 -1400 509 135 336
8953 336 586 -250 911 253 -1306 -710 -85 121 664 196 -60 1461 396 485 895 -313 -272 -674 -66
8972 -66 -846 -494 411 -511 2 -168 -106 -96 -676 1156 -1617 -314 246 730 409 746 742 30 1124 450
8992 450 250 -1753 -452 680 -261 70 -494 -542 83 -685 -322 -222 1303 34 -1421 737 202 1353
9010A353j196N40q21j196K479j104O01m25j76p72O01J265k898L236j504J52j00
9027C5j39R50l023L545k299J286q6r50Q43j28J45J328j219n39J55J35k52J728
9045A515k763K82J748j691Q54o06J448q64J9j1K55N09j66q45Q96K21M4j175N84
9064B54l64k01o49J067J126j299o31J741j687J081J94Q1j447J340n45l71K60P9
9082B9J013k032K172k208L10O82m01J277j252J710j474j315J503m93P03L35j91
9099C68m84L3L00r70J535j452K508j765J26j16O65m10k26Q2k41P74j135q05J916
9118G03j064M39j232R1J245M43J09k16m4k21j130J067K03r16R15q63R17n51L11
9137B06j281J325P44o47P48j100Q33o82j45o37J604k535K89J340p6q99J761n01
$$ plain form
9010 1353 157 697 -124 -1320 1159 55 656 231 55 -717 -116 1149 -1749 1487 -17 135 35
9027 35 -104 846 -2177 1368 -931 355 269 -681 162 34 179 1507 288 -251 -96 39 -213 1515
9045 1515 -1248 -966 782 -909 -55 -661 787 -77 -58 -69 186 695 529 -316 580 801 845 -330 254
9064 254 -110 -311 -960 107 1233 -66 -697 1044 -643 438 632 713 -734 606 61 -310 -50 29
9082 29 1042 -990 1182 -1026 -716 -34 -435 842 -410 1300 -174 -1489 14 -479 224 559 368
9099 368 -116 -83 217 -753 782 -670 1838 73 199 83 748 338 112 194 -47 727 -408 -1213 703
9118 703 -361 78 -1154 -1063 182 625 734 518 474 253 -877 190 393 -523 392 -471 446 -105 206
9137 206 -1075 250 994 347 1095 -5 828 146 1 -636 968 -1567 -1278 62 -14 -913 848 347
9155C47OP91n50L7j144M39O16l81m43n96N49O52l16j298J345l32J331j987L39
9174e95K576j510L65k471J829o20J272j806J021j71q52N29J956k505R50k16K490
9191B242l836K169j583Q25O28n50N68j267l6Q77l52q2P53J34j306L34P70m26O36
9210D98q16J625j232N99j2m45j29M76m20r97R60r45R45R3j131J16k0J659k051
9229a227J201K11m31J631j262j087K0R64J433j824K74J225q28K151k329M58m82
9246I8M12K61l65k81J065j565K76p15J59l30K438k979J349l38J46J866j060J024
9264A461k841L332k432J073q08M6K20m13o4M9j41R11j924J997k180J783j042R19
9282e4o58o3J935j022J441j699R7L37p54L57R1m07J8O15m82l17J335q97l73L87
$$ plain form
9155 347 353 1144 594 631 -513 -74 542 161 -282 -878 -329 323 7 -1291 54 -278 1053 -934 -595
9174 -595 1981 471 836 -1635 194 -426 846 -960 61 -110 -962 -433 1523 -982 -32 -248 2242
9191 2242 -1594 575 -1008 -183 445 -105 463 -804 -840 37 -315 -397 356 490 -816 -482 288 -138 498
9210 498 -318 1307 75 674 662 217 88 564 144 -853 107 -838 107 200 -931 -815 -835 824 -1227
9229 -1227 -26 185 -246 1385 123 -964 -944 20 1453 -371 -97 1128 300 2451 122 580 98
9246 98 510 771 406 125 1190 -375 -99 -814 -655 -985 1453 -1526 -177 -515 -369 1497 437 1461
9264 1461 -1380 1952 -480 593 -215 -169 51 -362 -426 -377 -518 393 -1531 466 -1714 69 -973 -54
9282 -54 -712 -775 1160 138 1579 -120 -23 314 -440 -83 8 -399 -381 234 -248 -565 770 -127 -500 -113
9302a13Q15J871j954P47j937J164j245o08J028Q89J065j991J042j472n16J633
9318D18n73J004j155j14m23Q37M99n75L18N3j315J629j699J29R87K34P24q03r49
9337g74l73R47Q68j12k126J481M38j671L51J007N81j374N41J616j131l46j216
9354a293J938L16j150R31r18o94J693o14l17O6r9N50j015Q95Q75j314r68O90L6
9373c92K47j057Q76J349j021l13j764K161o26O34N89j72J6O4O02j127n01J079
9391F44o34Q46j94K45j533n11J762j054N66j202J922o10o31P90k130L632k220
9408c12J282j361Q95k76l00J13k94l6J273p88k07k71k3P21l34R24o95q01k04J103
9428D09m30L43Q5j758J437K74O44N55j140k05j219l44p3K337k72j04n8j503K171
$$ plain form
9302 -113 702 2573 619 1366 -571 593 -652 -1260 -232 657 1722 -269 773 -699 -1215 418
9318 418 -155 849 -306 -420 -843 -6 493 -82 236 289 -1026 603 -1096 -967 20 254 978 175 -774
9337 -774 -1147 -200 668 556 -1570 -89 349 -1322 -971 36 617 -757 -216 1400 269 -77 -1293
9354 -1293 645 961 -189 742 -176 -870 823 209 -108 -42 -141 409 -606 289 1164 -150 -1118 -428 -392
9373 -392 -145 -1202 -326 1023 2 -311 -2075 86 -540 94 683 511 527 591 1193 66 -435 644
9391 644 10 856 662 907 -626 -1137 625 -429 137 -1065 857 247 -384 406 -1724 1908 -312
9408 -312 970 -391 504 228 -72 41 -253 -289 984 196 -11 -282 -305 416 82 1006 311 -490 -694 409
9428 409 -21 322 407 -1351 86 360 1004 1559 419 214 -1005 -1349 -1422 915 643 539 481 -1022 1149
9447A149j558L1p56J445Q44j333L76p98J526m40O0J43k633K412K14j368J503r36
9465a19O19j259R26N9m72p40J326J028k094K415k639L42Q62k90Q90o99J935l455
9483a365J279Q04o53p8j19J866m93j329K42r71J343l56k07Q06r01K04p26K016
9501A362j302N51k481K908j242k163L799k172R72k20O74k49j067k99m62Q55J216
9518F80m07J71r9k71N77j389R31j079K185j426l48p3J028N85P34j631r30Q36J71
9537B45K97j140o19L92m68J736mm4J01j111J982j728Q61n65R13Lq80j635O89Q33
9557a42J93J45o7j063J649j455K009n42j789J392j074L304k633J052j666P82K01
9574B96j016K348k549J265L62n79Q37j986J637l47k96j495J083P12j151K129j301
$$ plain form
9447 1149 -409 -378 -1134 311 1155 -178 198 -600 926 486 546 689 -1944 468 682 -686 817 -119
9465 -119 500 -759 167 226 -246 -986 340 1368 -726 1689 -950 -608 254 -36 854 155 2090 -1365
9483 -1365 -86 718 65 -13 -132 1734 1241 -88 154 -817 526 170 -37 769 -132 72 -654 1362
9501 1362 60 611 -1870 1038 -204 -2367 1432 -740 232 12 686 437 -630 -929 -1391 -536 680
9518 680 273 444 345 74 651 -738 193 -886 1299 -127 -475 -548 480 1065 1799 168 -762 74 245
9537 245 542 -598 -1217 -825 -1293 443 439 395 496 -615 1367 -361 500 -65 848 851 -29 -1664 -975 -142
9557 -142 51 196 129 -934 715 -740 1269 727 -1062 330 -744 2560 -73 979 -687 95 296
9574 296 -720 1628 -921 344 706 127 964 -1022 615 268 -28 -1523 -440 272 -879 1250 -51
9591e1O3p42R05J080j459o1N36J92j626M50k08m55J185N85o11r9K69M47j158R32
9611A74j280J931j07J34p67r9l95p92P79J094o92j105J861l57m41j582J472q64
9629a036J963m04k82j46k273J597j521K039p64J281l20j084J219k64K65k30m05
9646c65n30R62q37O01Q20j228J282n45p50J538q51J286j369p44J795m73r01O76
9664C67M91j511K63K0J88n35J256L43p32j46o58N68p18J84J225k92j979K598r33
9683aN63j52j195P38k35J93o71R15j109J7J389j52Q72p41k68j07j478K249k84
9702E43j205J41J308j115m1L10L78J435k078j18L4j99J265j363R78J41l33j76
9720i5j410K767j389J30M85j245J120n49j210P05N08k95M39L64j59p22R58J319
$$ plain form
9591 -51 12 -730 175 1255 -204 -265 271 463 -1163 -713 -921 -1376 -191 394 -217 -316 -47 400 -758 174
9611 174 -1106 825 718 852 85 -14 -409 -1201 -422 672 -20 -1125 736 379 -62 -1644 -172 -1036
9629 -1036 927 523 241 95 -2178 -581 -2102 -63 -827 454 134 -950 269 5 270 40 -365
9646 -365 -895 67 -770 -169 651 -577 705 160 -590 948 97 1383 14 -730 1065 592 -309 367
9664 367 858 -653 -390 -370 -182 -717 539 882 150 4 -654 -86 -804 -620 605 313 -1666 932 -1
9683 -1 562 410 -785 -47 -282 -89 -760 155 -954 -937 452 300 1172 431 163 56 -1422 827 543
9702 543 -662 -521 787 -328 -369 -59 319 1754 -324 -442 -408 -607 658 -705 273 414 81 -95
9720 -95 -1505 1262 -127 3 488 -757 363 -186 -1396 -691 -183 -478 -39 325 166 -556 402 1721
9738A721m169J663J395j777J368K99l89n20k9L30j144Q84Q69o78l84J136p5p6
9756D24k71l84J807j840Q2O95n64K95j096J480j455O69J233m86O22j901N29Q63
9774G02J41j406M2J746r12m58j184L53R59P44K71j483P54j529j55K002L9M09j409
9793c74j59K64j75J503j603J686k87p24M80J70j836J641j131m76p0R76M51K46
9811E82p80R92j373J178j127l13J780j348J144j146n55l23J081P5K48O09j445
9828g21N29j053N65J075j106N63O78m56L24p82O94l5L17k103K138o02K30k59j138
9847a142L8R17j174Q16M49M69k00K22M5Q00p68j311P94J132j895O88o82P05q50
9866i47J650r31k39K84k52R32n41L82m67q84J222r13J361L63j240J356p19j64
$$ plain form
9738 1721 -2448 -785 610 -1167 201 500 111 -409 -438 -108 -1252 -368 501 -177 -561 575 500 424
9756 424 153 -231 1576 -264 -182 513 -51 244 -852 628 -827 -158 1075 589 1211 -690 -161 702
9774 702 843 -563 -521 1225 313 -145 -1329 -976 -17 727 998 -485 269 -1260 -1415 587 626 1035 -374
9793 -374 -533 -269 -444 1059 -544 1142 855 131 611 781 -1055 586 -545 -1021 -1091 -115 336 582
9811 582 -198 794 -579 599 -528 -841 939 -409 735 -411 -966 -1289 -208 -133 115 724 -721
9828 -721 -192 -1245 -680 395 -711 -148 530 74 398 -384 310 275 592 -1511 627 25 255 -4 -1142
9847 -1142 -1104 -187 -1361 -545 -96 373 173 395 440 1240 472 -839 -45 1087 -808 -120 -802 -97 -947
9866 -947 703 -228 -467 -183 -435 497 -44 338 -129 -1013 209 -704 657 1020 -220 1136 417 253
9884B53K46j050R83M13n94j149N3J404K25p90K71q6l3j93k48J861j958O57o4j02
9904I9J80M22r09k90P8l20j220K638p00R84p97J26R77l161J743p5J264p07k89
9923D3Q20j987J980j033J67Q68k54j136O05J264j091k67L71n01n7l20J680k171
9941a019J475m21J308j243j339K225j188l71N90j60N69j142J723j519j222K311
9957E77p28J516q95m54K6LN92k66j89l7j5J808r16n85M2O18j295q82K385q27p65
9978b87n04J815j436l96R41j551K625j988Q36N17o29J53K06j9j511K659j319q66
9996g54K225j862Q29M6l26L17l552M488j521N80j280M75L28J062L18l071J360
10013c38M6m11J039j30k68q99K188k399O32Q70n68P4N08J586j757J763l084J172
$$ plain form
9884 253 499 -551 432 845 251 -898 -845 559 784 -6 265 179 146 -47 -295 1566 -392 265 201 99
9904 99 279 701 -208 -498 -420 -740 -1960 678 -22 962 165 291 1268 -1893 -150 -225 1039 332 43
9923 43 863 -1124 856 -177 -10 858 604 -532 73 1337 246 -21 350 -151 -208 -528 1152 -1019
9941 -1019 456 35 1343 100 -1239 986 -202 -573 17 -143 426 -716 1007 -512 -1734 577
9957 577 -151 1365 470 16 42 45 637 371 182 145 130 1938 1022 437 479 1097 -198 -1080 1305 478 -287
9978 -287 -791 1024 -412 -808 133 -1418 1207 -781 55 572 -57 96 302 283 -1228 1431 112 -754
9996 -754 1471 -391 438 484 158 475 -3077 1411 -110 470 -810 -335 -7 1055 1373 -1698 -338
10013 -338 -292 -703 336 206 -62 -961 1227 -1172 -540 330 -238 -164 344 1930 173 1936 -1148 24
10031B4j536J673n97j237K377M70k148J350L4k57j79J04r69J013P94j534L78L36
10049I6m43j028Q87L53j31J105N73k172J039j027J16l67R96N08n06P67j473J858
10067A151j260j52o58p44K327j965L149j858k65M89J66m67j137J758o48k90J297
10084H93j064J074j818N60K71L3J200j137O47r63J252j915J659K16j435J024j107
10101f10R33n2k1m9K24p14J99J078r74R0o86L98o03N92R96l17J90j745q11K500
10121F18n04n12Q35r41J18n71J202q55R73j89j085Q20l80Q97n27M46r48J175m57
10140A15J518j563n5j79J65P33M5k29N60k125J490J299j513L7K02J72r11m09m17
10159a065N91K247k318J62J227n26K44k281J513K26M7l04l24J052j192M1J28k94
$$ plain form
10031 24 -1512 161 -436 -1673 704 1174 -974 376 410 153 -26 78 -891 122 916 -618 -240 96
10049 96 -347 -1375 -488 -135 -266 839 1412 -760 279 -748 -632 -999 -3 505 -1 766 -707 1151
10067 1151 -109 -261 -919 -1663 664 -1301 1848 -10 -275 214 380 -87 -1224 534 -114 -404 893
10084 893 -171 903 -915 -355 -84 -51 1149 12 659 -304 948 -967 692 908 -527 497 -610
10101 -610 323 271 250 201 425 -289 -90 988 14 104 -582 -184 -787 -195 801 484 674 -1071 -1882 618
10121 618 114 -398 437 -504 -386 -957 245 -610 363 174 -911 -91 -471 426 -101 345 -603 572 115
10140 115 1633 70 15 -164 1 734 779 550 1110 -1015 475 1774 261 298 500 672 -239 -648 -1065
10159 -1065 -474 1773 -545 -383 844 318 562 -1719 -206 20 67 -237 -561 491 -701 -660 -532 -826
10177h26N16Q05k68r46J439n25k6o16j09J784q05l24J45l33l46p24K447k033P06
10196c9m59p3J350l32j05q51J734k356QQ99O01l54P78k94K3K02j03j188Q55O91
10216I87m98K37j027J991k019k27k08j49M72J2J57J405k045J880q52Mr70J272
10234D22j856J763j302L71J411j908J485j128J353j563K308j700k40J853j551
10249b82o92J010L49q35J56K165k030O40j917J840k28q94J667k561J848m64L36
10266A08Q53j862J700j610J511j618J848j264n48J375O3j439J798q00n73O12J23
10283B77k83n32Q08n3o0p80J746o42oj710N17J251L00p90L27m71Q83j395J266
10302F53m00p61K47M61L32o26N98M6j504Q07j061J985j277N8j003K254r87K22
$$ plain form
10177 -826 -310 495 227 -719 720 195 169 -447 -556 1228 423 99 244 -89 -435 -1159 1288 -745 -39
10196 -39 -498 -571 779 447 342 -509 1225 -1131 -1123 -224 377 23 801 507 530 732 629 -559 296 987
10216 987 489 726 -301 1690 -329 -556 -764 -913 -441 -429 -272 1133 -912 968 116 120 -850 422
10234 422 -1434 329 -973 -602 809 -1099 386 -742 611 -952 1356 -344 -584 1269 -282
10249 -282 -974 36 385 -450 -294 1871 -159 481 -1436 404 176 -718 949 -1612 236 -228 108
10266 108 961 -901 799 -811 700 -918 930 -334 -882 493 556 -883 915 115 -458 154 277
10283 277 -6 -538 270 217 157 -623 1123 481 475 -1235 -718 533 833 43 370 -101 782 -613 653
10302 653 253 -508 -261 200 532 -94 504 550 -954 -147 -1208 777 -500 -442 -1445 809 -178 44
10320D4L12j571J662o5M38m14%o20R52l85N24j246R6J602r87j280J133o48L94
10339e9J864l142L228p37j277m92L83M88j657J969m70l6m96L98J74K27p30P90
10357D25L65k54q43J030j377J277j516O91N46P71j882j24J537l65O43p40J47j24
10375B07L49k00j291K039J84j595J152o91J11o06p49k49M00K493j181l07m9L97
10393D14j841L45K660j241M12n74k25J53j30m34K95O02J30j406K534l790K999
10410I03p57j056j78J193k79j357P67N84j317K014R94q69r05K60l67O4L29Q98
10428I21o98j41K90j219n1J558m73o67R71p21l18J523j045k144K414n68J77n73
10446g64J20J751j795L08J120m20K45k94j45p11J422j0j614O98J167l24j028R10
$$ plain form
10320 44 356 -1215 447 382 820 406 406 -214 738 353 877 -369 -273 1329 342 -938 195 -453 -59
10339 -59 1805 -1337 1891 1154 -123 -615 -232 256 -1401 568 98 62 -434 -36 138 365 -365 425
10357 425 790 536 -307 723 -654 623 -893 -202 344 1115 -767 -891 646 281 924 184 331 207
10375 207 556 356 -935 1104 1288 -307 845 154 265 -341 -1090 -1339 -939 1554 373 66 17 414
10393 414 -1427 -1082 1578 337 749 175 -50 103 -27 -461 -166 436 566 -840 1694 -2096 903
10410 903 146 -910 -1088 105 -174 -1531 -764 -180 -1497 517 1511 642 -263 -3 -370 -306 23 921
10428 921 223 82 372 -847 -898 660 187 -480 491 -230 -548 975 -70 -2214 200 -368 -191 -764
10446 -764 -644 1107 -688 -380 740 320 565 271 126 -585 837 827 -787 -89 1078 754 -274 636
10464F36j007lN06q33J402j215P14m68J270q05n40J267k040J674L38l48k83k46
10482A9Q21r28K55n01P23K44j807J006L03l74n62K349j780jJ308l284K271p13
10500f51k45J448j101K237k914R45l42N76J260k975J740o08O26l68J70O89j649
10517a162J823l15n03O37n51P41rM96j648K43L28j63J074j961J134J44j323J343
10535C28r5K29j282K151j857J043L15j436R58n56R03j131M33J71r43R77j547J707
10553C68n10j240J882j392J152o81M03r61P21L91m6j238J224P1k88j323J916o56
10571b07Q45r23j06q01J096k6J186n85j017j8P15l57o5o55J072K94j581K215l391
10590b309J501o3J948j855k88J820q8N05j266L00R3q05Q02p68R66j603L22J649
$$ plain form
10464 636 -371 -374 132 -701 701 -514 200 -268 1002 197 -343 924 -1116 558 896 548 265 19
10482 19 840 -88 167 -334 389 633 -1174 -168 135 -239 -801 1548 -232 -233 1075 -2209 62 -651
10500 -651 -896 552 -549 1688 -1226 -281 -623 -47 1213 -1762 -22 -630 -4 -372 -202 487 -1162
10517 -1162 661 346 -157 480 -71 670 661 1157 -491 -248 80 -83 991 -970 164 308 -1015 328
10535 328 233 462 -820 1331 -526 517 832 -604 354 -202 701 -430 3 174 -769 208 -1339 368
10553 368 -142 -1382 500 -892 260 -421 -18 -979 -258 133 87 -1151 73 144 -144 -1467 449 -207
10571 -207 638 -285 -391 -1192 -96 -122 1064 479 -538 -556 159 -198 -263 -918 154 448 -1133 1082 -2309
10590 -2309 -808 -871 1077 -778 -1066 754 666 1171 -95 205 298 -507 295 -473 493 -1110 -788 861
10608H61j202Q63r97J948m65k31j501r2J445j348P18j009K15J110M80J82j176
$$ plain form
10608 861 -341 522 -475 1473 1008 777 -724 -816 629 -719 -1 -1010 -795 315 795 977 -199
$$ [...]
16383A6
##END NTUPLES=NMR FID
##END=
