##TITLE=31Pdec_DE-93k_d6
 DMSO-d6, 64 sc
 6.5.2025
##JCAMPDX= 6.0         $$ Bruker NMR JCAMP-DX V2.0
##DATA TYPE= NMR SPECTRUM
##DATA CLASS= NTUPLES
##ORIGIN= UXNMR, Bruker Analytische Messtechnik GmbH
##OWNER= root
$$ XWIN-NMR		Version 3.5
$$ Tue May  6 15:44:13 2025 Russian Standard Time (UT+4h)  she@DPX200
##.OBSERVE FREQUENCY= 81.013821
##.OBSERVE NUCLEUS= ^31P
##.ACQUISITION MODE= SIMULTANEOUS
##.ACQUISITION SCHEME= undefined
##.AVERAGES= 64
##.DIGITISER RES= 17
##SPECTROMETER/DATA SYSTEM= spect
##.PULSE SEQUENCE= zgpg30
##.SOLVENT NAME= DMSO
##.SHIFT REFERENCE= (INTERNAL, DMSO, 0, 198.062)
##AUDIT TRAIL= $$ (NUMBER, WHEN, WHO, WHERE, WHAT)
$$ ##TITLE= Audit trail, XWIN-NMR		Version 3.5
$$ ##JCAMPDX= 5.01
$$ ##ORIGIN= Bruker BioSpin GmbH
$$ ##OWNER= she
$$ F:/spectra/data/she/nmr/P31/2/pdata/1/auditp.txt
$$ ##AUDIT TRAIL=  $$ (NUMBER, WHEN, WHO, WHERE, WHAT)
(   1,<2025-05-06 15:43:13.43 +0400>,<she>,<DPX200>,
      <created by zg, POWCHK disabled, PULCHK disabled
       configuration hash MD5:
       00 E9 B6 7A A2 85 ED C7 34 08 36 98 17 FE 4E 26
       data hash MD5: 32K
       83 E1 D0 E0 37 65 F0 67 C4 5D 5D DF 00 85 6E 61>)
(   2,<2025-05-06 15:43:16.18 +0400>,<she>,<DPX200>,
      <Start of raw data processing
       efp BC_mod = 2 LB = 1.5 FT_mod = 6 PKNL = 1 PHC0 = 1357.6 PHC1 = 147.2934 SI = 64K 
       data hash MD5: 64K
       61 CF 5C 54 A9 44 BE DE 60 89 D9 A4 07 E3 40 40>)
(   3,<2025-05-06 15:43:29.81 +0400>,<she>,<DPX200>,
      <pk PHC0 = 11.85798 PHC1 = 0 
       data hash MD5: 64K
       89 B7 E1 28 52 92 6A A4 A3 8F C5 81 1A AC 25 DA>)
(   4,<2025-05-06 15:43:34.70 +0400>,<she>,<DPX200>,
      <abs ABSG = 5 
       data hash MD5: 64K
       3D C3 F5 23 2B 7C F5 E6 97 12 35 FB 15 F6 BB EB>)
$$ ##END=
$$ 
$$ hash MD5
$$ 53 76 61 15 45 BC 1A BF D9 8F BB 3E 26 21 15 A3
##$RELAX= 
##$RELAX= 
##$RELAX= 
##$RELAX= 
##$RELAX= 
##$RELAX= 
##$RELAX= 
##$RELAX= 
$$ Bruker specific parameters
$$ --------------------------
##$DU= <F:/spectra>
##$EXPNO= 2
##$NAME= <P31>
##$PROCNO= 1
##$TYPE= <nmr>
##$USER= <she>
##$AMP= (0..31)
100 100 100 100 100 100 100 100 100 100 100 100 100 100 100 100 100 100 
100 100 100 100 100 100 100 100 100 100 100 100 100 100 
##$AQSEQ= 0
##$AQ_mod= 1
##$AUNM= <au_zg>
##$AUTOPOS= <>
##$BF1= 81.014009
##$BF2= 200.13
##$BF3= 200.13
##$BF4= 200.13
##$BF5= 200.13
##$BF6= 200.13
##$BF7= 200.13
##$BF8= 200.13
##$BYTORDA= 1
##$CFDGTYP= 0
##$CFRGTYP= 5
##$CHEMSTR= <none>
##$CNST= (0..31)
1 1 145 1 1 1 1 1 1 1 1 1 1 1 1 1 1 1 1 1 1 1 1 1 1 1 1 1 1 1 1 1 
##$CPDPRG= <waltz16>
##$CPDPRG1= <>
##$CPDPRG2= <waltz16>
##$CPDPRG3= <>
##$CPDPRG4= <mlev>
##$CPDPRG5= <mlev>
##$CPDPRG6= <mlev>
##$CPDPRG7= <mlev>
##$CPDPRG8= <mlev>
##$CPDPRGB= <>
##$CPDPRGT= <>
##$D= (0..31)
0 1 0 0 0 0 0 0 0 0.06 0 0.03 2e-05 3e-06 0 0 0.0002 0 0 0 0 0 0 0 0 0 
0 0 0 0 0 0 
##$DATE= 1746531792
##$DBL= (0..7)
120 120 120 11 120 120 24 19 
##$DBP= (0..7)
150 150 150 150 150 150 150 150 
##$DBP07= 0
##$DBPNAM0= <>
##$DBPNAM1= <>
##$DBPNAM2= <>
$$ [...]
##$SUBNAM3= <"">
##$SUBNAM4= <"">
##$SUBNAM5= <"">
##$SUBNAM6= <"">
##$SUBNAM7= <"">
##$SUBNAM8= <"">
##$SUBNAM9= <"">
##$SW= 400.765351723535
##$SWIBOX= (0..15)
0 1 3 0 0 0 0 0 0 0 0 0 0 0 0 0 
##$SW_h= 32467.5324675325
##$TD= 32768
##$TD0= 1
##$TE= 0
##$TE2= 300
##$TE3= 300
##$TEG= 300
##$TL= (0..7)
0 120 53 12 22 120 120 120 
##$TP= (0..7)
150 150 150 150 150 150 150 150 
##$TP07= 0
##$TPNAME0= <>
##$TPNAME1= <>
##$TPNAME2= <>
##$TPNAME3= <>
##$TPNAME4= <>
##$TPNAME5= <>
##$TPNAME6= <>
##$TPNAME7= <>
##$TPOAL= (0..7)
0.5 0.5 0.5 0.5 0.5 0.5 0.5 0.5 
##$TPOFFS= (0..7)
0 0 0 0 0 0 0 0 
##$TUNHIN= 0
##$TUNHOUT= 0
##$TUNXOUT= 0
##$USERA1= <user>
##$USERA2= <user>
##$USERA3= <user>
##$USERA4= <user>
##$USERA5= <user>
##$V9= 5
##$VALIST= <valist>
##$VCLIST= <CCCCCCCCCCCCCCC>
##$VD= 0
##$VDLIST= <DDDDDDDDDDDDDDD>
##$VPLIST= <PPPPPPPPPPPPPPP>
##$VTLIST= <TTTTTTTTTTTTTTT>
##$WBST= 1024
##$WBSW= 4
##$XGAIN= (0..3)
0 0 0 0 
##$XL= 0
##$YL= 0
##$YMAX_a= 10512
##$YMIN_a= -11139
##$ZGOPTNS= <>
##$ZL1= 120
##$ZL2= 120
##$ZL3= 120
##$ZL4= 120
##$ABSF1= 198.0616
##$ABSF2= -202.7028
##$ABSG= 5
##$ABSL= 3
##$ALPHA= 0
##$AQORDER= 0
##$ASSFAC= 0
##$ASSFACI= 0
##$ASSFACX= 0
##$ASSWID= 0
##$AUNMP= <proc_1d>
##$AZFE= 0.1
##$AZFW= 0.5
##$BCFW= 0
##$BC_mod= 2
##$BYTORDP= 0
##$COROFFS= 0
##$CY= -3
##$DATMOD= 1
##$DC= 0
##$DFILT= <>
##$DTYPP= 0
##$F1P= 0
##$F2P= 0
##$FCOR= 1
##$FTSIZE= 65536
##$FT_mod= 6
##$GAMMA= 0
##$GB= 0
##$INTBC= 1
##$INTSCL= 9.790993e-09
##$ISEN= 30
##$LB= 1.5
##$LEV0= 0
##$LPBIN= 0
##$MAXI= 10000
##$MC2= 0
##$MEAN= 0
##$ME_mod= 0
##$MI= 50
##$NCOEF= 0
##$NC_proc= -7
##$NLEV= 6
##$NOISF1= 182.463
##$NOISF2= 159.3651
##$NSP= 0
##$NTH_PI= 0
##$NZP= 0
##$OFFSET= 198.0616
##$PC= 4
##$PHC0= 1369.458
##$PHC1= 147.2934
##$PH_mod= 1
##$PKNL= yes
##$PPARMOD= 0
##$PSCAL= 0
##$PSIGN= 0
##$REVERSE= no
##$SF= 81.0140089999434
##$SI= 65536
##$SIGF1= 159.3651
##$SIGF2= -187.1042
##$SINO= 113.3802
##$SIOLD= 16384
##$SREGLST= <1H.CDCl3>
##$SSB= 0
##$STSI= 65536
##$STSR= 0
##$SW_p= 32467.5324675325
##$SYMM= 0
##$S_DEV= 0
##$TDeff= 32768
##$TDoff= 0
##$TI= <>
##$TILT= no
##$TM1= 0
##$TM2= 0
##$TOPLEV= 0
##$USERP1= <user>
##$USERP2= <user>
##$USERP3= <user>
##$USERP4= <user>
##$USERP5= <user>
##$WDW= 1
##$XDIM= 65536
##$YMAX_p= 522011834
##$YMIN_p= -104829131
$$ End of Bruker specific parameters
$$ ---------------------------------
##NTUPLES= NMR SPECTRUM
##VAR_NAME=  FREQUENCY,     SPECTRUM/REAL,   SPECTRUM/IMAG
##SYMBOL=    X,             R,               I
##VAR_TYPE=  INDEPENDENT,   DEPENDENT,       DEPENDENT
##VAR_FORM=  AFFN,          ASDF,            ASDF
##VAR_DIM=   65536,         65536,           65536
##UNITS=     HZ,            ARBITRARY UNITS, ARBITRARY UNITS
##FACTOR=    0.49542278885378, 1,            1
##FIRST=     16045.7642231865, 0,            0
##LAST=      -16421.768244346, 0,            0
##MIN=       -16421.768244346, -104829131,   0
##MAX=       16045.7642231865, 522011834,    0
$$ Real data points
##PAGE= N=1
##DATA TABLE= (X++(R..R)), XYDATA
$$ [...]
43525e515149r34616L40313K73295n37959o17417K07195P87029N21057j6245k60591
43515e753088k97826j85164L20786J064138J370132R80003M41626K57311K54526
43506a547556J53043J81995O24382J115867R82434K09878m10789k64143K96262
43497A341373M54041M6853l24255l40715m39796q46261q81640r2133N55264j06945
43487f34214j329134j148462O49207K013778J652838P67782P33728Q48420K7746
43478C581689q03886k07984R04414M03310j464978k171196p64062Q05359Q48206
43469A130872J51242j0270j1692n64757r30210k02504P72080N55004n60939j112863
43459g84037q43386p64140j060212p26603M62593J238622P27837j86435j95761
$$ plain form
43525 -5515149 -6449765 -6109452 -5836157 -6374116 -6991533 -6784338 -5997309 -5476252 -5492497 -5753088
43515 -5753088 -6050914 -6236078 -5915292 -4851154 -3481022 -2501019 -2059393 -1802082 -1547556
43506 -1547556 -1394513 -1212518 -588136 527731 1510165 1720043 1309254 1045111 1341373
43497 1341373 1795414 1842267 1518012 1177297 737501 -108760 -990400 -1082533 -527269 -634214
43487 -634214 -1963348 -3111810 -2462603 -448825 1204013 1971795 2705523 3553943 3581689
43478 3581689 2777803 2569819 3474233 3877543 2412565 241369 -522693 282666 1130872
43469 1130872 1282114 1271844 1260152 695395 -234815 -437319 334761 889765 328826 -784037
43459 -784037 -1627423 -2391563 -3451775 -4178378 -3715785 -2477163 -1749326 -1935761 -2131522
43450b131522O45729J316405J348244J036444N22814l57054j327931j614301r22803
43441a483975M0138L86931O3893k84784k16987J47401N37270Q37113R36191O98350
43431A661541K53489k9563o3092j95946o07656r10373o97973j64647K28613M02903
43421a22704N24650N27935L19134J86791L84098N38762J83074l37485l18777O2463
43411A947941o3503p63828j014232k11426R14206J297153P28036k47077q96409
43402A690861o01013N29113J193809J99192j537064j721255L4931J368431O31843
43393A788848n94758j63733J042098N53630j553763k645499j499066K25713Q19117
43384b027413N31269J33370l78728p38837m2882J430226J817120M20347p92754
$$ plain form
43450 -2131522 -1485793 -169388 1178856 2215300 2738114 2381060 1053129 -561172 -1483975
43441 -1483975 -1443837 -1056906 -993013 -1277797 -1494784 -1347383 -810113 27000 963191 1661541
43431 1661541 1915030 1885467 1822375 1626429 1018773 108400 -589573 -754220 -525607 -122704
43421 -122704 401946 929881 1249015 1435806 1819904 2358666 2541740 2204255 1885478 1947941
43411 1947941 1884438 1120610 106378 -105048 809158 2106311 2834347 2587270 1690861
43402 1690861 1089848 1618961 2812770 3011962 1474898 -246357 -211426 1157005 1788848
43393 1788848 1194090 1030357 2072455 2626085 1072322 -1573177 -3072243 -2846530 -2027413
43384 -2027413 -1496144 -1362774 -1741502 -2480339 -2523221 -1092995 724125 1144472 351718
43375C51718l4358J415659J089464r31329k243485j590006j35392O31734N57768
43366h88227K19863L8602K35317O63223O53215p6790o15409l3150R83636R92927
43356B173207L5339m73294K8727P23812J120107J522857J611305M91569j292487
43347E941142j804175o70980j9032j172613k342468j415612N53164R18709m89492
43338e01357j339346m95113O00432M84156l66863p28083k97180M47579R53371
43329a242404P29748k30135r07366j97927J369501K022676J180299K46046M35926
43320C406364J053105P51092m89800j593706j872134j396409m59575N21292J016283
43311I36512R88417J053324J453409J451482M55899q31481j270711q55157m94157
$$ plain form
43375 351718 317360 1733019 2822483 1891154 -352331 -1942337 -2077729 -1445995 -888227
43366 -888227 -668364 -629762 -394445 268778 921993 845203 229794 196644 1180280 2173207
43356 2173207 2208546 1735252 1763979 2487791 3607898 5130755 6742060 7233629 5941142
43347 5941142 4136967 3465987 3446955 2274342 -68126 -1483738 -930574 -11865 -501357
43338 -501357 -1840703 -2335816 -1735384 -1251228 -1618091 -2346174 -2643354 -2195775 -1242404
43329 -1242404 -512656 -742791 -1650157 -1848084 -478583 1544093 2724392 2970438 3406364
43320 3406364 4459469 5210561 4720761 3127055 1254921 -141488 -601063 -79771 936512
43311 936512 1924929 2978253 4431662 5883144 6339043 5507562 4236851 3381694 2887537
43302B887537n33612n04843k43179k16165n40351n47122K42565J264613J485878
43293C295321N96837o39299j132216m96441N49186Q60817Q1976r65256j276417
43284H74508q00456k69765j80343m45612q93412j451859j764057j262324K6302
43275f167018J175231J291313N37680j63578k93812j26556L4697L92971J061509
43266b257563J427107Q38701k11337m57583L77157J049624N31726n26450q55035
43257h3653l82763P1322L97545J125957J930809J690078K89368r57169j106671
43248B974823o15640j61354K50856M23343l57365j844430k364928j064486M92914
43239b266267L67350j018371j695910j009531n8042K58499M0454m73906j012804
$$ plain form
43302 2887537 2353925 1849082 1605903 1389738 849387 302265 544830 1809443 3295321
43293 3295321 3892158 3252859 2120643 1624202 2173388 3034205 3116181 2150925 874508
43284 874508 74052 -195713 -376056 -821668 -1715080 -3166939 -4930996 -6193320 -6167018
43275 -6167018 -4991787 -3700474 -3162794 -3326372 -3620184 -3746740 -3712043 -3319072 -2257563
43266 -2257563 -830456 8245 -203092 -660675 -283518 766106 1297832 771382 -83653
43257 -83653 -466416 -395094 2451 1128408 3059217 4749295 5038663 4081494 2974823
43248 2974823 2359183 2197829 2448685 2872028 2514663 670233 -1694695 -2759181 -2266267
43239 -2266267 -1898917 -2917288 -4613198 -5622729 -5680771 -5422272 -5381818 -5855724 -6868528
43230f868528p19514Q73218K373969J770785o16014k086107r81213J311934K405714
43221b535756J622613n4927j489765j936563j098673L75615J152911P72363L00280
43212b891902P41611J546280J547908P47091J54330K07512L14421p5865o82367
43203A609019p93729p8449J026138J557268Q33908p94198k210797k653099k271502
43194c775441j538785o31902L46343J019010J027286M51606k98775q37917r67112
43185e205687p33357l60072N7141N85983R38972M57648p22914j110858L64278
43176e728866K360516K408944K42569j735932j683391l99313N08476Q97520J345725
43167a783752J493088O97326m38739p12808j23473K44409p8739m56493k76621
$$ plain form
43230 -6868528 -7588042 -6714824 -4340855 -2570070 -3186084 -5272191 -6253404 -4941470 -2535756
43221 -2535756 -913143 -968070 -2457835 -4394398 -5493071 -5117456 -3964545 -3192182 -2891902
43212 -2891902 -2150291 -604011 943897 1690988 1845318 2052830 2367251 2291386 1609019
43203 1609019 815290 736841 1762979 3320247 4154155 3359957 1149160 -1503939 -3775441
43194 -3775441 -5314226 -5946128 -5599785 -4580775 -3553489 -3101883 -3400658 -4238575 -5205687
43185 -5205687 -5939044 -6299116 -6241975 -5655992 -4717020 -4259372 -4982286 -6093144 -5728866
43176 -5728866 -3368350 -959406 -716837 -2452769 -4136160 -4535473 -4026997 -3129477 -1783752
43167 -1783752 -290664 406662 -32077 -744885 -868358 -623949 -702688 -1159181 -1435802
43158a435802L13078P96145Q22119M50449K01547N02742Q56424L03198r12347
43149A897553j186792J94741J738247J707458M15871o73314j167322j551311j601775
43140b26644q10446P1185j90401j129170j032700L42284J343587J021089L50524
43131b60692K96206L62950o2123m15070p2854M07246K67399j65866k41228k02784
43121h6816n17785o62329J38164J298034J303325j53075j531637j333310Q7709
43112a457720J116352Q81109N2785l37830k58100l86415q26056r25182m55011
43103b596068l7067N1242N12423J615749K098736Q47548r44459j007243P48293
43094A289154J974983J155923o10386j661001j865770j708935r19801N16208J236448
$$ plain form
43158 -1435802 -1122724 -326579 495540 945989 1147536 1650278 2506702 2809900 1897553
43149 1897553 710761 905502 2643749 4351207 4767078 4093764 2926442 1375131 -226644
43140 -226644 -1037090 -965905 -1156306 -2285476 -3318176 -2975892 -1632305 -611216 -260692
43131 -260692 35514 398464 336341 -78729 -151583 255663 523062 357196 115968 -86816
43121 -86816 -604601 -1266930 -1128766 169268 1472593 1319518 -212119 -1545429 -1457720
43112 -1457720 -341368 539741 592526 254696 -3404 -389819 -1215875 -2141057 -2596068
43103 -2596068 -2633135 -2581893 -2069470 -453721 1645015 2492563 1548104 540861 1289154
43094 1289154 3264137 4420060 3809674 2148673 282903 -1426032 -2345833 -1829625 -593177
43085e93177J74225j372590j182282O52020J724837P28947q26547r82247n3425
43076a730239J39435r57946j889434j234856N24434J664424J325253L41806p0375
43067a887498J43702J56106k63054l67508L14564J120044J142420M72500n8976
43058G72300p2494N5509n2275l09715m81762m74030k16061L41719R76928J259407
43048A799526J023335N34368M9886n31285j336052j986748j747623l31106J574013
43039i51686K726821K329715O66150j110473j816181j130160J30334P84651N34438
43030B163609J76807K94300K42592p72036j970421j642044L01459J808824J452085
43021B055175M34241O52710J752221J682698k54580k493456l318271k572203j136487
$$ plain form
43085 -593177 -418952 -1791542 -2973824 -2321804 -596967 131980 -694567 -1676814 -1730239
43076 -1730239 -1590804 -2548750 -4438184 -5673040 -5148606 -3484182 -2158929 -1817123 -1887498
43067 -1887498 -1743796 -1587690 -1850744 -2218252 -1903688 -783644 358776 831276 772300
43058 772300 699806 755315 703040 393325 -88437 -562467 -778528 -436809 540119 1799526
43048 1799526 2822861 3357229 3407115 2875830 1539778 -446970 -2194593 -2525699 -951686
43039 -951686 1775135 4104850 4771000 3660527 1844346 714186 844520 1629171 2163609
43030 2163609 2340416 2634716 2877308 2105272 134851 -1507193 -1205734 603090 2055175
43021 2055175 2489416 3142126 4894347 6577045 6322465 3829009 510738 -2061465 -3197952
43012c197952J35352P55098Q18542J012157J610949J664253K38129j751327k304831
43003a019630r80146N84685R32538K43862n95124r43764k66543J359667K348697
42994A664242J026571j594650k459369o38183J267646J010041k38592l63495K40949
42985h4840m0176r08804q93274j99121k18514p91096n36667L11776j612j571008
42975d933336k129591l06472K275357L099095J680914l41107j105837o0231J639203
42966a82005K114617Q65639m19957j35101P90790L01984j379838j892274l86608
42957c22753J175046J041266k2996m74419l17989m25362q20497r26169o41342
42948a735215j73777M31958Q67356N49198l07001o00089J2271M76569M3794o08955
$$ plain form
43012 -3197952 -3062600 -2307502 -1488960 -476803 1134146 2798399 3036528 1285201 -1019630
43003 -1019630 -1999776 -1415091 -482553 -238691 -833815 -1777579 -2044122 -684455 1664242
42994 1664242 2690813 1096163 -1363206 -2001389 -733743 276298 37706 -325789 -84840
42985 -84840 -125016 -1033820 -1927094 -2126215 -2344729 -3135825 -3672492 -3360716 -3362328 -4933336
42975 -4933336 -7062927 -7369399 -5094042 -1994947 -314033 -655140 -1760977 -1821208 -182005
42966 -182005 1932612 2798251 2378294 2243193 3033983 3335967 1956129 63855 -322753
42957 -322753 852293 1893559 1870563 1396144 1078155 652793 -167704 -1093873 -1735215
42948 -1735215 -1908992 -1477034 -609678 -60480 -367481 -967570 -955299 -478730 -434936 -1043891
42938a043891p55093p70099q93990k80750J318309K208097Q42012j592331k452544
42929c420280j000608J095380K168481J922386P99573m25727o71547L10996J040244
42920A818898O5581j640615j777519q4385J309076J098102L68937L55762N56960
42911B070797J21581m86219m93957l02268o46934j134424q54620J16587Q52722
42902g56735P45566k19198j681823k620960j731397P92626K617025J779364o36802
42893a712334j750237n20638J331594J972423J454685P48971K08658k88269o57772
42884G87081p87881p66109n08923J51682P14250K44168j139810j924758j068966
42875d299266N23693J170051M56103o47056j187664r48324j65762O81691J073239
$$ plain form
42938 -1043891 -1798984 -2569083 -3463073 -3743823 -2425514 -217417 624595 -967736 -3420280
42929 -3420280 -4420888 -3325508 -1157027 765359 1564932 1139205 467658 778654 1818898
42920 1818898 1884479 243864 -1533655 -1618040 -308964 789138 1158075 1513837 2070797
42911 2070797 2192378 1706159 1212202 909934 263000 -871424 -1726044 -1609457 -756735
42902 -756735 -11169 -230367 -1912190 -4533150 -6264547 -5471921 -2854896 -1075532 -1712334
42893 -1712334 -3462571 -3983209 -2651615 -679192 775493 1524464 1733122 1444853 787081
42884 787081 -800 -766909 -1275832 -1124150 -409900 -165732 -1305542 -3230300 -4299266
42875 -4299266 -3775573 -2605522 -2149419 -2796475 -3984139 -4932463 -5098225 -4416534 -3343295
42866c343295J007092R93806J066970N34788o29797j104871j0811J473948J676917
42857A664747Q84760N57421O58835j40377j701325k159088r33753J61539k31535
42848a238776r82878n42534O01624J006453N07591j23508o49277r92998m21787
42839b836090J250682K459811J631427l78218j223070j33497J419375J841405
42831D031825Q64570p72315j811588j127052P83583J627034J95529j413958n24968
42822A852660J875059K267916j46298k265551j761952r5450M17698K1505J69253
42813B334840O93807M53434l88781o89456k44957J84349K50956J49998j29816
42804B614374o19008r45744r51612j042132j161569l92200J442933K797977K228973
$$ plain form
42866 -3343295 -2336203 -1342397 -275427 259361 -370436 -1475307 -1486118 -12170 1664747
42857 1664747 2549507 3106928 3765763 3625386 1924061 -235027 -1168780 -1007241 -1238776
42848 -1238776 -2221654 -2764188 -2162564 -1156111 -648520 -772028 -1421305 -2414303 -2836090
42839 -2836090 -1585408 874403 2505830 2127612 904542 771045 2190420 4031825
42831 4031825 4896395 4124080 2312492 1185440 1969023 3596057 3791586 2377628 1852660
42822 1852660 3727719 5995635 5849337 3583786 1821834 1726384 2144082 2165587 2334840
42813 2334840 3028647 3482081 3093300 2403844 2158887 2343236 2594192 2744190 2614374
42804 2614374 1995366 1049622 98010 -944122 -2105691 -2497891 -1054958 1743019 3971992
42795C971992L53482j153344j614648j257997j93173J053044J098513m11495j463583
42786C82791k77994J583707J175623j207997k184066l34776J695258J191537r34770
42777A089313j987920j219514L3653P14876Q04500M39386j56489k34911O77021
42768A59915J737524J630222L19189r55843j328384j078168p85640n56166k57623
42759a114974R6435M33742P14229Q29214P12587N45977N21811M47671j3881p13726
42749B459085j074298q78103n52343m69346m08504o1773L21577L24244J36790
42740b02671K77533O34501N97514K54246M60192J234817J166893n61493k425686
42731A435846k296994m69348P51294M00733j29278J46234J12137j178778k309477
$$ plain form
42795 3971992 4325474 3172130 1557482 299485 106312 1159356 2257869 1846374 382791
42786 382791 104797 1688504 2864127 1656130 -527936 -862712 832546 2024083 1089313
42777 1089313 -898607 -2118121 -2084468 -1369592 -565092 -125706 -282195 -517106 159915
42768 159915 1897439 3527661 3846850 2891007 1562623 484455 -301185 -857351 -1114974
42759 -1114974 -1018539 -584797 129432 958646 1671233 2217210 2739021 3186692 3172811 2459085
42749 2459085 1384787 506684 -45659 -515005 -923509 -985282 -663705 -339461 -202671
42740 -202671 74862 709363 1306877 1561123 2021315 3256132 4423025 3861532 1435846
42731 1435846 -861148 -1330496 -579202 -178469 -307747 -161513 -49376 -1228154 -3537631
42722c537631j380878R83995K418596K038265J088951O22896K97344l41892q90868
42713A298778q50302l15282M05199J020766J029329J60621q87700j071413l99183
42704C90813J92476K96875L09419K95883j32557o50523k87557Q84486J406393
42695B705708M52259q73748j040541l5012R69037J177833O50360k32307j026789
42686B746800j299844r83707m14211K02401Q90259J337264R75092m9324p70770
42677B633960p35668o47898j090200j382044n74420R30122J711700J162411K14909
42668B222872J22227R70990J636110J123470k06310j040581q46174o29387j385309
42659A967908k376415k060122m66868P21880O08256J57759L34247N33497j83085
$$ plain form
42722 -3537631 -4918509 -3934514 -1515918 522347 1611298 2234194 2531538 2189646 1298778
42713 1298778 448476 133194 538393 1559159 2588488 2749109 1861409 789996 390813
42704 390813 583289 880164 1189583 1485466 1352909 702386 414829 1299315 2705708
42695 2705708 3157967 2284219 1243678 1208666 2177703 3355536 4005896 3773589 2746800
42686 2746800 1446956 463249 49038 251439 1141698 2478962 3454054 3404730 2633960
42677 2633960 1898292 1250394 160194 -1221850 -1796270 -866148 845552 2007963 2222872
42668 2222872 2345099 3316089 4952199 6075669 5869359 4828778 3982604 3353217 1967908
42659 1967908 -408507 -2468629 -2935497 -2213617 -1605361 -1447602 -1113355 -579858 -762943
42650g62943j311475j488460l41411J126342J718480J088601n2319m67657L65609
42641a25233J391919J089058m34559j489020j204594n99736o99828r68788n37301
42632c578082K18093M26455P0238m52520j133881j694379j199149M71118J835186
42623e036921J808500J392090J888062K578298K013245O26276o5803j58995r23525
42614D121227k055163j873178l68184L89584n67190j682900j415443k87470M71631
42605c267086O21055L19221n59577j495614j197467M40695J569484Q23994n85446
42596c330741n55063J006995K296006K047391O52726p57601j297607o75461N47679
42587f5676J222511P74603j19367m51280p9149L87411L84359l00677j401133j995806
$$ plain form
42650 -762943 -2074418 -3562878 -3904289 -2777947 -1059467 29134 -23185 -490842 -125233
42641 -125233 1266686 2355744 1921185 432165 -772429 -1372165 -2071993 -3040781 -3578082
42632 -3578082 -3359989 -2933534 -2863296 -3315816 -4449697 -6144076 -7343225 -6872107 -5036921
42623 -5036921 -3228421 -1836331 51731 2630029 4643274 5269550 5203747 5044752 4121227
42614 4121227 2066064 192886 -175298 214286 -352904 -2035804 -3451247 -3738717 -3267086
42605 -3267086 -2646031 -2326810 -2886387 -4382001 -5579468 -5138773 -3569289 -2745295 -3330741
42596 -3330741 -3885804 -2878809 -582803 1464588 2117314 1359713 62106 -613355 -65676
42587 -65676 1156835 1931438 1812071 1360791 1281642 1669053 2053412 1752735 351602 -1644204
42577a644204j247656K57261Q61983J08334m45717M59276J773684J663655J40629
42568A927245j241386j636025j335440m53255J107812K463955K204868L75952
42560C413726j307483j597777r37569k33663L97070J112345J595436J525001J126517
42551E093603P21725K81378k18238n90998q60823j209443j315528o38994L54313
42542A616995L82634o59184j136859j03434Q96473k7708j977486k217954j21096
42533c347619J839294J570868R9548k51991Q53616J722858J222573J2911p21952
42524C000106o80952l97721n04964j226848k123696k287259j213570N13790J746047
42515c175067J839925R01296o20065j961307k110571q06063P01931R22035J22246
$$ plain form
42577 -1644204 -2891860 -2634599 -1772616 -1664282 -2109999 -1650723 122961 1786616 1927245
42568 1927245 685859 -950166 -2285606 -2738861 -1631049 832906 3037774 3413726
42560 3413726 2106243 508466 -429103 -662766 -265696 846649 2442085 3967086 5093603
42551 5093603 5815328 6096706 5878468 5287470 4426647 3217204 1901676 1262682 1616995
42542 1616995 1999629 1340445 203586 100152 996625 968917 -1008569 -3226523 -3347619
42533 -3347619 -1508325 62543 162091 -89900 763716 2486574 3709147 3722058 3000106
42524 3000106 2319154 1921433 1416469 189621 -1934075 -4221334 -5434904 -4921114 -3175067
42515 -3175067 -1335142 -433846 -1053911 -3015218 -5125789 -5931852 -5229921 -4307886 -4185640
42506d185640n1575R79951J970864J860103J134393N32088j97553j215912j563797
42497g37078n87100N89140N50569j77233n8362P92914P30601p16083k048338k013560
42487c674530j064677j52523N47259J101727J213847Q55508O11032Q02751J003197
42478A243591P87474K26771n37956j296625j289889K1290J511195J236132p55596
42469A146387k063523j212936L29902N83829j06000k78847o0154n78072j470611
42460c710025j198697L16691J393080J148083O01659P43482J033260N73266l80975
42451E19824r17635p20185j26999M94088Q24680M85617n31707j464588j263868
42442b700773L77446K517139L584585K765915Q53473n95498r82004r74830j011580
$$ plain form
42506 -4185640 -4237215 -3257264 -1286400 573703 1708096 2240184 2042631 826719 -737078
42497 -737078 -1324178 -735038 -184469 -361702 -420064 372850 1103451 387368 -1660970 -3674530
42487 -3674530 -4739207 -4891730 -4344471 -3242744 -2028897 -1173389 -562357 240394 1243591
42478 1243591 2031065 2257836 1719880 423255 -866634 -845344 665851 1901983 1146387
42469 1146387 -917136 -2130072 -1800170 -1216341 -1322341 -1601188 -1661342 -2239414 -3710025
42460 -3710025 -4908722 -4592031 -3198951 -2050868 -1449209 -705727 327533 900799 519824
42451 519824 -397811 -1117996 -1244995 -750907 73773 559390 27683 -1436905 -2700773
42442 -2700773 -2323327 193812 3778397 6544312 7397785 6802287 5820283 4845453 3833873
42433C833873n31878O57021J349230N05027q99435j082439j21713K28963o37753
42424C300896j244768l75603J104716J561486O86064n07696j049459p30644l7952
42415B707040J77309m55977j043919k86270J542518K465494J302202o27537j210342
42406D570518k57190N60227J28688q62050j158532n43543J92377M25310L64590
42397C420395N11134P59309M95574k87066n92959K31621J241351R75071m08836
42388F345594j266903q02290N2827M21155O95404J201432J040236m79097k258037
42379D950321k702294j952177j365471j215016n07991R36846J818419J211638
42371A174275j00497p57028m30202K63811P94221J052360J066150Q80115N55279
$$ plain form
42433 3833873 3301995 3959016 5308246 5813273 4913838 3831399 3709686 3938649 3300896
42424 3300896 2056128 1680525 2785241 4346727 5032791 4525095 3475636 2744992 2707040
42415 2707040 2884349 2428372 1384453 1098183 2640701 5106195 6408397 5780860 4570518
42406 4570518 4313328 4873555 5002243 4140193 2981661 2438118 2630495 3055805 3420395
42397 3420395 3931529 4690838 5186412 4899346 4306387 4538008 5779359 6754430 6345594
42388 6345594 5078691 4276401 4329228 4750383 5445787 6647219 7687455 7208358 4950321
42379 4950321 2248027 295850 -1069621 -2284637 -2792628 -1855782 -37363 1174275
42371 1174275 1073778 316750 -113452 150359 944580 1996940 3063090 3943205 4498484
42362D498484R6108m02793n49696n3409O11298N19923m68720j327256j099583
42353A824356j37651L54727j76943r82830q41352O15608K364023K797080J328802
42344G145820p92382j650881p47485N62645R29213O23857O50128Q34963M5420
42335G601298j627178k271153o16334J830497K418996P77585q16906o15161N11989
42326G193633P65373j45478j312820k260881k848927k371469m91831J336135J256812
42317A120547k25918q27227k2293K20639j008487j677975j03467J908978J535342
42308I20139p30782j805592n53895R42658P91773k92672o22542J62327J243698
42299E5112J843311J604296O66489k25736m78733n47299j086347j435352m60649
$$ plain form
42362 4498484 4594592 4191799 3642103 3588694 4199992 4719915 4251195 2923939 1824356
42353 1824356 1686705 2041432 1864489 881659 40307 655915 3019938 5817018 7145820
42344 7145820 6353438 4702557 3955072 4517717 5446930 6070787 6720915 7555878 7601298
42335 7601298 5974120 3702967 3086633 4917130 7336126 8113711 7296805 6681644 7193633
42326 7193633 7959006 7813528 6500708 4239827 1390900 -980569 -1472400 -136265 1120547
42317 1120547 894629 67402 45109 265748 -742739 -2420714 -2524181 -615203 920139
42308 920139 189357 -1616235 -2170130 -1227472 -435699 -728371 -1350913 -1188586 55112
42299 55112 1898423 3502719 4169208 3943472 3464739 2917440 1831093 395741 -64908
42290f4908J146401J348100o0225q30500K89097J556264J083116k16118m24559
42281C826668J65290m4423q27106m73599J009685J537283J67014j442402j590898
42272B327512q18675n39534p10392k40834R21108J455393M87533j103958j597791
42263A80362l98719J255237J683670O24297o95584j207194j004732o01991j40889
42254c05543J81758j28051r18173j124177l54505K48476j23422l31076Q39580
42245b015133K212889J774700K9602p11204j84991m75803k044117k463455l73616
42236d251128K005834K150388P99410J51696L85917L68994L11814J043719J640488
42227D607132N36196j486188k061234q52726J16188j74646n39733j30146K37915
$$ plain form
42290 -64908 1081493 2429593 2369368 1538868 1827965 3384229 4467345 4251227 3826668
42281 3826668 3991958 3947535 3120429 2646830 3656515 5193798 5360812 3918410 2327512
42272 2327512 1508837 969303 258911 18077 939185 2394578 2882111 1778153 180362
42263 180362 -218357 1036880 2720550 3344847 2649263 1442069 437337 -164654 -305543
42254 -305543 -123785 -251836 -1170009 -2294186 -2648691 -2400215 -2523637 -2854713 -2015133
42245 -2015133 197756 1972456 2002058 1290854 1105863 630060 -1414057 -3877512 -4251128
42236 -4251128 -2245294 -94906 704504 856200 1242117 1611111 1922925 2966644 4607132
42227 4607132 5143328 3657140 1595906 743180 859368 684722 144989 14843 252758
42218B52758K4168M1260O55307Q75451K65344q9292L40139K87777j095511k450498
42208h93097k217542j023422l76548k30091L20910R79556R01080O26666J255698
42199f56790K178941J807257L67928k34125N15849J010326L47933k46583K35258
42190E325994P38571m589j247344j396727m04783N33056R56800J265792J265277
42181G032047J85930j757714l159036l148286k365420j806813j518969r70102
42173g508363j12846N85142R06978J091585J275009J185704O21633r420l512P10527
42163a257563J298263R94466J11011m36630m80863p21426j335495j395852l20384
42154c544473Q84151Q72195M634j30102Q11257J333898M42266p37505o45515L43177
$$ plain form
42218 252758 276926 318186 973493 1848944 2114288 2024996 2365135 2652912 1557401 -893097
42208 -893097 -3110639 -4134061 -4510609 -4740700 -4419790 -3440234 -2539154 -1912488 -656790
42199 -656790 1522151 3329408 3697336 3463211 3979060 4989386 5337319 5090736 5325994
42190 5325994 6064565 6059976 4812632 3415905 3011122 3544178 4500978 5766770 7032047
42181 7032047 7217977 5460263 2301227 -847059 -3212479 -5019292 -6538261 -7508363
42173 -7508363 -7621209 -7036067 -6129089 -5037504 -3762495 -2576791 -1955158 -1964578 -1968090 -1257563
42163 -1257563 40700 1035166 1146177 709547 228684 -492742 -1828237 -3224089 -3544473
42154 -3544473 -2660322 -1788127 -1783493 -1913595 -1102338 231560 673826 -63679 -709194 -366017
42144c66017N40888m82009j302841p08011P74543J751122J527652M30998p01388
42135A464937r69398p0367J019434P38812j081422k621420k220842n10204N60689
42126c689781L23802j70903p7618K54194L71197M86845O81129M81297r6912j46277
42116a583027O22105R27542l22871j980618j814807L96059K321650J981248R3866
42107F41147j103367o40861L83750N01387l95054j189004r86477k8490Q18204
42098a998765J087003R05586M20990l67455j162719j421406j122574q64885q27928
42089e352153l41974Q98380J887167J505293K28140m23806K9837N64415L27214
42080f77487k68633m66335l16470l39150n34844l11946O60522J783748J873923
$$ plain form
42144 -366017 174871 -307138 -1609979 -2317990 -1543447 207675 1735327 2166325 1464937
42135 1464937 495539 425172 1444606 2183418 1101996 -1519424 -3740266 -4250470 -3689781
42126 -3689781 -3365979 -3536882 -3614500 -3360306 -2989109 -2502264 -1821135 -1339838 -1436750 -1583027
42116 -1583027 -960922 -33380 -356251 -2336869 -4151676 -3755617 -1433967 547281 641147
42107 641147 -462220 -1103081 -719331 -217944 -612998 -1802002 -2788479 -2816969 -1998765
42098 -1998765 -911762 -6176 414814 47359 -1115360 -2536766 -3659340 -4524225 -5352153
42089 -5352153 -5694127 -4795747 -2908580 -1403287 -1175147 -1598953 -1569116 -1004701 -677487
42080 -677487 -946120 -1412455 -1728925 -2068075 -2602919 -2914865 -2254343 -470595 1403328
42071A403328M32136j432585j946090q23068K96953J31532n03453k61724M34705
42062b268266K91317l59648k6879J147774J321667L8929q57486k29836N69698
42053c72730J75436m51435J74073J424284J580332M48120p78175j416502j442968
42044f59565o12022Q24851J306729k03735k125417j986594R4795J682587J589109
42035h9262J003529R09815O09702m96054j536755j516908o26547N44801J784670
42026E86991K574325K017789L00545j018509j043324p11952j063612j553264j202401
42017a113412l63647j5389k6575N35121J736087K563679K231146Q77103q26467
42008E597646k072724k194870j218941J9350P48645R65615R73116P79637L97169
$$ plain form
42071 1403328 1835464 402879 -1543211 -2366279 -2069326 -1937794 -2441247 -2702971 -2268266
42062 -2268266 -1976949 -2336597 -2363476 -1215702 105965 144894 -712592 -942428 -372730
42053 -372730 -197294 -648729 -474656 949628 2529960 2978080 2199905 783403 -659565
42044 -659565 -1271587 -446736 859993 656258 -1469159 -3455753 -3360958 -1678371 -89262
42035 -89262 914267 1824082 2433784 1937730 400975 -1115933 -1742480 -1197679 586991
42026 586991 3161316 5179105 5479650 4461141 3417817 2705865 1642253 88989 -1113412
42017 -1113412 -1477059 -1492448 -1519023 -983902 752185 3315864 5547010 6424113 5597646
42008 5597646 3524922 1330052 111111 130461 879106 1844721 2817837 3597474 3994643
41999C994643J19813k2646m64886j213447j472850q46895j88353m15075j112806
41990a622502j221058n61567K39112Q29544J154229Q69914j86418j265424j453383
41981c217553q86780l16626J04764N23525L53204j021345k650806k644691o46393
41972a0402701J581535K396963J969359J342550R40678O47265N01598N81704O81562
41963B40513N98868L74789J1618n70422j115032j117840n52157j8281R763l26185
41953b464366n66835l08926N71268J548028J617618N65624l64907p3115O17751
41944A142140J68665j078408j359939m87522j63094q29677o54565J156472K398983
41935B93055J140257r95058j217632J81012P28576M2245J42275J573658K253084
$$ plain form
41999 3994643 4114456 4091810 3626924 2413477 940627 93732 -94621 -509696 -1622502
41990 -1622502 -2843560 -3405127 -3166015 -2336471 -1182242 -312328 -498746 -1764170 -3217553
41981 -3217553 -4104333 -4420959 -4316195 -3792670 -3439466 -4460811 -7111617 -9756308 -10402701
41972 -10402701 -8821166 -6424203 -4454844 -3112294 -2171616 -1524351 -1022753 -441049 240513
41963 240513 839381 1214170 1225788 655366 -459666 -1577506 -2129663 -2147944 -2138181 -2464366
41953 -2464366 -3031201 -3340127 -2768859 -1220831 396787 962411 597504 524389 1142140
41944 1142140 1310805 232397 -1127542 -1615064 -1778158 -2607835 -3262400 -2105928 293055
41935 293055 1433312 438254 -779378 -598366 130210 172455 314730 1888388 4141472
41926D141472R60937o03481n54018M18729N51789k42448p75094o78778m94240
41917B724868l25023P1582K07523o82894k119625k518503j124748J019035K277322
41908d70463J967357N54348j009136j764439j104479O78300K208294J957351j69677
41899B847456k307601k288369r6245J868099J495815n56406j889161j412616j93090
41890b532118N88554R93411J249200Q85643r7000m88051M15921J335316P15880
41881C066756q24899j405183p51050l01518n43547k75077R85849J784723R89495
41872B725549k42482j41343J059408J666990J065830J98145k70908p99161j720752
41863C541276k325427j801025m74424M61325K63164o01183r58651j82370J024439
$$ plain form
41926 4141472 5102409 4498928 3944910 4363639 4915428 4672980 3897886 3219108 2724868
41917 2724868 2399845 2471427 2678950 1996056 -123569 -2642072 -3766820 -2747785 -470463
41908 -470463 1496894 2051242 1042106 -722333 -1826812 -1148512 1059782 3017133 2847456
41899 2847456 539855 -1748514 -1844759 23340 1519155 962749 -926412 -2339028 -2532118
41890 -2532118 -1943564 -950153 299047 1184690 1087690 599639 1015560 2350876 3066756
41881 3066756 2241857 836674 85624 -215894 -759441 -1034518 -48669 1736054 2725549
41872 2725549 2483067 2341724 3401132 5068122 6133952 6332097 6061189 5262028 3541276
41863 3541276 1215849 -585176 -1059600 -598275 -335111 -936294 -1894945 -2077315 -1052876
41854a052876J324224L61923p47977r11039m81215m97444r56389r00550j02873
41845c964216N28714M83045M32368R11537J239112O51964k50193l03382M09379
41836A38328P37900L55928K51749J013652J683153J025180o84396j916785j688187
41827I16522m73925N80888Q13055L45391k98619o36301m87157m2129K86684J54428
41817A158837m44449j031639q46360M19065J882371J895576k07513k879202l554644
41808c607958j390493J633472K771047J391927o74757j498850j037324n04068
41800b917004l99307m798J124697K014775J369510m32908j403291m18556J105854
41791C8972R12508j036673k347595j328891P34219J277468k34668j800463j534802
$$ plain form
41854 -1052876 271348 633271 -114706 -1025745 -1506960 -2004404 -2960793 -3861343 -3964216
41845 -3964216 -3435502 -2952457 -2520089 -1608552 -369440 282524 32331 -271051 138328
41836 138328 876228 1232156 1483905 2497557 4180710 5205890 4521494 2604709 916522
41827 916522 442597 1023485 1836540 2181931 1883312 1247011 759854 717725 1004409 1158837
41817 1158837 714388 -317251 -1163611 -744546 1137825 3033401 2825888 -53314 -3607958
41808 -3607958 -4998451 -3364979 -593932 797995 123238 -1375612 -2412936 -2917004
41800 -2917004 -3316311 -3321109 -2196412 -181637 1187873 754965 -648326 -1066882 38972
41791 38972 951480 -85193 -2432788 -3761679 -3027460 -1749992 -1984660 -3785123 -5319925
41782e319925K11992J655627J720911Q91391L00921M15185O08393L1752j070606
41773e54359j335585n4775J494705J463386k7501j044177p21880m55188j405344
41764b640718k287456j169418J387702K771023J700209m12819j591101j330982
41756c573560k01881J185704K142168J942426P54281k02500j15918M43863O07116
41747B981699N08086P08130R70657O25886j83354o29562n00659m74938r67075
41738C038870j435091j144736j77369O24155N34898l35599j093966q81671J95748
41729f74761J047913O89355p13964j972207j909246l09616J776089K614108J293853
41720A841524j003380j856064k96122J871528K177081M78575j110756j089887
$$ plain form
41782 -5319925 -5107933 -3452306 -1731395 -840004 -539083 -123898 484495 516247 -554359
41773 -554359 -1889944 -1944719 -450014 1013372 985871 -58306 -780186 -1235374 -2640718
41764 -2640718 -4928174 -6097592 -4709890 -1938867 -238658 -651477 -2242578 -3573560
41756 -3573560 -3775441 -2589737 -447569 1494857 2249138 2046638 1930720 2374583 2981699
41747 2981699 3489785 4197915 5168572 5794458 5611104 4981542 4480883 4005945 3038870
41738 3038870 1603779 459043 281674 905829 1440727 1105128 11162 -870509 -674761
41729 -674761 373152 1062507 348543 -1623664 -3532910 -3842526 -2066437 547671 1841524
41720 1841524 838144 -1017920 -1314042 557486 2734567 3213142 2102386 1012499
41712A012499k20506k7508o46264r18271k05506O67278M44384r10488j943719
41703b748101j298019N65257J718469J030133m66816r22457J10055J474338K047042
41694A509901J712270Q68084j06024p89027r08537p41995o80356m14152N85419
41685A035583J723072J530135k94255k085240k148184p39930O06373J063420R49320
41676A640294O59418J54119n30616r95594q71269k11827M76096N23042k48643
41667E95020j048899q49756J95805P91546L13568l37914l53426m18570j355425
41658b468051k250441j541271M44369J759269J631830J271551J563101J672392
41650B082749P12258o62750j329671j203850o61049M25258J853322K299613Q59320
$$ plain form
41712 1012499 791993 764485 118221 -800050 -1005556 -338278 106106 -804382 -2748101
41703 -2748101 -4046120 -3480863 -1762394 -732261 -1199077 -2121534 -2011479 -537141 1509901
41694 1509901 3222171 4090255 3984231 3195204 2286667 1544672 864316 450164 1035583
41685 1035583 2758655 4288790 3994535 1909295 -238889 -978819 -372446 690974 1640294
41676 1640294 2299712 2453831 1923215 927621 56352 -155475 320621 843663 595020
41667 595020 -453879 -1303635 -1107830 -316284 -2716 -340630 -694056 -1112626 -2468051
41658 -2468051 -4718492 -6259763 -5815394 -4056125 -2424295 -1152744 410357 2082749
41650 2082749 2795007 2132257 802586 -401264 -1062313 -637055 1216267 3515880 4375200
41641D375200j249497k036264j378624p97564r17943q80349k80175J36807J11327
41632b917082M43605J221222J166301j74506j121715j98863J430047J560360J42230
41623A551599r70479r79191q70642j203551j099271O0496J488754K201968K131008
41614B310691J459473J01781j475970k097675j360329k84458K27346M89530Q31297
41605B01686N96575n26357j392527j028487l26685n23015r35660j17906J441072
41596b611304J920121J110483M72979L24892n02265j768270j294306J417337L385386
41587B455053J862296j788724l914570l123280j053927N41952J363691J498008
41579b159501P86945m18332j212606j168722n73252K86800J188085J573218J121603
$$ plain form
41641 4375200 3125703 1089439 -289185 -1086749 -2004692 -2885041 -3165216 -3028409 -2917082
41632 -2917082 -2473477 -1252255 -85954 -260460 -1382175 -1581038 -150991 1409369 1551599
41623 1551599 581120 -398071 -1268713 -2472264 -3571535 -3511039 -2022285 179683 2310691
41614 2310691 3770164 3871945 2395975 298300 -1062029 -1346487 -1119141 -629611 201686
41605 201686 798261 271904 -1120623 -2149110 -2475795 -2998810 -3934470 -4052376 -2611304
41596 -2611304 -691183 419300 892279 1217171 714906 -1053364 -2347670 -930333 2455053
41587 2455053 4317349 2528625 -1385945 -4509225 -5563152 -5021200 -3657509 -2159501
41579 -2159501 -1372556 -1790888 -3003494 -4172216 -4745468 -4458668 -3270583 -1697365 -575762
41570e75762M92180M43935N35831o3884q27085n11373N49807O51307m59617q85249
41560f49910M58625J971043J785826N96576L32644R99378Q61186n31944j517352
41551D306072r05013K78966M90723r8644k14597L71354N82453j84124j153347
41542C473843j367731r16030m03758J22623Q67436J274357M23252j411574k599145
41533e36727k067535o39562J77921J03521k0188K48112N16180M96967M41214N34895
41523g45202N85904M35709J31382l01043o85803m29742Q24047K303963K672110
41514D791325J555775k03074j783972k973735l521023l036793j822337p29889
41506g723723J43101J462651K910513K833936O22018j768115k015615m01118Q24841
$$ plain form
41570 -575762 -83582 360353 896184 832300 5215 -506158 43649 694956 235339 -649910
41560 -649910 -191285 1779758 3565584 4162160 4494804 5494182 6355368 5823424 4306072
41551 4306072 3401059 3680025 4170748 4072104 3857507 4228861 4811314 4627190 3473843
41542 3473843 2106112 1190082 786324 908947 1776383 3050740 3473992 2062418 -536727
41533 -536727 -2604262 -3243824 -3065903 -2962382 -2982570 -2734458 -2218278 -1721311 -1280097 -745202
41523 -745202 -159298 276411 407793 106750 -579053 -1008795 -184748 2119215 4791325
41514 4791325 6347100 6144026 4360054 1386319 -2134704 -5171497 -6993834 -7723723
41506 -7723723 -7580622 -6117971 -3207458 -373522 248496 -1519619 -3535234 -3936352 -3111511
41497c111511N44462k17173k51257K72463N20562K79659N8791L88498J223795
41488b91711J809135J328310J9791p85388k77634O88032P81819j7883p54606j047867
41478A451998j116558p02831N10194J552126R46896q74540j621767k56846J480729
41469A369401J593732M73521k29639k45170n99395j492887j885124j189950j34855
41460b340366K99464m4795o57919r69906p08490r4800L70612O00630R96181J432350
41450a117039R41112p16613j961019j280761L11987N07550p51476j100382L73745
41441d792896J450174L71314j004015L1692K503025K913702N92195j167621k8407
41432H69163K021597J789192o44288k583132k566632j401715n1575J295702K131388
$$ plain form
41497 -3111511 -2567049 -2784222 -3035479 -2763016 -2242454 -1962795 -1904004 -1515506 -291711
41488 -291711 1517424 2845734 2865525 2080137 1802503 2490535 3272354 3254471 2499865 1451998
41478 1451998 335440 -367391 142803 1694929 2641825 1767285 145518 -111328 1369401
41469 1369401 2963133 3436654 3207015 2961845 2362450 869563 -1015561 -2205511 -2340366
41460 -2340366 -2040902 -2085697 -2743616 -3713522 -4422012 -4516812 -4146200 -3545570 -2549389 -1117039
41450 -1117039 -175927 -892540 -2853559 -4134320 -3822333 -3314783 -4066259 -5166641 -4792896
41441 -4792896 -3342722 -2971408 -3975423 -3943731 -1440706 1472996 2065191 897570 869163
41432 869163 2890760 4679952 4035664 1452532 -1114100 -2515815 -2567390 -1271688 859700
41423H59700J623465J20133r32449j021717j054897j356543q31267R59011K378480
41414G43916J733197l04628j668189j571776q70815l44616q3384k53279r77195
41405c596769j488098p74310P95646J730739J485050J053356J228931J521251
41397A955796J310700R19143Q06986O32310q0741r93774j398062j129371n14572
41388A508415J06668M08448K04876j07081Q1024M79443R6778j007671j324695
41379D46205p3749J322487J085898m75542j635694j615361r04227J33324J380699
41370c35960K070098J420133Q7568n48362m82308q47436j602843j354376J45499
41361a447987J261198J000763M50038O24414O43861m67961j637243j237450K26503
$$ plain form
41423 859700 2483165 2603298 1670849 649132 -405765 -1762308 -2593575 -1634564 743916
41414 743916 2477113 2172485 504296 -1067480 -1938295 -2282911 -2366295 -2619574 -3596769
41405 -3596769 -5084867 -5859177 -5063531 -3332792 -1847742 -794386 434545 1955796
41397 1955796 3266496 4185639 4992625 5624935 5544194 4550420 3152358 2022987 1508415
41388 1508415 1615083 2023531 2228407 2121326 2202350 2681793 2778571 1770900 446205
41379 446205 372456 1694943 2780841 2305299 669605 -945756 -1849983 -1716659 -335960
41370 -335960 1734138 3154271 3241839 2693477 2211169 1363733 -239110 -1593486 -1447987
41361 -1447987 -186789 813974 1264012 1888426 2532287 2064326 427083 -810367 -583864
41352e83864Q29423R1798o65193n91205k39231k08203l52779m82573n30744L7105
41342b695466J584143K969375K468203M40642o20026M45020J567093L93287k160453
41333D391818l129211j619966K81131P48913M23396O19640R40405J46386j382278
41324A420234j752202k12562J699437K248266J630054J094158Q11742p316j245391
41315E686420j731879j177116o92954p67991k92240J275549K233315Q83008j530709
41306C885403k244590r16679J18131l80991q94427K4522J430902J780519J263025
41297D065815Q02893K04739r22032j555962o14706Q16532P20586p25600j396216
41288A396049o08081p2960r31425j915881j561424n39324k76726m39612M26426
$$ plain form
41352 -583864 245559 337357 -327836 -919041 -1158272 -1366475 -1719254 -2201827 -2732571 -2695466
41342 -2695466 -1111323 1858052 4326255 4766897 4146871 4591891 6158984 6552271 4391818
41333 4391818 1262607 -357359 -76228 672685 1096081 1715721 2656126 2802512 1420234
41324 1420234 -331968 -544530 1154907 3403173 5033227 6127385 6939127 6931811 5686420
41315 5686420 3954541 2777425 2084471 1316480 1024240 2299789 4533104 5416112 3885403
41306 3885403 1640813 724134 842265 461274 -433153 -408631 1022271 2802790 4065815
41297 4065815 4868708 5073447 4151415 2595453 1980747 2797279 3517865 2792265 1396049
41288 1396049 787968 715008 -216417 -2132298 -3693722 -4233046 -4509772 -4949384 -4522958
41279d522958K246372L152748K064166J94454n91883o7247M67775J44652m90733
41270B597346n79079l12541n51052j319945j548861o03828O59226J014885N21713
41261a22136K23400N16996Q00603O79798M88955M22032J30779m25537o19098j58779
41251A937013L24825K85306J29195M20129R20640J223479J645565K436056K656413
41242A1978621J291146n93944l92977K684949N999645O272858L321423j19982
41234C0441739j922047k540025l271163l945795l433879j744903k77159M8631
41226A3355399k03793j65120J08055J24578j16990l98929q46517j463477j677770
41217H715436j186112o86831p93527q02526J92407J424733J288940r9465r57466
$$ plain form
41279 -4522958 -2276586 876162 2940328 3134782 2542899 2475652 2943427 3088079 2597346
41270 2597346 2018267 1705726 1154674 -165271 -1714132 -2317960 -1658734 -643849 -122136
41261 -122136 101264 618260 1418863 2098661 2587616 3009648 3140427 2714890 2095792 1937013
41251 1937013 2261838 2547144 2676339 3096468 4017108 5240587 6886152 9322208 11978621
41242 11978621 13269767 12675823 12282846 14967795 20967440 27240298 30561721 30441739
41234 30441739 28519692 25979667 22708504 18762709 15328830 13583927 13306768 13355399
41226 13355399 13151606 12986486 13094541 13219119 13102129 12703200 11856683 10393206 8715436
41217 8715436 7529324 6842493 6048966 5246440 5438847 6863580 8152520 8053055 7095589
41208G095589o50023n38887j376783j805583o79238P78932P79983k75020o22125
41199B706845R7035O89304N21504J1130p10363j848350k672958j939890R5260
41190c050483J587096J475971O53096L13568M52337N96990P91743J040147Q16520
41181D676985M5478l09678L65701J081676M98217j032254j867345j345588m56955
41172A656237r6242J62546R02291J393256M43638j499926k321780p89960J725536
41163A575596K894404K197248R96494K16064n57879j452471j432928k4550J350491
41154E762469J116431j63840o59022O2924P03835L80185l11211m70023K3487P60374
41144G205609J237574J058316N26364P54072K184401L495297L332614K621907
$$ plain form
41208 7095589 6445566 5906679 4529896 2724313 2045075 2824007 3603990 3328970 2706845
41199 2706845 2803880 3493184 4014688 4025818 3315455 1467105 -1205853 -3145743 -3050483
41190 -3050483 -1463387 12584 665680 979248 1431585 2028575 2820318 3860465 4676985
41181 4676985 4722463 4412785 4778486 5860162 6358379 5326125 3458780 2113192 1656237
41172 1656237 1559995 1722541 2624832 4018088 4461726 2961800 640020 -149940 1575596
41163 1575596 4470000 6667248 7663742 7879806 7321927 5869456 4436528 4411978 5762469
41154 5762469 6878900 6715060 6056038 6118962 6822797 7202982 6891771 6421748 6445235 7205609
41144 7205609 8443183 9501499 10027863 10781935 12966336 16461633 19794247 22416154
41136B2416154L326179N145861N638919L819022J299418p24321l076966n959580
41128C1884686p226971n408003k607057j947004l253223l721914k240515n95169
41120D884830m17829j120106j348423q50462k09749K15084M88796P90134J130704
41111C562979J100768K00969j154802j615148o02749O67247Q53275M55607R02749
41102D370895K253757L178794K872580J702042K88503q06653r21744j71557M0688
41093A2807305j077753j937001o76294J419936J128359j914280m219733l108009
41085B422530p4437J703291J253979k02134j451034j831994q81716R22533J968619
41076C829637J439572N62904O80750J127202N42689o57558r41530j89947L07562
$$ plain form
41136 22416154 25742333 30888194 36527113 40346135 41645553 40921232 37844266 31884686
41128 31884686 24657715 19249712 16642655 14695651 11442428 7720514 5479999 4884830
41120 4884830 4467001 3346895 1998472 1148010 938261 1153345 1642141 2432275 3562979
41111 3562979 4663747 4864716 3709914 2094766 1492017 2159264 3012539 3468146 4370895
41102 4370895 6624652 9803446 12676026 14378068 14666571 13859918 12938174 12766617 12807305
41093 12807305 11729552 9792551 9116257 10536193 11664552 9750272 5530539 2422530
41085 2422530 2348093 4051384 5305363 5103229 3652195 1820201 938485 1861018 3829637
41076 3829637 5269209 5832113 6512863 7640065 8182754 7525196 6583666 6393719 6701281
41067F701281J42787K33943Q65654R91230j3349j242957j543093q93036R1992
41058E334452J184488K331028K957166K306299M85535j261930j576475l25988
41050A1434575J182297J601484J132910J243877K674526M372966M819027L783794
41042C2245456K173687O79950o13834j595839j926287j473722n01248M31488N01975
41033B9921626q81252l087151m375740l767535k300617j615731j829505j813586
41025A0250509j122012m32399k74098m93475r07216j364726j230358j4872J433710
41016E845063J638492N95350r4392M73482J347000J389011Q68415N95380N10235
41007A3168036J19718l44470j49530R07399K325156L407962L527189K391174N32524
$$ plain form
41067 6701281 6844068 7078011 7943665 8934895 8921546 7678589 6135496 5242460 5334452
41058 5334452 6518940 8849968 11807134 14113433 14598968 13337038 11760563 11434575
41050 11434575 12616872 14218356 15351266 16595143 19269669 23642635 28461662 32245456
41042 32245456 34419143 35099093 34485259 32889420 30963133 29489411 28988163 29419651 29921626
41033 29921626 29040374 25953223 21577483 17809948 15509331 13893600 12064095 10250509
41025 10250509 9128497 8696098 8422000 7928525 7021309 5656583 4426225 4411353 5845063
41016 5845063 7483555 8078905 7984513 8457995 9804995 11194006 12062421 12657801 13168036
41007 13168036 13287754 12943284 12793754 13701153 16026309 19434271 22961460 25352634 25885158
40998B5885158r54141j563677j745723j830032j382074j57519J096154J511915
40990B0860061J143782M69200m40136j449896j781780r51924J73434L37603l49468
40981A8010876o18298J39569J206005J673177J419853Q91153N44862N54667O50517
40972B4472381M58633L45606J328497L492816N233894N107842L807461L018346
40964D7265476K869761K164148Q61559L75435J126420J721806J268005P54286
40956E8406896J154444J762690J724778J855866L346154N678925P588585R423407
40948I0941745J2672654J7360074K1785546K5096190K8245614L1351582L1325063
40941B58778468K3821496P970806j1335918k6439850l2667973l1397706k7493249
$$ plain form
40998 25885158 24931017 23367340 21621617 19791585 18409511 18251992 19348146 20860061
40990 20860061 22003843 22473043 22032907 20583011 18801231 17849307 18022741 18360344 18010876
40981 18010876 17392578 17532147 18738152 20411329 21831182 22722335 23267197 23821864 24472381
40972 24472381 24931014 25276620 26605117 30097933 35331827 40439669 44247130 47265476
40964 47265476 50135237 52299385 53160944 53536379 54662799 56384605 57652610 58406896
40956 58406896 59561340 61324030 63048808 64904674 68250828 73929753 81518338 90941745
40948 90941745 103614399 120974473 142760019 167856209 196101823 227453405 258778468
40941 258778468 282599964 290570770 279234852 252795002 220127029 188729323 161236074
40934A61236074k4156296k1057521j7124836j3165676j0566727q946650p082896
40927E9135472n402950n358335o498195o469185m418699k322297k001565k627455
40919B4036791k438592j435782q30575q75821q54234o03005n97988q79339j089017
40910A4432438j235994j384714j059880p0481O21424J50636o25496k43305R70041
40901A1554669J290343K80768p06863q70304r14584j193120q21441M45017J246891
40892A0311376Q04557M64694J464480K514566J606529o65706j794568j003352
40884A3702576J4306R4095J29156R40179J617498J209036N83090J139717K604612
40875B2034265L549079L513100L217057L018442K597073K161239K577978L931947
$$ plain form
40934 161236074 137079778 116022257 98897421 85731745 75165018 66218368 59135472
40927 59135472 53732522 48374187 41875992 35406807 30988108 28665811 26664246 24036791
40919 24036791 21598199 20162417 19331842 18456021 17601787 16998782 16400794 15521455 14432438
40910 14432438 13196444 11811730 10751850 10681369 11302793 11453429 10827933 10584628 11554669
40901 11554669 12845012 13125780 12418917 11548613 10634029 9440909 8619468 9064485 10311376
40892 10311376 11115933 11580627 13045107 15559673 17166202 16500496 14705928 13702576
40884 13702576 13716882 13810977 13940133 14880312 16497810 17706846 18289936 19429653 22034265
40875 22034265 25583344 29096444 32313501 35331943 37929016 40090255 42668233 46600180
40867D6600180N112672N471905O021798Q161809J1704053J5014255J7054899J8700589
40859A33842160K1876753K7633760L5191545M2876888M9807526N5873787N9227932
40852D26330351N4523128L6145416N012939k8801565n2519093o0478309n6880328
40845C23332539m9300389m1538270l3440068k5177681j8750972j5378796j3733321
40838A26013042j1809118r419135p875207p845028q482319q514110p502090n987780
40830E8578255m820829m426224m486241m295154l544765k674194k279759k327243
40822B9723846k260069j835833j433900j371912j339233r44504n67268r91638
40814A8979489k112567k729976k065678q74148l37860l21545K68635J533548K180738
$$ plain form
40867 46600180 51712852 57184757 63206555 71368364 83072417 98086672 115141571 133842160
40859 133842160 155718913 183352673 218544218 261421106 311228632 367102419 426330351
40852 426330351 480853479 516998895 522011834 493210269 440691176 380212867 323332539
40845 323332539 274032150 232493880 199053812 173876131 155125159 139746363 126013042
40838 126013042 114203924 104784789 96909582 89064554 80582235 72068125 64566035 58578255
40830 58578255 53757426 49331202 44844961 40549807 37005042 34330848 32051089 29723846
40822 29723846 27463777 25627944 24194044 22822132 21482899 20538395 19971127 18979489
40814 18979489 16866922 14136946 12071268 11197120 10859260 10537715 10806350 12339898 14520636
40805A4520636J399557O8677n56386n25015p46676j458162k008137j840211r63496
40796G890787K64535J186853J053030j08358j159103j109187l47498J10844J20643
40787G902546K23602M61283N44547Q36818J760137K357103J059036j793102l690716
40778I661254k890197m69341J207763J105537m0914r88352r68840p4127P78506
40769G321289P80893L25393L93565Q34132M85154p16861j234384j89248J331715
40760I331648K126907K594712L435330M009765L490004K568261K391433K574014
40752C2522074J880507L11934j006907j548649j591678j243545o90216q42278
40744B7791242k164758l386823l044757j810838j447951j889693j507041j52030
$$ plain form
40805 14520636 15920193 15988870 15432484 14907469 14160793 12702631 10694494 8854283 7890787
40796 7890787 8155322 9342175 10395205 10286847 9127744 8018557 7671059 7781903 7902546
40787 7902546 8126148 8587431 9131978 9968796 11728933 14086036 15145072 13351970 9661254
40778 9661254 6771057 6301716 7509479 8615016 8574102 7585750 6616910 6542783 7321289
40769 7321289 8102182 8427575 8821140 9655272 10140426 9423565 8189181 7999933 9331648
40760 9331648 11458555 14053267 17488597 21498362 24988366 27556627 29948060 32522074
40752 32522074 34402581 34714515 33707608 32158959 30567281 29323736 28633520 27791242
40744 27791242 25626484 22239661 19194904 17384066 15936115 14046422 12539381 12387351
40736A2387351L80481p33351k118030k455205k004709j240143N4378J476155J694791
40727G441718N17751m33869j92365J28171m13929p16732L15376J420253P38292
40718H804666j116040j876675r67176Q742m5061m07481j68730L34993K61039m67826
40708D360451j068638o71435Q07172K263000K269212P69664o82742r02169m49404
40699F695111k92852j73720M37727P39916l12234j896366k200649j181507m75916
40690A339510n48537j24001J021412J012747j074056l014683k176858P10037K536516
40681c17913J984699P15921M43598P72362N54418j59987n66295n29974m90375
40672B406454n04862l67662k96622n33727n43620L02722J348395J203645j18200
$$ plain form
40736 12387351 12767832 12034481 9916451 7461246 5456537 4216394 4270772 5746927 7441718
40727 7441718 7959469 7525600 7333235 7461406 7047477 6330745 6646121 8066374 8804666
40718 8804666 7688626 5811951 4844775 4853517 4808456 4400975 4232245 4567238 4828277 4360451
40708 4360451 3291813 2620378 3427550 5690550 7959762 8729426 8046684 7144515 6695111
40699 6695111 6402259 6228539 6666266 7406182 7093948 5197582 2996933 1815426 1339510
40690 1339510 790973 666972 1688384 2701131 1627075 -1387608 -3564466 -2854429 -317913
40681 -317913 1666786 2382707 2826305 3598667 4153085 3993098 3426803 2896829 2406454
40672 2406454 1901592 1533930 1237308 703581 159961 462683 1811078 3014723 2896523
40663B896523r60594m91140j0001p04198j369453j14452K336878L089336R44371
40654E617270j941928k815123j365475O07048J409082O57170p92074j509510q57408
40645i90948K7461l93060j570490j271256J043102L035100K749083J308043P95988
40636D733023R79021K16064j365741j939158r06123L56737P58469O72682O10873
40627D115847L63040r1285j64608L50525R02917J092058J025662O88485J3814
40618H296455l89492J67691R81546M54792j509955k926198k195850r0725J447721
40609D235985J563951P81490j67582q93905j136093p93566j63822K07379m4687
40600C589150p59327j197136o54362M90303Q32569k68037j487179j146036L95051
$$ plain form
40663 2896523 1935929 1444789 1434788 730590 -638863 -753315 1583563 4672899 5617270
40654 5617270 3675342 860219 -505256 101792 1510874 2168044 1375970 -133540 -990948
40645 -990948 -963487 -1356547 -2927037 -4198293 -3155191 -120091 2628992 3937035 4733023
40636 4733023 5712044 5928108 4562367 2623209 1717086 2073823 2832292 3504974 4115847
40627 4115847 4478887 4387602 4222994 4573519 5476436 6568494 7594156 8282641 8296455
40618 8296455 7906963 8074654 9056200 9510992 8001037 5074839 2878989 2788264 4235985
40609 4235985 5799936 6581426 6413844 5519939 4383846 3590280 3426458 3633837 3589150
40600 3589150 2829823 1632687 978325 1468628 2301197 2033160 545981 -600055 -205004
40591b05004J257725P74527J83326M05845O73807L0345j011498j217525l61874
40582E29674N37260M45635n34401j118304j74720J617583K174932P76461o29779
40573C624341k12264Q20782J95899j421965j270003Q27216J829309K41535j603672
40564C031178j382757p8044L52547Q0978N2776k76412j443771k028403p28359
40555b420267J054328J206330K22252j008M62329J25933q40590r20620r9392L23040
40545h87665L56961R69173J396308j10978k667335l006221j59271K900830L396426
40536B188228K030797Q39644R1481r12435j716491j355607j66791N99620M32757
40527B031203j84548o17643m85703J53114N76937R2006q38334j127625q05547
$$ plain form
40591 -205004 1052721 1827248 2010574 2416419 3090226 3120571 2109073 891548 529674
40582 529674 1066934 1512569 978168 -140136 -314856 1302727 3477659 4254120 3624341
40573 3624341 3412077 4232859 4428758 3006793 1736790 2564006 4393315 4634850 3031178
40564 3031178 1648421 1570377 1922924 2003902 2056678 1780266 336495 -1691908 -2420267
40555 -2420267 -1365939 -159609 62643 61635 523964 649897 -190693 -1111313 -1210705 -887665
40545 -887665 -530704 438469 1834777 1723799 -943536 -3949757 -4109028 -1208198 2188228
40536 2188228 4219025 5058669 5150150 4237715 2521224 1165617 998826 1598446 2031203
40527 2031203 1846655 1229012 743309 896423 1473360 1565366 727032 -400593 -1206140
40518a206140q75231j248308n38567J467582K871655K215330N15385l73991j77564
40509B650151J45835K7375n54652j519445k240783j675757O4955J351488J245267
40500e05566Q68088J406792K065844J524880L07081o7980M86594P82650L79590
40491G247973k13937q95487j846969k369148j522398J44328J031392O76478J31736
40482B383968J44022L21164K42400J38884K05897K21621J8822m13183j136202
40473B127393j774659j294203N93934K294834K037035M04021m15448K78663J071774
40464E323344Q85130K02312l82395r58452j200743l73439R30900R80661l26053
40455E081265r00275J56521P27825r63541l044249k476372L12958J970907R82900
$$ plain form
40518 -1206140 -2081371 -3329679 -3868246 -2400664 470991 2686321 3201706 2827715 2650151
40509 2650151 2795986 2823361 2268709 749264 -1491519 -3167276 -3102321 -1750833 -505566
40500 -505566 362522 1769314 3835158 5360038 5667119 5599139 6085733 6868383 7247973
40491 7247973 7034036 6138549 4291580 1922432 400034 544362 1575754 2252232 2383968
40482 2383968 2527990 2849154 3091554 3230438 3436335 3657956 3676778 3263595 2127393
40473 2127393 352734 -941469 -347535 1947299 3984334 4388355 3972907 4251570 5323344
40464 5323344 6208474 6410786 6028391 5069939 3869196 3495757 4426657 5407318 5081265
40455 5081265 4180990 4337511 5065336 4101795 1057546 -1418826 -1105868 865039 1847939
40446A847939o69936q09899K94924J276867J731000J861323J427204K05646j270465
40437E894603k282982k639047k274830r60455R08608K024995J611766O40936O78876
40428C602470J836980K774023K546132J535232N55324o0496l07790k78980m11639
40419A1791256j215260k295434k391680j093390J26047l54565j838130j889254
40411H39590L63018K769574K823984Q45234o80469m35049M58347N37459m6643
40402G475045l47927l24823o31531j199092j157529k10130P97780R77302M53232
40393E832327n1051k43980l98431o62643p53303m12929J86894O93335R79850J041263
40383F211332O77030k68322j332509j651274j045065l90878m00140n10248J58507
$$ plain form
40446 1847939 1178003 368104 663028 1939895 3670895 5532218 6959422 7165068 5894603
40437 5894603 3611621 972574 -1302256 -2262711 -1354103 670892 2282658 2923594 3602470
40428 3602470 5439450 8213473 10759605 12294837 12850161 12789665 12481875 12202895 11791256
40419 11791256 10575996 8280562 5888882 4795492 4921539 4566974 2728844 839590
40411 839590 1202608 3972182 6796166 7641400 6960931 6525882 6984229 7521688 7475045
40402 7475045 7127118 6802295 6170764 4971672 3814143 3604013 4401793 5379095 5832327
40393 5832327 5781276 5537296 5138865 4476222 3722919 3309990 3496884 4190219 5170069 6211332
40383 6211332 6888362 6620040 5287531 3636257 2591192 2200314 1800174 1289926 1448433
40374A448433J065460P52137o99752j153083O89950L000260K900077K74298k133413
40365F144367k366859j283923m87415N5699J146485K320575K295398J010480k27745
40356H607062o06679n89905o98796o55586j57743L86925M31904k071n90876j123824
40346E000411j338533r62389k92317q7674m43452m44088N05349J669214J977327
40337E583848J412464O46119q7630q36891j218351r40658n89391p15793n86988
40328B666729P14762K251407K076280K43158r35868k12635Q86427O59560k24000
40319H125820k36953L76195K83164n38252r08383m39005K17000O96882R29838
40310H506306K38917j771808l645714l320219j080491N94488M59228j11917K81559
$$ plain form
40374 1448433 2513893 3266030 2566278 1413195 2103145 5103405 8003482 8277780 6144367
40365 6144367 3777508 2493585 2006170 2061869 3208354 5528929 7824327 8834807 8607062
40356 8607062 8000383 7410478 6711682 6056096 5898353 6285278 6717182 6715111 6124235 5000411
40346 5000411 3661878 2699489 2407172 2319498 1876046 1431958 1937307 3606521 5583848
40337 5583848 6996312 7642431 7554801 6717910 5499559 4558901 3969510 3253717 2666729
40328 2666729 3381491 5632898 7709178 7952336 7016468 6803833 7690260 8349820 8125820
40319 8125820 7888867 8265062 8548226 8009974 7101591 6662586 6879586 7576468 8506306
40310 8506306 8745223 6973415 3327701 7482 -1073009 -478521 -19293 -131210 150349
40301A50349J053655J214328J168954J534331J582419M73367r77516j379522q80234
40292C940131o35008p39639l30977N60330R14508M98869K34672N58126P59640
40283E760652L45423j28482q8618K12224M48926Q81130J533197J506686P7704
40274A0548842j877238k481696r67541J384603K579690J854604J40127j154607
40266A0026784j472418j188101p73343l92296k42724n82145j099319r40180L2906
40257C369164N95017l36840j921135k218645p67785Q32915J225589J026642J501579
40248C306501K375330K126235K59156j780175k291732j262213r5889K52715J74048
40239C063976L54527O11949M33348J52723M95319J037170M89161j046472j589719
$$ plain form
40301 150349 1204004 2418332 3587286 5121617 6704036 7177403 6199887 4820365 3940131
40292 3940131 3305123 2565484 2234507 2794837 3709345 4208214 4442886 5001012 5760652
40283 5760652 6106075 5977593 5888975 6101199 6550125 7431255 8964452 10471138 10548842
40274 10548842 8671604 6189908 5222367 6606970 9186660 11041264 11181391 10026784
40266 10026784 8554366 7366265 6592922 6200626 5957902 5375757 4276438 3336258 3369164
40257 3369164 3964181 3627341 1706206 -512439 -1280224 -447309 778280 1804922 3306501
40248 3306501 5681831 7808066 8067222 6287047 3995315 2733102 2637213 2889928 3063976
40239 3063976 3418503 4030452 4463800 4616523 5111842 6149012 6638173 5591701 4001982
40230D001982j06300J524955R74636j115047k170056j497202o82406l70974N66698
40221A126286K055141J891713o24174k596615j335090J518541K255518L68726
40213D660046j201977o43951O50883Q53935J56056l26463k88802K3864M85386
40204D368977P24736J78522q76686j335787q00913j05941J23963L38720R51396
40195C566987J443164J247628O06283o4354p57466j283759j100504l61573r8027
40186C198379o33694r04875k02429N55788L75607r9520K03355P91752M57943m67831
40176C274475n02125M87590Q77750k92036j868214k117719q08466P47434J189375
40167I88064L92842l96137J80535J814796K493141R83250j198779j478253M33912
$$ plain form
40230 4001982 3895682 5420637 6395273 5280226 3110170 1612968 930562 559588 1126286
40221 1126286 3181427 5073140 4448966 1852351 517261 2035802 4291320 4660046
40213 4660046 3458069 2814118 3465001 4318936 4474992 4148529 3859727 3883591 4368977
40204 4368977 5093713 5272235 4395549 3059762 2258849 2152908 2276871 2615591 3566987
40195 3566987 5010151 6257779 6864062 6799708 6042242 4758483 3657979 3296406 3198379
40186 3198379 2564685 1659810 1457381 2013169 2388776 2289256 2492611 3284363 3742306 3274475
40176 3274475 2772350 3259940 4137690 3845654 1977440 -140279 -948745 -201311 988064
40167 988064 1380906 984769 1165304 2980100 5473241 6456491 5257712 3779459 4213371
40158D213371K263330K243865J049093L16886N39589J048682J135039N35602n24485
40149A2820972j323385j268019p67484p90592j424358j763129j407497r97615
40141C078893q92348m79624N55096J320599R22012k10838r95482j061617p57033
40132A479658m09244k16380k83536k64660L16746R67993M78676j069839j746042
40123g46628k97912J801887K187397P07557p15749p67375J75360J225311J753147
40114E322995J173644n57189k199678k274872r27874L75111R25032J275857J713919
40105D826945J672263R33598R6742n26275j271379k005040j870608o81378N10665
40096A685533P82964L26971l45279j095047j562214j046665K91113J145280P88500
$$ plain form
40158 4213371 6476701 8720566 9769659 10086545 10626134 11674816 12809855 13345457 12820972
40149 12820972 11497587 10229568 9462084 8671492 7247134 5484005 4076508 3078893
40141 3078893 2186545 1706921 2262017 3582616 4504628 4293790 3298308 2236691 1479658
40132 1479658 1070414 854034 570498 305838 622584 1590577 2069253 999414 -746628
40123 -746628 -1044540 757347 2944744 3652301 2936552 2169177 2344537 3569848 5322995
40114 5322995 6496639 5939450 3739772 1464900 537026 912137 1837169 3113026 4826945
40105 4826945 6499208 7432806 7529548 7003273 5731894 3726854 1856246 1174868 1685533
40096 1685533 2468497 2795468 2450189 1355142 -207072 -1253737 -962624 182656 971156
40087I71156J71798M71071J357662J592219O86214p74615j830727j610734L1278
40078A065322J703489J388120r42597k763191k185294n09899o1688o13637r9702
40069c019077J703964K646124J528079k39099r50200o98744k84682K76796R93397
40060A956558J040168K6169r31265p77891k77662o70706j313017n56615J221277
40051b82984J562847n08954k679480k299869J06680J835863J778208J395829J912165
40042B820305K347352J277384o86332j594384q97085p9387l83072j084076p14453
40033A006252P47078J812659J394349j4453j165750j441902j083266m49149L90940
40024A196758J323338J917316J801770J126396L23383m74862j361134k032568
$$ plain form
40087 971156 1142954 1614025 2971687 4563906 5250120 4475505 2644778 1034044 1065322
40078 1065322 2768811 4156931 3214334 451143 -1734151 -2244050 -2305738 -2919375 -3019077
40069 -3019077 -1315113 1331011 2859090 2619991 1669791 971047 686365 963161 1956558
40060 1956558 2996726 3022895 2091630 1313739 1036077 365371 -947646 -1504261 -282984
40051 -282984 1279863 770909 -1908571 -4208440 -4101760 -2265897 -487689 908140 2820305
40042 2820305 5167657 6445041 5758709 4164325 3267240 3187853 2804781 1720705 1006252
40033 1006252 1753330 3565989 4960338 4945885 3780135 2338233 1254967 805818 1196758
40024 1196758 2520096 4437412 6239182 7365578 7688961 7214099 5852965 3820397
40016C820397j856039q27734Q6941M6814o54528j183807j318639j308118r85607
40007d180320L7123J403606K157235J911219J119014K42309m86529n94641K07967
39998A816983J085454Q26549k42278n05833L51553O25337o76216k000855j539832
39989b59138j6578N51315l0352j64933Q07984J764677J666786P25172m15337j316557
39979C313039j481369p18424J19891k9394q10345r01144j14033M08522K69140
39970E5883M43819J282330J493480J28396j675372k115818j051290K05185P92042
39961d41345R01321Q25828M38107l28444j091959j270687o13813L78923O75922
39952e26147j57487j130165q64776N11414J445120J104395L56785J71289K11122
$$ plain form
40016 3820397 1964358 1136624 1223565 1270379 615851 -567956 -1886595 -3194713 -4180320
40007 -4180320 -4143197 -2739591 -582356 1328863 2447877 2690186 2203657 1609016 1816983
39998 1816983 2902437 3728986 3486708 2980875 3332428 3957765 3281549 1280694 -259138
39989 -259138 -275716 275599 245247 80314 888298 2652975 4319761 5044933 4629596 3313039
39979 3313039 1831670 1113246 1233137 1203743 393398 -507746 -621779 -213257 55883
39970 55883 499702 1782032 3275512 3403908 1728536 -387282 -1438572 -1233387 -441345
39961 -441345 459976 1285804 1723911 1395467 303508 -967179 -1580992 -1202069 -526147
39952 -526147 -683634 -1813799 -2678575 -2167161 -722041 382354 739139 910428 1121550
39943A121550j77322n69027j40182Q68309J435133J201702P54424O38755P77261
39934E910603P50662J98311q54333j769510j785108r80145j99151K02697P09203
39925B183229J398820J472416P34148L44061R62894J249214k31286k386756k782447
39916B944293j172078J22644l67552j305898q26368O90575J324179L02368j190125
39907E22038j667953r64994j26474j23606q09382j099923k52790J144298J761694
39898a617092J064623j30816o97451l87652J91973M63136M27057M18132N51423
39889B83333N84281L59032J64851L48501O70119N26812j23428n96831m27501N4044
39879A843213L27298L26752K07325K2391r2995j6765j17591q39795j582164j079529
$$ plain form
39943 1121550 944228 375201 235019 1103328 2538461 3740163 4494587 5133342 5910603
39934 5910603 6661265 6859576 6005243 4235733 2450625 1470480 1271329 1474026 2183229
39925 2183229 3582049 5054465 5788613 6132674 7095568 8344782 8113496 5726740 2944293
39916 2944293 1772215 1894859 1527307 221409 -604959 85616 1409795 1712163 522038
39907 522038 -1145915 -2110909 -2237383 -2360989 -3170371 -4270294 -4523084 -3378786 -1617092
39898 -1617092 -552469 -683285 -1380736 -1768388 -1576415 -1113279 -686222 -268090 283333
39889 283333 867614 1226646 1391497 1739998 2410117 2936929 2813501 2216670 1789169 1843213
39879 1843213 2170511 2497263 2704588 2726979 2633984 2617219 2499628 1659833 77669 -1001860
39869a001860O26087J851119J648007J120808J270802J059984o49009k487955
39861C437983k171184l3036J336123P70516l92758r29790j130194j216593o13569
39852i42502M40131N34573o94013j695419j318516l73589J36025P04072J936125
39843a273113K885597K299635N77812q54010j367149j209657n66687L41982R29172
39834A763582R95143J111110J438022J129258j40348j159536r21940l58602r12126
39825B944563k233970k811128k212656j219874l20430M13369N00588k91819q94997
39816f126354j45028J313078J940464J736713J937629K527912K120248M82126
39808E786788q35201q84296n15295n66927o14437l13395l15600q25092p62852
$$ plain form
39869 -1001860 -375773 1475346 3123353 4244161 5514963 6574947 5925938 3437983
39861 3437983 1266799 1233763 2569886 3340402 2947644 2017854 887660 -328933 -942502
39852 -942502 -502371 32202 -661811 -2357230 -3675746 -4049335 -3913310 -3209238 -1273113
39843 -1273113 1612484 3912119 4489931 3635921 2268772 1059115 492428 834410 1763582
39834 1763582 2758725 3869835 5307857 6437115 6296767 5137231 4215291 3856689 2944563
39825 2944563 710593 -2100535 -4313191 -5533065 -5853495 -5440126 -4939538 -5231357 -6126354
39816 -6126354 -6271382 -4958304 -3017840 -1281127 656502 3184414 5304662 5786788
39808 5786788 4951587 4067291 3551996 2985069 2370632 2057237 1741637 916545 153693
39799A53693M08525J360568Q16553k86398j60741J009119J312716k1155j565733
39790C027147j748949p66637M5609k6868m96881m96569K20316J026490J069278
39781A852936K26933o70171p51069j45969J64150l92989j124049q00219O85865
39772i54582J790282R82723j165831k354787j301979P09881J636804J182811N29282
39763A054604K72893L546l97966n36797n74032j061022j548833q84403P35805
39754b936205J575002Q43102j60392k11711J01330o1410n4644Q43722J555567
39745A494361O57743j103418j754367j072730n80560p60973m63274O31294J087618
39736a864306R4443j002596o80343N86896J325826J179323P71215K64283o08887
$$ plain form
39799 153693 562218 1922786 2739339 2452941 2292200 3301319 4614035 4592880 3027147
39790 3027147 1278198 511561 557170 530302 33421 -463148 -242832 783658 1852936
39781 1852936 2079869 1409698 658629 512660 676810 283821 -840228 -1640447 -954582
39772 -954582 835700 1818423 652592 -1702195 -3004174 -2294293 -657489 525322 1054604
39763 1054604 1327497 1331043 933077 396280 -177752 -1238774 -2787607 -3672010 -2936205
39754 -2936205 -1361203 -518101 -678493 -890204 -788874 -850284 -904928 -61206 1494361
39745 1494361 2152104 1048686 -705681 -1778411 -2358971 -3119944 -3583218 -2951924 -1864306
39736 -1864306 -1769863 -2772459 -3452802 -2865906 -1540080 -360757 410458 674741 65854
39727F5854j506198j678931j056699k08987N65616J235386J384771O06207n08567
39718a101548q03629j49613L17752j72777r89858j090174l49904N60529J072319
39709b706903J014348M81503j06985j75868L54454R01359J028506R83017J041180
39700B814611Q63733J06245p78792j072709q16808n94730n60343m26648j65975
39691f31416Q3038N33546J240820J358026J09251j579774j826765m01664Q23471
39682b91467M95592n75760j085624j072698j042775o13385N36542J377780P91342
39673a480453n04674q16643J35995J111201J301880R90539M48135m11792j270292
39664d96104j504206j098562n15040J28884P79270Q29910K9902n17617K44585
$$ plain form
39727 65854 -1440344 -3119275 -4175974 -4384961 -3819345 -2583959 -1199188 -592981 -1101548
39718 -1101548 -1905177 -2054790 -1737038 -1909815 -2899673 -3989847 -4339751 -3779222 -2706903
39709 -2706903 -1692555 -1211052 -1318037 -1493905 -1139451 -238092 790414 1773431 2814611
39700 2814611 3678344 3784589 3005797 1933088 1116280 521550 -38793 -465441 -631416
39691 -631416 -548378 -14832 1225988 2584014 2693265 1113491 -713274 -1114938 -291467
39682 -291467 204125 -371635 -1457259 -2529957 -3572732 -4186117 -3649575 -2271795 -1480453
39673 -1480453 -1985127 -2801770 -2665775 -1554574 -252694 737845 1185980 774188 -496104
39664 -496104 -2000310 -3098872 -3613912 -3485028 -2705758 -1875848 -1845946 -2363563 -2118978
39655b118978J408853J295493J52405l09012J81020K38991m61226o49235M1694
39646b19995M37777K08810M20157J033278N42222q99084q70537J289139K730034
39637D671801J376713p72854j085867m32152r05853j731826j000193K82293j84812
39628B17250j451075n61612K073331K796990N55614j429592r05705K03504m58918
39619A039787j860772j699076p0670J178851J240162O03629l01840j157252j333082
39610b360263o69269M5599J94503J03663J61060K26144L56848Q57167J201346
39601A16798M35963q56477p76612R50610K122677J206097m77461j002019n49455
39592A170121l51340m76136l79046l59290p13614n42591Q16328K090960J613648
$$ plain form
39655 -2118978 -710125 585368 737773 428761 609781 848772 387546 -261689 -219995
39646 -219995 217782 426592 846749 1880027 2422249 1523165 652628 1941767 4671801
39637 4671801 6048514 5275660 4189793 3757641 2851788 1119962 119769 402062 217250
39628 217250 -1233825 -1795437 277894 3074884 3630498 2200906 1295201 1498705 1039787
39619 1039787 -820985 -2520061 -2590731 -1411880 -171718 431911 130071 -1027181 -2360263
39610 -2360263 -3029532 -2983933 -2789430 -2685767 -2524707 -2298563 -1941715 -1084548 116798
39601 116798 552761 -303716 -1080328 -129718 1992959 3199056 2721595 1719576 1170121
39592 1170121 818781 342645 -36401 -395691 -1109305 -1651896 -835568 1255392 2869040
39583B869040j25887j153674o94714L57451J131966J426990J069367M8307r51237
39574C977609j242770j004765o32462J2305P85427P43657l60847j163843o32536
39565D81775K30068J60990j72046L43283Q49643o7401j528478j530582l27626
39556a560374J09804l45559R4955J582458K039548P43329l35107J98760J069395
39547C597209P65003j54874n96332q53936j488421j855530j208177j1897R95133
39538h11822J773607K046777R53731j168441k243973j151379M73678O76085J5158
39529E63421J46712Q30693N64275n34248q00374J23012O00486m32618j865524
39520h04165k030836q02564O06002J231472J103852O98353J83821n48289j204552
$$ plain form
39583 2869040 2743153 1589479 894765 1252216 2384182 3811172 4880539 4928846 3977609
39574 3977609 2734839 1730074 1097612 1109917 1895344 2639001 2278154 1114311 481775
39565 481775 711843 872833 700787 1044070 1893713 1826312 297834 -1232748 -1560374
39556 -1560374 -1450570 -1796129 -1701174 -118716 1920832 2664161 2329054 2527814 3597209
39547 3597209 4362212 4207338 3611006 2757070 1268649 -586881 -1795058 -1806955 -811822
39538 -811822 961785 3008562 3962293 2793852 549879 -601500 -127822 548263 563421
39529 563421 710133 1540826 2105101 1570853 770479 893491 1493977 1061359 -804165
39520 -804165 -2835001 -3637565 -3031563 -1800091 -696239 2114 185935 -362354 -1566906
39511a566906j006955J51946R87655L66203p12280k34403J619621K309980O66214
39502B581075j216814j084386L24668R70866P49311Q44881J043775J93333j231895
39493C174814j485071l60665N47468M46998J22725l044m27127q33395r748J771322
39483B944277K336325O28269j602203k293169j707462j262689j112779m86137
39475b555568N05875J030587J042122J237909J703913J725644R14741k75019j100462
39466D229742j081905k75054N45505M09637o30084j330862q69259M7484M06304
39457A451508M41920Q64067J178516K99410j295717j638013K3103J877819J768207
39448D970820j02124j612391j417303k60159L16133k28605j159191j513004j055243
$$ plain form
39511 -1566906 -2573861 -2421915 -1434260 -1068057 -1780337 -2014740 -395119 1914861 2581075
39502 2581075 1364261 279875 604543 1575409 2324720 3169601 4213376 4406709 3174814
39493 3174814 1689743 1329078 1876546 2323544 2446269 2443225 2016098 1182703 1172955 2944277
39483 2944277 5280602 5908871 4306668 2013499 306037 -956652 -2069431 -2555568
39475 -2555568 -2049693 -1019106 23016 1260925 2964838 4690482 5605223 5330204 4229742
39466 4229742 3147837 2872783 3418288 3827925 3197841 1866979 997720 1045204 1451508
39457 1451508 1893428 2757495 3936011 4235421 2939704 1301691 1324794 3202613 4970820
39448 4970820 4868696 3256305 1839002 1578843 1894976 1666371 507180 -1005824 -2061067
39439b061067l16306O7909k5987k01860n7443M07634Q88820J096226Q60742J18611
39429G77279r09359j576105j246030o1453J031150J297015R90058P49988N34407
39420A586950j61458j079061j095334K05243J556848J371809k27611j481607j069141
39411c93362M91339J621166J394595K74138n89264n60723j5610L30122L51470
39402B903871L83042K88075n38491j939893k645831j840643l45035O47336J279688
39393a807881K253431K936362J948100l77440j846967j219961L07515J069888
39385C263047R22485L63875q30919k617717l428160j816746J017133K208971R03894
39376a4137o78031m08008R47757J126775l71319j768619j519919j20089R14395
$$ plain form
39439 -2061067 -2377373 -2309464 -2335451 -2537311 -2594754 -2187120 -1298300 -202074 658668 777279
39429 777279 -132080 -1708185 -2954215 -3015668 -1984518 -687503 302555 1052543 1586950
39420 1586950 1425492 346431 -748903 -543660 1013188 2384997 2157386 675779 -393362
39411 -393362 97977 1719143 3113738 3387876 2798612 2237889 2222279 2552401 2903871
39402 2903871 3286913 3574988 3036497 1096604 -1549227 -3389870 -3734905 -3087569 -1807881
39393 -1807881 445550 3381912 5330012 4952572 3105605 1885644 2193159 3263047
39385 3263047 4185532 4549407 3718488 1100771 -2327389 -4144135 -3127002 -918031 -14137
39376 -14137 -692168 -1100176 -152419 974356 603037 -1165582 -2685501 -2805590 -1891195
39367a891195R68723N70401K41821J4178O011N30640J259475J113994k78250j611832
39357I23966j333640K77740J494907J459103R44282O99648L33792n85391j424804
39348B789603j335587m91254K87673N65646L08637m64732j319373j351217l37723
39339a348327O45685O35344J99244M22441J049166R29732J8790m69883M8505P54310
39329B885007P72390J88071n80179j356173j729316j021050N95501J670210R27784
39320B352245j182230k883924k816709j138852Q23077J828331J808251J664946
39312D55135J812472J412282k45454k118293k422885j156434j46077l04146l99222
39303c112622P04395K090302K291467J563246J144532J045071K40733j280057
$$ plain form
39367 -1891195 -922472 -352071 -110250 -96072 -90061 440579 1700054 2814048 2535798 923966
39357 923966 -409674 -131934 1362973 2822076 3766358 4466006 4799798 4214407 2789603
39348 2789603 1454016 962762 1250435 1816081 2124718 1659986 340613 -1010604 -1348327
39339 -1348327 -702642 -67298 131946 554387 1603553 2533285 2552075 2082192 2130697 2885007
39329 2885007 3657397 3845468 3265289 1909116 179800 -841250 -245749 1424461 2352245
39320 2352245 1170015 -1713909 -4530618 -5669470 -4846393 -3018062 -1209811 455135
39312 455135 2267607 3679889 3434435 1316142 -1106743 -2263177 -2409254 -2713400 -3112622
39303 -3112622 -2408227 -317925 1973542 3536788 4681320 5726391 5967124 4687067
39295D687067k301552k210794j572870p40634O07009K101294K345164Q58478p49854
39286C023308p17458M48297P13060o20322k041288j988938q07091M7395O7105
39277a875932J08756Q72399J780753J792161R03271J88920L23506O88660L49551
39268E132045n05177p61170K7849Q86889N47767j047668k694685l149711k123024
39259c686885k75139J337361J822086R45380n70345j416227q16506N63144J153720
39250i43411K51078r94513q81224O12565J622127P36227j136620j895109p90309
39241c419189R63881J881542J581269M86488q31517j668598j423455l95648K61736
39232b563491n8310n85442k86560P02075J385944J226137N08684j94879l14868
$$ plain form
39295 4687067 2385515 174721 -1398149 -2138783 -1531774 569520 2914684 3773162 3023308
39286 3023308 2305850 2754147 3467207 2846885 805597 -1183341 -1990432 -1943037 -1875932
39277 -1875932 -1767176 -894777 885976 2678137 3581408 3770328 4093834 4782494 5132045
39268 5132045 4626868 3865698 3893547 4780436 5328203 4280535 1585850 -1563861 -3686885
39259 -3686885 -3962024 -2624663 -802577 142803 -427542 -1843769 -2660275 -2097131 -943411
39250 -943411 -692333 -1686846 -2568070 -1955505 -333378 402849 -733771 -2628880 -3419189
39241 -3419189 -2455308 -573766 1007503 1493991 662474 -1006124 -2429579 -2825227 -2563491
39232 -2563491 -2621801 -3207243 -3493803 -2791728 -1405784 -179647 329037 134158 -180710
39223a80710M61684J459419J123170j061151l191437k834275j54568K212802K441462
39214B76396J173013k68046j507166k258152j657404J82786J356172N28431q88048
39205c062018o54692R59614J683178O86031n05504o17906k38859l26670p26104
39196b802930q64955o55777o3843J058616K082057J710008k33275k079284k141947
39187c991330n05086J517322K752346K504055P23279j370714j984769r82621l01633
39178a639151j168022k187693j551454J08783Q40247M14086K31551P27201R82819
39169c241633P86103R77754J536626J306118J37767n10551J35307Q78048M72632
39160B478171m99328o83978J56311J218521J735685J208452n17630k590145l404097
$$ plain form
39223 -180710 280974 1740393 2863563 1802412 -1389025 -4223300 -4377868 -2165066 276396
39214 276396 1449409 1181363 -325803 -2583955 -4241359 -4058573 -2702401 -2173970 -3062018
39205 -3062018 -3716710 -2757096 -1073918 -387887 -893391 -1511297 -1750156 -2076826 -2802930
39196 -2802930 -3667885 -4323662 -4387505 -3328889 -1246832 463176 229901 -1849383 -3991330
39187 -3991330 -4496416 -2979094 -226748 2277307 3000586 1629872 -354897 -1337518 -1639151
39178 -1639151 -2807173 -4994866 -6546320 -6437537 -5597290 -5183204 -4951653 -4224452 -3241633
39169 -3241633 -2455530 -1477776 58850 1364968 1502735 992184 1127491 2005539 2478171
39160 2478171 1978843 1294865 1451176 2669697 4405382 5613834 5096204 2506059 -898038
39151h98038k322394m30381R77495J663189J587239J89065k239935l655505k409757
39142g539022L39929J967267J692437R66507Q37048P29538M6534o84618q56966
39133b501346o85856l95905L96197J695711K422850J654339P4980o90746p738
39124A962486J161288J484554N87169q26863j751096j663333p76754K91861J008496
39115A477808J069164L08786j155759k650882l189401k291486n23088R34124J318489
39106d702245R27992O97672J068646J419124R19767j77342p30966l38434J9953
39097h95833m87406j099461n01043J098809K053940J452306J82456m08139o0665
39088A334964N42875P55108L62282m41063j065145r22779j24982N60503N86903
$$ plain form
39151 -898038 -3220432 -3650813 -2673318 -1010129 577110 766175 -1473760 -5129265 -7539022
39142 -7539022 -7199093 -5231826 -3539389 -2572882 -1735834 -1006296 -959762 -1644380 -2501346
39133 -2501346 -3187202 -3583107 -3186910 -1491199 931651 2585990 2660970 1970224 1962486
39124 1962486 3123774 4608328 5195497 4368634 2617538 954205 177451 469312 1477808
39115 1477808 2546972 2855758 1699999 -950883 -4140284 -6431770 -6954858 -6020734 -4702245
39106 -4702245 -3774253 -3076581 -2007935 -588811 330956 153614 -577352 -915786 -895833
39097 -895833 -1383239 -2482700 -2983743 -1884934 169006 1621312 1803768 1395629 1334964
39088 1334964 1877839 2632947 2995229 2554166 1489021 566242 441260 1001763 1588666
39079A588666N0684p55650j539810j690333o58072J005410J866401J339116L51195
39070A557607k06826o47006j341591j594351r04372l67853j166419k290671j696122
39061h657604M46457J692511Q33053m98621m70663M89812R91933R09404R32291
39052c331427J050370R18879Q38864J009650O96597l93327q42854N78263K515270
39043C040285K615015R99844k01011n39158j634521l463486l392750m17691K377679
39034f15794J892572m96037j190703K84455J214497L64516m00580M27165J569841
39025C049932J116794o72894j942236j566118j9613J359712J430384K15653q84890
39016B086724n13081R24962J726767J045860l63237j450801j766599j112363L14908
$$ plain form
39079 1588666 1639350 883700 -656110 -2346443 -3004515 -1999105 -132704 1206412 1557607
39070 1557607 1350781 703775 -637816 -2232167 -3136539 -3504392 -4670811 -6961482 -8657604
39061 -8657604 -8211147 -6518636 -5685583 -6184204 -6654867 -6165055 -5173122 -4263718 -3331427
39052 -3331427 -2281057 -1362178 -523314 486336 1182933 789606 -53248 525015 3040285
39043 3040285 5655300 6655144 6454133 5914975 4280454 816968 -2575782 -2993473 -615794
39034 -615794 1276778 780741 -409962 -125507 1088990 1453506 1052926 1480091 3049932
39025 3049932 4166726 3493832 1551596 -14522 -34135 1325577 2755961 2971614 2086724
39016 2086724 1573643 2498605 4225372 5271232 4907995 3457194 1690595 578232 893140
39007H93140J316981P17856p36930j046582J33000R74811M43036j58485L93600
38998B930427J151688P60938k93028q44138j061901j492047j311351L44606K153036
38989B338230J971240R1467j019845k49976Q72248P26388l25437j026822j022975
38980B354518q19444q02624q99277p92944l06004J82106N1613m01780J01806J873393
38970E41363L102616J988055o41079k368000k342638j673616j030527J14731J703275
38961f05820K475587J708637J14926j395290k483087k670161j426148N72414J699017
38952b009925J352607L87091n92017j713854k398837j475158N68361J506948O21581
38943c753203L1386J367113K958162K222653m85769k458254k255502q77643K29945
$$ plain form
39007 893140 2210121 2927977 2191047 1144465 1277465 2252276 2695312 2536827 2930427
38998 2930427 4082115 4843053 4550025 3705887 2643986 1151939 -159412 185194 2338230
38989 2338230 4309470 4400937 3381092 3131116 4003364 4729752 4404315 3377493 2354518
38980 2354518 1535074 732450 -166827 -959771 -1265775 -1083669 -1032056 -1433836 -1332030 541363
38970 541363 3643979 5632034 4990955 2622955 280317 -1393299 -2423826 -2309095 -605820
38961 -605820 1869767 3578404 3693330 2298040 -185047 -2855208 -4281356 -3708942 -2009925
38952 -2009925 -657318 -270227 -862244 -2576098 -4974935 -6450093 -5881732 -4374784 -3753203
38943 -3753203 -3721817 -2354704 603458 2826111 2340342 -117912 -2373414 -3251057 -3021112
38934c021112O53736O25926M74603M92004N96836L95691N3466L28081J116796
38925A716027J079946k97416j444853q58115N29084P36092l16164j016370o64494
38916e36263r544N30756J301987K007881J650211K63765p55571n68847L0229n1805
38906C862799p82681j401080j463650j053890m88428r8572N3924K47482N61962
38897e62134N89713K04062J12207Q00117J370247N41957j354504k508729j848744
38888b655808k05764Q85825P99109R4210k26453L14332J078856R31835k04890
38879H11252r96308m65244O26010R99201O78678N12928O28285O29563O69794R17250
38869E011409O09718p60270j919571j345833Q1471O0585j588722k558966j504416
$$ plain form
38934 -3021112 -2367376 -1741450 -1266847 -774843 -178007 217684 271150 599231 1716027
38925 1716027 2795973 2498557 1053704 195589 724673 1460765 1144601 128231 -536263
38916 -536263 -545807 -15051 1286936 3294817 4945028 5208793 4453222 3884375 3914604 3862799
38906 3862799 3080118 1679038 215388 -838502 -1326930 -1425502 -1371578 -1124096 -562134
38897 -562134 27579 231641 343848 1143965 2514212 3056169 1701665 -807064 -2655808
38888 -2655808 -2861572 -1975747 -1176638 -1082428 -1308881 -994549 84307 1016142 811252
38879 811252 -185056 -650300 -24290 974911 1653589 2166517 2794802 3424365 4094159 5011409
38869 5011409 5621127 4860857 2941286 1595453 1676924 1737509 148787 -2410179 -3914595
38860c914595K92660J271439J549526J658573J187495j19650j296259j344413
38852g15224n44576K15586N32118L99940J7983N28O88802J154087K84758j140762
38842H93240j309819m02648m24776j528257j277707J159862K894187J463771j214451
38833B53402j619809L44803J824105J360501P4002q28530j187026q44881K71081
38824c52352J140993O45345n73309r32933k65075L32350M80485N09998O0226j171275
38814a25547j770936j53439K405184K860274P06987j350164j423283n30320j0761
38805F07995M27107R47166M66429j129642j899107p27886P14034P65185N09649
38796F80930J453443K314339J008435j382794j832734j18898Q25243m41929j885135
$$ plain form
38860 -3914595 -3621935 -2350496 -800970 857603 2045098 1925448 629189 -715224
38852 -715224 -1259800 -1044214 -512096 -112156 -94173 -93645 595157 1749244 2034002 893240
38842 893240 -416579 -819227 -1244003 -2772260 -4049967 -2890105 4082 1467853 253402
38833 253402 -1366407 -1021604 802501 2163002 2237004 1408474 221448 -623433 -352352
38824 -352352 788641 1433986 860677 -72256 -337331 -4981 475504 985502 1045728 -125547
38814 -125547 -1896483 -2049922 355262 3215536 3922523 2572359 1149076 618756 607995
38805 607995 1035102 1982268 2448697 1319055 -580052 -1307938 -593904 171281 680930
38796 680930 2134373 4448712 5457147 4074353 2241619 2122721 2947964 2506035 620900
38787F20900j556507m35630j77009k18588P89465K080497J601959p06356k460720
38778d61989j869023J94497J561975J236338R74q05205o27840k8374R0166m10492
38768a118973p45363k98959N09368Q47049N55340M9645m60142q76944p10676K88644
38758a961011J162593O63240p42255j141358J31969J468326J373633N02295K21247
38749A678679M30546K71971k0824K91461P14945K14512p55595p91832O6474L99592
38739B499929j21984k92167L84825R86549J085250J298216J369993k0437k536065
38730D654109l536788j669956Q48583J287374L4132p09456l34985J83774M76273
38721A233060P41635M62745o89728j454233o09970P30736O81343k64538r2554
$$ plain form
38787 620900 -935607 -1371237 -1548246 -1766834 -977369 1103128 2705087 1998731 -461989
38778 -461989 -2331012 -2136515 -574540 661798 662772 -142433 -770273 -798647 -708481 -1118973
38768 -1118973 -1864336 -2163295 -1653927 -806878 -251538 -201893 -662035 -1538979 -2249655 -1961011
38758 -1961011 -798418 -135178 -877433 -2018791 -1886822 -418496 955137 1457432 1678679
38749 1678679 2109225 2381196 2360372 2651833 3366778 3581290 2825695 2033863 2100337 2499929
38739 2499929 2377945 2085778 2470603 3457152 4542402 5840618 7210611 7190174 4654109
38730 4654109 1117321 -552635 295948 1583322 1617454 907998 573013 756787 1233060
38721 1233060 1974695 2437440 1747712 293479 -316491 414245 1095588 831050 738496
38712G38496J189743J532310L04722q60809r84725j006697j576478j842573j158601
38703c664612n2812J048094K156291K464189R74042j167680j442239K14128R85240
38694A514641m00785j657628r13353J66409m92750j632904r31029Q62062J234798
38685b250539K13729J24300J513257K335141J350284k36126r57251q01404l06793
38676I84598K36688K92776n31942j269891m38496J520267K370840J211429k46460
38667D129809l54260J41902l25518j480730j639642k73734J195698J185156k76293
38658B302388j707916j747347m81903P37642Q70712L35986K19494O85766R49548
38649B164370O49440K18539k14337j128183k350735k630509j340773K38173M44457
$$ plain form
38712 738496 1928239 3460549 3765271 2904462 1919737 913040 -663438 -2506011 -3664612
38703 -3664612 -3717424 -2669330 -513039 1951150 2925192 1757512 315273 529401 1514641
38694 1514641 1113856 -543772 -1457125 -1290716 -1783466 -3416370 -4347399 -3485337 -2250539
38685 -2250539 -2036810 -1912510 -399253 1935888 3286172 3050046 2092795 1291391 984598
38676 984598 1221286 1514062 982120 -287771 -726267 794000 3164840 4376269 4129809
38667 4129809 3775549 3917451 3591933 2111203 471561 197827 1393525 2578681 2302388
38658 2302388 594472 -1152875 -1634778 -897136 -26424 309562 529056 1214822 2164370
38649 2164370 2813810 3032349 2818012 1689829 -660906 -3291415 -4632188 -4394015 -3949558
38640c949558m60316p13441L74185J510651J388172M78299J57700P35876J258248
38631G79816J010752L22744k24934o19670j068288j355866j052180j37202R07106
38622a437722J449181J020288k86348j474669j301235K24684J563006J489992
38614A247177O00782J55575J56078j95459o96251m23819L75909M42302l10851
38605A351443n62965N0724K40260n23503q24979K65883J343120Q19184n26377
38596A632790r40209m81539m85387j068459j144037m40819L15393Q68185J354368
38587c89714J177287j41653j245509j94478K392333L496701J576872j456359k853238
38578B362242k094999n41386O09441R41735L69647q00208j727180j682712p17797
$$ plain form
38640 -3949558 -4409874 -5123315 -4749130 -3238479 -1850307 -1372008 -1214308 -478432 779816
38631 779816 1790568 2113312 1888378 1268708 200420 -1155446 -2207626 -2344828 -1437722
38622 -1437722 11459 1031747 745399 -729270 -2030505 -1805821 -242815 1247177
38614 1247177 1847959 2003534 2159612 1964153 1267902 844083 1219992 1662294 1351443
38605 1351443 788478 839202 1079462 555959 -269020 -3137 1339983 2159167 1632790
38596 1632790 692581 211042 -274345 -1342804 -2486841 -2927660 -2612267 -1744082 -389714
38587 -389714 787573 645920 -599589 -794067 1598266 5094967 6671839 5215480 2362242
38578 2362242 267243 -274143 335298 1277033 1646680 846472 -880708 -2563420 -3281217
38569c281217N10768J306514J373947J106615J229656J671766J298254m15035
38561D801268k059694j899606l84288M09022l34843j365751j426730n58294P18994
38552b099922J914565K128252Q26475o86209m15322J280950J774755j8028j969858
38543B735658j953382p35548k09763m75384m41657j5322J70704K97625Q85713
38534B58644J404367R00078m33083j560825j974771j680107n64985J005538J741847
38525i03297R48387j67343j00793O64331M99969p29611j514741r91631J29851
38516b164878R15890J164038R74982N23876K77893M58182M23588m37652j485249
38507F50670j575699p12004K21481R77460J795649K048357P41524j523857k727373
$$ plain form
38569 -3281217 -2770449 -1463935 -89988 1016627 2246283 3918049 5216303 4801268
38561 4801268 2741574 841968 457680 866702 531859 -833892 -2260622 -2818916 -2099922
38552 -2099922 -185357 1942895 2769370 2083161 1667839 2948789 4723544 4705516 2735658
38543 2735658 782276 46728 -163035 -638419 -1080076 -1095398 -924694 -627069 258644
38534 258644 1663011 2563089 2130006 569181 -1405590 -3085697 -3650682 -2645144 -903297
38525 -903297 45090 -122253 -223046 441285 941254 211643 -1303098 -2294729 -2164878
38516 -2164878 -1248988 -84950 890032 1413908 1691801 2149983 2573571 2135919 650670
38507 650670 -925029 -1637033 -1415552 -438092 1357557 3405914 4147438 2623581 -103792
38498a03792j976024m89010L85089P51558J165877J366546R40149L22699J60790
38489B523882K34920j15260p86018q77182R3901J371868J619996M42205r94114
38480C514198j316781p92350q79447j767039j766886k7544J650072J327967M2025
38471a5785J94510J567741J585689m37409k027749j288075M84811J121859N38302
38462A723894m6841k06056q6509N71877J651891J988696R94996m4671J28596N17693
38452G193566o16527k681623l301648j855751m29581p23600j702407j301751O27483
38443d791839K257839K254960J271365P66210R59592O34935r30201k536258k369433
38434b482830m82365J148637J255527P52536R28546J361905Q28600n16654j323353
$$ plain form
38498 -103792 -2079816 -2568826 -2183737 -1432179 -266302 1100244 2040393 2363092 2523882
38489 2523882 2758802 2643542 1857524 980342 1074243 2446111 4066107 4508312 3514198
38480 3514198 2197417 1405067 525620 -1241419 -3008305 -3035849 -1385777 -57810 -15785
38471 -15785 178725 1746466 3332155 2894746 866997 -421078 63733 1185592 1723894
38462 1723894 1677053 1470997 1384488 1956365 3608256 5596952 6591948 6547277 6675873 7193566
38452 7193566 6577039 3895416 593768 -1261983 -1691564 -2415164 -4117571 -5419322 -4791839
38443 -4791839 -2534000 -279040 992325 1758535 2718127 3353062 2422861 -113397 -2482830
38434 -2482830 -2965195 -1816558 -561031 191505 1120051 2481956 3310556 2793902 1470549
38425A470549j108142p46656q61504r69806n73988r6688j86846p15767r59887
38416d748735m71066N05494J269267J254846O19371J80178M84952J100584J193608
38407A388499O07293j14869n61516p03679m68298J97714P98531N73710m24209
38398A293176j128036p11646L30245P40868j5666j098761j148652K10087J764548
38389B36163J880027M16920r14667n25347J071709J863444P60443j259078k450077
38380A079537k097273q38108K34727M41298j73913r93734j280504o37592P64504
38371c501058K145590K395965J034280q61509j427836k97428O77459q0206j417370
38362a332113r56896J324382K864018K113060N10412J3017L11283q8018j183994
$$ plain form
38425 1470549 362407 -384249 -1245753 -2215559 -2789547 -2886235 -3073081 -3788848 -4748735
38416 -4748735 -5219801 -4714307 -3445040 -2190194 -1570823 -1390645 -905693 194891 1388499
38407 1388499 1995792 1880923 1319407 615728 147430 345144 1143675 1717385 1293176
38398 1293176 165140 -546506 -216261 524607 508941 -589820 -1738472 -1528385 236163
38389 236163 2116190 2533110 1618443 1093096 2164805 4028249 4788692 3529614 1079537
38380 1079537 -1017736 -1855844 -1621117 -1179819 -1353732 -2347466 -3627970 -4265562 -3501058
38371 -3501058 -1355468 1040497 2074777 1213268 -214568 -511996 165463 85257 -1332113
38362 -1332113 -2289009 -964627 1899391 4012451 4522863 4535880 4847163 4759145 3575151
38353C575151j620606r72049k32284q3728j10150M8529j8759o02309j182051j167954
38343b366210p32100m51933n14951n82433j92485P56579J643164J460441Q0930
38334h98998j104547p29394N18073O48946o79614j479958m09404J071295Q49922
38325b213679o72359j327879m59400N05844O37341O28949R29303P10002l09667
38316a571545o97813N56102J981295J490929m00134j182485o6960Q69131j80410
38307G98110k116465k572097j135470M36180Q17182N78867Q47230J557823J744867
38298I56227J054930J48165l73610o72168r84869r19851j65729N27978J26403
38289c02524r75582j207456j45350O92180J86445m86431K96373J771545J707543
$$ plain form
38353 3575151 1954545 982496 750212 666484 556334 604863 586104 -16205 -1198256 -2366210
38343 -2366210 -3098310 -3550243 -4065194 -4647627 -4840112 -4083533 -2440369 -979928 -898998
38334 -898998 -2003545 -2732939 -2214866 -1565920 -2245534 -3725492 -4134896 -3063601 -2213679
38325 -2213679 -2886038 -4213917 -4673317 -4167473 -3530132 -2901183 -1971880 -1261878 -1571545
38316 -1571545 -2269358 -1713256 268039 1758968 1358834 176349 109389 978520 798110
38307 798110 -1318355 -3890452 -5025922 -4589742 -3772560 -3193693 -2346463 -788640 956227
38298 956227 2011157 2159322 1785712 1113544 128675 -791176 -956905 -428927 -302524
38289 -302524 -1278106 -2485562 -2630912 -1938732 -1752287 -2238718 -1942345 -170800 1536743
38280A536743j08084j349644n26843J020535J411747Q36404M87716K03444r42667
38271B569351k314977k045850P3621J765473J144429p73522j525420m42123Q40194
38262g08824R44028M83145O72988J230272Q21207p21065j926045j733215q71366
38253a808875m99697m67421k6762M45708q3029j323618j693637n99515O76326
38244e380520R28353O70534R95938J705264J605762K75920j295416j762651p57549
38235c014365O73410R30864m08069j814779j504033J85750J192662N97364l02242
38226c463438k30372K89883L30709L28222J116422K187356K318755J301067j16605
38217D061999j331377j887616j265788Q4810M61391q46052j961490q70952J367241
$$ plain form
38280 1536743 1428659 79015 -447828 572707 1984454 2820858 3308574 3512018 2569351
38271 2569351 254374 -1791476 -1717855 47618 1192047 418525 -1106895 -1549018 -708824
38262 -708824 235204 718349 1391337 2621609 3442816 2721751 795706 -937509 -1808875
38253 -1808875 -2308572 -2775993 -2802755 -2357047 -2440076 -3763694 -5457331 -6056846 -5380520
38244 -5380520 -4452167 -3781633 -2785695 -1080431 525331 801251 -494165 -2256816 -3014365
38235 -3014365 -2340955 -1410091 -1818160 -3632939 -5136972 -4951222 -3758560 -3161196 -3463438
38226 -3463438 -3693810 -3403927 -3073218 -2744996 -1628574 558782 2877537 4178604 4061999
38217 4061999 2730622 843006 -422782 -337972 123419 -722633 -2684123 -3555075 -2187834
38208b187834K022693P75356p5846N50581J105283M46304j92591M65326J399441
38199D308713Q90818q19515k000425j780848p94287k1567M6438m64510q22169
38190a457352l08176O76260P97068m00932j638703j500973j85639J018793J373198
38181a626456J124790Q35109Q95956J290916J397704N18439j064633k190946k286687
38172a105808j960258j780867j393559m22146O37146J141499J183900J090493
$$ plain form
38208 -2187834 -165141 610215 534369 1084950 2190233 2636537 2443946 2909272 4308713
38199 4308713 5199531 4380016 2379591 598743 -195544 -217111 -170673 -635183 -1457352
38190 -1457352 -1765528 -1089268 -292200 -693132 -2331835 -3832808 -4018447 -2999654 -1626456
38181 -1626456 -501666 333443 1229399 2520315 3918019 4436458 3371825 1180879 -1105808
38172 -1105808 -3066066 -4846933 -6240492 -6662638 -6025492 -4883993 -3700093 -2609600
$$ [...]
##END NTUPLES=NMR SPECTRUM
##END=
