##TITLE=31Pdec_DE-92m_TFA
CDCl3, 64 sc
 14.8.2025
##JCAMPDX= 6.0         $$ Bruker NMR JCAMP-DX V2.0
##DATA TYPE= NMR SPECTRUM
##DATA CLASS= NTUPLES
##ORIGIN= UXNMR, Bruker Analytische Messtechnik GmbH
##OWNER= root
$$ XWIN-NMR		Version 3.5
$$ Thu Aug 14 14:27:37 2025 Russian Standard Time (UT+4h)  she@DPX200
##.OBSERVE FREQUENCY= 81.013821
##.OBSERVE NUCLEUS= ^31P
##.ACQUISITION MODE= SIMULTANEOUS
##.ACQUISITION SCHEME= undefined
##.AVERAGES= 64
##.DIGITISER RES= 17
##SPECTROMETER/DATA SYSTEM= spect
##.PULSE SEQUENCE= zgpg30
##.SOLVENT NAME= DMSO
##.SHIFT REFERENCE= (INTERNAL, DMSO, 0, 198.062)
##AUDIT TRAIL= $$ (NUMBER, WHEN, WHO, WHERE, WHAT)
$$ ##TITLE= Audit trail, XWIN-NMR		Version 3.5
$$ ##JCAMPDX= 5.01
$$ ##ORIGIN= Bruker BioSpin GmbH
$$ ##OWNER= she
$$ F:/spectra/data/she/nmr/P31/2/pdata/1/auditp.txt
$$ ##AUDIT TRAIL=  $$ (NUMBER, WHEN, WHO, WHERE, WHAT)
(   1,<2025-08-14 14:26:17.93 +0400>,<she>,<DPX200>,
      <created by zg, POWCHK disabled, PULCHK disabled
       configuration hash MD5:
       00 E9 B6 7A A2 85 ED C7 34 08 36 98 17 FE 4E 26
       data hash MD5: 32K
       5D CF 34 B2 21 89 A2 C4 9E D5 29 EA D1 CD 59 F1>)
(   2,<2025-08-14 14:26:20.43 +0400>,<she>,<DPX200>,
      <Start of raw data processing
       efp BC_mod = 2 LB = 1.5 FT_mod = 6 PKNL = 1 PHC0 = 1771.65 PHC1 = 6.499474 SI = 64K 
       data hash MD5: 64K
       6A 8E B5 3B 6A 0D A3 ED E4 62 DC 7B 11 3C D9 B3>)
(   3,<2025-08-14 14:26:37.17 +0400>,<she>,<DPX200>,
      <pk PHC0 = -20.88387 PHC1 = 0 
       data hash MD5: 64K
       5C C8 4B BE E0 15 7C 32 4D 2C 69 2D 76 2B 9F 24>)
(   4,<2025-08-14 14:26:48.65 +0400>,<she>,<DPX200>,
      <pk PHC0 = 0 PHC1 = 0 
       data hash MD5: 64K
       5C C8 4B BE E0 15 7C 32 4D 2C 69 2D 76 2B 9F 24>)
(   5,<2025-08-14 14:27:05.78 +0400>,<she>,<DPX200>,
      <pk PHC0 = 1.200006 PHC1 = 0 
       data hash MD5: 64K
       FB 69 89 E0 92 59 71 7E 4B 88 BB A0 66 34 85 C2>)
(   6,<2025-08-14 14:27:10.28 +0400>,<she>,<DPX200>,
      <abs ABSG = 5 
       data hash MD5: 64K
       F4 30 7A 9C 13 73 46 9B DE 7B C0 FF F0 82 FA E4>)
$$ ##END=
$$ 
$$ hash MD5
$$ 16 2A 91 8D 99 E7 F9 9C 47 09 35 F3 98 BF 17 91
##$RELAX= 
##$RELAX= 
##$RELAX= 
##$RELAX= 
##$RELAX= 
##$RELAX= 
##$RELAX= 
##$RELAX= 
$$ Bruker specific parameters
$$ --------------------------
##$DU= <F:/spectra>
##$EXPNO= 2
##$NAME= <P31>
##$PROCNO= 1
##$TYPE= <nmr>
##$USER= <she>
##$AMP= (0..31)
100 100 100 100 100 100 100 100 100 100 100 100 100 100 100 100 100 100 
100 100 100 100 100 100 100 100 100 100 100 100 100 100 
##$AQSEQ= 0
##$AQ_mod= 1
##$AUNM= <au_zg>
##$AUTOPOS= <>
##$BF1= 81.014009
##$BF2= 200.13
##$BF3= 200.13
##$BF4= 200.13
##$BF5= 200.13
##$BF6= 200.13
##$BF7= 200.13
##$BF8= 200.13
##$BYTORDA= 1
##$CFDGTYP= 0
##$CFRGTYP= 5
##$CHEMSTR= <none>
##$CNST= (0..31)
1 1 145 1 1 1 1 1 1 1 1 1 1 1 1 1 1 1 1 1 1 1 1 1 1 1 1 1 1 1 1 1 
##$CPDPRG= <waltz16>
##$CPDPRG1= <>
##$CPDPRG2= <waltz16>
##$CPDPRG3= <>
##$CPDPRG4= <mlev>
##$CPDPRG5= <mlev>
##$CPDPRG6= <mlev>
$$ [...]
##$SUBNAM3= <"">
##$SUBNAM4= <"">
##$SUBNAM5= <"">
##$SUBNAM6= <"">
##$SUBNAM7= <"">
##$SUBNAM8= <"">
##$SUBNAM9= <"">
##$SW= 400.765351723535
##$SWIBOX= (0..15)
0 1 3 0 0 0 0 0 0 0 0 0 0 0 0 0 
##$SW_h= 32467.5324675325
##$TD= 32768
##$TD0= 1
##$TE= 0
##$TE2= 300
##$TE3= 300
##$TEG= 300
##$TL= (0..7)
0 120 53 12 22 120 120 120 
##$TP= (0..7)
150 150 150 150 150 150 150 150 
##$TP07= 0
##$TPNAME0= <>
##$TPNAME1= <>
##$TPNAME2= <>
##$TPNAME3= <>
##$TPNAME4= <>
##$TPNAME5= <>
##$TPNAME6= <>
##$TPNAME7= <>
##$TPOAL= (0..7)
0.5 0.5 0.5 0.5 0.5 0.5 0.5 0.5 
##$TPOFFS= (0..7)
0 0 0 0 0 0 0 0 
##$TUNHIN= 0
##$TUNHOUT= 0
##$TUNXOUT= 0
##$USERA1= <user>
##$USERA2= <user>
##$USERA3= <user>
##$USERA4= <user>
##$USERA5= <user>
##$V9= 5
##$VALIST= <valist>
##$VCLIST= <CCCCCCCCCCCCCCC>
##$VD= 0
##$VDLIST= <DDDDDDDDDDDDDDD>
##$VPLIST= <PPPPPPPPPPPPPPP>
##$VTLIST= <TTTTTTTTTTTTTTT>
##$WBST= 1024
##$WBSW= 4
##$XGAIN= (0..3)
0 0 0 0 
##$XL= 0
##$YL= 0
##$YMAX_a= 29152
##$YMIN_a= -9054
##$ZGOPTNS= <>
##$ZL1= 120
##$ZL2= 120
##$ZL3= 120
##$ZL4= 120
##$ABSF1= 198.0616
##$ABSF2= -202.7028
##$ABSG= 5
##$ABSL= 3
##$ALPHA= 0
##$AQORDER= 0
##$ASSFAC= 0
##$ASSFACI= 0
##$ASSFACX= 0
##$ASSWID= 0
##$AUNMP= <proc_1d>
##$AZFE= 0.1
##$AZFW= 0.5
##$BCFW= 0
##$BC_mod= 2
##$BYTORDP= 0
##$COROFFS= 0
##$CY= -3
##$DATMOD= 1
##$DC= 0
##$DFILT= <>
##$DTYPP= 0
##$F1P= 0
##$F2P= 0
##$FCOR= 1
##$FTSIZE= 65536
##$FT_mod= 6
##$GAMMA= 0
##$GB= 0
##$INTBC= 1
##$INTSCL= 9.790993e-09
##$ISEN= 30
##$LB= 1.5
##$LEV0= 0
##$LPBIN= 0
##$MAXI= 10000
##$MC2= 0
##$MEAN= 0
##$ME_mod= 0
##$MI= 50
##$NCOEF= 0
##$NC_proc= -8
##$NLEV= 6
##$NOISF1= 182.463
##$NOISF2= 159.3651
##$NSP= 0
##$NTH_PI= 0
##$NZP= 0
##$OFFSET= 198.0616
##$PC= 4
##$PHC0= 1751.966
##$PHC1= 6.499474
##$PH_mod= 1
##$PKNL= yes
##$PPARMOD= 0
##$PSCAL= 0
##$PSIGN= 0
##$REVERSE= no
##$SF= 81.0140089999434
##$SI= 65536
##$SIGF1= 159.3651
##$SIGF2= -187.1042
##$SINO= 113.3802
##$SIOLD= 16384
##$SREGLST= <1H.CDCl3>
##$SSB= 0
##$STSI= 65536
##$STSR= 0
##$SW_p= 32467.5324675325
##$SYMM= 0
##$S_DEV= 0
##$TDeff= 32768
##$TDoff= 0
##$TI= <>
##$TILT= no
##$TM1= 0
##$TM2= 0
##$TOPLEV= 0
##$USERP1= <user>
##$USERP2= <user>
##$USERP3= <user>
##$USERP4= <user>
##$USERP5= <user>
##$WDW= 1
##$XDIM= 65536
##$YMAX_p= 287261947
##$YMIN_p= -34545738
$$ End of Bruker specific parameters
$$ ---------------------------------
##NTUPLES= NMR SPECTRUM
##VAR_NAME=  FREQUENCY,     SPECTRUM/REAL,   SPECTRUM/IMAG
##SYMBOL=    X,             R,               I
##VAR_TYPE=  INDEPENDENT,   DEPENDENT,       DEPENDENT
##VAR_FORM=  AFFN,          ASDF,            ASDF
##VAR_DIM=   65536,         65536,           65536
##UNITS=     HZ,            ARBITRARY UNITS, ARBITRARY UNITS
##FACTOR=    0.49542278885378, 1,            1
##FIRST=     16045.7642231865, 0,            0
##LAST=      -16421.768244346, 0,            0
##MIN=       -16421.768244346, -34545738,    0
##MAX=       16045.7642231865, 287261947,    0
$$ Real data points
##PAGE= N=1
##DATA TABLE= (X++(R..R)), XYDATA
$$ [...]
9631 -4280183 1005187 3648072 2990681 1366637 541617 -247502 -1978625 -3583522 -3448661
9622 -3448661 -1848446 -274065 909832 2554273 4715668 5990458 5188250 2829293
9614 2829293 610809 -153979 662983 2355492 4139084 5607838 6771843 7935768 9479423
9605 9479423 11334949 12525343 11741410 8783658 4946945 1527284 -1281378 -3188683
9597 -3188683 -2609148 1450775 6676903 8962900 7272616 4972979 5291886 7331720 8029725
9588 8029725 6305821 3297664 -49690 -3095187 -4086788 -1580269 2614277 4561079
9580 4561079 2974361 653796 329364 1327074 1744401 1891028 3397535 5972352 7261818
9571 7261818 5846469 2873097 594968 204592 987978 900862 -1627030 -5646137 -7947493
9562 -7947493 -6382058 -2494060 265288 526182 -181589 -376402 -600413 -1801583 -3105898
9553 -3105898 -2444194 903427 5132685 7333461 5937275 1963919 -1959941 -3796471
9545 -3796471 -3279642 -1249779 1253258 2902656 2349648 -111798 -1811788 -212114 3982642
9536 3982642 7637652 9042748 9365788 10073501 10714906 10125400 8436173 6781959 5877664
9527 5877664 5726486 5948928 5711450 4208164 1929130 544112 802876 1563294 1724912
9518 1724912 1918762 3019581 4023177 3084263 238371 -2426048 -3240612 -2461211 -1401135
9509 -1401135 -1076405 -1693967 -2724483 -3528150 -4240180 -5449656 -6651221 -6236121 -3976954
9500 -3976954 -2206984 -3022234 -5395737 -6810797 -6749570 -6512928 -6505623 -6204300 -6207354 -7422902
9490 -7422902 -8360031 -6392904 -2189178 330443 -522118 -1910140 -1206443 111534 -367926
9481 -367926 -1602870 -865199 1891294 4389722 5499476 5553963 4299703 1461155 -1414363
9472 -1414363 -2638748 -3360826 -5790350 -8848124 -9126816 -6437320 -4626669 -5723913 -6862058
9463 -6862058 -4999587 -1552320 354134 736088 1624391 2734106 1802836 -1266328 -3793104
9454 -3793104 -4014491 -2707108 -799299 1901076 4657826 5037726 1984302 -1984104 -3619500
9445 -3619500 -3120301 -3622431 -6805672 -10638414 -11811353 -9382418 -5536309 -3178961 -3055988
9436 -3055988 -3208408 -1459858 1593247 2828235 274158 -4332120 -7610394 -8450243 -8524383
9427 -8524383 -9266059 -10008931 -9481626 -7779257 -6177442 -5875570 -7312426 -9718494 -10982429
9418 -10982429 -9230552 -5209416 -1860922 -744492 -265451 1503015 3879366 5171758
9410 5171758 5735199 6971282 8071165 6564871 2193426 -2348080 -5056501 -6615718
9402 -6615718 -7899606 -7823608 -5170471 -840999 3254049 6255052 7983337 7875001 5892906
9393 5892906 3483187 1968971 625318 -2216785 -6617377 -10729498 -12566342 -11238090
9385 -11238090 -7333581 -3077135 -1002960 -1172038 -770838 2128069 5649615 6676654
9377 6676654 4979852 2537692 -24231 -3335657 -6263633 -6448353 -4201344 -2619429
9369 -2619429 -2917125 -2779856 -793599 608513 -996510 -3680781 -3715176 -1025189 1007393
9360 1007393 599002 -579331 -766366 -569873 -1072199 -1636552 -1229113 -690150 -1814390
9351 -1814390 -4325779 -5332744 -2562790 2558720 6065691 5726775 3268657 1862939
9343 1862939 2348769 3155149 3376780 3983965 5539718 6601633 5739482 3882408 2959092
9334 2959092 2864313 1584107 -1743684 -5533872 -7774839 -7894663 -6212494 -3123453 181699
9325 181699 1564124 157668 -1873543 -1554705 916439 2084660 -361484 -4678537 -7579324
9316 -7579324 -8270228 -8356239 -8649220 -8256827 -6786232 -5219627 -3879561 -1500192 2357429
9307 2357429 5504968 5504687 3047946 1324992 2352102 5111737 6886389 5340450 -8008
9298 -8008 -6902363 -11369907 -11129892 -7791142 -4573114 -2656283 -1398832 -1112534 -2917756
9289 -2917756 -5916360 -7270748 -5820126 -3396358 -1798301 -644786 811601 1877832
9281 1877832 1713718 662947 -865394 -3060003 -5114757 -5010054 -2425139 71679 549164
9272 549164 560840 2315803 4695715 4694957 1709946 -2164553 -5219509 -6885064 -6173700
9263 -6173700 -2421040 2441145 5195733 5340378 5264516 5975743 5397201 2079729 -1867971
9254 -1867971 -3417897 -2528186 -1434704 -1098779 -484966 833613 1319830 -434406 -3229214
9245 -3229214 -4060664 -1570321 2099568 3705531 2871100 2444200 4550283 7639361 8510924
9236 8510924 6222645 2578358 -491332 -2336707 -2832097 -2193018 -1752132 -3134503 -5975057
9227 -5975057 -7755960 -6704563 -3998594 -2457131 -3635989 -6601366 -8993473 -8948893 -6380967
9218 -6380967 -2635074 1065634 4300248 6356560 5718523 2007919 -2322177 -4006992
9210 -4006992 -2576222 -477405 203863 -501274 -1845237 -3504508 -4850713 -4842592 -3346887
9201 -3346887 -1178645 1555782 5403122 9232215 10030520 6483507 1291257 -1670931
9193 -1670931 -1481414 -36040 1146548 2083919 2694856 1930954 -906927 -4934916 -8203521
9184 -8203521 -9069537 -7141110 -3458283 168497 2383502 2971733 2314985 559555 -2231718
9175 -2231718 -5267126 -6969526 -6162281 -3324558 -318108 1474131 2458887 3647007 4501412
9166 4501412 3409216 642388 -996515 165269 1957105 1409417 -581954 -341380 3058454
9157 3058454 6179593 5823971 2847296 142264 -1267108 -2418305 -3756822 -4011343 -1806354
9148 -1806354 2282125 5555860 5412822 2008917 -1913077 -4259390 -5414152 -6003713 -4909350
9139 -4909350 -1694543 931874 412905 -1214324 -195528 2428504 2096250 -1326842 -2542690
9130 -2542690 455436 2252730 -1973532 -8959086 -12203339 -10721508 -8207954 -6239322
9122 -6239322 -3575229 -698103 194267 -502617 107599 2750115 5012362 5372322 5049846
9113 5049846 5494293 6734873 8411464 10001967 10113471 7983345 5464401 5093380 6571662
9104 6571662 7628584 7675699 7692868 7188088 4768994 1576135 545512 1938490 3043649
9095 3043649 2830823 3448238 6228714 9448213 11109232 11005182 9142513 5277864 1137703
9086 1137703 -169492 1482211 2437579 504873 -1876613 -1632375 488204 1700068 1193849
9077 1193849 63210 -992669 -1758651 -1741759 -1157740 -1434863 -3336205 -5925104 -8386953
9068 -8386953 -11012211 -13290493 -13358314 -10980320 -8882306 -9195962 -10515155 -10387107 -8768321
9059 -8768321 -6944861 -4982138 -2666099 -1336643 -2165791 -3713938 -3587675 -1738130 -111620
9050 -111620 181334 -410702 -1130642 -1352935 -721170 -54044 -757015 -2220486 -1765661 1330065
9040 1330065 4040269 3792479 2087504 1511846 1592637 669474 -347890 252384 1124854
9031 1124854 -353028 -3544263 -5562475 -5916335 -6295293 -6449993 -4494412 -1206751 182239
9022 182239 -949033 -1563919 151082 2224964 2189027 -17300 -3166685 -5926807 -6453454
9013 -6453454 -3944376 -1206823 -2351840 -7054092 -10438521 -9662193 -7025647 -5193416
9005 -5193416 -3235952 240626 3481548 4183473 3314914 3368062 4458993 4732385 3348342
8996 3348342 959363 -1545126 -3054472 -2470555 -552701 124630 -1317135 -2501905 -1596182
8987 -1596182 -530410 -1995077 -5089579 -6842801 -6763356 -6881738 -7967574 -8537718 -7491663
8978 -7491663 -5457137 -3515963 -2306049 -2109490 -2338831 -1548792 502086 1664395 58266
8969 58266 -2910335 -4101858 -2464469 539916 3336143 4865474 3793176 -221254 -4891216
8960 -4891216 -7470441 -8141449 -8626517 -8055324 -3807039 3162179 7633444 6417880 2369948
8951 2369948 89181 130269 44552 -742937 -409010 1375978 2139031 136859 -2857832
8942 -2857832 -3869865 -2763008 -2053588 -2722486 -2420796 623052 3585370 1991812 -3405356
8933 -3405356 -6275776 -2904756 2432547 3226074 -625608 -3918318 -4397380 -4995631 -7606888
8924 -7606888 -9524594 -8063879 -5000580 -3741710 -4608065 -5455239 -5015163 -3231874 7718
8915 7718 3983800 6289133 5273373 2385239 23221 -1680498 -3524970 -4086792 -1332812
8906 -1332812 2919767 3786314 -431409 -5626229 -7057440 -4963879 -3177565 -3727786 -5008852
8897 -5008852 -4667287 -2291651 918926 3674814 5211694 5307559 4456398 3745610 3973658
8888 3973658 4799107 5039104 3923698 1871508 -70250 -1243991 -1534229 -868741 701458
8879 701458 2438458 3297561 3244644 3438604 4484668 5150119 3760246 656875 -1664746
8870 -1664746 -1063258 2195456 6082665 8953739 10609217 11504908 11650382 10775430 9242675
8861 9242675 7862552 6519343 4016785 221567 -2508949 -1591574 2389918 6206265
8853 6206265 7836744 7917249 7191502 5024936 1614781 -677464 -201438 1458804 1972496
8844 1972496 1826649 2974008 5107310 6138795 5767860 5563612 5621713 4256767 1503721
8835 1503721 -77198 854220 2437361 2594363 1712418 1147701 1343102 2715410 5899699
8826 5899699 9407606 9684127 5933366 2577642 3898615 7992466 9398558 6481372
8818 6481372 2540404 270636 -834553 -1291396 93022 3271732 5527431 5008119 3395390
8809 3395390 3156928 4058722 4292700 3386283 1970280 56315 -2228935 -3164047 -1102476
8800 -1102476 2573772 4242111 2140384 -1719339 -4099961 -3985455 -3137831 -3889967 -6668903
8791 -6668903 -9484971 -9983570 -8038042 -5678109 -4264142 -2835052 -7163 3545718
8783 3545718 5678522 5165906 2458080 -1218807 -4346675 -5469296 -4529433 -3375206 -3548871
8774 -3548871 -4092597 -3051307 -537068 1632181 2999716 4918873 7738799 9748933
8766 9748933 9580545 7768785 5251794 2253087 -456458 -1183908 441461 2435105 2962399
8757 2962399 2319032 1144800 -1348366 -5303249 -8101409 -7119143 -3710766 -1551456 -1350664
8748 -1350664 -307628 2744532 4825150 3087326 -661465 -1970851 806515 5109915
8740 5109915 7797370 8364183 8295565 8578737 8699801 7693420 5513678 3150492 1557000
8731 1557000 800263 426299 294199 578811 1131695 1396081 975467 -56644 -1244774
8722 -1244774 -1804806 -1065508 458208 975254 -513723 -2464980 -2534437 -875633 135706
8713 135706 -262342 184772 3234910 7211838 9327331 9389244 9006818 8245675 5841565
8704 5841565 2485589 1009750 2558947 4896036 5546423 4550863 2820897 -84656 -4453108
8695 -4453108 -8257686 -9052933 -7258251 -5071919 -2643364 1699181 7134211 9531029
8687 9531029 6606463 1471620 -1152919 -556471 477338 445645 481927 1371585 2130171
8678 2130171 2039022 1753852 1689974 1376922 1174083 2454817 4923545 5868271 3788515
8669 3788515 1045069 902373 3229995 5220822 5322620 4184747 2448717 125105 -1953451
8660 -1953451 -2394181 -1287435 -204568 -36376 -498466 -1524707 -2979173 -3126954 -145215
8651 -145215 4325517 5975876 3284577 -466005 -2027838 -2298248 -3600388 -5502299 -6134093
8642 -6134093 -5620272 -5000890 -3252216 990643 5487969 6000605 2079957 -2158070 -3708848
8633 -3708848 -3859488 -4525268 -4622445 -2292496 1502569 4108765 4678310 4394537 3949898
8624 3949898 2705750 140405 -3171992 -5871987 -6451999 -4389145 -1496187 -1018342 -3978292
8615 -3978292 -7274315 -7044397 -3369956 61198 594836 -1017254 -2906011 -4603774 -6368333
8606 -6368333 -7602384 -7382225 -5894837 -4221491 -2983576 -2023401 -1201787 -727067 -702659
8597 -702659 -972330 -1495768 -2325410 -2999618 -2469923 -126272 3294221 6295450 8034998
8588 8034998 8600260 7936015 5510992 1673001 -1578181 -2405451 -1337484 -351519 -4403
8579 -4403 799788 1973002 1326158 -2233703 -6258957 -7354855 -5213104 -2186238 342006
8570 342006 2826643 4973750 4864964 1637405 -2702431 -5262146 -4896625 -2079253 2400320
8561 2400320 7231227 10072961 9018648 4663629 -153116 -2653507 -1814164 1468962
8553 1468962 4858493 5701467 3125761 -666917 -2171340 -136188 3231719 4987336
8545 4987336 4733362 4488987 5612927 6911715 6335364 3878446 1688433 1203474 1331252
8536 1331252 220343 -2031148 -3596866 -3367606 -1894378 -161176 1157359 1354522 352414
8527 352414 -116400 1969752 5509813 6547070 3267314 -1312196 -3438486 -3363636 -3449024
8518 -3449024 -3329949 -592917 4337912 7864064 8274787 7593591 7268863 5606717 1627939
8509 1627939 -1652087 -938092 2358817 4193722 3764422 3883420 5915000 7873815 8150935
8500 8150935 7961157 8612179 8766872 6450220 2370405 -738888 -1486860 -1008629 -1078996
8491 -1078996 -2256438 -3783610 -4400943 -3371357 -1498598 -958180 -3183011 -6836564 -8765825
8482 -8765825 -7323275 -4103431 -1955017 -1823790 -2204578 -1341824 1013594 4207136 7972620
8473 7972620 12141333 15489202 16143740 13531639 9123683 4794304 1137086 -2092814
8465 -2092814 -4699529 -6184474 -6731441 -7029220 -7192759 -6666724 -5179723 -3162306 -1338243
8456 -1338243 -420703 -751416 -1421166 -337456 3528688 8272304 10911399 10979902 10559124
8447 10559124 10685392 9923063 7286161 4352105 2894341 2179269 626804 -1104884 -969541
8438 -969541 1198492 3471532 4587282 4818798 4251000 2519231 590709 437869 1995683
8429 1995683 2526094 384491 -2316873 -2536299 -489895 1021839 777399 463840 1767531
8420 1767531 3990864 5222482 4610412 2673896 214089 -2187259 -3960457 -4612572 -4075607
8411 -4075607 -2746740 -1254749 -240449 452 -39175 706516 2732200 5106306 6255669
8402 6255669 5726871 4714673 4552687 5111756 5259230 4657702 4272430 4891532 5904525
8393 5904525 6098082 5186140 3947256 3157758 2975304 3129082 3143228 2627852 1950911 2281683
8383 2281683 4197209 6601485 8042510 8812953 10374897 12657267 13535052 11624860 8212630
8374 8212630 5492266 4059794 3218627 2700849 2718900 3004621 3163066 3520607 4338072
8365 4338072 4603514 3036828 187298 -1718679 -1004305 2324957 7166014 11594518 13018471
8356 13018471 10125240 4989146 1393364 505132 -31529 -2117766 -4440464 -4926612 -3927712
8347 -3927712 -3037788 -2320279 -1113783 -575744 -2561970 -5999741 -7115160 -4169868 84989
8338 84989 1861479 645904 -1272772 -2235357 -2362329 -1879168 -239011 2659981 5620481
8329 5620481 7260562 7473262 7286426 7637246 8752001 10443897 12335086 13682616 13654236
8320 13654236 12305316 10895905 10496761 10378387 8667443 4887373 1048594 -334978
8312 -334978 1266794 4390197 7324598 9079284 9253333 8071920 6380600 4748275 2831668
8303 2831668 440408 -1323780 -1281308 -178671 74082 -914697 -1816180 -2174094 -3113287
8294 -3113287 -4748965 -5076124 -2962833 -514498 -463608 -2311990 -3127508 -1501764 1330780
8285 1330780 3933015 6065514 7496866 7358977 5333387 2239138 -879751 -3143166
8277 -3143166 -3438615 -1345692 1259458 1368282 -1616550 -5086066 -6822757 -7690109 -9403586
8268 -9403586 -11160315 -10462266 -6609234 -1567310 2390112 4344422 4143401 1801318 -1969745
8259 -1969745 -5664184 -8072365 -9109905 -9442020 -9691546 -9975061 -9761617 -8276867 -5464040
8250 -5464040 -2334009 43246 1469415 2024666 1291843 -737380 -2535508 -2378890 -873291
8241 -873291 -652878 -3078825 -6426659 -7904849 -6379504 -2509570 2560736 7546295 10977580
8232 10977580 12207888 12219916 12431166 12918385 12733334 11704292 10767419 10371932 9579745
8223 9579745 7246175 3517037 -307701 -3127340 -4975779 -6704611 -8765287 -10281573
8215 -10281573 -9711171 -6787667 -3316321 -1286499 -535941 662035 2770419 4040694
8207 4040694 2824345 -273187 -3218604 -4644085 -4470571 -3419677 -2738481 -3380305 -4388344
8198 -4388344 -3257292 546099 3631824 2624141 -719103 -1518201 924598 1633866 -2527404
8189 -2527404 -7531681 -7746938 -4192842 -2688748 -4830020 -5925499 -2712521 1726332
8181 1726332 3212618 2706300 3556393 5063544 3332552 -2090784 -6699115 -6999584 -4713696
8172 -4713696 -3486783 -3993285 -4468641 -4431102 -5262896 -7406947 -9166516 -8925442 -7285573
8163 -7285573 -6163540 -6387621 -6968787 -6543996 -4856246 -2723299 -1148340 -802553 -1847911
8154 -1847911 -3607378 -4720074 -4446381 -3649853 -3460757 -3050027 -281913 4847349 9088997
8145 9088997 9627141 7657027 6527542 7142460 7322986 5509055 2837866 1035317 194438
8136 194438 -346969 -395890 560989 2060571 3008571 2915069 2124646 1250637 836416 1037528
8126 1037528 1215159 396772 -1484447 -3345533 -4189509 -3967714 -3105034 -2037313 -1415098
8117 -1415098 -1753719 -2555879 -2804340 -2578883 -2880463 -3460530 -2490388 683157 4031483
8108 4031483 5365927 4972766 4300759 3461673 1961015 742189 1066186 1825218 472117
8099 472117 -3120441 -5886040 -5391118 -2895744 -1788941 -3941689 -8079654 -10971669 -10073228
8090 -10073228 -5863855 -1608305 20804 -222476 228856 1942144 3156797 3056886 2986968
8081 2986968 3732470 3801680 1764468 -1331157 -3376273 -3809701 -3304572 -1848121 1126165
8072 1126165 5031563 7981143 8458038 6471457 3326830 778135 -161141 -223093 -1109657
8063 -1109657 -3123187 -4448611 -3641185 -1813618 -1044983 -1399026 -1129949 519852 2379801
8054 2379801 3216152 3055026 2461763 1880456 1975075 3174993 4258364 2783429 -1899097
8045 -1899097 -6878083 -8214449 -5110352 -731144 1042053 -951913 -4741024 -7332702
8037 -7332702 -7051316 -4572600 -2196561 -1694008 -2363876 -1576328 2116139 6741157 8785880
8028 8785880 7289610 4747643 3507100 2905274 1269143 -847478 -1767556 -2122166 -4107491
8019 -4107491 -7157907 -7703091 -4594237 -1692643 -2702109 -5923014 -7193080 -6151819
8011 -6151819 -5839006 -7034787 -7191704 -5267655 -3607674 -3742232 -3844648 -2337545 -1015631
8002 -1015631 -2024549 -4076443 -4568724 -3768284 -3772802 -4399131 -3472887 -1028402 -18520
7993 -18520 -2146376 -5508235 -7371078 -7316616 -6600799 -6080811 -5930312 -6127155 -6201109 -5563488
7983 -5563488 -4819909 -5444133 -7310258 -8130860 -6689759 -5123837 -6064854 -8581042 -9295188
7974 -9295188 -7138725 -4548819 -3646378 -3564929 -2591858 -1048170 -449881 -966904 -1420839
7965 -1420839 -1349056 -1582092 -2727281 -4137269 -4641252 -3782597 -2333592 -1892183 -3537181
7956 -3537181 -6302219 -7547962 -5839519 -3097430 -2632142 -5024502 -7274455 -6437911 -2891542
7947 -2891542 712234 2618035 2963615 2324098 749839 -1536824 -3443981 -3621712 -1707742
7938 -1707742 1092335 2731096 2065716 170896 -539562 1037980 3358459 4163380 3372423
7929 3372423 3147114 5082116 8177426 9949163 9101549 6764649 5185307 5264764 5528328
7920 5528328 4001432 1104924 -401714 928849 2875036 2424400 149924 -570797 1453944
7911 1453944 3762271 4519816 5292784 7478291 8513251 5054305 -1201029 -4646800 -2976096
7902 -2976096 113837 428142 -1648757 -3359110 -3987696 -4253964 -3286538 234491 4554054
7893 4554054 5941861 3713611 1126846 370888 -363118 -3048951 -5680157 -4797761 -772771
7884 -772771 2518447 3030410 2671216 3438009 3941156 1494023 -3576037 -7475579 -6746638
7875 -6746638 -1677263 4067659 6800088 5906238 3898391 3486665 4917137 6489317 6988692
7866 6988692 6497300 5188691 2951510 473877 -920871 -1226069 -2071563 -4148002 -5710033
7857 -5710033 -4879823 -2201872 498075 2597721 4337848 5130825 4350359 3099587 2906773
7848 2906773 3104090 1982636 323854 833847 3612066 5283531 3897919 1787844 1633745
7839 1633745 2318518 1356092 -610443 -1029509 -49378 -414210 -2827463 -4642743 -3927389
7830 -3927389 -2143040 -1511201 -1793848 -1290148 322262 1710314 1702136 134275 -2613459
7821 -2613459 -5801339 -8158286 -8325235 -5753657 -1258825 3052165 4749630 2966712
7813 2966712 -471729 -2638678 -2474914 -1391237 -862580 -697596 -231836 60740 -763938
7804 -763938 -2586820 -4330351 -5091568 -4491641 -2623735 -491387 225899 -1137393 -3289041
7795 -3289041 -4575711 -4811589 -4528761 -3386607 -951191 1597948 2570368 2455778 3367265
7786 3367265 5442920 6099486 3977329 1510077 1613191 3221012 2578610 -1418469 -5571584
7777 -5571584 -6536305 -4669589 -2683493 -1926832 -1545369 -659160 286609 552325 322851
7768 322851 310738 730932 1175413 1181554 592042 -291751 -594029 572485 2774390 3868880
7758 3868880 1903370 -2523937 -6597068 -8124839 -7274654 -5382810 -3239673 -1191965
7750 -1191965 269650 1286757 3173608 6552137 9231460 7756492 1554827 -5802346
7742 -5802346 -10133645 -10411908 -8450477 -6082534 -3809757 -1547739 592979 2312368
7734 2312368 3294650 3514280 3691487 4842380 6727433 7411526 5424712 2023249 140165
7725 140165 1109210 3526009 5474912 6624389 7474780 7594403 5879471 2442386 -762612
7716 -762612 -1640242 89389 2980728 5674158 8056840 10395630 11840871 10664490 6286845
7707 6286845 550174 -3586278 -4662033 -3936366 -4080254 -6520882 -9759105 -10522228 -7169582
7698 -7169582 -1748897 2160041 3324431 3182470 2543011 447051 -2731626 -3845147 -1112327
7689 -1112327 2322340 2247144 -444860 -1309695 387520 622568 -2110684 -3271809 935328
7680 935328 6855791 7643232 2291437 -3766669 -6215650 -5900828 -5219017 -4469091 -3253690
7671 -3253690 -2603069 -3653721 -5727583 -7239983 -7537037 -6885875 -5664681 -4388653 -3582283
7662 -3582283 -2904181 -1299847 1377010 3803816 4725250 4064975 2187869 -563460 -2997958
7653 -2997958 -3364647 -1722738 -753841 -2770785 -6786962 -9865532 -10466510 -8951645 -5730288
7644 -5730288 -1168657 2688440 2628099 -2278557 -8804275 -12267237 -10834790 -6664686 -3183457
7635 -3183457 -1854586 -1620788 -1023944 -226147 -439903 -1632098 -1942927 -131926 2166836
7626 2166836 1918216 -1568602 -5469142 -6529827 -4688922 -2972945 -3966703 -6947217 -8751377
7617 -8751377 -7233506 -3422715 -162920 821164 -33657 -1480958 -2713852 -3220657 -2667998
7608 -2667998 -1582677 -1222130 -1954418 -2457928 -1346733 1019260 3170701 4291286 4260635
7599 4260635 2526853 -1491432 -6665446 -10100753 -9669201 -6308496 -3346913 -3395757 -5794289
7590 -5794289 -7248926 -5429723 -1791692 18693 -1461748 -4061889 -5243426 -5021126
7582 -5021126 -4465740 -3079838 275633 4899692 8883752 11587903 13366420 13466865 10792334
7573 10792334 6675640 4243744 4543330 5597584 5766264 5597700 5643267 5033779 3463657
7564 3463657 2264972 2088496 1692834 547669 348473 2009241 3343053 2177695 3560
7555 3560 -166439 1818379 3818547 5242852 7179440 9182994 9100561 6389082 3024253
7546 3024253 695635 -675579 -1316509 -765944 782035 2245698 3255331 4214129 4564306
7537 4564306 3092866 365925 -1335916 -1133655 -465719 -273082 314782 1483803 1443093
7528 1443093 -780178 -3376656 -4319753 -3986318 -3450443 -2210475 78269 1395644 -242290
7519 -242290 -3204689 -3950009 -1866800 240720 316327 -954707 -2511141 -4586081 -7059230
7510 -7059230 -8244966 -6691854 -3026468 919581 3888574 5474900 5583848 4299216
7502 4299216 1704390 -2370579 -7616338 -12219238 -13794003 -11835529 -8331761 -5553756
7494 -5553756 -4117297 -3508204 -3427665 -3994280 -5311453 -7190319 -8713895 -8309939 -5579085
7485 -5579085 -3018462 -3985587 -8186372 -11080889 -9185601 -4418694 -1323286 -1097507 -712336
7476 -712336 2271910 6281724 7845601 5722589 2021962 -129497 566718 2701105 3703753
7467 3703753 2280393 -711294 -3632831 -5520175 -5821559 -3846886 203766 4220769
7459 4220769 5760605 4724707 3263186 2983551 3576975 4347238 5443884 6783556 7150426
7450 7150426 5642459 3223344 1648546 1370478 1632002 2197006 3602780 5608080 6682411
7441 6682411 5726755 3636777 2411939 2867511 3775959 3421824 1683760 162749 196885
7432 196885 1287392 2063410 2450063 3811009 6701140 9573989 10484507 9287381 7271381
7423 7271381 5397587 4098725 4084291 5489932 6322369 3908590 -1279132 -5096825 -4464389
7414 -4464389 -1254619 330582 -746428 -1782985 -960935 82289 -789729 -2798144 -3469948
7405 -3469948 -2062125 8712 1550007 2645511 3416283 3379226 2480532 1557403 1219349
7396 1219349 1179738 1112055 1131147 849476 -820910 -3789820 -5687458 -4271889 -582570
7387 -582570 1985898 1796794 375661 -760847 -2601531 -6398043 -10440673 -11471626 -8989030
7378 -8989030 -5833972 -4076031 -2482654 771974 4703164 6685074 6027839 4439673
7370 4439673 3403940 3122118 3997725 6833263 10636382 12186851 9489406 4641899 1584249
7361 1584249 1470640 1880506 538649 -1822087 -2924367 -2116823 -990656 -1068903 -1792974
7352 -1792974 -1371166 552203 1968545 1062923 -847376 -586147 2274271 3964573 1203060
7343 1203060 -4002306 -6405474 -3874410 524775 2833766 2377699 1066445 598438 1493807
7334 1493807 3357472 4845192 4476152 2509429 925339 629367 26317 -2396968 -5476178
7325 -5476178 -7089948 -7419450 -8427715 -10553930 -11969597 -11245714 -9148385 -7474459 -7243398
7316 -7243398 -8117212 -8547157 -6590368 -1795669 3683833 6983329 7590737 7536028 8647443
7307 8647443 10749477 12507776 12862331 11557457 9267371 7151097 5460692 3154175
7299 3154175 38273 -1686754 -11503 3438825 5039344 3962289 2510815 1649208
7291 1649208 -269419 -3285422 -4074500 -811148 3106719 3222024 -67932 -2832451 -3357294
7282 -3357294 -3272540 -3715395 -3724125 -2646177 -1471563 -1226093 -1910598 -3209819 -4574044
7273 -4574044 -4803022 -3470017 -2445918 -3673301 -5519313 -4115947 1064271 5685908
7265 5685908 5865929 2758710 304524 368890 2015431 4051059 5914424 6646154 5258966
7256 5258966 2510504 830279 1771363 4190697 5492519 4427775 2221589 815616
7248 815616 462465 -68191 -826289 291496 4576750 9649424 11588809 9645762 6758396
7239 6758396 5274856 4442788 2805593 743154 -789038 -2151102 -3859469 -4955741
7231 -4955741 -4479229 -3554668 -3929866 -4946436 -4035623 -309982 4008689 6095455 5263751
7222 5263751 2961177 1088663 616285 972873 442814 -2178155 -5975744 -8368255 -7428288
7213 -7428288 -3690352 178339 1368957 -877251 -4464004 -6061125 -4091699 -105309
7205 -105309 2914397 3186938 1017761 -1989572 -3917422 -3490230 -1013991 1925395 4239480
7196 4239480 6227396 8137328 8864143 7347505 4672073 3291947 4152051 5629648 5377942
7187 5377942 2528400 -1601326 -4166493 -2736274 2154147 6664117 7127679 3747941
7179 3747941 -268624 -2763247 -4164055 -5257549 -5625219 -4943819 -4013358 -3444667 -2660938
7170 -2660938 -1206838 152580 733149 1259174 2619436 4085217 4133764 2658453 1153362
7161 1153362 830178 1481481 2098709 1826203 433701 -1409342 -2415886 -1914829 -766381
7152 -766381 -524633 -1842083 -4189235 -6744686 -8688691 -8850531 -6309738 -1849538 1969097
7143 1969097 2887330 904507 -2091059 -4219760 -4736782 -3709429 -1424909 1597568 4429841
7134 4429841 6064425 6095332 5105685 4439178 5455781 8520076 12276666 14144481 12286740
7125 12286740 7476778 2623225 80799 -224217 310681 1203125 2972721 5265570 6358673
7116 6358673 5208464 3043174 1987196 2655673 4079932 5618649 7667553 10291599
7108 10291599 12300189 12361084 10436045 7623083 5202944 4343606 5816107 8832042 10717769
7099 10717769 9300325 5683009 3179400 3173506 3652457 2574253 891938 698025 1800131
7090 1800131 2270943 1623810 1143129 1315954 1269801 919790 1332397 2411246 2522886 1323880
7080 1323880 747218 1971808 3513894 3758832 3293122 3014374 2128072 315663 -161232
7071 -161232 2482003 5827760 5893731 2715665 8409 -305430 248267 509187 1361913
7062 1361913 2631611 1764199 -2590862 -8180955 -12005733 -13481586 -13369395 -11861015 -9558401
7053 -9558401 -8335530 -9090295 -10036646 -9081741 -6676914 -4729027 -4042185 -4392008 -5552766
7044 -5552766 -6440204 -4929567 -809536 2577659 2336528 562108 1910584 7164862 12229336
7035 12229336 13495596 11276099 7555386 3329839 -693600 -3239563 -3889904 -3750205
7027 -3750205 -3514626 -2432766 -311469 1198392 870764 3413 416780 1466093 1147444
7018 1147444 -460810 -1203623 -383934 -45577 -1896712 -4763487 -6411634 -6569327 -6514086
7009 -6514086 -6553159 -5903169 -4793700 -4472960 -4644263 -3119076 691427 3923597 4005809
7000 4005809 2866019 4639073 9599085 13265051 12029799 7106541 1958241 -1697846
6992 -1697846 -3762824 -3851386 -1872802 595298 1654346 1333336 922645 616066 -639847
6983 -639847 -3302150 -6550707 -9123666 -9823901 -7871171 -3964618 -328918 1569771 2692657
6974 2692657 4596365 6845553 7768995 6892860 4904424 2177659 -536453 -894142 2706602
6965 2706602 7716622 9260219 5923159 1230435 -1275750 -1806783 -2099767 -2125840 -1115770
6956 -1115770 -90760 -958830 -3678903 -6044237 -6046026 -3430900 480163 3413484 3236084
6947 3236084 -127352 -3941030 -4981590 -2851456 -228845 366454 -711292 -1323268 -832901
6938 -832901 -1050267 -3296812 -5713502 -5350624 -2704737 -1674969 -4031387 -6509111 -5567830
6929 -5567830 -2803053 -2309961 -3994391 -3587736 662180 5366799 7157237 6839730 6545469
6920 6545469 5897362 3653222 943264 -43715 548515 651899 -509267 -1550115 -932187
6911 -932187 1517779 4610763 6322002 5150151 1966618 -459492 -770544 -673056 -2169790
6902 -2169790 -4485365 -5192139 -3280916 242830 3636680 4992559 3074159 -669003
6894 -669003 -2402732 -297100 2696508 2735961 482025 -173022 2068147 4467817 4547896
6885 4547896 2872012 1076785 -304326 -1297327 -1909188 -2880760 -5199717 -8196997 -9841857
6876 -9841857 -9494626 -8564477 -7806662 -6000130 -2506600 553840 321496 -3400625 -7913920
6867 -7913920 -10261514 -9420437 -6580807 -3997891 -3170974 -3770152 -4598884 -5218290 -5685510
6858 -5685510 -5272313 -3308420 -1310683 -1948062 -4959772 -6305258 -3167331 1756879 3230484
6849 3230484 71709 -3505970 -3334152 -138898 1939938 403869 -3336007 -6286371
6841 -6286371 -7045273 -6179633 -4552547 -2651184 -1393881 -1957474 -3965096 -5068301 -3665068
6832 -3665068 -1314031 -973818 -3199728 -5578243 -5841909 -4091939 -1840900 -269827 268829
6823 268829 257834 854885 2665486 4546265 4773186 3386212 1981639 1218906 341307
6814 341307 -594353 -193314 1686028 2877956 1867939 168559 160238 1911768 3806693
6805 3806693 5087498 5805736 5179498 2399676 -984625 -1678541 1568280 6063857 7916882
6796 7916882 6097714 3176313 2203834 3269096 3529680 881534 -3015512 -4451165 -2152940
6787 -2152940 1554800 4335131 6502723 8922303 10222354 8278843 3486625 -1517093
6779 -1517093 -4780828 -5777605 -3940804 997980 7054587 10700991 10354230 7660731 4871866
6770 4871866 2590906 692345 -363715 -395532 -480388 -1738096 -3668457 -4588399 -3403434
6761 -3403434 -563557 2234910 3212300 2240683 1445728 2811255 5070788 4811238 1331005
6752 1331005 -1756623 -1285924 1126635 1916970 1257981 2657025 7134297 11140769 11244769
6743 11244769 8211505 4963086 2760690 1347986 987182 1751120 1833053 -577882 -3831761
6734 -3831761 -3965417 -84928 3701523 3194608 -647160 -3193218 -2079265 228062 -113425
6725 -113425 -3766291 -7805368 -9144489 -7539083 -5149008 -3750126 -3155163 -2536493 -2291979
6716 -2291979 -3423638 -5453552 -6497772 -5705382 -4242515 -3354397 -2905413 -2598707 -2994357
6707 -2994357 -3991327 -3825812 -1428419 1382460 2145076 1222697 597801 -13196 -2683034
6698 -2683034 -6819602 -8597633 -6069736 -1967227 310894 937988 1711149 2205073 885921
6689 885921 -1367835 -2187813 -1710777 -2478106 -5088904 -6944810 -6285568 -4813975 -4675161
6680 -4675161 -4968106 -3511602 -751163 699581 98964 -364974 849908 2227164 1870492
6671 1870492 1054597 2774092 6983938 9610952 7327809 1811061 -2214575 -2400724 -736990
6662 -736990 -367421 -1963758 -3624902 -3324885 -869490 2094227 3649689 3329411 2170950
6653 2170950 1017175 -432690 -2280451 -3253496 -2278379 -449443 333421 157663 480056
6644 480056 1080079 150226 -2448376 -4774123 -6184722 -8058807 -10012669 -8866890 -3747925
6635 -3747925 839475 397744 -3204284 -4406959 -1580627 1913817 3503809 3998861 4109594
6626 4109594 2508828 -1080967 -3986427 -3754335 -1206742 1207719 2328786 2165452 626645
6617 626645 -1973032 -4384876 -5823102 -6825216 -7585755 -6800620 -3730468 -316152 647406
6608 647406 -942396 -2322369 -1146760 2232825 5717213 7653459 7927482 7563806 7486953
6599 7486953 7549069 6964151 5668480 4530040 3929253 3057068 1334313 -270184 -389021
6590 -389021 676320 1106266 -243389 -2628000 -4450734 -4749609 -3435090 -783063 2649901
6581 2649901 5820609 7627184 7914658 7726758 8055134 8496290 7854954 6167747 5241060
6572 5241060 6653376 9890968 13024906 14589702 14301089 12876915 11899922 12630671 13723497
6563 13723497 11487435 4408795 -3611353 -7110361 -5784854 -4629883 -7268532 -12096897
6555 -12096897 -15783318 -17450231 -17623043 -15703470 -11142772 -5723363 -2294043 -1863700
6547 -1863700 -3427205 -5567504 -6675556 -5041847 -994084 2053153 1232014 -1514693
6539 -1514693 -1364329 3074991 7847837 8744972 6144701 3452116 2271818 1053779 -1687349
6530 -1687349 -4404035 -3847897 701064 5561736 6145700 2131631 -2306655 -3728014 -2996059
6521 -2996059 -2590396 -2544092 -1452287 -66834 -621568 -2754037 -3354766 -1328981 379872
6512 379872 -821816 -3050631 -2522380 1028689 3943201 3366813 367425 -1990037 -2165569
6503 -2165569 -1043772 -256983 -515161 -1402803 -2158410 -2281462 -1457508 599995 3654335
6494 3654335 6384495 7113778 5562700 3415238 2595231 3241295 3929631 3704210 3153366
6485 3153366 3284189 3940915 3888686 2316672 -157605 -1946082 -1616634 1286067 5838222
6476 5838222 9878817 11259933 9688650 7049149 5312289 4516009 3572481 2518147 2523852
6467 2523852 3629495 4064146 2550152 84341 -1500662 -1840423 -1950014 -2590232 -3729340
6458 -3729340 -5058621 -6090903 -6249942 -5759268 -5887913 -7331472 -8910586 -9025719 -7939378
6449 -7939378 -7260944 -7333125 -6539635 -3502683 1037022 4850826 6040444 4155076 308276
6440 308276 -3531080 -5895850 -6766808 -7099756 -7644106 -8378225 -8575220 -7137427 -3655203
6431 -3655203 371417 2381384 1680814 543646 1366170 3797353 5965502 7297468 8260011
6422 8260011 8347244 6720337 4420342 3546963 4270084 4867746 4693491 4713008 4962957 4145742
6412 4145742 2360095 1592481 2482346 3089952 2160948 1220898 1814532 2859367 2648825
6403 2648825 1589530 871442 43624 -1813700 -3673902 -3503880 -847419 3213437 7574481
6394 7574481 10785592 10573193 6173599 463883 -2574241 -2163267 -534851 914810 2886576
6385 2886576 5833138 8717503 10327592 10023167 7314586 2618401 -1815014 -3864002
6377 -3864002 -4244383 -5045381 -5956746 -4818646 -1897733 -202983 -799355 -1323063 -561196
6368 -561196 -823378 -3309944 -4534548 -1037965 4606631 6662299 4042099 1198696 1415030
6359 1415030 3164485 3882988 3782704 4287610 5389772 6474225 7769837 9083319 8740289
6350 8740289 5873282 2625890 1934867 3683034 4970783 3925302 1459078 -676285
6342 -676285 -1806236 -2031014 -1635542 -1427870 -2401041 -4342228 -5748807 -5717936 -4936542
6333 -4936542 -4213283 -3241458 -1817161 -1124324 -2242049 -3971037 -3843561 -1257446 1879375
6324 1879375 3785419 4628179 5281174 5677946 5267764 4077056 2374582 102706 -2335825
6315 -2335825 -3410800 -1869657 1358236 3758711 3866163 2564195 1726707 2308241 3933141
6306 3933141 5679836 6856617 7273914 6991883 5789512 3129777 -952136 -5065053 -7154794
6297 -7154794 -6253942 -3355088 -401378 1537901 3024779 5087502 7305280 7651997 5015402
6288 5015402 1435356 317746 2111196 3498727 1956998 -606449 -732963 1294466
6280 1294466 1769991 -946318 -4004746 -4006183 -1196371 1590931 2565509 2054905 1028456
6271 1028456 28828 -917797 -2260512 -4268678 -5918767 -5508933 -3132890 -1218184 -1435112
6262 -1435112 -2397809 -2044278 -1146911 -2360253 -6329400 -10801169 -13392201 -13315707 -10558915
6253 -10558915 -5632272 -558923 2029274 1781890 1159065 2286347 4583816 6138721
6245 6138721 5987551 4312066 1893550 290747 1008720 3270600 3989431 1327996 -2910140
6236 -2910140 -5790518 -6793850 -7116013 -6699199 -4330760 -200960 3925355 7077436 9623652
6227 9623652 11355879 11039239 8351224 4607752 1088966 -1828322 -3526509 -2949912 -321755
6218 -321755 2525860 4406011 5893441 7348034 7561315 5771761 3518044 2627542 2352240
6209 2352240 529835 -2864560 -5339717 -5160734 -3300432 -1720495 -1145024 -1240361 -1882483
6200 -1882483 -3163387 -4487868 -4551802 -2518712 954671 4091453 5561075 5591603 5245100
6191 5245100 4774361 3415485 913745 -1698475 -3396540 -4386904 -5224887 -5442695 -4191124
6182 -4191124 -1928241 -330105 -416474 -1522539 -2247814 -1949290 -1351874 -2027186 -4942289
6173 -4942289 -9059031 -11794776 -11467231 -8927048 -6338010 -5039302 -5238353 -6783914 -8950614
6164 -8950614 -10125986 -9192165 -6925636 -4794432 -2914755 -725123 976442 891270 -9059
6155 -9059 838618 3432702 4221803 799846 -4314948 -6510640 -4466448 -820266 1655221
6146 1655221 2470798 2319971 1607224 544402 -639882 -2091495 -3942263 -5217569 -4328548
6137 -4328548 -1395326 987939 625869 -1123030 -723345 2645789 5236761 3125224 -2634655
6128 -2634655 -7261773 -8328026 -8146786 -9443545 -11165226 -10398556 -6574592 -1433016 3832740
6119 3832740 8624126 10962130 8776879 3539354 -254815 -165840 1861997 3026450 3111399
6110 3111399 3179861 3087292 2109585 586682 -595288 -963872 221092 4005641 9586669
6101 9586669 13597537 13423502 10330877 7712100 7065252 7216327 6668461 5045012 2686472
6092 2686472 289457 -1239407 -1500810 -868588 305366 1742171 2186518 141847 -3358619
6083 -3358619 -4766715 -2485893 496132 459671 -2214078 -4362708 -4645259 -4066240 -3070538
6074 -3070538 -1258997 451393 431944 -768847 -735600 1364886 3899630 5424844 5913493
6065 5913493 5194576 2681948 -670714 -2258946 -574123 3298145 7200866 9538043
6057 9538043 9550627 7787520 6292270 6512498 7145952 5967536 3405025 1829806 1433872
6048 1433872 -276283 -4343887 -8459583 -10148113 -9590903 -8395203 -7603694 -7608867 -7997740
6039 -7997740 -7023537 -3510900 361094 878041 -2038181 -4439187 -3965375 -2618320 -2661401
6030 -2661401 -3174956 -2621767 -1631948 -866651 953833 4229848 6405364 5671595 4324248
6021 4324248 5215440 7008416 6507097 3999438 2482706 2671656 2610154 1781815 1935464
6012 1935464 3617758 4996847 4669873 3246468 1792384 711682 243097 195965 -621427
6003 -621427 -2834209 -4763477 -4281730 -1937245 -48291 819148 2029866 3900281 5242331
5994 5242331 5925713 7196541 8967115 9237566 7029479 3963755 2120595 1753675 1574768
5985 1574768 127098 -3124334 -6910628 -8803440 -7986953 -6398699 -5504333 -3585173 1096145
5976 1096145 6041816 7214837 5157344 4147321 5342117 5353712 2412575 -701003 -1528075
5967 -1528075 -1454369 -2230708 -2972843 -3164318 -4788052 -8349156 -10314667 -8196048 -5126654
5958 -5126654 -5253975 -7135351 -6374081 -3041234 -1412659 -2964405 -4522475 -3723231 -1966229
5949 -1966229 -986002 -266721 778546 1249072 916143 1252488 2701534 3232141 1321066
5940 1321066 -1515990 -2856447 -2502880 -1926048 -1921201 -2373465 -3248291 -4273609 -4482875
5931 -4482875 -3497974 -2533773 -2705282 -2958136 -1289382 2163005 4809466 4709653 2797530
5922 2797530 1388040 1231331 917370 -914377 -3533173 -4767877 -3438468 -450972 2670855
5913 2670855 5464542 7994328 9416439 8561972 5972407 3862167 3413250 3267003 1605144
5904 1605144 -1203153 -3209412 -3573045 -3306974 -3416572 -3538586 -2802657 -1149054 734599
5895 734599 2178624 2692523 1823458 -471918 -3406908 -5797607 -6962199 -6967994 -6156708
5886 -6156708 -4847655 -3479104 -2538433 -2083980 -1573464 -418476 1337687 2972296 3687409
5877 3687409 3386663 3030496 3982861 6532115 9172766 10006794 8899663 7435529 6505683
5868 6505683 5020028 1815609 -2047393 -4156264 -3565902 -1570693 188042 1165637 1386475
5859 1386475 746214 -622755 -2128568 -3345618 -4241838 -4518376 -3494940 -1053985 1957223
5850 1957223 4610791 6549843 7554066 7345921 6249505 5153906 4290134 2962939 1144809
5841 1144809 254781 1221227 2579534 1981536 -618620 -2656235 -2026990 611754 2991065
5832 2991065 3819382 3601933 3330474 3061374 1954240 -510218 -3628035 -5968076 -6715918
5823 -6715918 -6337727 -6004488 -6650574 -8415579 -10398796 -10928425 -8834826 -4852977 -1238725
5814 -1238725 423234 671444 1176186 2739298 4590536 5323500 4304618 2423779 1425349
5805 1425349 2121759 3562684 4615029 5744693 7858786 9827512 9278803 6166419 3283992
5796 3283992 2356399 1940973 594729 -357497 522836 1550231 395900 -1694719 -1729098
5787 -1729098 -277328 -1020571 -4709340 -7484392 -6562271 -4154137 -3616180 -4555156 -4591352
5778 -4591352 -4070678 -5741857 -10251754 -14708982 -16113029 -14418349 -11702441 -9511004
5770 -9511004 -7608717 -4890295 -1362722 808344 -959285 -6262018 -10922709 -10736213
5762 -10736213 -5642903 646482 4547117 5018930 2810174 -817821 -4165117 -5242369
5754 -5242369 -2940212 1966788 7160562 10167391 9895064 7314063 4372486 1917418
5746 1917418 -763004 -3990483 -6429816 -6876503 -6255147 -6065895 -5510621 -2522124 2246932
5737 2246932 5052109 3765684 797075 -322129 506130 923531 323205 382150 1766918
5728 1766918 3035792 3314222 3673855 4822409 5518760 4842502 4341592 5822840 7997969
5719 7997969 7681067 4192030 474411 -532391 1137469 3644068 5650375 6434307 5333287
5710 5333287 2750686 823747 1394442 3681266 5391195 5769248 5923725 6308208 5880910
5701 5880910 4271667 2872303 2647298 2390509 608618 -2097102 -4280049 -6280130 -9347403
5692 -9347403 -12559014 -13297315 -11337511 -9813398 -10645837 -11287793 -8331876 -2804718 975274
5683 975274 1137095 -136204 -727478 -1093298 -1746228 -1446390 51917 77932 -3278910
5674 -3278910 -7343410 -7915446 -5095901 -2601485 -1738605 -14390 3608551 6126533 5201042
5665 5201042 3168476 3487757 5541524 6237160 5238029 5012768 6225526 6628158 4980516
5656 4980516 2979029 2172478 1486138 -589547 -3160076 -4073388 -2905870 -1306101 -924686
5647 -924686 -2128315 -4309738 -6481034 -7809139 -8274852 -8607302 -9183188 -9423477 -8642746
5638 -8642746 -6927144 -4764786 -2475605 -523498 320223 -166928 -1166296 -1786931 -1944661
5629 -1944661 -1703191 -584317 1496569 3312438 3565272 2601813 1621220 582242 -1435515
5620 -1435515 -3768972 -4045694 -1441696 1474337 1626557 -656396 -2113165 -602282 2732292
5611 2732292 5349657 5948627 4726988 2219746 -1066945 -4316419 -6619890 -7600453 -7472275
5602 -7472275 -6646120 -5566214 -4595936 -3619501 -2095099 -75467 1141196 172288 -2684337
5593 -2684337 -5570550 -6974078 -6802136 -5561621 -3450554 -666212 2191415 4621896
5585 4621896 6625454 8166729 8801465 8360791 7525873 7164712 7426288 7877208 8132685
5576 8132685 8056800 7901728 8529306 10654777 13342569 14183716 11787582 7321060 2845440
5567 2845440 -734185 -2939526 -2429258 1279431 5417628 5972325 2575893 -817103 -1037396
5558 -1037396 456621 191008 -2401644 -4457460 -3369888 576882 4992901 7445267
5550 7445267 6718581 3263305 -1025388 -4036907 -5045731 -5112486 -5702146 -6839482 -6852345
5541 -6852345 -4390628 -719623 871940 -1299877 -4951489 -6272573 -4351772 -1715009
5533 -1715009 -566469 -385572 113104 535747 -140395 -1225423 -839738 1485173 4092966
5524 4092966 5087644 3945179 1331398 -1627021 -3647307 -3670425 -1476589 2126683 5688922
5515 5688922 7679821 7231890 4886206 2334810 898082 414429 -34862 -718291 -1111266
5506 -1111266 -785698 190431 1435730 2184065 1385815 -1244270 -4415398 -6360177 -6708951
5497 -6708951 -6420680 -5967076 -4850241 -3270126 -2842283 -4507390 -6636202 -6765366 -4975837
5488 -4975837 -3910105 -5038285 -6483726 -5717547 -3325341 -2380127 -4331379 -7276153 -8771869
5479 -8771869 -8834942 -9087169 -9943812 -10044479 -8220378 -4936314 -1696167 327029 1051318
5470 1051318 1314977 1837202 2122339 916799 -1790629 -3921791 -3313913 -167533 3260561
5461 3260561 4972342 4512279 2568226 302532 -1334338 -2488063 -4071503 -5861779
5453 -5861779 -6069858 -4021627 -1842964 -1488498 -1387291 1213709 5398324 7417711 6284480
5444 6284480 4891155 4840506 3940478 546020 -3082207 -4304185 -4179684 -5044330 -6220960
5435 -6220960 -5525996 -3610048 -3222741 -4636972 -5086243 -3029165 -316334 518061 -849138
5426 -849138 -2903469 -3989321 -3175937 -743194 1727199 2608441 1781763 474531 -8495
5417 -8495 1170131 4102094 7304673 8194423 5800107 2111572 -614490 -2573804 -4624748
5408 -4624748 -5409564 -3191293 323596 1375128 -646438 -2594142 -2503636 -1787111 -1573523
5399 -1573523 -325821 2978870 6171156 6845979 5848962 5298194 5003208 3756860 2723093
5390 2723093 3975698 6087109 4952416 -97792 -4348662 -3823399 -775334 -258496 -2842897
5381 -2842897 -4342826 -2648515 -947349 -2441676 -5049432 -4577948 -1402127 -45629
5373 -45629 -2319004 -4822242 -4421286 -2687763 -2655466 -3899126 -3769782 -1777772 323714
5364 323714 1847278 3590631 5336491 5659891 4273397 2266571 -1412 -2999490 -5976385
5355 -5976385 -7215123 -6749471 -6591482 -7604604 -8171773 -6756457 -3999054 -1464333 97225
5346 97225 541040 10416 -385534 897802 3790403 6415153 7560464 7816866 7582028
5337 7582028 5824982 2223618 -927585 -765060 2676996 6321455 7182349 4919892 1597081
5328 1597081 -460916 -649070 -162733 -117826 -122513 614008 1357586 332535 -2895444 -6543263
5318 -6543263 -8124665 -6243293 -1567470 3031873 4409862 2736896 1960614 4652169
5310 4652169 7744412 6320654 677494 -3997332 -4676813 -3214653 -1665874 674700
5302 674700 4002905 5849221 4682119 2585215 1921535 2030586 1529044 1113093 1463425
5293 1463425 986111 -1412219 -3573550 -3222653 -1905164 -2571390 -4820056 -5821383 -4793739
5284 -4793739 -3453943 -2962315 -3282087 -4584135 -6469673 -6895479 -4878202 -3185430 -5009951
5275 -5009951 -8782201 -9840537 -6837454 -2876021 -383182 1357892 3049263 3415346
5267 3415346 1653815 -1017680 -3504155 -6115797 -8679660 -9697503 -8480164 -6059578
5259 -6059578 -3104624 848947 5077019 6914142 4875177 788909 -2590044 -4548278
5251 -4548278 -5705243 -6001832 -5143317 -3967377 -3632861 -3918881 -3632311 -2426133 -1196844
5242 -1196844 -745657 -700750 115064 2304197 4803504 5589712 4041553 2089817 2029516
5233 2029516 3545086 4089117 2022312 -1827697 -5538006 -7688371 -7761404 -6506344 -6007303
5224 -6007303 -7819952 -10653991 -11280951 -8249696 -3575767 -297305 630097 513892 754682
5215 754682 989972 -627457 -4884477 -9226318 -9589075 -5573999 -1972739 -3073685 -7054133
5206 -7054133 -8874374 -7466410 -6299763 -7196472 -7863324 -6436057 -4412368 -3264386 -1725157
5197 -1725157 1079209 2857423 1620012 -300994 884877 4779028 7279321 6260359
5189 6260359 3837931 2793920 3246017 3662398 3450789 3421992 4326857 5617916 5735153
5180 5735153 3805893 1000826 -622426 -938080 -2306058 -6482492 -11911299 -15153162
5172 -15153162 -14343762 -10258147 -4728979 623074 4498430 6332465 6940484 7722080 8706189
5163 8706189 8057734 4288007 -1137526 -4255317 -2519020 1899183 3932289 1330734
5155 1330734 -2598008 -3015383 822921 5545095 8182599 8362478 6517077 2856768 -1283335
5146 -1283335 -3683890 -4005588 -4295026 -5664398 -6530187 -5461527 -3718327 -3208819 -3640593
5137 -3640593 -3642537 -3325230 -3657999 -4293929 -3995348 -2519955 -375267 2469276 5762337
5128 5762337 7644233 6325193 2816995 -37664 -1181297 -1969847 -3063235 -2950476 -588600
5119 -588600 2146167 2147763 -1376374 -6055702 -8707998 -7825316 -4110596 452305 3829858
5110 3829858 4995022 4504352 3979893 4495705 5408190 5265580 3825308 2245174 1038299
5101 1038299 -751050 -3290705 -4267724 -1401936 3993806 8095951 9058180 8265786 7036768
5092 7036768 4648294 654031 -3071714 -4322213 -3281560 -1737836 -494257 1029853
5084 1029853 3159092 5129029 5805165 4688295 2394921 285573 -732649 -868659 -494077
5075 -494077 641592 2126348 1937553 -1107867 -4689329 -5514434 -4289835 -4902426 -8142631
5066 -8142631 -9881779 -7144628 -2679600 -872318 -1568559 -1064673 2084049 5192876 5114977
5057 5114977 1728859 -2330056 -4281790 -3520422 -1672577 -182115 1320921 2863151
5049 2863151 1762115 -4202518 -11544518 -13276990 -7536768 -19209 3805792 4644402
5041 4644402 5255662 5079177 2802206 339679 -430445 -1926076 -6922266 -12658350 -14007944
5032 -14007944 -10894188 -7423446 -4923732 -1353755 2881974 4290071 2223431 474713
5024 474713 1573687 3573535 3875150 2681983 1355091 507257 872981 3168188 6152856
5015 6152856 7509735 7089168 6373302 4746710 197033 -5744129 -8250942 -6035243 -3738478
5006 -3738478 -5133075 -7695457 -6950106 -3092181 205701 1360199 1664932 1877663 1475710
4997 1475710 859426 1352559 2791155 3282335 1824809 -296192 -1164750 -349095 952557
4988 952557 1334844 545687 -419975 -585177 -183141 -252068 -1299041 -2929408 -4502988
4979 -4502988 -5412408 -5027163 -3331773 -1530792 -1158313 -2570582 -4819952 -6650268 -7063627
4970 -7063627 -5545235 -2568149 508530 2505599 2851067 1124093 -2226583 -4626246
4962 -4626246 -3306182 635516 2796703 1423776 -237478 588196 1928957 1227082 285831
4953 285831 1915240 4378656 3949700 1195847 -8907 1563751 4003458 6346074 8447986
4944 8447986 8082854 3362303 -2638661 -4777507 -2936299 -1339491 -1492534 -1158293 130263
4935 130263 369127 -7271 1721291 5068251 6542262 5675831 5203081 5048741 2327946
4926 2327946 -2225796 -4432160 -4063308 -5204517 -8134850 -8188615 -4429389 -1876735 -2722468
4917 -2722468 -3005403 -966936 -802920 -4184162 -5696047 -1560384 3879572 5308659 3805224
4908 3805224 2328364 131892 -3329071 -4941379 -3458548 -2830869 -5354061 -7325544
4900 -7325544 -5907179 -3918251 -3337885 -1078637 3858927 6411651 3858589 521197
4892 521197 -1085761 -5043147 -12232743 -15662647 -12547701 -10514753 -13747382 -14429268 -7460533
4883 -7460533 -1267978 -2654321 -4153174 339357 2211255 -3355561 -2318405 13646039
4875 13646039 26451786 26028002 47894904 131131127 241573547 287261947 226633094
4868 226633094 120135280 51391080 34064204 27695377 12968551 6438185 14961661
4861 14961661 20432210 12703414 4549524 6328543 10355899 8422221 5212190 6196368
4853 6196368 7777468 6814778 7106776 10129203 10533733 6328460 3390432 4963940 6187239
4844 6187239 3721749 1731462 3383418 4747823 2264682 -1092236 -2029762 -2614485 -4972557
4835 -4972557 -6466099 -4925114 -3172199 -3682866 -3799692 -971637 1772661 503854 -3015285
4826 -3015285 -4079863 -1765398 1078991 2392558 2013913 28444 -3027496 -5595549
4818 -5595549 -6724598 -6864514 -5915377 -2813798 1502156 3301271 289332 -5242198 -9267185
4809 -9267185 -10453165 -10299181 -10344495 -10692820 -10466686 -8923245 -6571201 -4853918 -3908854
4800 -3908854 -1901491 1693085 3774582 1315660 -3964750 -7831149 -9220167 -10021289
4792 -10021289 -10316174 -8336023 -4789298 -2541551 -1756771 12466 2415212 1910510 -2045788
4783 -2045788 -5228481 -4860931 -3244577 -3130500 -3601547 -3000527 -2243142 -2474847 -2467342 -934946
4773 -934946 1121477 2554679 4010708 5750070 6178173 4665540 3363791 4065371 5472339
4764 5472339 5612651 4898772 4811375 5320364 5345322 4354226 2453371 408723 -130426 1376134
4754 1376134 2200149 -721331 -5517588 -6785765 -2875204 2248799 5164923 6310786
4746 6310786 5882810 1979147 -4422632 -7880231 -5657802 -2050276 -1602444 -2337076 -301601
4737 -301601 3175668 4200239 3215615 3557931 5290534 5934088 5652912 6350294 6956482
4728 6956482 5082429 2445631 3013939 5981467 6204162 2191665 -1616880 -1770715 -182201
4719 -182201 212149 -55035 768865 2060967 1940190 7891 -2721423 -5010464 -5465478
4710 -5465478 -3151902 873918 4099916 5218139 4910433 3962845 2394160 503705 -1167248
4701 -1167248 -2955744 -5119714 -5914601 -3197945 1756231 4735390 3719849 1247715
4693 1247715 769911 2764261 5379701 6812210 5853113 2007633 -3349793 -7111260 -7064931
4684 -7064931 -3917366 -346816 1139519 -476313 -4053125 -6734765 -6545922 -4766438
4676 -4766438 -4268467 -5545214 -6343965 -5444861 -4478636 -5095689 -6375289 -6350638 -4630886
4667 -4630886 -2310329 -442755 395812 71779 -744511 -1149674 -1526998 -3338372 -6731043
4658 -6731043 -9515189 -9349667 -6117424 -1652154 1927831 3225747 2049662 -486876
4650 -486876 -3021192 -5105047 -6422076 -5479572 -1100447 4797966 8287384 7968919 6328528
4641 6328528 5827768 5948744 5213745 3666550 1639378 -1604033 -5642104 -7244347 -3943532
4632 -3943532 1689792 4281446 1970892 -2030489 -4232184 -4667191 -5279993 -6857206 -8954246
4623 -8954246 -11309151 -13616059 -14581424 -12839562 -8932904 -5258209 -3560578 -3157130 -2232859
4614 -2232859 -367187 1172385 1469901 1005412 254181 -1348744 -3915546 -5727438 -5008390
4605 -5008390 -2415207 -20108 1582536 2980189 3164386 21328 -5683924 -9658285
4597 -9658285 -9013362 -5638651 -2905618 -1154359 1201440 3839283 4809747 3923057 2980704
4588 2980704 2661226 1728338 -259728 -1722849 -1360226 84493 1263404 2005665 2743945
4579 2743945 3398447 3875441 4704925 6027931 6570804 4774949 704941 -4057878 -8176192
4570 -8176192 -11236189 -12817568 -12270930 -10076124 -8239494 -7908572 -7117484 -2870408 4033874
4561 4033874 8274383 5791886 -941930 -5607881 -5389091 -3134853 -2184842 -2067447 -726305
4552 -726305 1526864 2693977 2344302 1766701 1490943 837726 -240433 -829952 -751244
4543 -751244 -975020 -1993803 -3020095 -3126508 -2213101 -711010 737193 1249787 287596
4534 287596 -1666728 -3695199 -5372277 -6260938 -5262509 -2109835 893524 691188 -2672981
4525 -2672981 -5836218 -6222157 -4611367 -3038467 -2071167 -1269707 -624027 -107231 836453
4516 836453 1906027 1331421 -1663049 -4813462 -5084344 -2296774 1242503 3970265 5825916
4507 5825916 6323396 4483063 1015957 -1832418 -3431511 -5565138 -8923801 -10981373
4499 -10981373 -9333724 -5609045 -3617094 -4235868 -4507158 -1899440 2600563 6227514
4491 6227514 7619906 7430579 6993277 7314712 8547328 9622797 9033722 6637823 4043621
4482 4043621 2633714 2045069 1353399 718141 547574 -163375 -2817341 -6580750 -8524803
4473 -8524803 -6967784 -3413772 -573268 391585 -28418 -1103462 -2219824 -2620607 -2111139
4464 -2111139 -1725692 -2566952 -4082247 -4507330 -3103735 -1094139 -183713 -847133 -2300333
4455 -2300333 -3582596 -4386712 -5172823 -6547821 -8202511 -8656226 -6782013 -3595659 -1587323
4446 -1587323 -1851401 -2718451 -1967072 263115 1821949 1555310 711274 962190 2089702
4437 2089702 2582895 1944954 1096087 417877 -1154089 -4118610 -6508579 -5699585 -2099652
4428 -2099652 622257 -273706 -3451035 -5597696 -5557236 -4749975 -4157634 -3131249 -1624573
4419 -1624573 -1493836 -4035159 -7351042 -7946809 -4798445 -571516 1265784 -386414 -3882195
4410 -3882195 -6515673 -6449200 -4121415 -2219748 -3294720 -6817251 -9506058 -9250466 -7636513
4401 -7636513 -7401746 -8318011 -7474112 -3550915 1064247 3044632 1584798 -1641570 -4620796
4392 -4620796 -5976735 -4937103 -1934721 1021440 1763133 -193864 -3639078 -6815947
4384 -6815947 -7957719 -5943844 -1963498 406900 -1207737 -4792770 -6433601 -5520041
4376 -5520041 -4745318 -4979904 -3768968 -282624 1875447 -276642 -3830513 -3480683 1056433
4367 1056433 4922307 5017430 3259863 2428904 2267942 1241743 -479762 -1678143 -1960744
4358 -1960744 -1355417 503033 3232287 4976082 4343934 2179837 206197 -1053554 -1834868
4349 -1834868 -1906341 -1330938 -1298882 -2394353 -3020073 -1671232 -70525 -1483582 -5861407
4340 -5861407 -9143944 -8141459 -4075204 -246990 2016938 3637685 5271654 6275050
4332 6275050 5825444 3862757 1040336 -1484270 -2534529 -2049902 -1526460 -2449687 -4303650
4323 -4303650 -4951620 -3201730 -363622 1116140 238048 -1657436 -2453966 -1475110 -85387
4314 -85387 -132578 -1898825 -3772316 -3967457 -2290586 -10878 1692994 2636394 3030610
4305 3030610 2672614 1235844 -932848 -2929285 -4226889 -4964165 -5218739 -4702088 -3600670
4296 -3600670 -3040653 -3915289 -5658056 -7108601 -8312683 -10255266 -12748379 -13970417 -12749583
4287 -12749583 -10232742 -8393058 -7563052 -6263431 -3009299 2277341 8032750 11686786
4279 11686786 11370931 7808302 3850103 1468799 68498 -1545453 -2865990 -2741908
4271 -2741908 -1689427 -1466736 -2932959 -5698430 -9011476 -11392944 -10545005 -5943732 -821848
4262 -821848 932090 -539788 -1932522 -1751139 -1380611 -1525107 -1299263 -1333192 -3857718
4253 -3857718 -8426789 -11323993 -10996015 -10379748 -11613757 -12253725 -9774899 -6276482 -4946260
4244 -4946260 -4936766 -4029782 -3634039 -6075022 -8940334 -7834376 -3860869 -2531684 -5170692
4235 -5170692 -7225645 -6113588 -4979509 -6530813 -8440506 -8114243 -7667114 -10145100 -13827145
4226 -13827145 -14426702 -11223838 -7427804 -5553354 -5566895 -6895678 -9304591 -11671235 -12008361
4217 -12008361 -9238719 -4206492 828054 3469473 3140305 2218191 3628144 6675400
4209 6675400 7372762 4050596 278204 256523 3288753 5224091 3941524 828974 -2273588
4200 -2273588 -4956068 -7160513 -8308468 -7947744 -6282732 -4064092 -2446325 -2394096 -3764746
4191 -3764746 -5664906 -7683379 -9381173 -8807758 -4138137 2538440 6013518 4170951
4183 4170951 853330 635040 3157623 4817869 3762557 725905 -3081106 -6353156
4175 -6353156 -7654054 -7265988 -7379198 -8635558 -8904193 -7489667 -7348960 -10219313 -12880820
4166 -12880820 -12047326 -9905798 -10364980 -12439526 -12249772 -9554459 -7400045 -6988100 -7578184
4157 -7578184 -9617580 -13204927 -15578200 -15071749 -14956962 -18058749 -21115339 -20909146 -21489268
4148 -21489268 -26831435 -31386824 -29322898 -27840688 -34545738 -33725540 2068668 69210873
4140 69210873 122808181 124804876 88026155 55563165 47923131 50668054 47112116 39219031
4132 39219031 33824764 28694777 20819279 15011594 15360839 17179186 14880413 10792657
4124 10792657 9663509 10418929 9571909 7990462 8463950 10200416 10811197 10835408 11992922
4115 11992922 13527266 13976501 14106529 14797206 14513010 12094883 9770852 10244079 12664755
4106 12664755 14196613 13779979 12011939 9296823 6496801 5560752 7215602 9578516
4098 9578516 10744901 10873608 10332547 8345876 5274334 3519010 4023921 4533532 3521205
4089 3521205 2923555 4363968 5765494 5062927 4413739 6650130 9801827 9719570 6724370
4080 6724370 4870917 5135899 4152759 298590 -3264771 -3136785 -26918 3130405 4950701
4071 4950701 5773801 5866192 5171685 3940204 2527897 1240829 850546 2206059 4613963
4062 4613963 5544008 3031215 -1815671 -5459727 -5376616 -2635543 -644706 -1231998 -2666734
4053 -2666734 -2233667 74540 1909536 2092300 1685860 1456035 706196 -499469 -327911
4044 -327911 2113601 5014680 6476573 7169783 8616033 10417643 11113563 10401615 8669452
4035 8669452 5833839 2681660 1741766 4317514 7974243 9634590 9953409 11627303 14357177
4026 14357177 14993678 12435487 8915291 6130960 3453650 774507 -32643 2085913
4018 2085913 5487577 7992459 8764015 7091516 2003077 -5092901 -9668768 -8428713
4010 -8428713 -3181097 1616514 4068186 5561700 7215604 8085510 7039617 4546247
4002 4546247 2049329 700241 991765 2547334 3814011 2862160 -810160 -5599370 -9241643
3993 -9241643 -10574112 -9680490 -7024439 -3285658 207131 2039448 2275161 2732579 4832171
3984 4832171 7532298 8433455 6894491 4887796 4349471 4769792 4288871 2461896 780224
3975 780224 534850 1105700 761141 -1200979 -3494418 -4159368 -2730138 -676915 529467
3966 529467 1173654 2446223 4435369 6085349 6847216 7095942 7046548 6648412 6496957
3957 6496957 7258401 8127796 7692886 6574621 7055107 9404129 10849848 9390018 6524657
3948 6524657 4735420 4223262 3847329 3419052 3046421 1813671 -700408 -2877640 -3131403
3939 -3131403 -2326250 -2101105 -2113133 -1274760 -529113 -1750369 -4581982 -6790448 -7215917
3930 -7215917 -6269167 -4400814 -2449534 -2530913 -5734639 -9460623 -9845480 -6568774 -2672959
3921 -2672959 -77400 1831786 3393387 3592315 2177533 293733 -1280610 -2320629
3913 -2320629 -1892772 448768 2529571 1611691 -1505938 -3417790 -2914526 -1621219 -243181
3904 -243181 1891008 3648735 3068297 2097526 5334117 12499011 17156502 15317487 10634801
3895 10634801 8118132 7275644 5257499 2637708 1463035 807944 -867426 -1511507 1344805
3886 1344805 5252759 5954944 4373682 4872607 7225401 6462620 1577223 -1527931 1673598
3877 1673598 7690871 9966909 7215352 3252111 684173 -1309021 -3458307 -4186954
3869 -4186954 -1969378 2012499 4848353 4760797 2136022 -1687606 -5459520 -7817492 -7458576
3860 -7458576 -4602146 -1538047 -344360 -405027 333608 1946664 2386122 982397 -159892
3851 -159892 781199 2828531 3939392 3527605 1992677 -524193 -3372960 -4927477 -4545223
3842 -4545223 -3708182 -3711594 -3594175 -1937576 675653 2655910 3505477 3364394 2035862
3833 2035862 167468 -371107 722972 901082 -1428255 -3803057 -3257938 -1120144 -902268
3824 -902268 -2879716 -4483841 -5067732 -6293020 -8237989 -9143503 -9033887 -9616809 -10234981
3815 -10234981 -7994377 -2892911 1037516 1235228 -84412 162739 1669755 2257336 1156865
3806 1156865 -1039570 -3589427 -5202659 -4474738 -2102359 -599217 -590397 188291 2736485
3797 2736485 4350805 2513879 -1132487 -3292958 -3633759 -4061659 -4717817 -3767346 -826271
3788 -826271 2055025 3163050 3040149 3186299 4040860 4676897 3957454 1902840 3206
3779 3206 -225921 1086125 2735216 4346814 6146527 6931064 4601315 -437748 -4599042
3770 -4599042 -5169089 -3150040 -668837 2283176 6369140 9944495 10406579 7852253 4966357
3761 4966357 3491361 2894833 2485479 2752885 3978184 4951935 4025141 1024479 -2325598
3752 -2325598 -3913354 -3191917 -1394030 455491 2912289 6381191 9036831 8793630 6968898
3743 6968898 6991802 9127487 9939558 8106228 6851344 8300959 9366900 6909470 3675366
3734 3675366 4272842 7386352 7436487 3230423 -400495 112662 3156791 6244759 9345771
3725 9345771 12016471 11648102 7489658 3179899 2277602 3676475 4172148 3350834 2951132
3716 2951132 3079389 2220656 168603 -1734096 -2784692 -3204629 -2863421 -1763809 -1105568
3707 -1105568 -1735526 -2223383 -870071 843236 -439960 -5013693 -9115092 -9607652 -7377580
3698 -7377580 -5093112 -3790310 -3188027 -3527721 -4993853 -6284395 -5799890 -3891610 -2170943
3689 -2170943 -761197 1857307 5839842 8614688 7782899 4430797 2176814 3156903 6037166
3680 6037166 8016298 7791761 6204325 4766570 4214778 4136524 3441168 1385346 -1367433
3671 -1367433 -2878194 -1763752 1000901 2686178 1556525 -1335627 -3498048 -3903105
3663 -3903105 -3976852 -5547425 -8256005 -9499140 -6980600 -1042030 5628191 10353365 12375069
3654 12375069 12684567 12412328 11608804 9619355 6553786 3992207 3668014 5441465 7325881
3645 7325881 7866287 7609056 7430069 6392374 2949082 -1919428 -4687423 -3140182 1083285
3636 1083285 4635312 5954493 5610927 4386345 2700515 1512089 2078898 4413726 6900853
3627 6900853 7779563 6515705 3770351 721853 -1466174 -2113913 -1299415 406227 2367841
3618 2367841 3999159 4897301 5143702 5028354 4293799 2422663 30945 -1118028 -338719
3609 -338719 750859 385597 -863442 -1188615 -380600 142398 -314619 -1152656 -1991353
3600 -1991353 -2785242 -2496551 74443 3658019 4984826 2909707 85683 -770415 -442289
3591 -442289 -1347902 -3632481 -5238953 -5021702 -3699358 -2072725 -283622 1045738 671787
3582 671787 -1695784 -4722827 -6748782 -7077420 -6041615 -4734424 -4628456 -6272472 -8106891
3573 -8106891 -7760246 -5122064 -3134496 -4610830 -8794559 -11991189 -11479181 -8069247 -4747829
3564 -4747829 -3482070 -3804719 -4165323 -3867636 -3321111 -2947120 -2690440 -2595232 -2961075 -3543692
3554 -3543692 -3425314 -2383990 -1704180 -2564493 -3935382 -3346649 -36313 3674037 4852317
3545 4852317 3364806 2119946 3771432 7382845 8690873 4203857 -4648429 -11902330
3537 -11902330 -12333408 -6431307 231205 2421541 -384329 -4603834 -6444145 -4977874
3529 -4977874 -2183379 -547168 -557100 -599462 574342 2026848 2201436 1643073 2420132
3520 2420132 4764784 6258442 5203090 3016735 1876918 1478311 46878 -2373785
3512 -2373785 -3808460 -3203427 -1421016 514754 2156651 2491934 304889 -3542155 -6196588
3503 -6196588 -6365926 -6037726 -7161345 -8213983 -6254194 -1605968 1885599 1492734 -1359226
3494 -1359226 -3397597 -3530324 -3528671 -5230382 -8010447 -9233952 -6904276 -1563074 4412522
3485 4412522 8824556 10459241 8712667 4146812 -424538 -1482002 1266082 4002519
3477 4002519 3443763 1012862 354590 1944199 3103023 2986031 4040239 7409611 9968741
3468 9968741 8244987 3464849 149341 460204 2221105 2436808 784701 -883625 -1055863
3459 -1055863 286322 2232115 3734163 3958234 2529951 -131405 -2812056 -4303901
3451 -4303901 -4525541 -4568036 -5252412 -5985208 -5625940 -4183741 -2883927 -2704296 -3577125
3442 -3577125 -4785806 -5279523 -3973963 -995524 1570810 1663400 17191 -644440 608895
3433 608895 1789056 1235880 31291 -10683 868271 1106527 216515 -1014683 -1936166
3424 -1936166 -2437848 -2622628 -2993106 -4122275 -5333381 -4850255 -2267682 330886 852318
3415 852318 -442843 -2181839 -3890623 -5143047 -4335987 -665585 3600694 5148854 3452132
3406 3452132 671197 -1572931 -3171334 -3868676 -3120903 -1671958 -1241612 -2501453 -4878827
3397 -4878827 -7859920 -10554427 -10683354 -6713708 -975078 2061802 1085821 -819538 -645086
3388 -645086 1276191 3041880 3670641 2842233 536553 -1756220 -1529416 1538587 4502070
3379 4502070 4651121 2714906 1330961 1601989 2405277 2127177 102415 -2853601 -4819580
3370 -4819580 -4618701 -3377596 -2867999 -2524285 -321808 3293242 5245450 4484791 3828456
3361 3828456 5613140 8354003 9794476 10541621 11884075 12227988 9100408 3513407 -837655
3352 -837655 -2166995 -1715553 -811729 485785 1912097 2525798 1889822 100349 -2865390
3343 -2865390 -6000327 -6417465 -2387555 3105621 4875888 2017814 -969609 -411422 2006195
3334 2006195 2549930 859255 -457299 -324212 -496442 -2315827 -4453911 -4898575 -3817938
3325 -3817938 -3034533 -3202002 -3107018 -2045758 -1277962 -1924772 -2623287 -1160110 2086251
3316 2086251 4499371 5040072 5371141 6637427 7617658 7279091 6745792 6848443 5776860
3307 5776860 1573256 -4429069 -9039648 -11046808 -11356692 -10331172 -7620852 -4204091
3299 -4204091 -2086442 -1903182 -2629639 -3322350 -3346300 -1656569 1726908 4061976 2505557
3290 2505557 -1613850 -3939319 -2825089 -1092809 -1331808 -2401105 -2194948 -1471449 -2668974
3281 -2668974 -6142217 -9539017 -10480512 -8626642 -5440809 -2807865 -1669319 -1461927 -949394
3272 -949394 387506 1994348 2870472 2105846 -453754 -3268146 -3859888 -1865616 -296727
3263 -296727 -1896992 -5118477 -6012001 -3510979 -179675 2032491 3746852 5479398 6051131
3254 6051131 4788513 2880678 1452621 472155 410616 2415383 5592694 6751134 4593127
3245 4593127 1833863 1228837 1735349 930872 -759946 -1116363 -187546 -437554 -3204194
3236 -3204194 -7272212 -10736770 -12338754 -11199440 -7302833 -2603999 -106362 -1110357
3228 -1110357 -3938470 -5566910 -4276050 -1031461 1410597 1195105 -656919 -1577880 -617072
3219 -617072 931910 1981484 2876899 3754156 3803949 3186127 3610399 5575018 6906468
3210 6906468 5733905 3225736 1559377 800034 -185916 -1241958 -1596932 -1695410 -1968721
3201 -1968721 -1005022 2335007 5789375 5550579 1093851 -4184533 -6905406 -6137988 -2552987
3192 -2552987 2059473 4574080 2808739 -1371223 -3598488 -2183505 476004 2003735
3184 2003735 2836022 3842584 3745032 887564 -3835345 -7565176 -8347043 -6454306 -3629791
3175 -3629791 -1802121 -1853136 -3031035 -4065413 -4876205 -6243633 -7904047 -8421248 -7187873
3166 -7187873 -5106902 -2978588 -811520 771725 229158 -2784023 -6372927 -8505414
3158 -8505414 -9008820 -8630241 -7483917 -5642673 -4130614 -3899247 -4447735 -4540878 -3661073
3149 -3661073 -1845126 1035834 4640038 7538507 8614219 8685575 9470900 11197974 12475249
3140 12475249 12379951 11327231 9677282 6803513 2308936 -2586320 -5782047 -6317005 -5098930
3131 -5098930 -3578270 -2169427 -341668 1957520 3625257 3495013 1728306 -371994
3123 -371994 -1737025 -2206069 -1972889 -1019956 714140 2964264 5051352 6064038 5457050
3114 5457050 3850083 2798118 3111299 3788238 3474407 2639022 3109633 5392856 7663492
3105 7663492 7871149 6003608 3809650 2890841 3346247 3745510 2363276 -898808 -3925730
3096 -3925730 -4708264 -4166899 -5215691 -8632263 -11491503 -10784103 -7287256 -4270755 -3040422
3087 -3040422 -1511638 2628601 8596889 12895549 12499327 7472662 915193 -3481126
3079 -3481126 -4246205 -2938664 -2247025 -3331639 -5105709 -5960015 -5755276 -5750479 -6658267
3070 -6658267 -7384556 -6251207 -3183866 147720 2382266 3647010 4427634 4597603 4427375
3061 4427375 5176523 7111267 7973306 5569261 1496494 -114327 2022108 4432040 3353785
3052 3353785 -623679 -3671954 -3173624 258788 4155805 6052810 4545958 79007
3044 79007 -5031481 -8099682 -7930451 -5278523 -1956011 357120 1133364 1346718 2424553
3035 2424553 4608029 6766159 7787568 7418764 5843588 3600323 2045085 2476391 4251059
3026 4251059 5067760 3774814 1591111 -140996 -1776904 -3742090 -4701735 -3260152 -545805
3017 -545805 903287 475410 -67988 585281 1611485 1441024 -283798 -2357845 -2946795
3008 -2946795 -1156739 1549926 2198383 -109554 -2079393 349385 6452895 10719137
3000 10719137 9171275 3917676 177718 233207 2053175 3016134 2749501 1988446 575048
2991 575048 -2021932 -5013520 -6597324 -6040816 -4460966 -3270619 -2740121 -2560557 -2903741
2982 -2903741 -3958982 -4956262 -4819084 -3722106 -2967935 -3137715 -3212160 -1868154 849867
2973 849867 3321490 3577902 1114417 -1997030 -2480002 612194 4297505 4947096 2678167
2964 2678167 782035 1119738 2246849 2284978 1357034 471602 109418 844510 3342762
2955 3342762 6627599 8245258 7301019 5437735 3761730 1172081 -2755479 -5848572
2947 -5848572 -6536469 -6609062 -8140494 -9823061 -9413894 -7828004 -7178369 -6416894 -3250249
2938 -3250249 541526 609662 -2821216 -4125582 -152080 5155566 6354463 3599379 1468918
2929 1468918 2802752 6277052 8913944 8934532 6719878 4211360 2910813 2192907 711899
2920 711899 -713842 97098 2583752 2987590 -529056 -4843763 -5981092 -4129886 -2174264
2911 -2174264 -973717 1006304 4208290 6891051 7485968 6026792 3261742 74913
2903 74913 -2186493 -2346423 -583614 1930975 4241207 5469095 4319744 534780 -3427607
2894 -3427607 -4148918 -1158840 2344952 3191218 1435817 -626217 -1350053 -690847 770576
2885 770576 2380441 3192133 2471875 850410 14657 419536 22373 -3289522 -8141743
2876 -8141743 -10382468 -8113251 -4221024 -2395735 -2306146 -1132423 1279180 2055475 85642
2867 85642 -2103961 -2234825 -1256732 -1087401 -1807649 -2688432 -3798494 -4795387 -4116811 -1352928
2857 -1352928 1305989 1929970 1439333 1362943 991498 -657848 -1800593 21727 3837934
2848 3837934 6360823 6587194 6271049 6248211 5488461 3893455 2971692 3161775 3104826 2226357
2838 2226357 1702895 2218889 2896625 3028111 2876866 2360410 991572 -546262 -922314
2829 -922314 -534433 -1075441 -2511068 -3066998 -2509528 -2475042 -2988189 -2020091 403814 1217164
2819 1217164 -867440 -3070842 -3261316 -3334397 -4915929 -5229453 -1404761 3675027 4585728
2810 4585728 1048910 -2162040 -2266432 -916296 204259 1576601 2956778 2645415 1113899
2801 1113899 1582864 5066735 8055688 7311344 4252363 2262541 2033131 2148926 2318616
2792 2318616 3130676 3858675 3334089 2328005 2489629 3246878 2200175 -1329454 -5323123
2783 -5323123 -7978994 -9668472 -11351900 -12686192 -12654749 -11015742 -8316717 -5249128 -2611391
2774 -2611391 -1168745 -891347 -918515 -836090 -1285269 -2481052 -2756488 27915 5385925
2765 5385925 9676406 9580041 5672401 1654809 164033 329904 -267826 -2314976 -4351864
2756 -4351864 -5003280 -4395973 -3356679 -2222977 -819998 946602 2742621 3800179 3458306
2747 3458306 2144516 1317404 1565221 1311998 -1185200 -4809331 -6308352 -4282484 -736781
2738 -736781 1734255 2444724 1772044 142929 -953731 603909 4189182 5749960 3103267
2729 3103267 -117390 847917 4749876 5995670 2931275 -57375 581197 3025140 4311296
2720 4311296 5215199 7958823 11796367 14114305 14222433 13179957 11262163 8451460 6267456
2711 6267456 6019248 5872225 2765646 -2794099 -6728269 -6503932 -3632899 -504748 2606396
2702 2606396 6108197 8836759 9126481 7194868 5079616 4535501 5564108 6533270 5536046
2693 5536046 2346730 -915771 -1972620 -1126670 -572306 -1055997 -975244 785254 3003328
2684 3003328 4122985 4555858 5665551 7581179 9338051 10319633 10275308 8644704 5270302
2675 5270302 1437121 -1000526 -1429996 -630907 552677 1832609 3023036 3807428 3956685
2666 3956685 3420161 2551593 2486997 4419595 7769325 9908176 8772976 5231519 1877380
2657 1877380 59499 -748169 -1220026 -1398871 -1553578 -2259382 -3218854 -3155832 -1349813
2648 -1349813 1581124 4669298 7341589 8819304 8000325 4859941 1170617 -1223619
2640 -1223619 -2411598 -3685606 -5096808 -4987783 -2282827 1736385 4606920 5054847 3546153
2631 3546153 1059443 -1627030 -3563000 -3743161 -2036832 774793 4138622 7856964
2623 7856964 10675726 10334832 6449456 2228752 1418064 3993092 6700109 7444544 6916272
2614 6916272 5902655 3714832 305677 -2334137 -2471165 -758676 1284288 3384778
2606 3384778 5631521 7000732 6605731 5325495 4449887 3744763 2665092 2367997 4203694
2597 4203694 6789903 6994649 3887341 -215139 -2726502 -3109088 -2240906 -1277138 -1352940
2588 -1352940 -2758381 -4040758 -3296698 -647118 1714975 1965598 49665 -2947601 -5312549
2579 -5312549 -5060534 -1855081 1426759 1196074 -2367882 -5275075 -4648907 -1786368 289291
2570 289291 350926 -871320 -2247558 -2783612 -1973329 -720938 -854892 -2864683 -5005107
2561 -5005107 -5132820 -2510661 2205958 7303694 10304105 9799190 7316500 5556497 4764728
2552 4764728 3213807 1271235 1613161 4425447 5978597 3904717 608626 -1012187
2544 -1012187 -2056293 -4663120 -7358970 -7223104 -4768131 -2694447 -1204192 1291131
2536 1291131 3656944 2615955 -2001997 -6351445 -7418441 -5665802 -2656370 669916
2528 669916 2908168 2617902 613514 -909476 -1897857 -4142701 -7285709 -8678226 -7860001
2519 -7860001 -7398118 -8173609 -7761676 -5106082 -2789812 -2437580 -1829005 532114 1795186
2510 1795186 -600518 -3925815 -4024813 -1558351 133074 1181561 4045705 7573154 7791553
2501 7791553 4503083 1763807 1124944 -430565 -4307817 -7046267 -5936208 -3854691
2493 -3854691 -5101806 -9188678 -12130616 -12026192 -10207842 -8108607 -5911045 -3748693
2485 -3748693 -1962057 -424568 954945 1825213 2659084 4932661 8337777 9524879 6109211
2476 6109211 674294 -2051443 -1237543 -211266 -1142997 -2798348 -3826218 -4817272 -5887682
2467 -5887682 -5289475 -2392344 280571 297828 -976010 -249394 3094594 6511832 7942248
2458 7942248 7775782 7039543 5516296 2557485 -1171277 -3687488 -3449748 -916440 1792111
2449 1792111 2975868 2891947 2749209 2655021 1827932 721957 1045139 2984728 4363709
2440 4363709 3905047 3499986 5218233 7556951 7317306 4442352 2084336 1861141 1878349
2431 1878349 143999 -2544843 -4224428 -4206600 -2666265 389090 4298945 7344455 8555643
2422 8555643 8711757 8405018 6676007 3138006 -104359 -827729 42166 -125843 -1541420
2413 -1541420 -1812867 84304 2088801 1987500 140698 -1628036 -2309036 -1852395 -298081
2404 -298081 2066583 4447344 6356871 8040356 9384226 9270238 7045736 3980942 2048798
2395 2048798 1562734 1218735 374830 -61107 595700 1405442 1172008 464973 917797 2527518
2385 2527518 3016001 671634 -2975219 -4450139 -2215750 1615795 3565907 2105322
2377 2105322 -1373781 -4064910 -3912589 -1071120 2185463 3402634 2164275 41646
2369 41646 -1615534 -2881646 -4030321 -4507634 -4092328 -3886091 -4735175 -5547943 -4894024
2360 -4894024 -3715885 -4404687 -7138450 -9188294 -8476902 -6038870 -4021407 -2898445 -2079097
2351 -2079097 -1982763 -3551835 -6076935 -7344945 -6378203 -4803981 -4774648 -6154337 -6539152
2342 -6539152 -4031513 491208 4178949 5200331 4543020 4543015 5978318 7318851 6825976
2333 6825976 4515168 1633735 -1023578 -3481242 -5656153 -6948778 -6873908 -5658399 -4187545
2324 -4187545 -3593891 -4569536 -6488616 -7412655 -5821159 -2525554 -97768 -2796 -1005796
2315 -1005796 -1017089 205094 1207202 1214477 917518 798087 234480 -1014019 -1863576 -1659690
2305 -1659690 -1668594 -3138302 -4749325 -4170849 -1922255 -1339991 -4220045 -8547121 -11267643
2296 -11267643 -11344412 -9213121 -5456011 -1524528 245280 -666049 -1784587 -1122690 -261918
2287 -261918 -1699250 -4683661 -6541795 -6938524 -7456067 -7543934 -4644964 1245976 6518845
2278 6518845 8284715 6898073 3591057 -959839 -4509081 -3463312 2230363 7229220
2270 7229220 6727642 2298146 -867929 -791870 123867 -554143 -2840607 -5649803 -7858183
2261 -7858183 -8271896 -6777751 -5270307 -5406483 -5873018 -4031565 167040 4292084 7162952
2252 7162952 9771249 12257425 12790134 10520591 7386956 5522284 4472005 2516880
2244 2516880 -236964 -1553416 332981 4458874 7395031 5965697 493772 -4784182
2236 -4784182 -5611351 -2092771 1835758 3191045 2686139 2430713 2653135 1886990 -511111
2227 -511111 -3226787 -4249354 -2855007 -503409 346191 -1136890 -2917075 -2281677 977820
2218 977820 4578006 6614451 7040463 6453411 5177221 3905425 3583209 4004087 3939629
2209 3939629 3196010 2974731 3560968 3453069 1802941 -45844 -745162 -893364 -1147830
2200 -1147830 -179779 3104795 6540860 6745933 3840677 1445700 1793554 3398408 4208140
2191 4208140 4525465 5391359 6113839 5406377 3811486 2980732 3107924 2970720 2342812
2182 2342812 2412139 3390689 3552608 1770653 -355048 -532547 716030 412888 -2877159
2173 -2877159 -7004846 -8835069 -7658425 -5204301 -3372282 -3055851 -4263323 -5869794
2165 -5869794 -5682653 -2378725 2491737 5670836 5529409 3240535 774867 -871636 -1419067
2156 -1419067 -1057940 -1135318 -3500307 -8068809 -12160809 -13310472 -11809022 -9569446 -7613973
2147 -7613973 -5893289 -4512277 -3524219 -2142726 230867 2536809 3115672 1996250 611453
2138 611453 -574033 -2323356 -4222620 -3928852 40089 5920112 10346497 11830858 11591040
2129 11591040 11275412 10950122 9588444 6928432 4334201 3732273 5726617 8802841 10482482
2120 10482482 9385290 6366620 3831767 3737224 5732654 7211740 5810627 2042812
2112 2042812 -1276871 -2484220 -2811235 -3905845 -4943699 -4007590 -1740637 -1368210 -4572878
2103 -4572878 -9093952 -11331805 -10063011 -6684602 -3053164 -374414 713861 594457
2095 594457 945606 3147663 6315659 8013363 7050966 4542146 2020400 -263016 -2529614
2086 -2529614 -4059415 -3817014 -2194401 -1069023 -1939261 -4580755 -7594150 -9650674 -10039001
2077 -10039001 -8695338 -6283092 -3996482 -2789314 -2734727 -3198344 -3370723 -2503058 -161377
2068 -161377 3137923 5747202 6030059 3884243 851078 -1272932 -1669597 -588295 1170557
2059 1170557 2752450 3677596 3961683 3705192 2852601 1740834 1374973 2233502 3011721
2050 3011721 1685776 -2035347 -6341059 -9511376 -11272067 -11780679 -10893147 -9180586 -7986047
2041 -7986047 -7151132 -4234379 2051661 8663281 10861714 7835248 3560846 1896223
2033 1896223 2813157 3936555 3780703 2423586 555338 -821104 -672268 1058842 3409052
2024 3409052 5867258 8734672 11387086 11838939 9479059 6832183 6572292 7639175 6630036
2015 6630036 2779290 -880493 -1703205 -452310 824082 1858336 3523743 5635292
2007 5635292 7234072 8144372 8473482 7301702 3903011 -19474 -1465597 188388 2474535
1998 2474535 3184760 2572267 1646462 436491 -816174 -765321 910434 2114107 1205708
1989 1205708 -82733 881524 3280308 3961891 2488370 1736280 3012388 3839129 1901126
1980 1901126 -1560840 -3963831 -4654501 -4132090 -2100380 1533654 5237764 7411444 8080147
1971 8080147 7503664 4988772 1092365 -1150797 -75546 1270924 -989786 -5567367
1963 -5567367 -7632920 -5834593 -3701687 -3928411 -5227015 -5695392 -5566812 -5178935 -3546493
1954 -3546493 -791468 845889 388217 33098 1655647 3607495 3144327 226570 -3083777
1945 -3083777 -5331271 -5921898 -4446893 -1799058 -438385 -1583563 -3522903 -4340509 -4474800
1936 -4474800 -4713736 -3886832 -1131886 1553482 2056234 1758092 3063652 4699348 3240535
1927 3240535 -1369486 -5544617 -7029537 -6548206 -4576710 -364891 5114351 8736227
1919 8736227 8919665 7071587 4731856 2224573 718077 2146628 5772419 8007077
1911 8007077 7191993 5572029 4999095 3985909 1154445 -1619795 -2284283 -2070420 -2834617
1902 -2834617 -3436773 -2283936 -1427923 -3997757 -8547170 -10049656 -6531311 -1260540 2028733
1893 2028733 3042642 3406412 3927937 4428463 4399738 3024362 82750 -2643291 -2356955
1884 -2356955 1821465 7933341 13131544 15356732 13629072 8721406 3612448 1276832
1876 1276832 1589208 1974218 1180833 541054 1337977 3049447 4682691 5774098 5485648
1867 5485648 2989288 -241760 -761496 2689018 7045965 8449263 6436202 3208736
1859 3208736 305097 -2180270 -4252894 -5835842 -7262059 -8402555 -8021175 -5487364
1851 -5487364 -2377318 -782588 -670756 -513343 142680 548362 689784 1322987 2193212
1842 2193212 2218460 1611669 1837166 2965725 3008477 836197 -1836708 -2602037 -1288188
1833 -1288188 557580 2150600 3863388 5582997 6318816 5695750 4573985 3629200 2331098
1824 2331098 230469 -1459219 -948208 1438754 3087990 2373279 969352 1632150 4459379
1815 4459379 7023774 7803117 7360997 5987395 2784134 -1643763 -4036676 -2387117 566290
1806 566290 543522 -2331655 -3740124 -1324781 2315029 3620164 2433947 822579 -462529
1797 -462529 -2333869 -5237330 -8421664 -10765206 -11038085 -8101201 -2447534 2840020 4401006
1788 4401006 2168884 -555284 -912757 684158 1988205 2135596 2371926 3863698 5869025
1779 5869025 6585744 5300209 2934790 517942 -1954546 -4592829 -6378148 -6009354 -3720399
1770 -3720399 -1021257 1380425 3938603 6120916 5690596 1730002 -2622536 -2639391 2481659
1761 2481659 8173767 9393015 5869966 1450681 -915373 -1805788 -2908052 -3974482
1753 -3974482 -3680405 -2378918 -1730726 -1558360 500990 5028204 8622366 7857882 4177527
1744 4177527 2197013 3547923 5164323 4023237 879269 -1797797 -3230104 -3991685
1736 -3991685 -4010915 -2843444 -947310 840396 2204872 2489202 249013 -4508346 -8657071
1727 -8657071 -8722722 -5004068 -1067636 611500 561691 -78133 -1604176 -4444661 -7300099
1718 -7300099 -7953905 -5684006 -2257936 -453041 -1492826 -3876290 -5118946 -4616994 -3834407
1709 -3834407 -3560433 -2750577 -1009487 -144197 -1264800 -2081499 135658 3958190 5286245
1700 5286245 3046900 201270 -1052243 -1748257 -3072733 -4029107 -3587226 -2466057 -1280876
1691 -1280876 560845 2550183 2323382 -725125 -3513961 -3379366 -1941122 -2157695 -3512284
1682 -3512284 -3399705 -1877543 -1356484 -2120323 -1806510 389948 2263573 2167235 1315087
1673 1315087 1439286 2368045 3126194 3685759 4464960 5414801 6497915 7950149 9480274
1664 9480274 10310184 10229262 9212152 6036248 -476717 -8196577 -12174309 -10098005 -5527437
1655 -5527437 -3854378 -6287574 -9548588 -10311000 -7943054 -3760476 127251 1398683
1647 1398683 -990616 -5491745 -9352805 -11277802 -11523480 -9895148 -5736868 -189957
1639 -189957 3670942 4136037 3003292 3167476 5113321 6788435 6416526 4321842 2258818
1630 2258818 1806402 3261907 5457061 6803152 6961653 7163111 8464247 10281657 11363001
1621 11363001 11614307 11907215 12419809 12424620 11746999 11187907 11136766 10821022 9453730 7267879
1611 7267879 4915514 2715966 1090306 804986 1896939 3083117 3228752 2856917 3205072
1602 3205072 4308684 5216409 5778698 6848360 8607756 9910205 9662249 8008456 5839706
1593 5839706 3815738 2058385 184298 -2380415 -5410324 -7308745 -6491676 -3438141
1585 -3438141 -441193 804802 503472 -318673 -1114381 -1981432 -3554550 -6560206 -10172734
1576 -10172734 -11246051 -7378050 -937929 2501523 666183 -2943246 -4304491 -3771896
1568 -3771896 -3539727 -2979509 -46115 4218041 6504114 6199622 5921671 6845431 6991401
1559 6991401 5142943 3302678 3531602 4733289 4541169 2775133 1241859 1265202 2825454
1550 2825454 4971955 5746071 3016427 -2857378 -8133470 -9332954 -7281260 -5741693
1542 -5741693 -6279222 -6372803 -2990323 3516826 9825476 12865458 11823356 7807546 2786763
1533 2786763 -1167250 -2644958 -1597234 915059 3896001 6930016 9210526 8973054
1525 8973054 5363609 743070 -776362 1988605 5610318 6366468 4806866 4127773 5187142
1516 5187142 5787418 4574194 2772924 1513035 118272 -1711176 -2347832 -703819 1412872
1507 1412872 1502543 10692 -238132 2085836 5217780 6665711 5854071 4032978 2472353
1498 2472353 1403177 517436 -80217 82478 925730 1761920 2546298 4114700 6299090
1489 6299090 7206321 6131653 5816743 8936354 13001678 12421542 6165183 -295360 -2035545
1480 -2035545 -83800 2254676 4775992 8671500 12198622 12259478 9078611 5643588 3237978
1471 3237978 883210 -1402058 -2269170 -1835331 -1590169 -1455659 -20837 2197443 2972898
1462 2972898 2232883 2356709 3818286 3948785 1516463 -571656 773126 4526605 7342360
1453 7342360 7830047 7089389 6483741 6723161 7950286 9176287 8805698 7039025 6299776
1444 6299776 7766433 9057776 7359171 3659785 1677572 3183584 6370016 8552191
1436 8552191 8756902 7707546 6669408 6461769 6858156 7166552 7686847 9501575 12176558
1427 12176558 13311230 11752509 9576538 8849777 7998849 4303053 -874115 -2847196
1419 -2847196 5645 3776859 4166322 1541284 -733319 -919348 195728 1654989 3361436
1410 3361436 5197221 6827889 8246624 9245780 8631755 5391603 654017 -2929571 -4161857
1401 -4161857 -4447188 -5310073 -5908886 -4302845 -690832 2217742 2535497 1664224 2339377
1392 2339377 4887226 6915483 6776338 5750245 5894916 6919362 6704616 4515427 2159671
1383 2159671 1760829 3599337 6526143 9345947 11117614 11091580 9373255 7141083 5372115
1374 5372115 3821291 2056428 819335 1081416 2170057 2475304 2052842 2654950 4571386
1365 4571386 5477683 3931858 2311575 3927941 8088188 10717151 9862150 7833088 7113759
1356 7113759 6850468 5189051 3080164 3298784 6516117 10485497 12869138 13209776 12275089
1347 12275089 10906469 9471157 7409731 3750375 -857882 -3501269 -2058507 1790573
1339 1790573 4563282 5383192 6025210 6926922 6210069 3341256 836549 745996 1610371
1330 1610371 683346 -2374622 -5590566 -7135347 -6321391 -3541895 -653973 -27917 -1597012
1321 -1597012 -2136719 744064 5044325 6799556 5253644 3523531 4461099 7731435 10970900
1312 10970900 12317805 11656311 10356454 9761349 9501889 8095072 5667944 4438013 5264454
1303 5264454 5637583 3207842 -344211 -1699124 -898345 -686677 -1549707 -1158471 992447
1294 992447 2239591 1374110 1273347 4744834 10080930 13044509 11748914 7596662 2709346
1285 2709346 -1475015 -3880502 -4168850 -3431670 -3243990 -4022041 -4972254 -5233173 -4400615
1276 -4400615 -2477507 -42883 1951232 3071356 3590332 3483628 2110608 -538068 -3119041
1267 -3119041 -4196934 -3660717 -2411386 -1331081 -991615 -1554926 -2369909 -2326961 -1095858
1258 -1095858 519079 1570630 1558066 186803 -2173971 -3784692 -2898570 -146956 2053956
1249 2053956 2723621 2934427 2832552 726075 -3573289 -7099325 -7373234 -5523493 -3707364
1240 -3707364 -1702910 1283627 3556739 3115976 1527697 1973600 4180057 4935311 3287409
1231 3287409 1397051 86809 -2374333 -6054402 -7870984 -6233302 -3924431 -4029670
1223 -4029670 -5618322 -5967690 -4832116 -3633040 -2029433 1504442 6204164 8890571
1215 8890571 7629745 3774347 173342 -1386404 -995158 -24647 227957 -63502 440071
1206 440071 2126162 3642648 4090752 4762898 7234181 10679094 12793016 12741663 11487714
1197 11487714 9771222 7736181 6292770 6688158 8393697 9261448 8343540 7020080 6749031
1188 6749031 7160701 7178190 6820632 6939819 7878624 9084502 9614457 8776370 6789143
1179 6789143 4742893 3241592 1570504 -606312 -1464078 876772 4621258 5507052 2594583
1170 2594583 33680 1397154 4915454 6805175 6974410 7984729 9848724 10024558 8456123
1161 8456123 8463765 11415320 13989916 12767454 8892443 5728013 3763072 646479 -4538390
1152 -4538390 -9556838 -11570608 -9678377 -4952592 560324 4784619 6797623 7294193
1144 7294193 7205508 6252551 3857535 947273 -632821 -400179 455490 1010099 1354587
1135 1354587 1278591 -61989 -2471247 -4193201 -4081419 -3168797 -2995669 -3329792 -2842066
1126 -2842066 -1426838 -408476 -519631 -896751 -393935 892768 1782108 1256558 -685102
1117 -685102 -3137652 -5026369 -5758061 -5196058 -3260944 -89903 3326863 5362762 5122980
1108 5122980 3257660 1121725 -314315 -366240 1539765 4768993 6773717 5153354 782228
1099 782228 -2423182 -1674842 1543525 3368715 2083795 -205272 -251039 2933079 7540995
1090 7540995 10978927 11813226 10301479 7935956 6493547 6721759 7563080 7220643 5442362
1081 5442362 4217336 5540566 8921982 12012534 13433976 13836180 14118636 13995009 12946866
1072 12946866 11415876 10042342 8547160 6488795 4538194 3759973 3910059 3670708 2556646
1063 2556646 1495124 1417266 2281026 3632193 5083635 5941734 5456202 4079035 3598184
1054 3598184 5159838 7682422 9106102 8951206 8729701 9708550 11077446 10960553 8960161
1045 8960161 6863620 6406704 6928593 6202785 3505139 639868 -573996 -611372 -1004473
1036 -1004473 -1846958 -2077601 -1616487 -1350158 -1114309 307473 2746385 4139490 3440517
1027 3440517 2495111 3722369 6946104 9723161 10086336 8018934 5025037 3211641 3971561
1018 3971561 6510312 8385752 8446237 8322135 9905440 12421453 13500303 12236412 9443420
1009 9443420 5685684 1212142 -2523534 -3628159 -2332141 -839883 -308393 146208 1121262
1000 1121262 1746353 1610055 1942427 3851108 6927270 10334262 13464574 14767197 12302036
991 12302036 6947409 2720450 1815503 1479916 -1499062 -5156949 -4810332 -136318 4272653
982 4272653 5632941 6312680 9135717 12686017 13487592 10631848 6048042 1803003 -723318
973 -723318 -268226 3251816 7428426 9018852 7086527 3470412 450657 -974383 -911925
964 -911925 -35425 682529 600426 -44031 -495991 -30743 2023775 5763491 9531572 10532488
954 10532488 7942064 4442961 3133530 3744337 3722653 2333748 1314852 1531510 1529212
945 1529212 190709 -1274098 -1220678 75605 1247847 1935760 2853926 4478016 6538571
936 6538571 8176138 8097828 5646315 2390614 1334217 3395044 5812125 5441044 2680317
927 2680317 526743 483990 1290901 1391185 700090 -210008 -763061 307367 4380470
918 4380470 10428115 14443037 13140398 7857255 3342716 2643903 4410824 5558385 5287530
909 5287530 5335526 6880171 8807366 9524038 9272728 9554314 10894486 12470872 13699972
900 13699972 14699381 14963792 13221075 9543127 6338136 5866122 7396083 8129430 6687455
891 6687455 4587398 4329626 6847170 10753117 13503746 13613356 12252289 11989251 13248821
882 13248821 13167238 9465206 4427347 2680362 5258895 8518867 9482077 9511399 11145918
873 11145918 13666251 14299639 12475694 10158097 8467089 6730165 5107260 5346876 7625989
864 7625989 8916324 6714384 3138004 2683526 6027674 8628450 6437749 921897 -3290989
855 -3290989 -4216813 -3562785 -2713880 -771958 2569375 4926111 4122483 1650634 869707
846 869707 2440430 3866388 3420421 2132204 1309282 329876 -1658521 -3330973 -2351773
837 -2351773 1439989 5487439 7365114 7282386 7372863 8941865 10892267 10982490 8429192
828 8429192 4878287 2718683 2897551 4580136 6194457 6214985 3788301 -226650 -3287243
819 -3287243 -3490685 -1676104 -139803 259377 254959 -39527 -1357747 -3169119 -3613507
810 -3613507 -2322906 -1323851 -2072298 -3330652 -3152469 -1348558 1235781 4168908 6608989
801 6608989 6686733 3739690 102048 -1206704 266749 3034640 6266359 9648104 11736091
792 11736091 11089458 8721089 7043648 6490570 5449778 3509841 2320237 2802072 3734138
783 3734138 3802106 3195288 2607580 2478939 3676124 6810946 10153612 10493203 7307834
774 7307834 4013381 3526829 4494686 3851631 1481875 -104957 190481 905955 765608
765 765608 344034 603148 1581097 3235112 6137421 10234836 13669477 13989781 10627538
756 10627538 5641120 1769754 -64230 -1077668 -2595700 -4360727 -5307084 -5302572 -4978210
747 -4978210 -4127345 -1862472 1232627 2672312 827266 -2975692 -6230948 -8195918 -9741993
738 -9741993 -11048403 -11196338 -10009032 -8704573 -8165014 -7564948 -5423655 -1605320 2211010
729 2211010 4024288 3414492 1949377 1488989 2141165 2458561 1689978 828000 936358
720 936358 1561905 1752098 1601125 1454926 500222 -2038373 -4762206 -5216629 -3260838
711 -3260838 -1417848 -1504061 -2808531 -4191196 -5846584 -7761179 -8441857 -7130951 -5859218
702 -5859218 -6999009 -9566943 -10337094 -8350628 -5904568 -4850455 -4393722 -3480245 -3074693
693 -3074693 -4327315 -5969794 -5546985 -2643736 709365 2496108 2283631 795714 -606693
684 -606693 -251028 2488983 5996764 7797639 7245795 5716760 4278831 2715531 982784
675 982784 -124426 -343053 -407978 -492689 179990 1361373 1261005 -690352 -2282285 -1387992
665 -1387992 1136816 3282420 5072659 7514907 9582013 9183594 6694711 4651693 4000613
656 4000613 3461452 2728974 3180903 4687150 4859561 2892751 1368632 2422624 4553999
647 4553999 5355435 5244115 5972851 7104620 6722264 4656354 2462648 868500 -336885
638 -336885 -369794 2056092 6265873 9848479 11638972 12668664 13889167 14679391 14069873
629 14069873 12054874 9277110 6530253 4751155 4402696 4803405 5140788 5979483 8430560
620 8430560 11915240 14225338 13898770 11192856 6831564 1568658 -2806812 -4082221 -2240942
611 -2240942 -87806 -261671 -2566245 -4913499 -5832118 -5275061 -3936822 -2703264 -2162893
602 -2162893 -1922738 -798028 1908679 5672309 9303919 11609866 11611296 9099031 5144218
593 5144218 1294960 -1667194 -3413446 -3117484 -315847 3628127 6724283 8888973 11283618
584 11283618 13229985 12379918 8472500 4196380 1306539 -1316515 -4279105 -5386797
576 -5386797 -3184652 -243712 147426 -1237428 -1245311 672125 2617989 4342622 7281350
567 7281350 10695542 11702163 9876861 8355430 9141597 10404143 9974322 8624980 7719937
558 7719937 6001304 1527526 -4423965 -8050431 -7401990 -4264469 -1743100 -1279051 -2028398
549 -2028398 -2249452 -1255387 -255951 -711877 -1779522 -821192 2780637 5990619 5901203
540 5901203 3836504 3518611 5858576 8096555 8238745 7808011 9060105 11366542 12110037
531 12110037 10281534 7522029 5777700 5285796 5160324 4934283 4822423 4920244 4921675 4702132
521 4702132 4604754 4789662 4690695 3723764 2421137 2126038 3310499 4776277 4887123 3167858
511 3167858 494454 -1593361 -1465021 1558590 5704370 7287385 4453726 31653 -1204823
502 -1204823 1758840 5137605 5524292 3893406 3042440 3119084 2206927 258470 -562112
493 -562112 443115 1246765 387504 -880537 -1171109 -1623826 -3870058 -6747994 -7580162
484 -7580162 -6194334 -5119068 -5519857 -5282901 -2175873 2770397 6403029 7044240 5780192
475 5780192 4703357 4838773 5554868 5365222 3452429 653376 -1407723 -2155768 -2274277
466 -2274277 -2097295 -1115023 439165 1049230 82626 -849537 -244323 680067 -303785 -2768569
456 -2768569 -3985929 -2981856 -1970464 -2989461 -4891395 -4782534 -1356994 3963364 8198824
447 8198824 8645767 4970515 339631 -925040 1993279 5254501 5121913 2599586 1529103
438 1529103 3043604 4330403 2914459 -76939 -1686740 -538956 2440792 5448574
430 5448574 6876073 5869632 3024775 197956 -1216875 -1619214 -2256395 -3345486 -3856494
421 -3856494 -2926479 -774618 1686869 3511220 4063505 3403545 2424115 2041099 2157212
412 2157212 2011568 1624777 2052099 3745208 5474603 5803533 5217073 5648970 7800081
403 7800081 9996259 10238848 8598128 6823673 6124513 6271015 6657505 7150511 7581987
394 7581987 7295218 5922934 4281759 3837236 5231738 7663684 9748724 10751525 10891517
385 10891517 10627440 9956572 8717107 7556810 8017225 10998226 15226182 17938928 17347647
376 17347647 14004789 9678926 5634539 2449918 718952 880938 2485622 4498077
368 4498077 6457624 8646076 10917105 12084303 11035032 8134825 4984636 2806866
360 2806866 1436920 1666 -1667310 -2570079 -1551334 1350418 4734113 7009086 7590963
351 7590963 7017938 6273365 6103728 6504429 6501573 4912006 1926479 -466563 -530442 934399
341 934399 1503651 498182 77921 2153044 5391391 6762019 5492275 3816904 3727175
332 3727175 4601533 4732878 3914334 3431204 4226992 6107007 8278880 9712378 9357429
323 9357429 7108221 4471114 3315553 3928709 5073976 5755414 5828606 5007656 2850616
314 2850616 260055 -494381 1627506 4753651 6151455 5329541 4068706 3978230 5151771
305 5151771 6724427 7463432 6110122 2535598 -1401286 -3342514 -2878707 -1488609 -190927
296 -190927 1327622 3142717 4325596 4429984 4377257 4990028 5783104 6129967 6537511 7603065
286 7603065 8547136 8082896 6292329 4493040 3497673 2959646 2259401 1261339 379590
277 379590 451462 2127291 4812651 6811392 7178832 6673873 6090463 4727775 1879161
268 1879161 -1102903 -2100444 -1137436 -23514 759920 2620104 5868306 8312612 7960176
259 7960176 5666987 3981343 4416661 6727850 9720004 11741599 11411451 9045150 6712014
250 6712014 6026907 6658826 7714986 9325872 11583289 13073031 12277458 9881218 7967549
241 7967549 7268288 6916827 6641346 7138504 8016084 7483572 5039268 2783799 2783617 4357220
231 4357220 5353398 5165222 4898630 5127842 5249656 5089193 5487245 6691745 7418549 6425533
221 6425533 4255948 2500020 1817292 1617737 1385388 1251504 1208382 754295 -332575
212 -332575 -1633333 -2839339 -4043215 -4809913 -3933146 -1060721 2162199 3761389 3812314
203 3812314 3897994 4522487 4618857 3684881 2716186 2470908 2353016 1845631 1581262 1820802
193 1820802 1202902 -1370587 -4437079 -5293682 -3301708 -402468 1466875 2075106 2120658
184 2120658 2183043 2629319 3409969 3788763 3244400 2537801 2723664 3291508 2820218 1527923
174 1527923 1373628 3110801 5002775 5361086 4734203 4356730 3896665 2409313 549293
165 549293 -27733 864851 1663078 1226120 21135 -915914 -1068484 -320774 1237864 2997936
155 2997936 3935954 3372683 1442662 -1007491 -2666137 -2401363 -427399 1444190 1533842
146 1533842 137360 -1071866 -1190533 -677072 17633 1195554 3037115 5012556 6598787
137 6598787 7783224 8467914 8189746 6964658 5684973 4988438 4254137 2498866 29001
128 29001 -1538053 -963975 1364006 3966924 5675123 6282300 6096771 5398130 4584257
119 4584257 4354571 4950030 5297883 4000234 1600536 673160 2615589 5350065 5770641
110 5770641 3848302 2349255 2605741 2888339 1713608 545043 1540620 4061579 5374349
101 5374349 4138664 1444460 -1224096 -3266524 -4169063 -3157228 -351526 2734300 4504753
92 4504753 4561430 3426600 1682157 -246347 -2016894 -3526784 -4854366 -5844719 -6093019
$$ [...]
##END NTUPLES=NMR SPECTRUM
##END=
