##TITLE=31Pdec_DE-92k_TFA
CDCl3, 64 sc
 13.8.2025
##JCAMPDX= 6.0         $$ Bruker NMR JCAMP-DX V2.0
##DATA TYPE= NMR SPECTRUM
##DATA CLASS= NTUPLES
##ORIGIN= UXNMR, Bruker Analytische Messtechnik GmbH
##OWNER= root
$$ XWIN-NMR		Version 3.5
$$ Wed Aug 13 16:33:00 2025 Russian Standard Time (UT+4h)  she@DPX200
##.OBSERVE FREQUENCY= 81.013821
##.OBSERVE NUCLEUS= ^31P
##.ACQUISITION MODE= SIMULTANEOUS
##.ACQUISITION SCHEME= undefined
##.AVERAGES= 64
##.DIGITISER RES= 17
##SPECTROMETER/DATA SYSTEM= spect
##.PULSE SEQUENCE= zgpg30
##.SOLVENT NAME= DMSO
##.SHIFT REFERENCE= (INTERNAL, DMSO, 0, 198.062)
##AUDIT TRAIL= $$ (NUMBER, WHEN, WHO, WHERE, WHAT)
$$ ##TITLE= Audit trail, XWIN-NMR		Version 3.5
$$ ##JCAMPDX= 5.01
$$ ##ORIGIN= Bruker BioSpin GmbH
$$ ##OWNER= she
$$ F:/spectra/data/she/nmr/P31/2/pdata/1/auditp.txt
$$ ##AUDIT TRAIL=  $$ (NUMBER, WHEN, WHO, WHERE, WHAT)
(   1,<2025-08-13 16:31:48.09 +0400>,<she>,<DPX200>,
      <created by zg, POWCHK disabled, PULCHK disabled
       configuration hash MD5:
       00 E9 B6 7A A2 85 ED C7 34 08 36 98 17 FE 4E 26
       data hash MD5: 32K
       5B CA 4E 81 C2 EB E2 E8 52 53 6C 16 73 20 B2 C4>)
(   2,<2025-08-13 16:31:50.42 +0400>,<she>,<DPX200>,
      <Start of raw data processing
       efp BC_mod = 2 LB = 1.5 FT_mod = 6 PKNL = 1 PHC0 = 1772.118 PHC1 = 6.499474 SI = 64K 
       data hash MD5: 64K
       F9 76 89 F0 E0 9F 34 A6 83 A0 04 CF 0D 46 EB 55>)
(   3,<2025-08-13 16:32:05.98 +0400>,<she>,<DPX200>,
      <pk PHC0 = 12.77604 PHC1 = 0 
       data hash MD5: 64K
       82 D2 BC 70 FC 91 37 4C A0 2D 78 C3 C4 BE BE C4>)
(   4,<2025-08-13 16:32:09.76 +0400>,<she>,<DPX200>,
      <abs ABSG = 5 
       data hash MD5: 64K
       5B 74 EB 3B DA AB 05 52 75 72 94 50 EC 08 FA B8>)
(   5,<2025-08-13 16:32:27.35 +0400>,<she>,<DPX200>,
      <pk PHC0 = -8.304923 PHC1 = 0 
       data hash MD5: 64K
       C5 31 5A 44 BF AA D9 F6 9E 90 66 89 FA 94 54 7A>)
$$ ##END=
$$ 
$$ hash MD5
$$ BF 57 59 9D 9A E7 65 33 67 0C A2 44 F6 E7 78 19
##$RELAX= 
##$RELAX= 
##$RELAX= 
##$RELAX= 
##$RELAX= 
##$RELAX= 
##$RELAX= 
##$RELAX= 
$$ Bruker specific parameters
$$ --------------------------
##$DU= <F:/spectra>
##$EXPNO= 2
##$NAME= <P31>
##$PROCNO= 1
##$TYPE= <nmr>
##$USER= <she>
##$AMP= (0..31)
100 100 100 100 100 100 100 100 100 100 100 100 100 100 100 100 100 100 
100 100 100 100 100 100 100 100 100 100 100 100 100 100 
##$AQSEQ= 0
##$AQ_mod= 1
##$AUNM= <au_zg>
##$AUTOPOS= <>
##$BF1= 81.014009
##$BF2= 200.13
##$BF3= 200.13
##$BF4= 200.13
##$BF5= 200.13
##$BF6= 200.13
##$BF7= 200.13
##$BF8= 200.13
##$BYTORDA= 1
##$CFDGTYP= 0
##$CFRGTYP= 5
##$CHEMSTR= <none>
##$CNST= (0..31)
1 1 145 1 1 1 1 1 1 1 1 1 1 1 1 1 1 1 1 1 1 1 1 1 1 1 1 1 1 1 1 1 
##$CPDPRG= <waltz16>
##$CPDPRG1= <>
##$CPDPRG2= <waltz16>
##$CPDPRG3= <>
##$CPDPRG4= <mlev>
##$CPDPRG5= <mlev>
##$CPDPRG6= <mlev>
##$CPDPRG7= <mlev>
##$CPDPRG8= <mlev>
##$CPDPRGB= <>
##$CPDPRGT= <>
##$D= (0..31)
0 1 0 0 0 0 0 0 0 0.06 0 0.03 2e-05 3e-06 0 0 0.0002 0 0 0 0 0 0 0 0 0 
$$ [...]
##$SUBNAM3= <"">
##$SUBNAM4= <"">
##$SUBNAM5= <"">
##$SUBNAM6= <"">
##$SUBNAM7= <"">
##$SUBNAM8= <"">
##$SUBNAM9= <"">
##$SW= 400.765351723535
##$SWIBOX= (0..15)
0 1 3 0 0 0 0 0 0 0 0 0 0 0 0 0 
##$SW_h= 32467.5324675325
##$TD= 32768
##$TD0= 1
##$TE= 0
##$TE2= 300
##$TE3= 300
##$TEG= 300
##$TL= (0..7)
0 120 53 12 22 120 120 120 
##$TP= (0..7)
150 150 150 150 150 150 150 150 
##$TP07= 0
##$TPNAME0= <>
##$TPNAME1= <>
##$TPNAME2= <>
##$TPNAME3= <>
##$TPNAME4= <>
##$TPNAME5= <>
##$TPNAME6= <>
##$TPNAME7= <>
##$TPOAL= (0..7)
0.5 0.5 0.5 0.5 0.5 0.5 0.5 0.5 
##$TPOFFS= (0..7)
0 0 0 0 0 0 0 0 
##$TUNHIN= 0
##$TUNHOUT= 0
##$TUNXOUT= 0
##$USERA1= <user>
##$USERA2= <user>
##$USERA3= <user>
##$USERA4= <user>
##$USERA5= <user>
##$V9= 5
##$VALIST= <valist>
##$VCLIST= <CCCCCCCCCCCCCCC>
##$VD= 0
##$VDLIST= <DDDDDDDDDDDDDDD>
##$VPLIST= <PPPPPPPPPPPPPPP>
##$VTLIST= <TTTTTTTTTTTTTTT>
##$WBST= 1024
##$WBSW= 4
##$XGAIN= (0..3)
0 0 0 0 
##$XL= 0
##$YL= 0
##$YMAX_a= 7877
##$YMIN_a= -20124
##$ZGOPTNS= <>
##$ZL1= 120
##$ZL2= 120
##$ZL3= 120
##$ZL4= 120
##$ABSF1= 198.0616
##$ABSF2= -202.7028
##$ABSG= 5
##$ABSL= 3
##$ALPHA= 0
##$AQORDER= 0
##$ASSFAC= 0
##$ASSFACI= 0
##$ASSFACX= 0
##$ASSWID= 0
##$AUNMP= <proc_1d>
##$AZFE= 0.1
##$AZFW= 0.5
##$BCFW= 0
##$BC_mod= 2
##$BYTORDP= 0
##$COROFFS= 0
##$CY= -3
##$DATMOD= 1
##$DC= 0
##$DFILT= <>
##$DTYPP= 0
##$F1P= 0
##$F2P= 0
##$FCOR= 1
##$FTSIZE= 65536
##$FT_mod= 6
##$GAMMA= 0
##$GB= 0
##$INTBC= 1
##$INTSCL= 9.790993e-09
##$ISEN= 30
##$LB= 1.5
##$LEV0= 0
##$LPBIN= 0
##$MAXI= 10000
##$MC2= 0
##$MEAN= 0
##$ME_mod= 0
##$MI= 50
##$NCOEF= 0
##$NC_proc= -8
##$NLEV= 6
##$NOISF1= 182.463
##$NOISF2= 159.3651
##$NSP= 0
##$NTH_PI= 0
##$NZP= 0
##$OFFSET= 198.0616
##$PC= 4
##$PHC0= 1776.589
##$PHC1= 6.499474
##$PH_mod= 1
##$PKNL= yes
##$PPARMOD= 0
##$PSCAL= 0
##$PSIGN= 0
##$REVERSE= no
##$SF= 81.0140089999434
##$SI= 65536
##$SIGF1= 159.3651
##$SIGF2= -187.1042
##$SINO= 113.3802
##$SIOLD= 16384
##$SREGLST= <1H.CDCl3>
##$SSB= 0
##$STSI= 65536
##$STSR= 0
##$SW_p= 32467.5324675325
##$SYMM= 0
##$S_DEV= 0
##$TDeff= 32768
##$TDoff= 0
##$TI= <>
##$TILT= no
##$TM1= 0
##$TM2= 0
##$TOPLEV= 0
##$USERP1= <user>
##$USERP2= <user>
##$USERP3= <user>
##$USERP4= <user>
##$USERP5= <user>
##$WDW= 1
##$XDIM= 65536
##$YMAX_p= 101788191
##$YMIN_p= -239986944
$$ End of Bruker specific parameters
$$ ---------------------------------
##NTUPLES= NMR SPECTRUM
##VAR_NAME=  FREQUENCY,     SPECTRUM/REAL,   SPECTRUM/IMAG
##SYMBOL=    X,             R,               I
##VAR_TYPE=  INDEPENDENT,   DEPENDENT,       DEPENDENT
##VAR_FORM=  AFFN,          ASDF,            ASDF
##VAR_DIM=   65536,         65536,           65536
##UNITS=     HZ,            ARBITRARY UNITS, ARBITRARY UNITS
##FACTOR=    0.49542278885378, 1,            1
##FIRST=     16045.7642231865, 0,            0
##LAST=      -16421.768244346, 0,            0
##MIN=       -16421.768244346, -239986944,   0
##MAX=       16045.7642231865, 101788191,    0
$$ Real data points
##PAGE= N=1
##DATA TABLE= (X++(R..R)), XYDATA
$$ [...]
##PAGE= N=2
##DATA TABLE= (X++(I..I)), XYDATA
7455A863201J999563J048601j251656k266547m06288K147320K152715j09358j726969
7446C450582j823296j963593k301659j241150O68855N95550j576563k032631J128444
7437e095461M253757L004055j727935n501496n952209m082226j470816J111391
7429a5460940L022707L757810L401556K186431M47946o08058J53824J529447R45247
7420f24030j459834k520015j116862k96963k160426l982624k578165L67697J148134
7411a3223088o6668m04732L04272j18263j320375n78214K163270L782673L078383
7402f382742K337543K880364K894929J218477j40431P43560K558124K826831J160423
7393A0097078j157483l046399l771360l015730j994592k564674m086021l485928
$$ plain form
7455 1863201 3862764 4911365 3659709 1393162 986874 3134194 5286909 5177551 3450582
7446 3450582 1627286 -336307 -2637966 -3879116 -3210261 -2614711 -4191274 -6223905 -5095461
7437 -5095461 -841704 2162351 434416 -5067080 -11019289 -15101515 -16572331 -15460940
7429 -15460940 -12438233 -8680423 -5278867 -3092436 -2644490 -3252548 -3098724 -1569277 -624030
7420 -624030 -2083864 -4603879 -5720741 -6017704 -8178130 -12160754 -14738919 -14371222 -13223088
7411 -13223088 -13289756 -13694488 -13390216 -13508479 -14828854 -15407068 -13243798 -9461125 -6382742
7402 -6382742 -4045199 -1164835 1730094 2948571 2808140 3551700 6109824 8936655 10097078
7393 10097078 8939595 5893196 2121836 -893894 -2888486 -5453160 -9539181 -13025109
7385a3025109j8085K605792J317666j257110k59306L995911N911101K303744l181324
7376a606720m938123k222253J145781K395577K299754K229974J655678J1176j058255
7367h7411J95583K179208J496396j856405l723135j427737K426305L771470K424967
7358E399241R29039j21225k022508m056206l624319p76327J020370n2571j456511
7349d761017n09279J433263J535348J88429R5203J582672J926779l89747l205394
7340b103743l453761q92133K012960L044409K089700N34671j90740M93296J962004
7331C496663K565319R00392k418885m827123m561055k831843j926912j662306
7323a1265750M6325K899304L475755L67106k729584j807444J630778K968316J271829
$$ plain form
7385 -13025109 -13043194 -10437402 -9119736 -10376846 -10636152 -6640241 -729140 1574604 -1606720
7376 -1606720 -6544843 -8767096 -7621315 -5225738 -2925984 -696010 959668 970844 -87411
7367 -87411 108172 2287380 3783776 1927371 -1795764 -3223501 -797196 2974274 5399241
7358 5399241 6328280 6207055 4184547 128341 -3495978 -4272305 -3251935 -3304506 -4761017
7349 -4761017 -5270296 -3837033 -2301685 -2113256 -2018053 -435381 1491398 1101651 -2103743
7340 -2103743 -5557504 -6449637 -4436677 -1392268 697432 1232103 1041363 1534659 3496663
7331 3496663 6061982 6962374 4543489 -283634 -4844689 -7676532 -9603444 -11265750
7323 -11265750 -11219425 -8320121 -4844366 -4477260 -7206844 -9014288 -7383510 -4415194 -3143365
7314c143365l40635n39250j387245l381473l459480j02752L300929L121892P60056
7305e171323K3444J187338J176400j191471l428531l003883l46472K237527L028642
7296e488329J948340L37073j37435Q31025J707004J002495p65783j778330j099393
7287c443333O04582K014014K106882P70272q44517j245121m25284J69140l177
7278b96542K65048J465723J830659k3155k352358k423637n22010N25618n15909
7269b046563j894207j709539j85976J265825J704838J031793m9174k91641P27778
7260a446866J586351O30402j506087k407851r13553J682991L417177L301009J363715
7251E707288j394238l149655k953377k187639k621361l286618j620959K127087
$$ plain form
7314 -3143365 -3484000 -4023250 -5410495 -8791968 -12251448 -12354200 -9053271 -5931379 -5171323
7305 -5171323 -5147879 -3960541 -2784141 -3975612 -7404143 -10408026 -10754498 -8516971 -5488329
7296 -5488329 -3539989 -3202916 -3340351 -2509326 -802322 200173 -565610 -2343940 -3443333
7287 -3443333 -2838751 -824737 1282145 2052417 1207900 -37221 -462505 -293365 -296542
7278 -296542 -31494 1434229 3264888 3241733 889375 -1534262 -2056272 -1530654 -2046563
7269 -2046563 -3940770 -5650309 -5836285 -4570460 -2865622 -1833829 -1883003 -2174644 -1446866
7260 -1446866 139485 769887 -736200 -3144051 -4057604 -2374613 1042564 4343573 5707288
7251 5707288 4313050 1163395 -1789982 -3977621 -6598982 -9885600 -11506559 -9379472
7243i379472M354041K889881j71235j755904j571470q80700K00431J806109K426899
7234b081420O45963k139751l240529k325865j202105m90795Q14425K548581K912595
7225d558901J433076k3974j20878K15755J9564J09282J080267J313530q06836
7216a339115l745852m210361j453509J772114K751966J684636N40826L38935M08850
7207c251510j82621j172661j204309N35224K876151L566501J980728M8061k84225
7198B911339M56564N15966k81583p11819n38398o39767r34439m58588K93098l95623
7188B16750k193881k335621J43092K307005J446057r35882j765054j142455j330566
7179e590555k237464j521339R55035K251703P44067j402174j378982O98031K554792
$$ plain form
7243 -9379472 -5025431 -2135550 -2306785 -4062689 -5634159 -6514859 -6314428 -4508319 -2081420
7234 -2081420 -1435457 -3575208 -6815737 -9141602 -10343707 -10834502 -10020077 -7471496 -4558901
7225 -4558901 -3125825 -3149799 -3270677 -3054922 -3035358 -2926076 -1845809 -532279 -1339115
7216 -1339115 -5084967 -9295328 -10748837 -8976723 -6224757 -4540121 -3999295 -3660360 -3251510
7207 -3251510 -3434131 -4606792 -5811101 -5275877 -2399726 1166775 3147503 3195564 2911339
7198 2911339 3367903 3883869 3602286 2890467 2352069 1712302 777863 319275 612373 216750
7188 216750 -1977131 -4312752 -4169660 -1862655 -416598 -1352480 -3117534 -4259989 -5590555
7179 -5590555 -7828019 -9349358 -8394323 -6142620 -5398553 -6800727 -8179709 -7481678 -4926886
7170d926886K509199N21519k072048l107548j313216J771677L006284J476653
7162b134366l79604k77642Q66265N72422j710220l986962l942778j092386K616791
7153i468480M105228K097406j119902k166165p04969P16706Q59805J115154K017508
7144b547709J633712p71095k303798l46965L096629L830428J005644k367076l532973
7135b303203k232168L87228K778906L472010K503708J697509J835064R21577k447320
7126F613311n552922m631282o20276J762963O01754j124264n97306J051533J305918
7117a190571r0927j642656k329376j964012p56092M94262R26174P69935P14852
7108e068411K66397j359241k822195j664520J875085M660745M973646M341048
$$ plain form
7170 -4926886 -2417687 -1896168 -3968216 -7075764 -8388980 -6617303 -3611019 -2134366
7162 -2134366 -2513970 -2791612 -1925347 -1352925 -3063145 -7050107 -10992885 -12085271 -9468480
7153 -9468480 -5363252 -3265846 -4385748 -6551913 -7256882 -6540176 -5680371 -4565217 -2547709
7144 -2547709 -913997 -1685092 -3988890 -4335855 -1239226 2591202 3596846 1229770 -2303203
7135 -2303203 -4535371 -4148143 -1369237 2102773 4606481 6303990 8139054 9060631 6613311
7126 6613311 1060389 -3570893 -4191169 -2428206 -1826452 -2950716 -3548022 -2496489 -1190571
7117 -1190571 -1281498 -2924154 -5253530 -7217542 -7973634 -7479372 -6553198 -5783263 -5068411
7108 -5068411 -4802014 -6161255 -8983450 -10647970 -8772885 -4112140 861506 5202554
7100E202554M095840L033356J42013k953060m317940m342448m092436l162207
7092f394328j307021r0286l75399r2869K592364N486583N022680J641240r70005
7083E512959j484901k068060l641814l812999r95604K362928K802724L01300k217064
7074c240531k640540j277851M33905J251852N91613r95196j907218r98658J044902
7065g737722K478376K452712J557634O47968l7189n15540o04624k46454J22459
7056a882380l6421p51099j596226k167322k158422j210766O76447K558978L136838
7047c430373K303181J415336J435349J479417J58572k090760l256488k378342
7039d364108p89299l25540j135783j832408j351590j48743M14729k29578r19163
$$ plain form
7100 5202554 9298394 12331750 12473763 9520703 5202763 860315 -3232121 -6394328
7092 -6394328 -7701349 -7791635 -8167034 -8259903 -5667539 -180956 4841724 6482964 5512959
7083 5512959 4028058 1959998 -1681816 -5494815 -6490419 -4127491 -1324767 -1023467 -3240531
7074 -3240531 -5881071 -7158922 -6725017 -5473165 -4881552 -5876748 -7783966 -8782624 -7737722
7065 -7737722 -5259346 -2806634 -1249000 -601032 -638221 -1153761 -1758385 -2004839 -1882380
7056 -1882380 -1918801 -2669900 -4266126 -6433448 -8591870 -9802636 -9126189 -6567211 -3430373
7047 -3430373 -1127192 288144 1723493 3202910 3361482 1270722 -1985766 -4364108
7039 -4364108 -5153407 -5478947 -6614730 -8447138 -9798728 -9947471 -9532742 -9762320 -10681483
7030a0681483o2070J994381K936943J552808l76810n96128L56651L82324n48044
7021e041428n96565L91969N17232n74045p95415N47254J080567n85748j883009
7012f939188l7047L202143L672903O13325k552347k890857r10486J197365K099637
7003b544552J655085K38541j612166l348011m181975k893708P46314M060097L322689
6994d557686j057177l747172j275566K795341K872454m31772j531297J427084
6986e505791M057376K703402o56499k369352k190404j835379j347164J23474J723198
6977e297139J886678R75360O98061J469744K053143J381260n14143k842840m349557
6968d539433l977477k104660l84378K30827K99205L47164J02421p6195R98590
$$ plain form
7030 -10681483 -10743553 -8749172 -5812229 -4259421 -4636231 -5232359 -4875708 -4493384 -5041428
7021 -5041428 -5637993 -5246024 -4728792 -5302837 -6098252 -5550998 -4470431 -5056179 -6939188
7012 -6939188 -6976235 -3774092 -101189 512136 -2040211 -4931068 -5841554 -4644189 -2544552
7003 -2544552 -889467 -650926 -2263092 -5611103 -9793078 -12686786 -11940472 -7880375 -4557686
6994 -4557686 -5614863 -9362035 -10637601 -7842260 -4969806 -5401578 -6932875 -5505791
6986 -5505791 -1448415 1254987 598488 -1770864 -3961268 -5796647 -7143811 -7020337 -5297139
6977 -5297139 -3410461 -2435101 -1737040 -267296 1785847 3167107 2652964 -189876 -4539433
6968 -4539433 -8516910 -10621570 -11005948 -10775121 -10475916 -10128752 -10026331 -10102526 -9103936
6959i103936K887359K946680M2768k979808k812192k20413J445147J153968P68198
6950e872229J287743J529554P65010K4509J04881M06713M49832O62428R82713
6941C41154N00756p20283j230019n17163j1525o18408r89722J43086J402358O53471
6931a046295j406888j937629j57281J451585Q35125p33866q72950J68495m4190
6922c743894k336415m524844m246824j660486J430939L753130M700529L622592
6914c005273Q62958j166954j88121K591306L423706P86352k818008m446401l844486
6905g804921j989412Q25036L463743L052938j306859n591863n109316p96880K296035
6896a2961499K225603J723041K423864K285200L66714l62585J991748M093002
$$ plain form
6959 -9103936 -6216577 -3269897 -3227129 -6206937 -9019129 -9239542 -7794395 -6640427 -5872229
6950 -5872229 -4584486 -3054932 -2289922 -2265413 -2160532 -1753819 -1303987 -641559 341154
6941 341154 841910 121627 -1108392 -1625555 -1637080 -2255488 -3245210 -3102124 -1699766 -1046295
6931 -1046295 -2453183 -4390812 -4548093 -3096508 -2261383 -2995249 -3868199 -3699704 -3743894
6922 -3743894 -6080309 -10605153 -14851977 -16512463 -15081524 -11328394 -6627865 -3005273
6914 -3005273 -2142315 -3309269 -3497390 -906084 2517622 3303974 485966 -3960435 -7804921
6905 -7804921 -9794333 -8969297 -5505554 -2452616 -3759475 -9351338 -14460654 -15257534 -12961499
6896 -12961499 -10735896 -9012855 -6588991 -4303791 -3937077 -4299662 -2307914 1785088
6888A785088K027189k472366m607988l534736k304783j776750M20825M340312
6880f123209N880847K532132k493571m306764k153428J024774K829955K849520
6872D0256J393126o88624j698799p56431O86982P27876j95545k45077O24768O29918
6862E18450o75226j432613l72121J187167J362307M01424l1407M82340O66562
6853B106883k51557j169090o35519Q61064J195768n54176k475609j976337Q23935
6844b074638L129875K971558J233794l21497j433112k520684k916522j818732
6836c749958k55281m8820j023237j182020K16894J636901J714486R78872M45494
6827a266669N4772n77654j091033j003812n08120O0535P04620J230396J186443
$$ plain form
6888 1785088 3812277 1339911 -3268077 -6802813 -9107596 -10884346 -10463521 -6123209
6880 -6123209 -242362 2289770 -203801 -4510565 -6663993 -5639219 -2809264 40256
6872 40256 1433382 744758 -954041 -1710472 -1023490 -295614 -491159 -736236 -111468 518450
6862 518450 -156776 -1589389 -1961510 -774343 587964 989388 957981 1440321 2106883
6853 2106883 1855326 686236 50717 911781 2107549 1553373 -922236 -2898573 -2074638
6844 -2074638 1055237 4026795 5260589 4939092 3505980 985296 -1931226 -3749958
6836 -3749958 -4005239 -4054059 -5077296 -6259316 -6042422 -4405521 -2691035 -1712163 -1266669
6827 -1266669 -1211897 -1789551 -2880584 -3884396 -4392516 -4331981 -3627361 -2396965 -1210522
6818a210522P07744L20418l07998j896755l512105l066537p40526M05051j136083
6809a0437313k491457m40064L470507M876219K750722L62606J49963Q02905K84929
6800f70983q67048p39974J094739L271110M239199L348489J131631r39928j692102
6791H175133j464771j366700j538901j336741r52386j212935j813585j628493
6783c139379r35223j208137k263922k012472L109J285376J17991j666215j624958
6774a1443830l51735K36405M80895J882163L567709L161997Q86651l85610M92108
6765a473247J409059N98340q79056j395955j163538r31144l22531Q01234J018848
6756b337990n87712k243106j493818J229558L098561K709844J533752J349697
$$ plain form
6818 -1210522 -502778 -182360 -490358 -2387113 -5899218 -8965755 -9706281 -9301230 -10437313
6809 -10437313 -12928770 -13368834 -9898327 -5022108 -2271386 -1908780 -1758817 -955912 -670983
6800 -670983 -1538031 -2278005 -1183266 2087844 6327043 9675532 10807163 9867235 8175133
6791 8175133 6710362 5343662 3804761 2468020 1515634 302699 -1510886 -3139379
6783 -3139379 -4074602 -5282739 -7546661 -9559133 -9556024 -8270648 -8152657 -9818872 -11443830
6774 -11443830 -11795565 -11559160 -11078265 -9196102 -5628393 -2466396 -1579745 -1965355 -1473247
6765 -1473247 -64188 534152 -344904 -1740859 -2904397 -3835541 -4158072 -3356838 -2337990
6756 -2337990 -2925702 -5168808 -6662626 -5433068 -2334507 375337 1909089 3258786
6748C258786J843429J364781q80046l870423n512428m366368j218988J321063
6740h060194J506795L05092k92366m7364p0873k91289M59832J792072J651678
6731c046617l17663j622918n12481J292359J222739m65045j652285j587376r61695
6722g650982M5967J406794J921443Q56309L3251J360030K990695J477871k399291
6713D2087l954851j449001J453309J567781M98556P51808J391246P97218M61191
6704A559344K072916L339227J091447l089896m789635l267102j653646j275904
6696f013249l87549J409179K095051J273600R03600R76639j077996n046043o466935
6687a2333703l072481J257721K101542O39044N85708J890029J806707M37591O28440
$$ plain form
6748 3258786 5102215 6466996 5586950 1716527 -3795901 -8162269 -9381257 -8060194
6740 -8060194 -6553399 -6248307 -6540673 -6588037 -6658910 -6950199 -6490367 -4698295 -3046617
6731 -3046617 -3364280 -4987198 -5499679 -4207320 -2984581 -3449626 -5101911 -6689287 -7650982
6722 -7650982 -7605015 -6198221 -4276778 -3420469 -3387218 -2027188 963507 2441378 42087
6713 42087 -3912764 -5361765 -3908456 -2340675 -1842119 -1090311 300935 1098153 1559344
6704 1559344 3632260 6971487 8062934 4973038 183403 -3083699 -4737345 -6013249
6696 -6013249 -6400798 -4991619 -2896568 -1622968 -719368 257271 -820725 -5866768 -12333703
6687 -12333703 -15406184 -14148463 -12046921 -11407877 -10822169 -8932140 -7125433 -6687842 -6059402
6678f059402K795923L866159J818119j746703m116612m114946j856178J751746
6670g661894M564472M329626J311066j547073j904613n10874J89232q49800k178791
6661d258649j611319J082322L346473K368476j342482m028059l096842k83742
6653g823822Q22234o40800k300974j976275Q6630K207511L114671K791439K393939
6644a325447L071226M240110L855175J261863j393658j932897j107811j028435
6636E640126j717434j475306p3673Q19188L76013l53901m16149k28408n68589
6627B001867j551091k603298k494927j46866L234703M111452R07283k855321k684676
6618b080874M56875J573561o14528j672944J500756N692221N994993K445861r40992
$$ plain form
6678 -6059402 -3263479 602680 2420799 674096 -3442516 -7557462 -9413640 -7661894
6670 -7661894 -3097422 1232204 2543270 996197 -908416 -1419290 -1230058 -2079858 -4258649
6661 -4258649 -5869968 -4787646 -1441173 927303 -415179 -4443238 -7540080 -7823822
6653 -7823822 -7001588 -7642388 -9943362 -11919637 -11833007 -9625496 -6510825 -3719386 -1325447
6644 -1325447 1745779 5985889 9841064 11102927 9709269 7776372 6668561 5640126
6636 5640126 3922692 2447386 2373713 3192901 3568914 3215013 2798864 2570456 2001867
6627 2001867 450776 -2152522 -4647449 -4794315 -1559612 2551840 3459123 603802 -2080874
6618 -2080874 -1623999 -50438 -664966 -2337910 -837154 4855067 10850060 13295921 12354929
6609A2354929j796398j094447m19905l18522r68087k281902l293903k891530j209587
6600a919352M90742J024900j3312j877981k630065q24907K171815L231547J668437
6591A321824L38868J156773J853955l88170l996417m934588k644734o03100q93281
6582h788870j561997m08236J423908J522644Q0490m82405Q72374K389739J939821
6573c012532k17069j664228o19747J884437K979102J242591j489686k225890m35322
6564c558344J405392J073798o07574j085863L64614J684829R57172r04922j604642
6555b275540r71135j120313k746777l415618j174844J833250J977610m44014j522438
6546i859819K99237J929375P57031r74427L49790L850749N181932K817227k9199
$$ plain form
6609 12354929 10558531 9464084 9044179 8725657 7757570 5475668 2181765 -709765 -1919352
6600 -1919352 -1428610 -403710 -417022 -2295003 -4925068 -5749975 -3578160 -346613 1321824
6591 1321824 1660692 2817465 4671420 4283250 286833 -4647755 -7292489 -7895589 -8788870
6582 -8788870 -10350867 -10759103 -9335195 -7812551 -7732061 -8214466 -7342092 -4952353 -3012532
6573 -3012532 -3229601 -4893829 -5513576 -3629139 -650037 592554 -897132 -3123022 -3558344
6564 -3558344 -2152952 -1079154 -1686728 -2772591 -2407977 -723148 234024 -670898 -2275540
6555 -2275540 -3246675 -4366988 -7113765 -10529383 -11704227 -9870977 -7893367 -8337381 -9859819
6546 -9859819 -9560582 -7631207 -6874176 -7848603 -7498813 -3648064 1533868 4351095 4321896
6537D321896l53218O78211L74572r34258n76592J808682L012444O96520k867203
6528F161054l630681j455874k04619j820872l377321j781933J293647K173901
6520b642698R18422M82264J179318M29507j865049k375293p3176J557953K97760
6511b090992r18723R72378L715487L190111j90260k592353k569728j783582j100821
6502c368483P8179J162114P10164o77408r37030J27349Q98973R25695R73526O83199
6492E76278o85461j724336n49564J386639R13994j555288k404368p32593M76010
6483d298689q2135J03842K275975L637912K149877J89613M37526J416621M47044
6474F277586j638185k195370j160852m02960k37323K77772P98072L74500l17333
$$ plain form
6537 4321896 3968678 4646889 5021461 4087203 3510611 5319293 8331737 9028257 6161054
6528 6161054 2530373 1074499 869880 -950992 -4328313 -6110246 -4816599 -2642698
6520 -2642698 -1724276 -1242012 -62694 366813 -1498236 -3873529 -3946705 -2388752 -2090992
6511 -2090992 -3009715 -2037337 1678150 4868261 4678001 2085648 -484080 -2267662 -3368483
6502 -3368483 -3290304 -2128190 -1418026 -2095434 -3032464 -2905115 -2006142 -1080447 -106921 576278
6492 576278 -109183 -1833519 -2383083 -996444 -82450 -1637738 -4042106 -4774699 -4298689
6483 -4298689 -4380824 -4276982 -2001007 1636905 3786782 3976395 4413921 5830542 6277586
6474 6277586 4639401 2444031 1283179 880219 642896 920668 1718740 2093240 1775907
6465A775907p8930M64622J34570k88396M99639J391707K72428k312829l738950
6456a880232l088814j589446K83106L058987N623365N440294K136148j665873
6448H317535l790387m492722m405022l046158n64046J216170J050180Q2046J7252
6439e615152P14296Q97292K54208n10303j066896j668073k175796j784990J14556
6430a0840858K992656N095608M653242J712088j556750l111474l162697l052538
6422g270723k694601r31354J728705K999420K141782J303180K232138L466286
6414B974833K672614M94672k90861R83870J882492N44714j670128k287455j009484
6405D295267M63501R28283M17699r83472l143728m583833l209059O46751L547064
$$ plain form
6465 1775907 1696977 2161599 2296169 2007773 2507412 3899119 4171547 1858718 -1880232
6456 -1880232 -4969046 -6558492 -6275386 -3216399 2406966 7847260 9983408 8317535
6448 8317535 4527148 34426 -4370596 -7416754 -7980800 -6764630 -5714450 -5632404 -5615152
6439 -5615152 -4900856 -4003564 -3749356 -4259659 -5326555 -6994628 -9170424 -10955414 -10840858
6430 -10840858 -7848202 -2752594 1900648 3612736 2055986 -1055488 -4218185 -7270723
6422 -7270723 -9965324 -10896678 -9167973 -6168553 -4026771 -2723591 -491453 2974833
6414 2974833 5647447 6142119 5851258 6835128 8717620 9262334 7592206 5304751 4295267
6405 4295267 4758768 5687051 6104750 5121278 1977550 -2606283 -5815342 -5168591 -1621527
6396a621527K845928M9609j475095j063807o85598j025163o81951M95318N37252
6387b625034r90601j537682K95047K011172J251710j353J179576K934688P41966
6378C259489n140046q828843o380942n21608L678570M674881M003222K675375
6370b579902P85409p04404m24735J368640K819203K488466N74611j491369k149757
6361F86162j013897N89672J103238P29886P20446Q31640m76874k938364m023989
6352c792080k717917j318210j722419k206175l17082K879518M341124L554153
6344a299088K387711J291730q43570l130033k784316J46844J613654p98016l726179
6335g141263k340341K803345O312616M950075J171487r11003o31865k78002j056185
$$ plain form
6396 -1621527 1224401 1274010 -201085 -1264892 -1950490 -2975653 -3657604 -3162286 -2625034
6387 -2625034 -3615635 -5153317 -4858270 -2847098 -1595388 -1596741 -417165 2517523 3259489
6378 3259489 -1880557 -10709400 -17090342 -17611950 -13933380 -9258499 -5255277 -2579902
6370 -2579902 -1794493 -2498897 -2923632 -1554992 1264211 3752677 4327288 2835919 686162
6361 686162 -327735 261937 1365175 2095061 2815507 3647147 3170273 231909 -3792080
6352 -3792080 -6509997 -7828207 -9550626 -11756801 -12073883 -9194365 -4853241 -1299088
6344 -1299088 1088623 2380353 1536783 -1593250 -4377566 -4230722 -2617068 -3415084 -7141263
6335 -7141263 -9481604 -6678259 -365643 4584432 5755919 4844916 4213051 3935049 2878864
6326B878864j743048j149254K93M04909J74755L63095J136861J569258J056909
6317D692642o7598j257283k093234j962668n65096J090414J414063L36121n25448
6308A061913k72512M0458o36893j491954j123374L03904J398120J343338L53428
6299I76428r51200j715866j273632k93945m11965j702835j952820J22590K489832
6290d713413K575331R76235m485j93063r18119j514832p4184K462591K746220
6281A342281K00624j868919j518344r42584k192006l466688k262344M52382K054164
6272h201434K199607K104988J668812L39995m99020Q20863L019869L235229J115849
6263E804758j167163k453051l242489l199844j223499J731553K948939J757913
$$ plain form
6326 2878864 1135816 -13438 -13145 391764 566519 929614 2066475 3635733 4692642
6317 4692642 4625044 3367761 1274527 -688141 -1253237 -162823 1251240 1587361 1061913
6308 1061913 789401 829859 192966 -1298988 -2422362 -2118458 -720338 623000 976428
6299 976428 25228 -1690638 -2964270 -3258215 -3670180 -5373015 -7325835 -7203245 -4713413
6290 -4713413 -2138082 -1161847 -1166332 -1359395 -2277514 -3792346 -3866530 -1403939 1342281
6281 1342281 1542905 -326014 -1844358 -2786942 -4978948 -8445636 -10707980 -10255598 -8201434
6272 -8201434 -6001827 -3896839 -2228027 -1888032 -2387052 -1566189 1453680 4688909 5804758
6263 5804758 4637595 2184544 -1057945 -4257789 -5481288 -3749735 -800796 957117
6255I57117L53897R1018k94712j690266k546937j461651L50651R47474L57112
6246b936297j88036j85785L94793J667831K631857J276682k168577l938158j278760
6237d724450L088964M124984J338235r15359r8415J176378j40077k631542k811893
6228a593175n41937R82117J53269r58446j03035J727375J868813j36324j931979
6219e33322j496557M75802J799394J466214L34241l55891k76240J52136M96891
6210B062668N71224K95816l39745j141267j651558j449020p23528l53333r34411
6201c663154j890892k267850k208671k400779k046591O14544M860836O810498
6193b192059M184022j12842j827737j195729j440882k569865j334496K282089
$$ plain form
6255 957117 1311014 1402032 1107320 -582946 -3129883 -4591534 -4240883 -3293409 -2936297
6246 -2936297 -3124333 -3310118 -2915325 -1247494 1384363 2661045 492468 -3445690 -4724450
6237 -4724450 -1635486 2489498 3827733 2912374 2813959 3990337 3850260 1218718 -1593175
6228 -1593175 -2135112 -1152995 -999726 -1958172 -2061207 -333832 1534981 1398657 -533322
6219 -533322 -2029879 -1554077 245317 1711531 2045772 1689881 1413641 1565777 2062668
6210 2062668 2633892 2929708 2589963 1448696 -202862 -1651882 -2375410 -2728743 -3663154
6201 -3663154 -5554046 -7821896 -10030567 -12431346 -14477937 -13863393 -9002557 -2192059
6193 -2192059 1991963 1879121 51384 -1144345 -2585227 -5155092 -6489588 -4207499
6185d207499L633091N21947k784068j906116J019411J190639j194686j947707
6177e674988k4607J310891J80185j582669k307283k685576l069631k072287O83568
6168a5242397L192966L826959L168925K092067M35633j311242j499791J08978
6160e227902J472537J322286R25014J402707J579563K77144j270063j268123k2648
6151h09485J020448J339332Q49872q33700k851441k767511j4718K161017Q21291
6142a084895k148431k598574o4069K042914J639462J62065n14206m11173j84883
6133c161790l487l52002j853366l610984l594927j404036R11482J407945L39721
6124a1321444o62915k81531J714211M025736M220080J153130k970241m583350
$$ plain form
6185 -4207499 -574408 -52461 -2836529 -4742645 -3723234 -2532595 -3727281 -5674988
6177 -5674988 -5699595 -4388704 -4208519 -5791188 -8098471 -10784047 -13853678 -15925965 -15242397
6168 -15242397 -12049431 -8222472 -5053547 -2961480 -2525847 -3837089 -5336880 -5227902
6160 -5227902 -3755365 -2433079 -1508065 -105358 1474205 1751349 481286 -786837 -809485
6151 -809485 210963 1550295 2400167 1566467 -1284974 -4052485 -4067203 -1906186 -1084895
6142 -1084895 -3233326 -5831900 -5895969 -3853055 -2213593 -2051528 -2565734 -2976907 -3161790
6133 -3161790 -3165277 -3517279 -5370645 -8981629 -12576556 -13980592 -13069110 -11661165 -11321444
6124 -11321444 -11984359 -12265890 -10551679 -6525943 -2305863 -1152733 -4122974 -8706324
6116h706324k823601K4877J905618K661474K396959Q33568j038124j208509K93929
6107e660133P92853j250709l770861l852790j319864J760101L575715L320357
6099f405331J136757j228334j312374R73139K648740J591933m87306p63124O86014
6090c159886J709471J477883O80557m43437j748474j892457j22651J456777L39825
6081a702392k188578k509969j79012J521893J009503O66569K240557L469031J808825
6072D136427j073924j615557L43375J617023M51860j451732j759231j94970J899892
6063B353163K984100J942165j146679m324592n131927l292629j000281m7910J28125
6054g536465P88768J562697J184550j89159j098306j065236j031679j193503k79729
$$ plain form
6116 -8706324 -11529925 -11505048 -9599430 -6937956 -4540997 -3707429 -4745553 -5954062 -5660133
6107 -5660133 -4867280 -6117989 -9888850 -13741640 -15061504 -13301403 -9725688 -6405331
6099 -6405331 -5268574 -6496908 -7809282 -6836143 -4187403 -2595470 -3082776 -3845900 -3159886
6090 -3159886 -1450415 27468 708025 264588 -1483886 -3376343 -3498994 -2042217 -1702392
6081 -1702392 -3890970 -6400939 -6579951 -5058058 -4048555 -3381986 -1141429 2327602 4136427
6072 4136427 3062503 1446946 1790321 3407344 3859204 2407472 648241 453271 2353163
6063 2353163 5337263 7279428 6132749 1808157 -3323770 -6616399 -7616680 -7664590 -7536465
6054 -7536465 -6747697 -5185000 -4000450 -4189609 -5287915 -6353151 -7384830 -8578333 -8858062
6045h858062J930445L124816J461378j091703j026837J410901K211997m21018
6037a258083l185633k603572q5335P87900j1750L30251K026347K132282k49996
6028b117589k207928j768036q55604j512984k302491j120575R74221J807398J896327
6019g207261K779387L152133P02595k911900l262493K49265L067470K052681l03136
6010a681259k54091J773908K848030K285657J692229J619897J086793k35468j760482
6001G375214l355634m777576m431242j238893K587843L422210J143502m72538
5993B52886R81175L410465L612677J581527l80658j241406j828025k645264l064395
5984F78982k595993j580009m94187N16446J357452J842243J816950J132928j79834
$$ plain form
6045 -8858062 -6927617 -3802801 -2341423 -3433126 -4459963 -3049062 -837065 -1258083
6037 -1258083 -4443716 -7047288 -7132623 -6344723 -6356473 -6026222 -3999875 -1867593 -2117589
6028 -2117589 -4325517 -6093553 -6949157 -8462141 -10764632 -11885207 -10910986 -9103588 -7207261
6019 -7207261 -4427874 -1275741 -573146 -3485046 -6747539 -6498274 -3430804 -1378123 -1681259
6010 -1681259 -1935350 -161442 2686588 4972245 6664474 8284371 9371164 9135696 7375214
6001 7375214 4019580 -757996 -5189238 -6428131 -3840288 -418078 725424 252886
5993 252886 1234061 4644526 8257203 9838730 9458072 8216666 6388641 3743377 678982
5984 678982 -1917011 -3497020 -3991207 -3474761 -2117309 -275066 1541884 2674812 2494978
5975B494978j452902j690484p89362J37435J33043m90780q25993m68128M10890
5966b541303J208417Q00752j380051l603718k926277P21980L323042J659009k033919
5957d772068k909092j26311K419880J916876P116n70571K0987k35569j920427
5948f169179l617071l731699j848850R02591K337426J240412p45471q14546J060360
5939a1386027J988058O96435m27898N16243J432198l80139l273886l148861N73575
5930a3410302M289709N393408M815396L919624K150725p65901k898575k503692
5922I90392q27537n17085k013758l198281k295104K03398K502876L420258L050211
5913A315370K000913M77210j464620k835747j999932R88967L257775K051638j521167
$$ plain form
5975 2494978 1042076 -648408 -1437770 -1300335 -1167292 -1658072 -2484065 -2952193 -2541303
5966 -2541303 -1332886 -532134 -1912185 -5515903 -8442180 -7720200 -4397158 -2738149 -4772068
5957 -4772068 -7681160 -7807471 -5387591 -3470715 -3463599 -4034170 -4013183 -4248752 -6169179
5948 -6169179 -9786250 -13517949 -15366799 -14464208 -12126782 -10886370 -11631841 -12446387 -11386027
5939 -11386027 -9397969 -8701534 -9129432 -8613189 -7180991 -7561130 -10835016 -13983877 -13410302
5930 -13410302 -9120593 -3727185 1088211 5007835 7158560 6392659 3494084 990392
5922 990392 162855 -354230 -2367988 -5566269 -7861373 -7657975 -5155099 -1734841 1315370
5913 1315370 3316283 3793493 2328873 -506874 -2506806 -1517839 1739936 3791574 2270407
5904B270407l636131k718943j051135q17088j004192K21863K119972K600208J606460
5895d08579R01741J024105O92328p52217k210553k462661j520974q8296J121611
5886c703495J356383L02064j211427k019942k173408k545684k967473k197487
5878a5160469J7217K281816L325264L079371J737772n29284k343841j621838J419302
5869g794690L505257K228871p00243j991241j230636n01620n55615j87608Q39916
5860f387609J194105P20281R74214K051566J642591j090838l140149j537526K066175
5851c507190L378627J111320j904251k780217j284886J347694L767787M322424
5843D451308J985101j627226l237836j990017o58644j552410l186064k925902
$$ plain form
5904 2270407 -1365724 -4084667 -5135802 -5952890 -6957082 -6735219 -4615247 -2015039 -408579
5895 -408579 493162 1517267 2209595 1457378 -753175 -3215836 -4736810 -4825106 -3703495
5886 -3703495 -2347112 -2045048 -3256475 -5276417 -7449825 -9995509 -12962982 -15160469
5878 -15160469 -15143252 -12861436 -9536172 -6456801 -4719029 -5248313 -7592154 -9213992 -7794690
5869 -7794690 -4289433 -2060562 -2760805 -4752046 -5982682 -6484302 -7039917 -7227525 -6387609
5860 -6387609 -5193504 -4473223 -3499009 -1447443 195148 -895690 -4035839 -5573365 -3507190
5851 -3507190 -128563 982757 -921494 -3701711 -4986597 -3638903 128884 4451308
5843 4451308 6436409 4809183 1571347 -418670 -1077314 -2629724 -5815788 -8741690
5835h741690j294782r82365k223124k037995J308704N342546O267737L625902
5827A264933N92539m6279J002456Q45023j736496m424983l747136Q58886N954988
5818E63931P383246M251708o09877l612076l322146j016160P88739N03343j140247
5809C790461j950319r48522L54730J34770j017758j024444L00516P31558r49785
5800e78793k826672k410933o4967J698365J540987K51022j184798k567777l405658
5791i549224k711255o60401J015782J312108J354749K252221K765062J075463
5783c145495j757293k550083n15620J391642Q34477l76543P62035L430473L816861
5774A890454P72664k241654j860570P87809K096979R41331m99850m15574K25784
$$ plain form
5835 -8741690 -10036472 -11018837 -13241961 -15279956 -13971252 -8628706 -2360969 1264933
5827 1264933 1857472 1811193 2813649 3658672 1922176 -2502807 -6249943 -5391057 563931
5818 563931 7947177 12198885 11589008 7976932 4654786 3638626 4427365 4930708 3790461
5809 3790461 1840142 891620 1246350 1381120 363362 -661082 -360566 370992 -578793
5800 -578793 -3405465 -5816398 -5881365 -4183000 -2642013 -2390991 -3575789 -6143566 -9549224
5791 -9549224 -12260479 -12920880 -11905098 -10592990 -9238241 -6986020 -4220958 -3145495
5783 -3145495 -4902788 -7452871 -7968491 -6576849 -5742372 -6118915 -5356880 -1926407 1890454
5774 1890454 2663118 421464 -1439106 -651297 1445682 2387013 1887163 1471589 1697373
5765A697373m38974k190752k806735r13361K106976L548030K451071N26314k46967
5756C732975r9518o05351j880884k196705o78596J030473P58014j320372k748500
5747d008464j535335J613764L687204K126545k233190n334928m111235j79608
5739i975247K315685K250568K280468L550356L098054j146067n657930n338816
5731h622929q26977K191808P86861j923531k064111j11589J098662Q91011Q29660
5722g751135J569210J945540J079250j94468n16845p687l67481k550546m726567
5713a1520729l911197q8356L028624K717461R72874J280778L180641L191038M43777
5704g05089k127023k314435r23405R17908L130653M443933K597373j480074l266383
$$ plain form
5765 1697373 1258399 -932353 -3739088 -4652449 -2545473 1002557 3453628 3979942 3732975
5756 3732975 3633457 3028106 1147222 -1049483 -1728079 -697606 60408 -1259964 -4008464
5747 -4008464 -5543799 -3930035 -242831 1883714 -349476 -5684404 -9795639 -9975247
5739 -9975247 -7659562 -5408994 -3128526 421830 3519884 2373817 -3284113 -8622929
5731 -8622929 -9449906 -7258098 -6471237 -8394768 -10458879 -10570468 -9471806 -8580795 -7751135
5722 -7751135 -6181925 -4236385 -3157135 -3351603 -3868448 -3876135 -4243616 -6794162 -11520729
5713 -11520729 -15431926 -15520282 -12491658 -9774197 -8801323 -7520545 -4339904 -1148866 -705089
5704 -705089 -2832112 -5146547 -6069952 -5152044 -2021391 2422542 5019915 3539841 273458
5695B73458p20205K478610K373408K46843n19426j88950j260271l362487l846646
5686d525666k333297o59169R06590L394135N574707M817846J616132o90795j115517
5677F984966j990265l963709m186796j215326J933124J986351j41247j524501
5669b117403j516847j391967j550572j562938j678858k080890j698643K19746
5661a3378372K253290K370193O09068j342750k377724k292605r39425J224335
5653a3873990K624271K323394J440593J157933M71816j840890l979387k726037
5645a4402297J737672N312402M850671J391017k000723l448534k575211J51733
5637h983270L004582L650142J758753k68350m91371q1569j264335l732231m924878
$$ plain form
5695 273458 -446747 2031863 4405271 4652114 4132688 3943738 2683467 -679020 -4525666
5686 -4525666 -6858963 -7518132 -6611542 -3217407 2357300 7175146 8791278 8100483 6984966
5677 6984966 4994701 1030992 -3155804 -4371130 -2438006 -451655 -592902 -2117403
5669 -2117403 -3634250 -5026217 -6576789 -8139727 -9818585 -11899475 -13598118 -13378372
5661 -13378372 -11125082 -8754889 -8145821 -9488571 -11866295 -14158900 -15098325 -13873990
5653 -13873990 -11249719 -8926325 -7485732 -6327799 -5855983 -7696873 -11676260 -14402297
5645 -14402297 -12664625 -7352223 -2501552 -1110535 -3111258 -6559792 -9135003 -8983270
5637 -8983270 -5978688 -2328546 -569793 -838143 -1329514 -1411083 -2675418 -6407649 -11332527
5628a1332527l291010L15696L938652N624909L900146p47409m953602n196450
5620a1741595j850581J303989J993508J734168K422191L094008J946019k42482
5612a340775j109832j74172R75951J348709J164733K31339j795405l470232k504847
5603f674531O49572K562981J290836j051748j595159o39544m08856j376500j967746
5594i210695j103169Q38804K998992M302125L406749K57360k709130k801565m24057
5585d444586J517940J460066O00531L71192M52907k0998q63899j332712j167070
5576c426629m76916M92292J034104M33208p72678j011436K55821J642244J691115
5567a38875P88762M26333J107741J765255J096739r08926k772141k997817j969888
$$ plain form
5628 -11332527 -14623537 -14307841 -10369189 -4744280 -844134 -1591543 -6545145 -11741595
5620 -11741595 -13592176 -12288187 -10294679 -8560511 -6138320 -3044312 -1098293 -1340775
5612 -1340775 -2450607 -2624779 -1648828 -300119 864614 1095953 -699452 -4169684 -6674531
5603 -6674531 -6024959 -3461978 -2171142 -3222890 -4818049 -5457593 -5866449 -7242949 -9210695
5594 -9210695 -10313864 -9475060 -6476068 -2173943 1232806 1490166 -1218964 -4020529 -4444586
5585 -4444586 -2926646 -1466580 -866049 -494857 -41950 -62948 -926847 -2259559 -3426629
5576 -3426629 -3903545 -3411253 -2377149 -1943941 -2716619 -3728055 -3472234 -1829990 -138875
5567 -138875 649887 1076220 2183961 3949216 5045955 4137029 1364888 -1632929 -3602817
5558c602817j735992l096097l718386q50191M315739P067351M604794o57886m112183
5549a785668l795721j212597J192435J895820O28123j537933k752890k124857
5541i493288o00371N35928J311048K372536L496968L910504L431698K194906j724
5532G158205k731264m078116k553761L98559J737163Q45533K78422J765122L336147
5523F156010J998954j822975m459808l524392o38166R62242L70621n20866K700
5514a475680J316825J615401L87481r90071r32047N40359J660360N83930k433606
5505B72952m620688l377121L52977K705989J744623J24492J169925L686693L574294
5496E634136K14483k217002q25532J807423J635957j067144k758970k009843p68265
$$ plain form
5558 -3602817 -5338809 -8434906 -12153292 -13003483 -8687744 -1620393 2984401 2326515 -1785668
5549 -1785668 -5581389 -6793986 -5601551 -3705731 -3077608 -4615541 -7368431 -9493288
5541 -9493288 -10093659 -9557731 -8246683 -5874147 -2377179 1533325 4965023 7159929 7158205
5532 7158205 4426941 348825 -2204936 -1806377 -69214 776319 1054741 2819863 6156010
5523 6156010 8154964 6331989 1872181 -1652211 -2290377 -1328135 -957514 -1478380 -1475680
5514 -1475680 -158855 1456546 1844027 853956 -78091 462268 2122628 2706558 272952
5505 272952 -4347736 -7724857 -7371880 -4665891 -2921268 -2796776 -1626851 2059842 5634136
5496 5634136 5848619 3631617 2806085 4613508 6249465 5182321 2423351 413508 -354757
5487c54757o75761j002768p20172l19519n56095r13428m76287M48869N59477p20635
5477d731076k201757j913671M91910K518758J193310k850257n149573k606712
5469a5249068K388753M927323L675972J538452O89130K3372j696692l025050k062270
5460h790078K68345J288048J18443j528873j745835k97726J689357K880302K674611
5451c443406J691618J145270J401444J729071J761523K065093K523539J616716
5443A0490868j139869l237611j932472J485632K705324M2414l304199l621593
5435A488494j170549J205968K138682K279993J935104N89928j346136k357489
5427D763995j738997l50244O75705Q30110P0292q20730j01178K775462N076761
$$ plain form
5487 -354757 -1030518 -2033286 -2753458 -3072977 -3629072 -4542500 -5018787 -4569918 -4010441 -4731076
5477 -4731076 -6932833 -8846504 -8354594 -5835836 -4642526 -7492783 -12642356 -15249068
5469 -15249068 -12860315 -7932992 -4257020 -2718568 -2029438 -2006066 -3702758 -6727808 -8790078
5460 -8790078 -8521733 -7233685 -7115242 -8644115 -10389950 -10687676 -8998319 -6118017 -3443406
5451 -3443406 -1751788 -606518 794926 2523997 4285520 6350613 8874152 10490868
5443 10490868 9350999 6113388 4180916 5666548 8371872 8414286 5110087 1488494
5435 1488494 317945 1523913 3662595 5942588 7877692 8467620 7121484 4763995
5427 4763995 3024998 2674754 3350459 4180569 4250861 3430131 3328953 6104415 11181176
5418A1181176L354345j516496m608560l308355n85274j56986j234070q32956R57494
5409C250318J546595M18019m40454j81033J42558K52748Q52462J166272l84261
5400F623224k789230l225965j811844j819853l956819m380903o40497L885467
5392h116420M425429J108228k141264k895780j479128J208547L940805M536061
5384E86478K057814j143364k149604j284526p36735o67900K93660J684551J725391
5375C65765P73358Q75400J887666J393665j057381k836836k282118j015914r97285
5366b893680j681971j548465n14236O25254J709350K836245L474813K983159J450083
5357F440552l72132j444858j019726K63475M88074j005895k095924p87255J331616
$$ plain form
5418 11181176 14535521 13019025 8410465 5102110 4516836 4359850 3125780 2292824 3250318
5409 3250318 4796913 5214932 4774478 4593445 4736003 4988751 5841213 7007485 6623224
5400 6623224 3833994 608029 -1203815 -3023668 -6980487 -11361390 -12001887 -8116420
5392 -8116420 -3690991 -2582763 -4724027 -7619807 -9098935 -7890388 -3949583 586478
5384 586478 2644292 1500928 -648676 -1933202 -2669937 -3337837 -3044177 -1359626 365765
5375 365765 1139123 2014523 3902189 5295854 4238473 1401637 -880481 -1896395 -2893680
5366 -2893680 -4575651 -6124116 -6638352 -6013098 -4303748 -1467503 2007310 4990469 6440552
5357 6440552 6068420 4623562 3603836 3867311 4355385 3349490 1253566 466311 1797927
5348A797927J202216p93254j349620L15890J213974l12724j829976r09047J080354
5339D15740J498941L63088n65461p80834r80827j430421k084651k937356k969014
5330i470795o80698K885781M048507J449079j279104m34686K354580K878501P25735
5321B476900q62793n34116j54143o12429k54279J472631K136716j22721l415600
5312A30166m355705k196029P62462K094191J495180N39374Q00812K048527K455147
5303C774125J044398p65184j129886m72197m73455r95167l53184J380720K004501
5294D014671P28337n93330r24055j908596m251617m955564j437107L364622M021496
5285a941143K99932k365116p77014J817480J407343p65065j266942n97686j654275
$$ plain form
5348 1797927 3000143 2206889 857269 1173159 2387133 2074409 244433 -664614 415740
5339 415740 1914681 2277769 1712308 931474 -49353 -1479774 -3564425 -6501781 -9470795
5330 -9470795 -10151493 -7265712 -3217205 -1768126 -3047230 -3481916 -1127336 1751165 2476900
5321 2476900 1614107 1079991 925848 313419 59140 1531771 3668487 3545766 130166
5312 130166 -4225539 -6421568 -5659106 -3564915 -2069735 -1530361 -729549 1318978 3774125
5303 3774125 4818523 4053339 2923453 2451256 1977801 982634 629450 2010170 4014671
5294 4014671 4743008 4149678 3225623 1317027 -2934590 -7890154 -9327261 -5962639 -1941143
5285 -1941143 -1641211 -4006327 -4783341 -2965861 -1558518 -2323583 -3590525 -4188211 -5842486
5276e842486l604366k564882J419096L328802Q10351j941820q68489J625205J159461
5267f479128j156700r90522J477590J958493j82888m90839K999272O011273M347923
5258G494474j60917k945830k722755j239611L40934J601551J349096r18855l229196
5249d31109l417262k141885j427728j476848j176009m54849K20259J394512L189490
5240e721429L673303J472117j158292r71528J411399K564563J614423R58001J630536
5231E473093J662908j49303k179878k924539l117421l450244k857137q97054M43482
5222g996093m71501j950098j021899K400263N298626N070337J897304j985186
5214A241753m197397l713581j524140K32030L76211k58739j98589P73195J587003
$$ plain form
5276 -5842486 -9446852 -12011734 -10592638 -7263836 -6453485 -8395305 -9263794 -7638589 -6479128
5267 -6479128 -7635828 -8626350 -7148760 -5190267 -5373155 -5863994 -2864722 3146551 7494474
5258 7494474 7333557 4387727 1664972 425361 766295 2367846 3716942 2798087 -431109
5249 -431109 -3848371 -5990256 -7417984 -8894832 -10070841 -10525690 -10305431 -8910919 -5721429
5240 -5721429 -2048126 -576009 -1734301 -2705829 -1294430 1270133 2884556 3842557 5473093
5231 5473093 7136001 6986698 4806820 1882281 -1235140 -4685384 -7542521 -8439575 -7996093
5222 -7996093 -8467594 -10417692 -11439591 -9039328 -3740702 1329635 3226939 1241753
5214 1241753 -2955644 -6669225 -8193365 -7961335 -7585124 -7843863 -8042452 -7269257 -5682254
5205e682254J336025K56149n25622k9110J474142K388320J365362j013885k740871
5196c171744k584153j114979M32133J418503J761366J563477J173267R47057O88890
5187A113817m9498j011624j371460r67426m96387k24995M75167J770296K464673
5178A702563J326809j111381k812811k210068L87373L137459M148963K844517
5170G413424J90408k261641l417523k890699r88409J034174J420841l68208k650158
5161b517791l192099j753488m6053O34940N78052M76911M49843O49018J583361
5152c137306L028715L533183J992399p60551k786246l165267k535785j755578
5144e586436r93537l33154l37606j240824k010229j196938J168967L364143L963048
$$ plain form
5205 -5682254 -4346229 -4090080 -4615702 -4644812 -3170670 -782350 583012 -430873 -3171744
5196 -3171744 -5755897 -6870876 -6438743 -5020240 -3258874 -1695397 -522130 424927 1113817
5187 1113817 1064319 52695 -1318765 -2286191 -2782578 -3007573 -2532406 -762110 1702563
5178 1702563 3029372 1917991 -894820 -3104888 -2717515 419944 4568907 7413424
5170 7413424 7603832 5342191 1924668 -966031 -1954440 -920266 500575 132367 -2517791
5161 -2517791 -5709890 -7463378 -7509431 -6874491 -6296439 -5819528 -5369685 -4720667 -3137306
5152 -3137306 -108591 3424592 5416991 4656440 1870194 -1295073 -3830858 -5586436
5144 -5586436 -6579973 -6913127 -7250733 -8491557 -10501786 -11698724 -10529757 -7165614 -3202566
5135c202566L231631K105162Q18565n65525j293864r05410k51480o0513N62057
5126D38057K239487K949475M22594l481089m255251j129985J553785N89622j954021
5117b627326k749753k055249j916254k291843j923540r12454K94993K306710M458864
5108g415852L688594q41397m461168k522605K634642M754308K405484r0330K11184
5099a637140J683421K161858J674011O06696r05179j346475O31218K848506J804208
5090G521124j600670k962933j368866n69793k191713k987256q04998J604443J358480
5081b002182k92880j224708j908381k737204j929667N69778J060317k037089l892330
5072a4394346K36314O856284Q094883K572096k880334k637237J147831K832409
$$ plain form
5135 -3202566 29065 2134227 2952792 2387267 1093403 187993 -63487 -124000 438057
5126 438057 2677544 5627019 6049613 2568524 -1686727 -2816712 -1262927 -673305 -2627326
5117 -2627326 -5377079 -7432328 -9348582 -11640425 -13563965 -14476419 -14181426 -11874716 -7415852
5108 -7415852 -3727258 -4568655 -9029823 -11552428 -8917786 -4163478 -1757994 -1848324 -1637140
5099 -1637140 46281 2208139 3882150 4488846 3583667 2237192 2868410 5716916 7521124
5090 7521124 5920454 2957521 1588655 1018862 -1172851 -4160107 -4965105 -3360662 -2002182
5081 -2002182 -2295062 -3519770 -5428151 -8165355 -10095022 -9525244 -8464927 -10502016 -14394346
5072 -14394346 -14158032 -7301748 793135 3365231 484897 -2152340 -1004509 1827900
5064A827900Q25839j432631o32219K278857L500078J248476j937171k571898p84402
5055B322829M39947j35745r00395q18770p84744j007762l14732R89879Q68110
5046F58617p14376j308021n59481j274473l959393m622844r92125L069113L051750
5037f651233L25213q24510K42618J152237J245743J288871M29608k138859m016221
5028h946533k436721R10363K095516R91418Q74046K630810L614782K281085K23050
5019B237816p37452m64146N75691J649703J250352j191070l492956l103569p19878
5010c995509Q26972M19976j006291k714886l980133k991894Q37007M472507M412736
5001c719515J476291n59466j58523J169853K098363K157097L09869l451653n905086
$$ plain form
5064 1827900 2653739 1221108 588889 2867746 6367824 7616300 5679129 3107231 2322829
5055 2322829 2762776 2627031 1726636 907866 123122 -884640 -1199372 -209493 658617
5046 658617 -55759 -1363780 -1923261 -3197734 -7157127 -11779971 -12772096 -9702983 -6651233
5037 -6651233 -6326020 -7150530 -6907912 -5755675 -4509932 -3221061 -2791453 -4930312 -8946533
5028 -8946533 -11383254 -10472891 -8377375 -7385957 -6511911 -3881101 -266319 2014766 2237816
5019 2237816 1500364 1036218 1611909 3261612 4511964 3320894 -172062 -3275631 -3995509
5010 -3995509 -3168537 -2748561 -3754852 -6469738 -10449871 -13441765 -12604758 -8132251 -3719515
5001 -3719515 -2243224 -2802690 -2961213 -1791360 307003 2464100 2773969 -677684 -6582770
4992f582770l777172J314222M617368M441019L063763K027034M12834k139961
4984C376337m221040m798427l903317j484398J789581L439109J882672o68646
4976d588129j056069K67305P45666K82558N50474J168017O24438k50523J46362
4967b109901N81176p19482j862818l34390J465390n25296m515038m939658j458558
4958a4418575P79884l4942j32184K269012L816772K365036N51716P66542J591504
4949b445235J367007Q09541L29535j028203k586892k084959K55327J675465J350902
4940b357512Q32343K71008j122895j535295J034483L547489J375100l620657n340889
4931f916825l254420k223520k801723n66819M112861N122034J416444n37522K066901
$$ plain form
4992 -6582770 -10359942 -9045720 -4428352 12667 3076430 5103464 5516298 3376337
4984 3376337 -844703 -5643130 -9546447 -11030845 -9241264 -5802155 -3919483 -4588129
4976 -4588129 -5644198 -5376893 -4631227 -4348669 -3798195 -2630178 -2005740 -2256263 -2109901
4967 -2109901 -1528725 -2248207 -4111025 -4445415 -2980025 -3505321 -8020359 -12960017 -14418575
4958 -14418575 -13638691 -13673633 -13805817 -11536805 -7720033 -5354997 -4803281 -4036739 -2445235
4949 -2445235 -1078228 -268687 60848 -967355 -3554247 -5639206 -5383879 -3708414 -2357512
4940 -2357512 -1525169 -1254161 -2377056 -3912351 -2877868 669621 2044721 -1575936 -6916825
4931 -6916825 -10171245 -12394765 -15196488 -15763307 -11650446 -6528412 -5111968 -5649490 -3582589
4922c582589L897147J491973j223365j166149j016922j962931m33412L629839
4914c66409M248687j82851k996700o32807J367745j010365l279383j955902j247808
4905f055793l768703m419746n35508J796308j002078k593372J385510M441903
4897a0751479J027592l165627j996820M97745k30794m4118L406827L012038m039846
4888a2284482p734633k454647J423627l424533o565178q4619M034833l711824
4880c0801456r495422j463655M230085p728693j8432539r052376p773732m8730252
4872a29248040r4159049o4368659M2353411J25107977J07110020L2049073q496773
4865A0347960K820427J4465826J147462j0690061l336854M723735o07603n928314
$$ plain form
4922 -3582589 314558 1806531 583166 -582983 -1599905 -3562836 -3996248 -366409
4914 -366409 3882278 3699427 702727 69920 1437665 427300 -2852083 -4807985 -6055793
4905 -6055793 -9824496 -14244242 -14779750 -12983442 -13985520 -16578892 -15193382 -10751479
4897 -10751479 -9723887 -12889514 -14886334 -14388589 -14619383 -14663501 -11256674 -8244636 -12284482
4888 -12284482 -20019115 -22473762 -21050135 -24474668 -31039846 -31124465 -27089632 -30801456
4880 -30801456 -40296878 -41760533 -37530448 -45259141 -63691680 -72744056 -80517788 -129248040
4872 -129248040 -223407089 -287775748 -245422337 -120314360 -13204340 18844733 10347960
4865 10347960 13168387 27634213 28781675 18091614 14754760 19478495 18870892 12942578
4857A2942578o35007L999048o57519m590485k84757L252923o42147l597390M57884
4848A0245128L291358j327349n433711j837336L022489J813606q85363J020145
4840I908967L314994L96668l782224l514367j493469k083932k440242Q02678L365432
4831D474505P47698k677843q11242L457281L326561n91166k369152q53351J09231
4822D812522p17043r86618r7895J48159n75150q09145p1388R94389J932284J966355
4812F596470K33668j995876k067883r2889J008091M93071N87227J329603j04399
4803E987083l252022l348663Q56958L947763J835681k366477l973205l011653
4795c324535j170922K140901O288548P021250K528241k462742l369522k219666
$$ plain form
4857 12942578 12307571 16306619 15649100 11058615 10773858 14026781 13384634 9787244 10245128
4848 10245128 13536486 12209137 6775426 4938090 7960579 9774185 8888822 9908967
4840 9908967 13223961 13620629 9838405 6324038 4830569 2746637 306395 1109073 4474505
4831 4474505 5222203 2544360 1733118 5190399 8516960 7925794 5556642 4703291 4812522
4822 4812522 4095479 3108861 3010966 3159125 2583975 1774830 1703442 2697831 4630115 6596470
4812 6596470 6830138 4834262 2766379 2673490 3681581 4174652 4761879 6091482 5987083
4803 5987083 2735061 -613602 243356 4191119 6026800 3660323 -312882 -3324535
4795 -3324535 -4495457 -2354556 3933992 10955242 13483483 11020741 7651219 5431553
4787E431553k649682l092216o64782K252715J699985p04027o00194J525536J731091
4778D929979l33493j704865j863449k445813k549241j27281K858290K436919o70974
4769E30072j872884q9069J064479k56969j683815j446803q83256r81446n67267
4760f186958Q33252J886637K151012K517496K313576l72992m527006o053894l298685
4751a0737562M58418J624188N57195m66770q52606j106510o99864J093705L209391
4742f920415L593994J802392l22428o14717J150223L003782K981760J509487O74812
4733F858890R50777M15152j741014l071853j372330J464493J942350J63467o76752
4724D933180M92050J253257j36941k245043k953504k071737o15288N36660O15049
$$ plain form
4787 5431553 2781871 -310345 -975127 1277588 2977573 2273546 1673352 3198888 4929979
4778 4929979 4596486 2891621 1028172 -1417641 -3966882 -4094163 -1235873 1201046 530072
4769 530072 -1342812 -1431881 -367402 -624371 -2308186 -3754989 -4638245 -5619691 -6186958
4760 -6186958 -5353706 -3467069 -1316057 1201439 3515015 3142023 -1384983 -7438877 -10737562
4751 -10737562 -10279144 -8654956 -8097761 -8564531 -9417137 -10523647 -11223511 -10129806 -6920415
4742 -6920415 -3326421 -1524029 -1846457 -2461174 -1310951 1692831 4674591 6184078 6858890
4733 6858890 7809667 8224819 6483805 3411952 2039622 3504115 5446465 5609932 4933180
4724 4933180 5425230 6678487 6541546 4296503 1342999 -728738 -1344026 -807366 -192317
4715a92317n32671j402976k28704K100815K588228K99718k121739k152520o27935
4706b270101J32123j67677O4193J498859K854520K586952O70576j402736k088161
4697A878548j318997n09610p52670j415388j243407m11538k73855j153514j738989
4688f939420j079284k8945M8529o74984o20516J078287L164313L432854J380777
4679b38389r15893j277215k81744l11214j840202k585162j062169R29360Q49622
4670f733006r65233j939702o12124K168694M631339N300471L648407Q89277o77518
4661E710605l37492M1593j097340k511946k201809n08359P98569J190166R60801
4652B044788m65585l206258n060248l866800q84472J059327J833558L080941L930185
$$ plain form
4715 -192317 -724988 -2127964 -2356668 -255853 2332375 2632093 510354 -1642166 -2270101
4706 -2270101 -2137978 -2305655 -2241462 -742603 2111917 4698869 5369445 3966709 1878548
4697 1878548 559551 49941 -702729 -2118117 -3361524 -3773062 -4046917 -5200431 -6939420
4688 -6939420 -8018704 -8047649 -7999120 -8674104 -9294620 -8216333 -5052020 -1619166 -238389
4679 -238389 -1154282 -2431497 -2713241 -3024455 -4864657 -7449819 -8511988 -7582628 -6733006
4670 -6733006 -7698239 -9637941 -10250065 -8081371 -3450032 1850439 5498846 6388123 5710605
4661 5710605 5373113 5414706 4317366 1805420 -396389 -904748 -106179 1083987 2044788
4652 2044788 1579203 -1627055 -6687303 -10554103 -11438575 -10379248 -8545690 -5464749 -1534564
4643a534564J897320j807115k408012J590444N600780N096831J428785q93161
4635H971308k94967R99353O03891j713662m369790n158354l075609J36596J530800
4626b370434O24315k25547L25752Q14002J74383K8615J688259L162232J867285
4617F088862j128659k358923p88336J062096P20093j377574k790923j725832J154901
4608a144295L028616J709624j409525k523855k47894K453548K393262L08145r68196
4599C599430p01128k02039P0661N99823Q27091n9500p44651Q89376L951215M885020
4589A3115298K228137j474118l298746l159601k425606j617380q76551q08528
4581A682905j293948j049299J33273L77315j242797k341442m03997K820129L173477
$$ plain form
4643 -1534564 362756 -1444359 -3852371 -2261927 3338853 8435684 9864469 8971308
4635 8971308 8676341 9675694 10279585 8565923 4196133 -962221 -4037830 -3901234 -2370434
4626 -2370434 -1746119 -1971666 -1645914 -831912 -657529 -628914 1059345 4221577 6088862
4617 6088862 4960203 2601280 1812944 2875040 3595133 2217559 -573364 -2299196 -1144295
4608 -1144295 1884321 3593945 2184420 -339435 -587329 1866219 4259481 4567626 3599430
4599 3599430 2898302 2696263 2766924 3366747 4193838 4134338 3389687 4279063 8230278 13115298
4589 13115298 15343435 13869317 10570571 7410970 4985364 3367984 2491433 1682905
4581 1682905 388957 -660342 -527069 -149754 -1392551 -3733993 -4137990 -1317861 1855616
4572A855616J41662k119585o34429K346982K860612O48371j226673r70398J84567
4563C086725N48537J84929J07873O37223J084049M29035j628628l696734l426224
4554b673215l89938K530703K378775J47242p10835M86237Q54563j079287k845798
4545a301553k090377k78116N06q99275j010234l08642m931K70452J484621K520667
4535a616882J703597J84459M17672J807993J497497o74084j839975j046617n35670
4526a02010j217592r23461J244969K681635J594779J06326M54125J205772J67681
4517E212224j734545k705683l628951n623553o217038k417194L460683N582082
4509h071975K260964k127924l389276j956433j56924J393140K830210L243533
$$ plain form
4572 1855616 1997278 -122307 -756736 1590246 4450858 5099229 3872556 2902158 3086725
4563 3086725 3635262 3820191 3928064 4565287 5649336 6078371 4449743 753009 -2673215
4554 -2673215 -3063153 -532450 1846325 1993567 1282732 1768969 2623532 1544245 -1301553
4545 -1301553 -3391930 -3670046 -3669540 -4568815 -5579049 -5887691 -5892622 -5622170 -4137549 -1616882
4535 -1616882 86715 271174 688846 2496839 3994336 3320252 1480277 433660 -102010
4526 -102010 -1319602 -2243063 -998094 1683541 3278320 3384646 3838771 5044543 5212224
4517 5212224 3477679 771996 -2856955 -8480508 -14697546 -17114740 -13654057 -8071975
4509 -8071975 -5811011 -7938935 -11328211 -13284644 -13441568 -12048428 -9218218 -5974685
4501e974685K093123P08756M14852M19433o65651k202788k223795k51908K094645
4492e588018L111576K403935M77804j781160l109783k549478o43642Q74478J149007
4483e655281J188635K019756K686056J566781o13983j111464Q59561K501844J341309
4474D783214r93006j264755K70031L05255k216847m478122m109262k152363n11911
4465a0367766P76332K093240K572338J866027J389496J770402J274505r14139
4457D60435k193026l26898K324764K014266m55812j139285M96611R80819r49847
4448A212027k160996n77519J274572N69795j207545r11093J221325K280875J214668
4439B916109k96864j051123j782252l083087l891475k926782n33343J710028K699757
$$ plain form
4501 -5974685 -3881562 -3172806 -2757954 -2338521 -3004172 -5206960 -7430755 -7682663 -5588018
4492 -5588018 -2476442 -72507 405297 -1375863 -4485646 -7035124 -7678766 -6804288 -5655281
4483 -5655281 -4466646 -2446890 239166 1805947 1191964 80500 940061 3441905 4783214
4474 4783214 3790208 2525453 2795484 3100739 883892 -3594230 -7703492 -9855855 -10367766
4465 -10367766 -9591434 -7498194 -4925856 -3059829 -1670333 100069 1374574 460435
4457 460435 -1732591 -2059489 265275 2279541 1823729 684444 1181055 2161874 1212027
4448 1212027 -948969 -1526488 -251916 317879 -889666 -1800759 -579434 1701441 2916109
4439 2916109 2619245 1568122 -214130 -3297217 -7188692 -10115474 -10648817 -8938789 -6239032
4430f239032K562596J987192J385777Q66846O03518O48834M39105p35393k389892
4421h70449k728693o25549K667088M453090L064853p61014m316553m637769j128900
4412d883896K932653L134826p25875l813292k388094J175767K013892k78289j767083
4403d599391m83160J245137J105469j30690r72507j600666k362925k319725r21465
4394a1039923P29886J623454K134726K538305K110031Q10443n4465M840k03812
4385a346515j113238j265828m0134P51861j86948j197700l11644J480538J932109
4376a297499J028003L91449L81827J24919m43752p16589q48005j154042r26082
4367c459771L32475J451970J225051M12550K28534J18451p75110j338217k89940
$$ plain form
4430 -6239032 -3676436 -1689244 -303467 563379 1166897 1815731 2254836 1519443 -870449
4421 -870449 -3599142 -4224691 -1557603 2895487 5960340 5199326 882773 -3754996 -4883896
4412 -4883896 -1951243 1183583 457708 -3355584 -5743678 -4567911 -2554019 -2832308 -4599391
4403 -4599391 -5082551 -3837414 -2731945 -2862635 -3835142 -5435808 -7798733 -10118458 -11039923
4394 -11039923 -10310037 -8686583 -6551857 -4013552 -1903521 -1093078 -1147543 -1142703 -1346515
4385 -1346515 -2459753 -3725581 -3765715 -3013854 -3200802 -4398502 -4710146 -3229608 -1297499
4376 -1297499 -269496 121953 503780 628699 184947 -531642 -1379647 -2533689 -3459771
4367 -3459771 -3127296 -1675326 -450275 -37725 190809 309260 -465850 -1804067 -2094007
4358b094007J028085O53994l11804N49269K317350J732316j227953k865450j565515
4349a783715r2289o71988j536425n54877Q53268J94038j965599l126882k616340
4340a1300809j668954q09187N10991K240246L568880M003303L232710P43253k895161
4331b374728n183499l972150k66109K770948L372672K400347J358408P04423K29550
4322i60138j14956j59218K83467J170129J866514J500152J49597j003989j331949
4313A399609j637015k418185k309051J42192L665649N050657K886065q39871l089921
4304B850129k579392j34107K391147L101342J255399j625679k658028o16017K297002
4295D281796K625918l96684l920413m827654l263001j895901k014940j947178
$$ plain form
4358 -2094007 -1065922 -411928 -723732 -174463 2142887 3875203 2647250 -218200 -1783715
4349 -1783715 -1876004 -2547992 -4084417 -4639294 -3786026 -3591988 -5557587 -8684469 -11300809
4340 -11300809 -12969763 -13778950 -13267959 -11027713 -7458833 -3455530 -222820 520433 -2374728
4331 -2374728 -7558227 -11530377 -11796486 -9025538 -5652866 -3252519 -1894111 -1189688 -960138
4322 -960138 -1075094 -1234312 -950845 219284 2085798 3585950 3735547 2731558 1399609
4313 1399609 -237406 -2655591 -4964642 -4822450 -1156801 3893856 6779921 5940050 2850129
4304 2850129 270737 136630 2527777 5629119 6884518 5258839 2600811 1984794 4281796
4295 4281796 6907714 6511030 2590617 -2237037 -5500038 -7395939 -9410879 -11358057
4287a1358057p9050K175902K311636O82437m7934P46699Q96108k30856m8582K519883
4277b431814L883353Q65382l342948k837895K252469N502242L216658q46755j525452
4268D735240R30869K711988K050800p9582k671553m934875n311696l221100p90267
4259f580176j95197l37660J018699K891841K319499m75654j901820m23852J389582
4250b294738J312112N87397Q96301J205752J8683j526517j441124j68184M78672
4241i31646M38018R15323J713560J698047J329062J933644K599028P71271l413158
4232G053149o157253m772601j328287K21579q95936k037706j234491N00322J189868
4223g461356P88354J119443L217199N518306N378305K425599n13886o77791J119748
$$ plain form
4287 -11358057 -11437107 -9261205 -6949569 -6267132 -6315066 -5568367 -4672259 -4903115 -4951697 -2431814
4277 -2431814 1451539 2316921 -1026027 -3863922 -1611453 3890789 7107447 6260692 4735240
4268 4735240 5666109 8378097 10428897 10349315 7677762 2742887 -2568809 -5789909 -6580176
4259 -6580176 -6775373 -7113033 -6094334 -3202493 -882994 -1358648 -3260468 -3684320 -2294738
4250 -2294738 -982626 -395229 501072 1706824 1725507 198990 -1242134 -1410318 -931646
4241 -931646 -493628 421695 2135255 3833302 5162364 7096008 9695036 10466307 7053149
4232 7053149 895896 -3876705 -5204992 -4983413 -5879349 -7917055 -9151546 -8651224 -7461356
4223 -7461356 -6673002 -5553559 -2336360 3181946 8560251 10985850 10471964 9794173 10913921
4214A0913921J579401p41436l783427m869717l589886j272400P72358J606040
4206F14854Q12920n58495n72396R28049J770707R22982N51752K407772M058108
4197A0936253K054406k250506m102704k510436j539768l215672l734168K29651
4189d132944N152756N006335k2099l786305k606066Q95165K778857K579932J726750
4180G592381N82387p72324j169218l2274J108073P02873m61343p27791k11612
4171F611152j53323n49064l06247P15612J430461J083526r933r16204n83798J231306
4161H553488K891613K178847m00861j563724M9942J489799Q2469k099623j600042
4152I581908Q61793K275759K808973M409922N619828M055337L079888P800104
$$ plain form
4214 10913921 12493322 11751886 7968459 3098742 -491144 -1763544 -991186 614854
4206 614854 1427774 869279 296883 1224932 2995639 3918621 4470373 6878145 10936253
4197 10936253 12990659 10740153 6637449 4127013 2587245 -628427 -4362595 -4132944
4189 -4132944 1019812 6026147 6004048 2217743 -388323 506842 3285699 5865631 7592381
4180 7592381 8174768 7402444 6233226 6200952 7309025 8011898 7550555 6822764 6611152
4171 6611152 6457829 5908765 5602518 6318130 7748591 8832117 8822184 7905980 7322182 8553488
4161 8553488 11445101 13623948 13223087 11659363 11709305 13199104 13281573 11181950 9581908
4152 9581908 10443701 12719460 15528433 19938355 25558183 29613520 32693408 40493512
4144D0493512J3321461O780880j3817494l1464846k9144653j1213026L407101
4137b1637065N404539J944686J050763J088942j348922l297554j111766K360981
4129a5545396K481913L72217K16108K154926L040202K109542J198999P24548l69118
4120c616059j588125j428218k42264M25864M80665M88879m80107l106211n071266
4111a4136842l563541J21387J984726J061891K92810J526242L054204K860079
4103f799044J434984L67688L55328J322264K550597K379258q8255k801485k730076
4094d008741l12640P82593j008745k926929k172228L17887J981672K105837J331399
4085c909895j32321j640475j297486J539952M236074L812537J039868q08777o75307
$$ plain form
4144 40493512 53814973 60595853 46778359 15313513 -13831140 -25044166 -21637065
4137 -21637065 -16232526 -14287840 -13237077 -12148135 -13497057 -16794611 -17906377 -15545396
4129 -15545396 -13063483 -12691266 -12475158 -10320232 -7280030 -5170488 -3971489 -3246941 -3616059
4120 -3616059 -5204184 -6632402 -6874666 -6448802 -5968137 -5479258 -5959365 -9065576 -14136842
4111 -14136842 -17700383 -17578996 -15594270 -14532379 -14239569 -12713327 -9659123 -6799044
4103 -6799044 -5364060 -4996372 -4641044 -3318780 -768183 1611075 1522820 -1278665 -4008741
4094 -4008741 -4321381 -3538788 -4547533 -7474462 -9646690 -9328803 -7347131 -5241294 -3909895
4085 -3909895 -4042216 -5682691 -6980177 -5440225 -1204151 2608386 3648254 2839477 2164170
4076B164170n87234j838015k924934k161102k97772Q34143R59898J027334R10876
4067a912636o73564l520548m736192j760649L694391O486671L743286j456683
4059a35924l586668j241852J680408J441330j019377k158148q08588Q37570P33655
4050d257594m43118p61095J32885P20261j20406j520700j767234n38099Q32129
4041g722971J313972J425722J990924K549960K051864P08613K8287R26320K532206
4032E804897K966979R95686k716801n615373n281487k165130N77664Q66583J55425
4023d411557P88612K308736K565435J442913P15979O74201n3632j265085j058496
4014A707106M11958M28388j735566l038903j393516R28408J170072N52229J513893
$$ plain form
4076 2164170 1576936 -261079 -3186013 -5347115 -5644887 -4810744 -3850846 -2823512 -1912636
4067 -1912636 -2586200 -6106748 -10842940 -12603589 -8909198 -2422527 1320759 -135924
4059 -135924 -3722592 -4964444 -3284036 -1842706 -2862083 -5020231 -5828819 -4991249 -4257594
4050 -4257594 -4700712 -5461807 -5328922 -4608661 -4729067 -6249767 -8017001 -8555100 -7722971
4041 -7722971 -6408999 -4983277 -2992353 -442393 1609471 2318084 2346371 3272691 5804897
4032 5804897 8771876 9767562 7050761 1435388 -3846099 -6011229 -5433565 -4566982 -4411557
4023 -4411557 -3622945 -1314209 1251226 2694139 3410118 4084319 4030687 2765602 1707106
4014 1707106 2119064 2547452 811886 -2227017 -3620533 -2692125 -1522053 -969824 544069
4005E44069K687519P75050l448926n237264k490165J183672J352262j752749m218273
3996a0604805l353360o9469K858023L606818K412954N80181j055193k321694k755087
3987a0701632j661744M29720J634972R52694l73489o65421J07059J078923K011039
3978g187879K660971J960087l43878k249998j702652N07514J909597J610106M37611
3969b398521j148841k843584l018509l86286L146397M235217K711583J447484
3961A744940J495370Q06296j471010l078494k644568k173180l223122l641381
3953a2185149j149724K171696K584511M92878j96071J885255L744017K804020
3945A51433M15623p48455m94730m72896j090262j040916L31499J715058J396854
$$ plain form
4005 544069 3231588 4006638 557712 -4679552 -7169717 -5986045 -4633783 -6386532 -10604805
3996 -10604805 -13958165 -14027634 -11169611 -7562793 -5149839 -4569658 -5624851 -7946545 -10701632
3987 -10701632 -12363376 -11933656 -10298684 -9345990 -9719479 -10384900 -10277841 -9198918 -7187879
3978 -7187879 -4526908 -2566821 -2910699 -5160697 -6863349 -6355835 -4446238 -2836132 -2398521
3969 -2398521 -3547362 -6390946 -9409455 -9795741 -6649344 -2414127 297456 1744940
3961 1744940 3240310 4046606 2575596 -502898 -3147466 -5320646 -8543768 -12185149
3953 -12185149 -13334873 -11163177 -8578666 -8085788 -8281859 -6396604 -2652587 151433
3945 151433 567056 -181399 -676129 -1149025 -2239287 -3280203 -2948704 -1233646 163208
3936A63208m97656j972802j408584N73148J882264J426306J68743m10803j63681
3927b39857p176l10250l48547O34801K352458L592277L213780J086513j722552
3918H251447l690811l937078k721525j060761j4061j05252r61183j463150o81831
3909f384205J083194K344169J707135p22539l057202k982034l7848L336819L821038
3900h91473O96906l297711m901756l286987J20435L285410M246876J935827k061695
3891d154168l987537k106335Q17226J351271K39139N00976J952016J562053r01416
3882d726775j899925J63670K196354J225202j359623k553846j927403q04476K49734
3873i437088Q71329K19359q76354L73830M261757O464475L643620j120259k268462
$$ plain form
3936 163208 -334448 -2307250 -3715834 -3142686 -1260422 165884 334627 -76176 -239857
3927 -239857 -247033 -557283 -905830 -271029 2081429 5673706 8887486 9973999 8251447
3918 8251447 4560636 623558 -2097967 -3158728 -3172789 -3278041 -4239224 -5702374 -6384205
3909 -6384205 -5301011 -2956842 -1249707 -1972246 -5029448 -8011482 -8049330 -4712511 -891473
3900 -891473 -194567 -3492278 -8394034 -11681021 -11560586 -8275176 -4028300 -2092473 -4154168
3891 -4154168 -8141705 -10248040 -9430814 -8079543 -7840404 -7339428 -5387412 -3825359 -4726775
3882 -4726775 -6626700 -6463030 -4266676 -3041474 -4401097 -6954943 -8882346 -9686822 -9437088
3873 -9437088 -8565759 -8346400 -9222754 -8848924 -4587167 1877308 5520928 4400669 2132207
3864B132207N66925K864799K027602l26514k362782m040692m847274l450749n36157
3855g972635J187924P26235j28278O828N93024J358905L028460M993453N009639
3846H803555K283990j386469m145314n376183m383135j004759J978490Q83449
3838b346376l127841m245420j0917M663954M313663L55429j876033q67627M06575
3829b734593l6622j131693j622616j505464o89533R71428K320594J914599K64653
3820b249247r71908j556943k250776k441587p95816J868863K905355J336627j013998
3811e169430k093943j484841K97696K398498L386976K311486K45524p83340l95635
3802a287009J37036J43553k7993m70108j508904k317552j933686j339986k069367
$$ plain form
3864 2132207 2699132 5563931 7591533 7265019 4902237 861545 -3985729 -7436478 -7972635
3855 -7972635 -6784711 -6058476 -6186754 -6179926 -5586902 -4227997 -1199537 3793916 8803555
3846 8803555 11087545 9701076 5555762 179579 -4203556 -5208315 -3229825 -2346376
3838 -2346376 -5474217 -9719637 -9730554 -5066600 -752937 -397508 -2273541 -3141168 -2734593
3829 -2734593 -2771215 -3902908 -5525524 -7030988 -7720521 -6749093 -4428499 -2513900 -2249247
3820 -2249247 -3221155 -4778098 -7028874 -9470461 -10266277 -8397414 -5492059 -4155432 -5169430
3811 -5169430 -7263373 -8748214 -8450518 -6052020 -2665044 -353558 -108034 -891374 -1287009
3802 -1287009 -1149973 -1006420 -1034413 -1504521 -3013425 -5330977 -7264663 -8604649 -10674016
3793a0674016l058849j813103J336913L417116L572490L981480N095487L986168
3785E843686n43975m862177n337108l324448k219203k049832n78659K013134L335440
3776g723142K785491J908002J239981n5600j609994j857992p12540L75354J091049
3767d559391K437227M097306M214427K283197k0310j342132j816092j441376K32818
3758D085674K192562K249959K54364j281385q81442j23820n45320q71079N68684
3749E648197K435043J888359j355543m641477n644414m259600j574260J248725
3741f254970K965592K708115J075227r0710L49783J433460J174535p95766k143047
3732D22219l77192L324769M457764P36772m188453m987105j623926J136001Q49341
$$ plain form
3793 -10674016 -13732865 -15545968 -14209055 -10791939 -7219449 -3237969 1857518 5843686
3785 5843686 5299711 437534 -4899574 -8224022 -10443225 -12493057 -13071716 -11058582 -7723142
3776 -7723142 -4937651 -3029649 -1789668 -1845268 -3455262 -5313254 -6025794 -5650440 -4559391
3767 -4559391 -2122164 1975142 6189569 8472766 8452456 7110324 5294232 3852856 4085674
3758 4085674 6278236 8528195 8782559 7501174 6619732 6495912 5950592 5079513 5648197
3749 5648197 8083240 9971599 8616056 3974579 -1669835 -5929435 -7503695 -6254970
3741 -6254970 -3289378 -581263 493964 403254 753037 2186497 3361032 2565266 422219
3732 422219 45027 3369796 7827560 8564332 4375879 -611226 -2235152 -1099151 -249810
3723b49810o387O93196J336557O57232Q80994L274872M267632O85817l885809
3714G654294l523576P17589J902902k345024o399916n072721l23600K856316L005374
3705a528362J731673N6269j661044k486483k272590k359792k927965j961390J086340
3696a2323344L285054K489698R60690J575952K861635J586624j538399k928616
3688d030706j785071n17291r3375Q36289K194156J963005k1702j458155j445595
3679d358445j441966j684741m44645K076771L018952J590962N91932J191240L67128
3670I07188l461893o292968m233196j26286N97325j426514p51800L606487O127938
3661e053719L195245j661489l370670k019457p03402K14226K600578N688528N834362
$$ plain form
3723 -249810 -256197 436999 1773556 2430788 3311782 6586654 10854286 11540103 7654294
3714 7654294 4130718 4848307 6751209 4406185 -1993731 -7066452 -7390052 -4533736 -1528362
3705 -1528362 203311 259580 -1401464 -3887947 -6160537 -8520329 -11448294 -13409684 -12323344
3696 -12323344 -9038290 -6548592 -5587902 -4011950 -1150315 436309 -1102090 -4030706
3688 -4030706 -5815777 -6333068 -6426443 -5590154 -3395998 -1432993 -1454695 -2912850 -4358445
3679 -4358445 -5800411 -7485152 -7929797 -5853026 -2834074 -1243112 -651180 540060 907188
3670 907188 -2554705 -8847673 -13080869 -13207155 -12609830 -14036344 -14788144 -11181657 -5053719
3661 -5053719 -1858474 -3519963 -6890633 -8910090 -9613492 -9399266 -6798688 -1110160 4724202
3652D724202J693892l205462m425080j656958J458121J763985m11401k526553
3644b585254k831026j422813Q06629K841864L227534Q54071l009308m932293l099042
3635a0149638J67845J411128O43373O51605K215010K915327J207153j122855j856584
3626c917636j390443j217658j294801q93284n91046j259676k050573j491649M0243
3617a4066523R14779Q89954J256532K523060L681997L761670K678883P36662j316703
3608A060311k098081j089615M538p94651k700712l094485j404547J89896J50481
3599i776865o46710j011356r56475m25258J036199K398978J614561o92103q92581
3590i351610K203722M465073K037672k509230l445535J32199L675645L972067
$$ plain form
3652 4724202 6418094 3212632 -1212448 -2869406 -1411285 352700 -58701 -2585254
3644 -2585254 -5416280 -6839093 -6032464 -3190600 36934 891005 -2118303 -7050596 -10149638
3635 -10149638 -9981793 -8570665 -7927292 -7275687 -5060677 -2145350 -938197 -2061052 -3917636
3626 -3917636 -5308079 -6525737 -7820538 -8713822 -9304868 -10564544 -12615117 -14106766 -14066523
3617 -14066523 -13151744 -12261790 -11005258 -8482198 -4800201 -1038531 1640352 2377014 1060311
3608 1060311 -1037770 -2127385 -2122847 -2917498 -5618210 -8712695 -10117242 -9927346 -9776865
3599 -9776865 -10423575 -11434931 -12391406 -12816664 -11780465 -9381487 -7766926 -8459029 -9351610
3590 -9351610 -7147888 -2682815 -645143 -3154373 -6599908 -6467709 -2792064 1180003
3582A180003K346561Q41892n63974j717441j156303P71520R42799j898634m301685
3573c555262k814500P31344J999572N79582j84872R26129J440467R1490n62500
3564a348550J671723M592770M347233P22775k760418l413604j846866K8739J379921
3555C373723K127747J781072o3467k505462l740782k926794j142450j89183o65883
3546c951479j544299j561135n94054N35015J174675J205226N19871j002939k771324
3537g990443l522228k695529j212915j86311O20777K051192L657653L959065K748292
3528b570447J654228J720147J816579O53143p76422m68644J391647K328304Q02434
3519F550969j913623l419622k616812k66064J750614J593848q69285l376435l488072
$$ plain form
3582 1180003 3526564 4368456 3804482 2087041 930738 1702258 2645057 746423 -3555262
3573 -3555262 -6369762 -5638418 -3638846 -3059264 -3244136 -2318007 -877540 -786050 -1348550
3564 -1348550 323173 4915943 9263176 9985951 7225533 3811929 1965063 1993802 3373723
3555 3373723 5501470 7282542 7219075 4713613 972831 -1953963 -3096413 -3285596 -3951479
3546 -3951479 -5495778 -7056913 -7650967 -7115952 -5941277 -4736051 -4216180 -5219119 -7990443
3537 -7990443 -11512671 -14208200 -15421115 -15607426 -14986649 -12935457 -9277804 -5318739 -2570447
3528 -2570447 -916219 803928 2620507 3273650 2497228 2028584 3420231 5748535 6550969
3519 6550969 4637346 1217724 -1399088 -1665152 85462 1679310 810025 -2566410 -6054482
3510f054482j551346J8511L03489N92327J296098R37665o45047r56079J265043
3501d793821L324476K383807q5018o91853O73544J400855P19716Q8513k49954
3492B770265j321518k284734j127814J255360J549346p54208k366307j349348
3484c628958N24267J666175K844242L835408K244285j809660l946677j738943
3476i861J068429M03245j525486k28306L152873L557588L84170j560755K59097
3467E500994K531837J529068j786991l810715k769521K10158K602151K352002
3459F358983j37773j973101j469364r29825l000571n453539l799078J126947L233324
3450f043997J64553k768749n31987L979584M393282J86618l204689k501287j29964
$$ plain form
3510 -6054482 -7605828 -7587317 -7283828 -6691501 -5395403 -4457738 -5102785 -6058864 -4793821
3501 -4793821 -1469345 914462 829444 137591 811135 2211990 2931706 3020219 2770265
3492 2770265 1448747 -835987 -1963801 -708441 840905 86697 -2279610 -3628958
3484 -3628958 -3104691 -1438516 1405726 5241134 7485419 5675759 1729082 -9861
3476 -9861 1058568 1461813 -63673 -291979 2860894 6418482 6802652 5241897 5500994
3467 5500994 8032831 9561899 7774908 3964193 1194672 1404830 4006981 6358983
3459 6358983 6221210 4248109 2778745 1848920 -1151651 -6605190 -10404268 -9277321 -6043997
3450 -6043997 -5879444 -8648193 -9180180 -5200596 -807314 -620696 -3825385 -6326672 -6456636
3441f456636Q09431J024691K433351L805636K113149k374260n228781l236451
3433g109870J239791L286382J845523L62784J027613J766730N10678q81038M4389
3424B092982J662753Q53096j456373j777274k03896j67769k022309k081328P47411
3415b352707K469125M71685k047568j305200J167494J573418o7971q85392k79292
3406a256408j38125r51314j213551l28493P13706J324522J684861J465317K64491
3397A565006j004957j075914l94300n15329j646126k301849j378239M97051J688304
3388d566353J231584R3151M23984K484107L168616l258m118906l893289K46080
3379d934284J833120k115390o205659m555395R00641M318480M356417L601126
$$ plain form
3441 -6456636 -5647205 -4622514 -2189163 1616473 3729622 1355362 -3873419 -7109870
3433 -7109870 -5870079 -2583697 -738174 -375390 652223 2418953 2929631 2048593 2092982
3424 2092982 3755735 4608831 3152458 1375184 1171288 1003519 -1018790 -3100118 -2352707
3415 -2352707 116418 588103 -1459465 -2764665 -1597171 -23753 -91724 -977116 -1256408
3406 -1256408 -1394533 -2345847 -3559398 -3887891 -3174185 -1849663 -164802 1300515 1565006
3397 1565006 560049 -515865 -910165 -1425494 -3071620 -5373469 -6751708 -6254657 -4566353
3388 -4566353 -3334769 -3241618 -2817634 -333527 2835089 2831831 -1287075 -5180364 -4934284
3379 -4934284 -3101164 -5216554 -11422213 -15977608 -15076967 -10758487 -6402070 -2800944
3371b800944K685006P24830n07666J140066L078416J164015k804382l124841M02956
3362d2544J889020q10007k559015K16553L466101K223379j633792l048615j689746
3353a988666j208058k516738k539124N39353M229720M706070J119977l588085
3345a245551n671915m321387k066775r50683K54766L026476M979171K603680k419508
3336e811726m289345j278833J791155J025293j189709j075654M67828M36019q56750
3327a0781722j070815l04842j76701l8762J860283M369530M412219J682275r19839
3318i68374j528296j139662j094145j260195j036050j67231J571634L835680N007454
3309C220815L690568O94856j904730l114812k919465r05005K703053N330086M170900
$$ plain form
3371 -2800944 -115938 608892 101226 1241292 4319708 5483723 2679341 -445500 -42544
3362 -42544 1846476 1036469 -1522546 -1305993 2160108 4383487 2749695 -298920 -1988666
3353 -1988666 -3196724 -5713462 -8252586 -7713233 -3483513 1222557 2342534 -1245551
3345 -1245551 -6917466 -11238853 -13305628 -14256311 -14001545 -10975069 -5995898 -3392218 -5811726
3336 -5811726 -10101071 -11379904 -9588749 -8563456 -9753165 -10828819 -10360991 -9924972 -10781722
3327 -10781722 -11852537 -12157379 -12334080 -12372842 -10512559 -6143029 -1730810 -48535 -968374
3318 -968374 -2496670 -3636332 -4730477 -5990672 -7026722 -7193953 -5622319 -1786639 3220815
3309 3220815 6911383 7606239 5701509 2586697 -332768 -1237773 1465280 6795366 10966266
3300A0966266J54801k694643k311819o88178k50506n57134n8844P84510L30774
3291E675227j148159j475819L5471J068599n80017l428907l728043n02834K703560
3282a380922K146541j522158m453946m263804j734580J131546K597499J475637
3274f004187j559668l338258j493536J901779K857861J277375P08859K273384
3266c376391L084296J636602L04379O89944Q49272m65102j123568j64277o56128
3257G79027m163878o470163l655720R81529J619954j053641j523572J413448L426446
3248h646570K179163J73356m20975m61209m21572Q71703K823663K746246L83184
3239g73011j173169m87854R6640j100146k200896j206636Q60959K170884K653330
$$ plain form
3300 10966266 11121067 8426424 6114605 5426427 5175921 4618787 4559943 5344453 5675227
3291 5675227 4527068 3051249 3086720 4155319 3575302 146395 -3581648 -4084482 -1380922
3282 -1380922 765619 -756539 -5210485 -9474289 -11208869 -10077323 -7479824 -6004187
3274 -6004187 -7563855 -10902113 -12395649 -10493870 -7636009 -6358634 -5649775 -3376391
3266 -3376391 -292095 1344507 1648886 2338830 3188102 2723000 1599432 1435155 779027
3257 779027 -3384851 -9855014 -13510734 -12529205 -10909251 -11962892 -13486464 -12073016 -8646570
3248 -8646570 -6467407 -6294051 -6715026 -7176235 -7597807 -6726104 -3902441 -1156195 -773011
3239 -773011 -1946180 -2434034 -2337394 -3437540 -5638436 -6845072 -5984113 -3813229 -1159899
3230a159899K617657J439935o51110j886816j626107j430680k144863k352306
3222g194189j162932m3266k43919p06075j91077O29331Q12055Q53390J221947
3213f024735J108054J05708o81782n16037j69465r7060N06155J717481K105779
3204a945902J070306k10483j117122k358057l411166k185425J293488L873810
3196d990551L661385K356008J458512k63894l102359m029570j412346J340958
3188d981857Q71046n26215Q75844L136475J629909k318485k276245L313041P952950
3179G676463N983121l9436l731467l303000k266455l488631n643530n552811k315309
3170a2681055J546721K898848J625731N63365J476876K711044K135959N99033
$$ plain form
3230 -1159899 1457758 2897693 2246583 359767 -1266340 -2697020 -4841883 -7194189
3222 -7194189 -8357121 -8400387 -8644306 -9350381 -9541458 -8912127 -8100072 -7246682 -6024735
3213 -6024735 -4916681 -4810973 -5492755 -6008792 -6178257 -6275317 -5769162 -4051681 -1945902
3204 -1945902 -875596 -1086079 -2203201 -4561258 -7972424 -10157849 -8864361 -4990551
3196 -4990551 -1329166 1026842 2485354 2221460 -880899 -4910469 -6322815 -4981857
3188 -4981857 -4110811 -4637026 -3761182 -624707 1005202 -1313283 -3589528 -276487 7676463
3179 7676463 13659584 13620148 9888681 6585681 4319226 830595 -4812935 -10365746 -12681055
3170 -12681055 -11134334 -8235486 -6609755 -6046390 -4569514 -1858470 277489 876522
3162H76522J07823R2731j353425l350218k983535j76780J876080J757449J547367
3153a605986K198490J098886l125571o535134m323162K155840O392622M555909
3145H11894m96759l375109k068292J091946K787594J887297j69882j336519j044029
3136a911859k03281N79728J681124K822183K130080j488077n605607n991632j548736
3127i536077M049444O445920N011921K247887K21188p23837o63054K42124Q04174
3118H099690l15134k236307k330548L8924K172213J789289K80168K71985J529216
3109I299496J780746N89598m47449r07830j935619l272844k934888o77315R57987
3100B451882L28739r23442o19935Q92780K003648K319821K173442J208573p18609
$$ plain form
3162 876522 984345 1077076 -276349 -3626567 -6610102 -6786882 -4910802 -3153353 -1605986
3153 -1605986 592504 1691390 -1434181 -7969315 -12292477 -10136637 -3744015 811894
3145 811894 315135 -3059974 -5128266 -4036320 -1248726 638571 468689 -867830 -1911859
3136 -1911859 -2115140 -1535412 145712 2967895 5097975 3609898 -1995709 -7987341 -9536077
3127 -9536077 -5486633 959287 5971208 8219095 8440283 7716446 7053392 7295516 8099690
3118 8099690 7784556 5548249 3217701 3256625 5428838 7218127 7498295 7770280 9299496
3109 9299496 11080242 11669840 11222391 10314561 8378942 5106098 2171210 1493895 2451882
3100 2451882 2780621 1857179 1237244 2130024 4133672 6453493 8626935 9835508 9116899
3091I116899k377027k553961j757526j248474j275914j351949j285275j013200
3083c746427m94152m35032j660843l145347k627488p5138J731737J284843N15160
3074h652687J280488K353103K014171J025210N48113k31415j538902r15977K645786
3065a472110N128794K609524k025474k646612R79544L152992J171539j328615
3057E569582q78404J197540K346160K394993J615829o30450l137509k752333M92417
3048F217825K024740o21504l644083l010517j018076k174934n266350n073529
3040a2566428q35825K618790K454382J321458J888606K628734J644879P93334
3032e2070K357650M269649K894955p17170j860417N07680J938903n72415l924762
$$ plain form
3091 9116899 6739872 4185911 2428385 1179911 -96003 -1447952 -2733227 -3746427
3083 -3746427 -4240579 -4675611 -6336454 -9481801 -12109289 -12184427 -10452690 -9167847 -8652687
3074 -8652687 -7372199 -5019096 -3004925 -1979715 -1431602 -1663017 -3201919 -4117896 -1472110
3065 -1472110 3656684 6266208 4240734 1594122 2573666 5726658 6898197 5569582
3057 5569582 4691178 5888718 8234878 10629871 12245700 11615250 8477741 5725408 6217825
3048 6217825 8242565 7621061 3976978 966461 -51615 -2226549 -7492899 -12566428
3040 -12566428 -13402253 -10783463 -8329081 -7007623 -5119017 -2490283 -845404 -52070
3032 -52070 2305580 6575229 9470184 8753014 6892597 7400277 9339180 8766765 4842003
3023D842003l945918j712470q84435j084064J049026M953937N712263J553958
3015A0484300k993038l534614j339677O0568L0765n17153k201849n063040o072996
3006a1146734k975142J288239K155981K3691q62659J064882L401945M111362L044542
2997A06107l1326m528527o787238l563567K239826M266123J640560J30675L107288
2988c420079O421579M764869r33069n365690n268729j558788K666142M329857
2980A636092K509228l20382r90763L85n48229k971789l715668r83283K152960
2971c231449K066763q58886l581441l835477j175432K782522M511506J975763
2963a346131j748594j818338J247355K317985M3195j087681J259289L143611J264785
$$ plain form
3023 4842003 896085 -816385 -1700820 -2784884 -1735858 3218079 8930342 10484300
3015 10484300 7491262 3956648 2616971 2677539 2708304 2191151 -10698 -5073738 -11146734
3006 -11146734 -14121876 -12833637 -10677656 -10653965 -11516624 -10451742 -7049797 -2938435 106107
2997 106107 74781 -4453746 -11240984 -14804551 -12564725 -8298602 -6658042 -6527367 -3420079
2988 -3420079 3001500 7766369 6833300 1467610 -3801119 -5359907 -2693765 1636092
2980 1636092 4145320 3824938 2834175 2834560 2286331 -685458 -4401126 -5384409 -3231449
2971 -3231449 -1164686 -2023572 -5605013 -9440490 -10615922 -7833400 -3321894 -1346131
2963 -1346131 -3094725 -4913063 -3665708 -1347723 -1304528 -2392209 -1132920 2010691 3275476
2954C275476j427915r49232J430877K147700P03016j625743m524786o531075m465819
2945a1967501J080792M122374J491590j864594o78022K346859J994342j51229
2937c625389R87965M565029N194995J832746j742993l841574n511139n608633
2929g748993k143610K237297K886597P99269R62115L475449L363864n33049l604737
2920c05798l384754k657557l208264k858672n49378J495833K441680M018035N476441
2911D67566L397518j499934l548777p83868J546093o74466m173839m187672j637157
2902a1094536j83586j51958L80932J504044K113655K140148J503134l62585j909002
2893f059754q211M626760O575971L079790j744869l220896k572951l296577m843498
$$ plain form
2954 3275476 1847561 898329 2329206 4476906 5179922 3554179 -970607 -7501682 -11967501
2945 -11967501 -10886709 -6764335 -5272745 -7137339 -7815361 -5468502 -3474160 -3625389
2937 -3625389 -2637424 1927605 7122600 8955346 7212353 3370779 -2140360 -7748993
2929 -7748993 -9892603 -7655306 -4768709 -3969440 -3007325 468124 3831988 3298939 -305798
2920 -305798 -3690552 -6348109 -9556373 -12415045 -12964423 -11468590 -9026910 -5008875 467566
2911 467566 3865084 2365150 -1183627 -1967495 -421402 -1095868 -5269707 -9457379 -11094536
2902 -11094536 -11278122 -11430080 -11049148 -9545104 -7431449 -5291301 -3788167 -4150752 -6059754
2893 -6059754 -6067965 -1441205 5134766 8214556 6469687 3248791 675840 -2620737 -7464235
2884g464235m362080j874992N99705K807797N160508N997300L839681O06866r11889
2875D398661r42467q41608K59002K966456L993370j59661o858577r366679n404577
2866a1956080J33093J681595p77091l002825j967049J152048K841373J594672
2858a0300264k41228J06760J583469J052268j212141j581490Q39435K513301J362336
2849e877554j12039J70464L88150o31369j14350L308489N329312K120128k795196
2840A786035l437770m15605Q66210q16994j457805R25566L658494M291536L388266
2831H787933J937505j04025k221184l403671l758906l460007j103078L755514
2823D30081P639070O422730R53246l802142m525414j846076J624289K819359q5458
$$ plain form
2884 -7464235 -11826315 -13701307 -13101602 -10293805 -5133297 864003 4703684 5310550 4398661
2875 4398661 3456194 2614586 2873588 5840044 9833414 9673753 2815176 -6551503 -11956080
2866 -11956080 -11822987 -10141392 -10918483 -13921308 -15888357 -14736309 -11894936 -10300264
2858 -10300264 -10541492 -10434732 -8851263 -7798995 -9011136 -10592626 -9753191 -7239890 -5877554
2849 -5877554 -5989593 -5819129 -5430979 -6062348 -6176698 -2868209 2461103 4581231 1786035
2840 1786035 -1651735 -2067340 -1201130 -2018124 -3475929 -2550363 1108131 5399667 8787933
2831 8787933 10725438 10621413 8400229 4996558 1237652 -2222355 -3325433 430081
2823 430081 8069151 14491881 15445127 11642985 7117571 5271495 6895784 9715143 9629685
2814I629685m522556m884143l41470K575062l71806l765853j327568K864599R86721
2805H42671m334837l615736K954525M846694j361736o059686k350047L431376
2797e646776L228701l25800p32062J010680M17490j151177P677J590040p77711
2788b378938m415616l068755K359195M854050K338405j20238O28935J804031R29269
2779B930338l73988q09932k126094m927067o234147l945763l20526J559267K065264
2770a2182648L232131M737691M279481J103015k719374m380386k942745j57981
2762i030816J146253P0453j113725L45318L893521N842450L671046q54964l603341
2753C66195k781315r10167j463635l919836l963076L19026M622932L736606p86398
$$ plain form
2814 9629685 5107129 222986 -118484 2456578 2084772 -1681081 -3008649 -144050 842671
2805 842671 -3492166 -7107902 -4153377 693317 -668419 -6728105 -9078152 -5646776
2797 -5646776 -2418075 -2743875 -3475937 -2465257 -2047767 -3198944 -3191267 -1601227 -2378938
2788 -2378938 -6794554 -9863309 -7504114 -2650064 -311659 -431897 197038 2001069 2930338
2779 2930338 2556350 1746418 -379676 -5306743 -11540890 -15486653 -15807179 -14247912 -12182648
2770 -12182648 -8950517 -4212826 66655 1169670 -1549704 -5930090 -8872835 -9030816
2762 -9030816 -7884563 -7814110 -8927835 -8582517 -4688996 1153454 4824500 3969536 366195
2753 366195 -2415120 -3325287 -4788922 -8708758 -12671834 -12352808 -7729876 -3993270 -4779668
2744d779668k606960j01069J464243j058324l142161J4372N155378N626144J550974
2735B122929q16302J141660L355064K269739l36625j450364j352483j677308k203731
2726A052579k176475k519627m078259n034183k672274K510057O411484N661309
2718h45389J436322j901236j849462l49745m80756j776699j171319J684992L335675
2709a917617J877555P3084Q00203K381004J656387o91898j700102j226266j325739
2700g3389j722858m21661J633163J188893j657425k924381q83290J437454J372108
2691b051386L79851O94478J549921J089140n30811k076679l129140l276066j601310
2682h952002J315233L033124K520956J615255J707818J546340K12279m87253Q58457
$$ plain form
2744 -4779668 -7386628 -7487697 -6023454 -7081778 -10223939 -10209567 -5054189 571955 2122929
2735 2122929 1306627 2448287 5803351 8073090 7736465 6286101 4933618 3256310 1052579
2726 1052579 -1123896 -3643523 -7721782 -12755965 -15428239 -12918182 -6506698 -845389
2718 -845389 590933 -1310303 -3159765 -3509510 -3990266 -5766965 -6938284 -5253292 -1917617
2709 -1917617 -40062 33022 833225 3214229 4870616 4178718 2478616 1252350 -73389
2700 -73389 -1796247 -2217908 -584745 604148 -1053277 -3977658 -4860948 -3423494 -2051386
2691 -2051386 -1671535 -977057 572864 1662004 1131193 -945486 -4074626 -7350692 -8952002
2682 -8952002 -7636769 -4603645 -2082689 -467434 1240384 2786724 2999003 2511750 3370207
2673C370207K265856J464576j77441j80826M82927p15191k640702j652780K032251
2664D248877L561603L38976l925907m191726n44490K761656L114007J783038Q39287
2655G985321K47359j096813k731513k613907r2434K214273J039619l011638n442091
2646c501824l464414J31398Q22749j209088j612032J272805L699781K206592j116135
2637b770168j897017M0562J135449K07222n5694J484138J628321j896043n506946
2628g630176m096953J192459M064750K058234j99765J471625M267687L006229
2620D134090j576080l840499j631414J051271M21726k129188l172401k119415
2612h861910o19615N93434J687843K097000J346043M74040M12715o5365k366113
$$ plain form
2673 3370207 5636063 7100639 6923198 6742372 7225299 6510108 3869406 2216626 4248877
2664 4248877 7810480 8149456 4223549 31823 -512667 2248989 5362996 7146034 7985321
2655 7985321 8232680 7135867 4404354 1790447 1698013 3912286 4951905 1940267 -3501824
2646 -3501824 -6966238 -6834840 -6012091 -7221179 -8833211 -7560406 -3860625 -1654033 -2770168
2637 -2770168 -4667185 -4626623 -3491174 -3283952 -3339646 -1855508 -227187 -2123230 -7630176
2628 -7630176 -11727129 -10534670 -6469920 -4411686 -4611451 -3139826 1127861 4134090
2620 4134090 2558010 -1282489 -2913903 -1862632 -1440906 -3570094 -6742495 -8861910
2612 -8861910 -9481525 -8888091 -7200248 -5103248 -3757205 -3283165 -2870450 -2935815 -5301928
2603e301928m849376m432412j234245J388107J920320K682582N332262P297518
2595B802828N311749O84552k013664q81052J523401K273943J202143o83080l197429
2586G023391n836284o639135m304899m30846K164366K673322K337180K098589
2578i14316K005507K221218K544111J446428j992449n392572n105230j373490
2570f560793J376054L84738k064437k548167j006321O55816J821941K378449J026533
2561d536187k265521l837768k72886N935048Q463312M967576o35097l944421m571503
2552f97447m030805k726061q69664K67168J0461o67145j123164j979790k741578
2543a4558025j073357L357656O655741N273209J245766m47219J073062J829253
$$ plain form
2603 -5301928 -10151304 -14583716 -15817961 -14429854 -12509534 -9826952 -4494690 2802828
2595 2802828 8114577 8799129 6785465 5904413 7427814 9701757 10903900 10220820 7023391
2586 7023391 1187107 -5452028 -9756927 -10187773 -8023407 -5350085 -3012905 -914316
2578 -914316 1091191 3312409 5856520 7302948 5310499 -82073 -5187303 -6560793
2570 -6560793 -5184739 -4800001 -6864438 -9412605 -10418926 -9763110 -7941169 -5562720 -4536187
2561 -4536187 -6801708 -10639476 -10912362 -4977314 3485998 8453574 7818477 3874056 -697447
2552 -697447 -4728252 -7454313 -8323977 -8056809 -8046348 -8713493 -9836657 -11816447 -14558025
2543 -14558025 -15631382 -12273726 -5617985 -344776 900990 453771 1526833 3356086
2535C356086m49646k699976j291946K274804L324750N15253k620843k825845j055348
2526a472711K2376J22839N13990N93548j314551l900168l323981J015217M581685
2517c161756L797260J014860L93432J500865J051129q69660j124514N67577R40955
2508D110148j147662k879812k412590j548648j960204k440829j631036j99181
2500a0109814J205455K886721L761791J956067q43490k60635L346104L576134
2492E518333k306033p610225n443146O72617K026260k296930n076068k653403
2484a7168595M65917j36749k267140j475197K403085N781479N741971K157139
2476d498090k501443m498373k009859K494907M914402M374452L209801K809317
$$ plain form
2535 3356086 2906440 206464 -1085482 1189322 4514072 5029325 2408482 -417363 -1472711
2526 -1472711 -1450335 -1327496 -813506 -219958 -1534509 -5434677 -8758658 -7743441 -3161756
2517 -3161756 635504 1650364 2043796 3544661 4595790 3726130 2601616 3169193 4110148
2508 4110148 2962486 82674 -2329916 -3878564 -5838768 -8279597 -9910633 -10109814
2500 -10109814 -8904359 -6017638 -2255847 -299780 -1143270 -1403905 1942199 5518333
2492 5518333 3212300 -4397925 -9841071 -9168454 -7142194 -9439124 -14515192 -17168595
2484 -17168595 -16702678 -16839427 -19106567 -20581764 -18178679 -12397200 -6655229 -4498090
2476 -4498090 -6999533 -11497906 -13507765 -11012858 -6098456 -1724004 1485797 4295114
2468D295114K545672K358952K841823K772665J85024l877258o201412o076891
2460a156311n350995l985767k66348M152967M831637J686519J29110K664725M661169
2451G366706J835346k951626m597021l324134k645441l033335k466129p92305
2443a0607939J028444L724450P151792P354625J596608n332817n759405L67432
2435d76810N227644L696817j202984m377954m942052m327315k510255Q52421M175449
2426c885039N406368M267030J729594j111686k889754k695890j693321j937111
2418b809809l053658k515818J16383J993113J174147o02857q31659M88699K096260
2409c945199L636213M631606L351015r23411n747851p705652o005494k533218
$$ plain form
2468 4295114 6840786 9199738 12041561 14814226 14999250 11121992 4920580 -1156311
2460 -1156311 -6507306 -10493073 -10759421 -6606454 -1774817 -88298 40812 2705537 7366706
2451 7366706 9202052 6250426 1653405 -1670729 -4316170 -7349505 -9815634 -10607939
2443 -10607939 -9579495 -5855045 1296747 8651372 10247980 4915163 -844242 -476810
2435 -476810 4750834 8447651 7244667 2866713 -2075339 -6402654 -8912909 -8060488 -3885039
2426 -3885039 1521329 5788359 7517953 6406267 3516513 820623 -872698 -2809809
2418 -2809809 -5863467 -8379285 -8262902 -6269789 -5095642 -5698499 -6530158 -6041459 -3945199
2409 -3945199 -308986 4322620 7673635 6750224 1002373 -6703279 -12708773 -15241991
2401a5241991O54804K570710L109470L013837L286506L776024L317532J795580
2393F282472N54926J55495l80880j319650j530146j150639k164421m495724m466870
2384h515437K2717N208626N813667K041448j332499j684408o63327k54897n25917
2375A09973j365210l019111m364259l528004p38136J876656L328383L970193L052635
2366f76880l85867m018918l637165Q01207M243314L294477M25464n50056K00485
2357c03939L72312k37038n16882r88964k728173m612281m496638k341774P4841
2348a5778536J734638K735969L040662K682061K321425K185043J675550J120151
2340A716963J855412L185398K053496j986995m505030k170629J730001J819892
$$ plain form
2401 -15241991 -14587187 -12016477 -8907007 -5893170 -2606664 1169360 4486892 6282472
2393 6282472 6837398 6992893 6612013 5292363 3762217 2611578 447157 -4048567 -8515437
2384 -8515437 -8492720 -3284094 2529573 4571021 3238522 1554114 890787 635890 109973
2375 109973 -1255237 -4274348 -8638607 -12166611 -12904747 -11028091 -7699708 -3729515 -676880
2366 -676880 -1062747 -5081665 -8718830 -7917623 -3674309 -379832 45632 -504424 -303939
2357 -303939 68373 -168665 -685547 -1674511 -4402684 -9014965 -13511603 -15853377 -15778536
2348 -15778536 -14043898 -11307929 -8267267 -5585206 -3263781 -1078738 596812 1716963
2340 1716963 3572375 6757773 8811269 6824274 2319244 148615 1878616 3698508
2332C698508j521859l426224k040302J88492J733604L265095M006079K095312
2324G998705j027086j594865N10102J633459P23519M85806J368607M29708k202171
2315H325784k273027N51869N15377m243827o492390p95448O408592N514600j685582
2306E825948n102043j912836M56659k560264n548597k332111M466847P609833
2298I03436M780628k80524l642140m544871m149040l659919l412694k516957J37008
2289a6385073L958682O547574N966541K610602j094906k450596p95189J283743
$$ plain form
2332 3698508 2176649 -1249575 -3289877 -3101385 -1367781 1897314 5903393 7998705
2324 7998705 6971619 5376754 5886856 7520315 8243834 8729640 10098247 10527955 8325784
2315 8325784 6052757 6604626 7120003 2876176 -3616214 -4411662 1996930 7511530 5825948
2306 5825948 723905 -1188931 -732272 -3292536 -8841133 -11173244 -6706397 903436
2298 903436 5684064 5403540 1761400 -2783471 -6932511 -10592430 -14005124 -16522081 -16385073
2289 -16385073 -12426391 -5878817 87724 2698326 1603420 -847176 -1642365 -358622
$$ [...]
##END NTUPLES=NMR SPECTRUM
##END=
