##TITLE=31Pdec_DE-92k4_TFA
 CDCl3, 64 sc
 10.7.2025
##JCAMPDX= 6.0         $$ Bruker NMR JCAMP-DX V2.0
##DATA TYPE= NMR SPECTRUM
##DATA CLASS= NTUPLES
##ORIGIN= UXNMR, Bruker Analytische Messtechnik GmbH
##OWNER= root
$$ XWIN-NMR		Version 3.5
$$ Thu Jul 10 13:52:01 2025 Russian Standard Time (UT+4h)  she@DPX200
##.OBSERVE FREQUENCY= 81.013821
##.OBSERVE NUCLEUS= ^31P
##.ACQUISITION MODE= SIMULTANEOUS
##.ACQUISITION SCHEME= undefined
##.AVERAGES= 64
##.DIGITISER RES= 17
##SPECTROMETER/DATA SYSTEM= spect
##.PULSE SEQUENCE= zgpg30
##.SOLVENT NAME= CDCl3
##.SHIFT REFERENCE= (INTERNAL, CDCl3, 0, 198.062)
##AUDIT TRAIL= $$ (NUMBER, WHEN, WHO, WHERE, WHAT)
$$ ##TITLE= Audit trail, XWIN-NMR		Version 3.5
$$ ##JCAMPDX= 5.01
$$ ##ORIGIN= Bruker BioSpin GmbH
$$ ##OWNER= she
$$ F:/spectra/data/she/nmr/P31/2/pdata/1/auditp.txt
$$ ##AUDIT TRAIL=  $$ (NUMBER, WHEN, WHO, WHERE, WHAT)
(   1,<2025-07-10 13:49:19.31 +0400>,<she>,<DPX200>,
      <created by zg, POWCHK disabled, PULCHK disabled
       configuration hash MD5:
       00 E9 B6 7A A2 85 ED C7 34 08 36 98 17 FE 4E 26
       data hash MD5: 32K
       EC 7F 9E CA E1 F2 91 0E B5 3C 09 DD A1 84 42 8F>)
(   2,<2025-07-10 13:49:22.03 +0400>,<she>,<DPX200>,
      <Start of raw data processing
       efp BC_mod = 2 LB = 1.5 FT_mod = 6 PKNL = 1 PHC0 = 1779.411 PHC1 = -949.5064 SI = 64K 
       data hash MD5: 64K
       A4 34 5B 73 B2 82 73 CF EA D2 14 E9 F4 C1 C1 86>)
(   3,<2025-07-10 13:50:22.82 +0400>,<she>,<DPX200>,
      <pk PHC0 = -673.5485 PHC1 = 1910.005 
       data hash MD5: 64K
       41 8F 96 F4 D9 6B 9C 87 04 9F EA 99 19 A7 5E 89>)
(   4,<2025-07-10 13:51:22.06 +0400>,<she>,<DPX200>,
      <pk PHC0 = 370.5437 PHC1 = -1083 
       data hash MD5: 64K
       65 84 49 5F 2C 2C 75 08 20 53 81 90 BC 49 B9 57>)
(   5,<2025-07-10 13:51:26.78 +0400>,<she>,<DPX200>,
      <abs ABSG = 5 
       data hash MD5: 64K
       83 48 06 CC D3 F4 8B 68 AB 2E E3 20 BB B3 1C E4>)
$$ ##END=
$$ 
$$ hash MD5
$$ 0E 5E 37 A8 72 58 72 CA 6F 3C C0 FC 6F 51 38 49
##$RELAX= 
##$RELAX= 
##$RELAX= 
##$RELAX= 
##$RELAX= 
##$RELAX= 
##$RELAX= 
##$RELAX= 
$$ Bruker specific parameters
$$ --------------------------
##$DU= <F:/spectra>
##$EXPNO= 2
##$NAME= <P31>
##$PROCNO= 1
##$TYPE= <nmr>
##$USER= <she>
##$AMP= (0..31)
100 100 100 100 100 100 100 100 100 100 100 100 100 100 100 100 100 100 
100 100 100 100 100 100 100 100 100 100 100 100 100 100 
##$AQSEQ= 0
##$AQ_mod= 1
##$AUNM= <au_zg>
##$AUTOPOS= <>
##$BF1= 81.014009
##$BF2= 200.13
##$BF3= 200.13
##$BF4= 200.13
##$BF5= 200.13
##$BF6= 200.13
##$BF7= 200.13
##$BF8= 200.13
##$BYTORDA= 1
##$CFDGTYP= 0
##$CFRGTYP= 5
##$CHEMSTR= <none>
##$CNST= (0..31)
1 1 145 1 1 1 1 1 1 1 1 1 1 1 1 1 1 1 1 1 1 1 1 1 1 1 1 1 1 1 1 1 
##$CPDPRG= <waltz16>
##$CPDPRG1= <>
##$CPDPRG2= <waltz16>
##$CPDPRG3= <>
##$CPDPRG4= <mlev>
##$CPDPRG5= <mlev>
##$CPDPRG6= <mlev>
##$CPDPRG7= <mlev>
##$CPDPRG8= <mlev>
##$CPDPRGB= <>
##$CPDPRGT= <>
##$D= (0..31)
$$ [...]
##$SUBNAM3= <"">
##$SUBNAM4= <"">
##$SUBNAM5= <"">
##$SUBNAM6= <"">
##$SUBNAM7= <"">
##$SUBNAM8= <"">
##$SUBNAM9= <"">
##$SW= 400.765351723535
##$SWIBOX= (0..15)
0 1 3 0 0 0 0 0 0 0 0 0 0 0 0 0 
##$SW_h= 32467.5324675325
##$TD= 32768
##$TD0= 1
##$TE= 0
##$TE2= 300
##$TE3= 300
##$TEG= 300
##$TL= (0..7)
0 120 53 12 22 120 120 120 
##$TP= (0..7)
150 150 150 150 150 150 150 150 
##$TP07= 0
##$TPNAME0= <>
##$TPNAME1= <>
##$TPNAME2= <>
##$TPNAME3= <>
##$TPNAME4= <>
##$TPNAME5= <>
##$TPNAME6= <>
##$TPNAME7= <>
##$TPOAL= (0..7)
0.5 0.5 0.5 0.5 0.5 0.5 0.5 0.5 
##$TPOFFS= (0..7)
0 0 0 0 0 0 0 0 
##$TUNHIN= 0
##$TUNHOUT= 0
##$TUNXOUT= 0
##$USERA1= <user>
##$USERA2= <user>
##$USERA3= <user>
##$USERA4= <user>
##$USERA5= <user>
##$V9= 5
##$VALIST= <valist>
##$VCLIST= <CCCCCCCCCCCCCCC>
##$VD= 0
##$VDLIST= <DDDDDDDDDDDDDDD>
##$VPLIST= <PPPPPPPPPPPPPPP>
##$VTLIST= <TTTTTTTTTTTTTTT>
##$WBST= 1024
##$WBSW= 4
##$XGAIN= (0..3)
0 0 0 0 
##$XL= 0
##$YL= 0
##$YMAX_a= 8176
##$YMIN_a= -9660
##$ZGOPTNS= <>
##$ZL1= 120
##$ZL2= 120
##$ZL3= 120
##$ZL4= 120
##$ABSF1= 198.0616
##$ABSF2= -202.7028
##$ABSG= 5
##$ABSL= 3
##$ALPHA= 0
##$AQORDER= 0
##$ASSFAC= 0
##$ASSFACI= 0
##$ASSFACX= 0
##$ASSWID= 0
##$AUNMP= <proc_1d>
##$AZFE= 0.1
##$AZFW= 0.5
##$BCFW= 0
##$BC_mod= 2
##$BYTORDP= 0
##$COROFFS= 0
##$CY= -3
##$DATMOD= 1
##$DC= 0
##$DFILT= <>
##$DTYPP= 0
##$F1P= 0
##$F2P= 0
##$FCOR= 1
##$FTSIZE= 65536
##$FT_mod= 6
##$GAMMA= 0
##$GB= 0
##$INTBC= 1
##$INTSCL= 9.790993e-09
##$ISEN= 30
##$LB= 1.5
##$LEV0= 0
##$LPBIN= 0
##$MAXI= 10000
##$MC2= 0
##$MEAN= 0
##$ME_mod= 0
##$MI= 50
##$NCOEF= 0
##$NC_proc= -9
##$NLEV= 6
##$NOISF1= 182.463
##$NOISF2= 159.3651
##$NSP= 0
##$NTH_PI= 0
##$NZP= 0
##$OFFSET= 198.0616
##$PC= 4
##$PHC0= 1476.407
##$PHC1= -122.5014
##$PH_mod= 1
##$PKNL= yes
##$PPARMOD= 0
##$PSCAL= 0
##$PSIGN= 0
##$REVERSE= no
##$SF= 81.0140089999434
##$SI= 65536
##$SIGF1= 159.3651
##$SIGF2= -187.1042
##$SINO= 113.3802
##$SIOLD= 16384
##$SREGLST= <1H.CDCl3>
##$SSB= 0
##$STSI= 65536
##$STSR= 0
##$SW_p= 32467.5324675325
##$SYMM= 0
##$S_DEV= 0
##$TDeff= 32768
##$TDoff= 0
##$TI= <>
##$TILT= no
##$TM1= 0
##$TM2= 0
##$TOPLEV= 0
##$USERP1= <user>
##$USERP2= <user>
##$USERP3= <user>
##$USERP4= <user>
##$USERP5= <user>
##$WDW= 1
##$XDIM= 65536
##$YMAX_p= 519152645
##$YMIN_p= -156780502
$$ End of Bruker specific parameters
$$ ---------------------------------
##NTUPLES= NMR SPECTRUM
##VAR_NAME=  FREQUENCY,     SPECTRUM/REAL,   SPECTRUM/IMAG
##SYMBOL=    X,             R,               I
##VAR_TYPE=  INDEPENDENT,   DEPENDENT,       DEPENDENT
##VAR_FORM=  AFFN,          ASDF,            ASDF
##VAR_DIM=   65536,         65536,           65536
##UNITS=     HZ,            ARBITRARY UNITS, ARBITRARY UNITS
##FACTOR=    0.49542278885378, 1,            1
##FIRST=     16045.7642231865, 0,            0
##LAST=      -16421.768244346, 0,            0
##MIN=       -16421.768244346, -156780502,   0
##MAX=       16045.7642231865, 519152645,    0
$$ Real data points
##PAGE= N=1
##DATA TABLE= (X++(R..R)), XYDATA
$$ [...]
45405a3430562j468467o134781o706210k898269k21373j500665k915601J07477
$$ -13430562 -14899029 -21033810 -27740020 -30638289 -30859662 -32360327 -35275928 -35168451
45397c5168451O127420R276538O420685M95210l263207k687491L78439L309855
$$ -35168451 -29041031 -19764493 -13343808 -12848598 -16111805 -18799296 -18420857 -15111002
45389a5111002N377253O896271O846987L192094l501916q221289n932632J752870
$$ -15111002 -9733749 -2837478 4009509 7201603 3699687 -4521602 -10454234 -8701364
45381h701364O995140M528347j999700m865319j804113K390338K878953j58169
$$ -8701364 -1706224 2822123 822423 -4042896 -5847009 -3456671 -577718 -735887
45373g35887l465573m330200j824437K363874L994009P76836k821985k785P808818
$$ -735887 -4201460 -8531660 -10356097 -7992223 -3998214 -3221378 -6043363 -6046148 1762670
45364A762670J0500750K753293p353655q458173o58802O029003N323900J29863
$$ 1762670 12263420 15016713 7663058 -795115 -1453917 4575086 9898986 10028849
45356A0028849m380702o308019n378280j898968J387355J322581q55521j237593
$$ 10028849 5648147 -659872 -6038152 -7937120 -6549765 -5227184 -6082705 -7320298
45348g320298P8452m50122k170318M2369O432347R751689N699673l18814j603015
$$ -7320298 -7241846 -7691968 -9862286 -9819917 -3387570 6364119 12063792 11744978 10141963
45339A0141963L08731J95834j665132j724273j062561l571404p925134q581724
$$ 10141963 10450694 10646528 8981396 7257123 6194562 2623158 -5301976 -13883700
45331a3883700m447371o5257K002352L626734N069796K981166l013174p101768
$$ -13883700 -18331071 -18396328 -16393976 -12767242 -7697446 -4716280 -7729454 -14831222
45323a4831222m371845K315654N897703L314129k491007o839219p074103l369922
$$ -14831222 -19203067 -16887413 -10989710 -7675581 -10166588 -17005807 -24079910 -27449832
45315b7449832J904890N915803P475876P156426N621015L377978J829382K082295
$$ -27449832 -25544942 -19629139 -12153263 -4996837 624178 4002156 5831538 7913833
45307G913833K498467K85014l772415n417844l269084j619974m129168p568592
$$ 7913833 10412300 10697314 6924899 1507055 -1762029 -3382003 -7511171 -15079763
45299a5079763n909238O46378N127273K888063k389995l720144M69716N172383
$$ -15079763 -20989001 -20342623 -15215350 -12327287 -14717282 -18437426 -17967710 -12795327
45291a2795327N472362J850505j532754j757251Q74280M197447N669272L558657
$$ -12795327 -7322965 -5472460 -7005214 -8762465 -7888185 -3690738 1978534 5537191
45283E537191r10138l152263m1599M694727L677546m144854j0741632q972577
$$ 5537191 4627053 1474790 1433191 6127918 9805464 5660610 -5081022 -14053599
45275a4053599j539158L965801N471968O346455P170691M499814k005658p527351
$$ -14053599 -15592757 -11626956 -6154988 191467 7362158 11861972 9856314 2328963
45267B328963q713811p162981m761767r27378L242758L570671p92645m114065
$$ 2328963 -6384848 -13547829 -18309596 -19236974 -15994216 -12423545 -13216190 -17330255
45259a7330255j615930L241987L714401n24548l484256j336052L587628O747762
$$ -17330255 -18946185 -15704198 -11989797 -12514345 -15998601 -17334653 -13747025 -6999263
45251f999263N732386R36315m873548p597486n017943O46979M882107N229162
$$ -6999263 -1266877 -330562 -5204110 -12801596 -17819539 -17172560 -12290453 -7061291
45243g061291K461045j256163l698130l321946m41076L241958P098136J1493062
$$ -7061291 -4600246 -5856409 -9554539 -12876485 -13317561 -10075603 -2977467 8515595
45235H515595J4297778J1054723J461987p423446q397969k602369K798836L525687
$$ 8515595 22813373 33868096 35330083 27906637 19508668 16906299 19705135 23230822
45227B3230822R98961j799230k922446j376011J147141j00835o716771j2113346
$$ 23230822 24229783 22430553 19508107 18132096 19279237 19178402 12461631 348285
45219C48285q722910M35400M423506m40307n527850l114738K320719J648707m737374
$$ 348285 -8374625 -7939225 -3515719 -3956026 -9483876 -12598614 -10277895 -8629188 -13366562
45210a3366562p308254p23971R226639J3175539Q793403J756570k054804k865620
$$ -13366562 -20674816 -21398787 -12172148 1003391 9796794 11553364 9498560 6632940
45202F632940m871740r125183j1111254o760731J247568O145758N159221J718223
$$ 6632940 1761200 -7363983 -18475237 -25235968 -23988400 -17842642 -12683421 -10965198
45194a0965198j12712J36733J156784K387767L471053L873517M066717M694347
$$ -10965198 -11077910 -10941177 -9784393 -7396626 -3925573 -52056 4014661 8709008
45186H709008M293330R50434l509619m864824k740660j127453j449234k56596
$$ 8709008 13002338 13952772 10443153 5578329 2837669 1710216 260982 4386
45178D386L771723N967973K831100j726279k448652j203475l237334p509157p617477
$$ 4386 3776109 9744082 12575182 10848903 8400251 7196776 3959442 -3549715 -11167192
45169a1167192j863009L921557M552452J399040j360302k131653j659440o45233
$$ -11167192 -13030201 -9108644 -4556192 -3157152 -4517454 -6649107 -8308547 -8953780
45161h953780M08512J071324J846353L287264L902003J518031k588647l798653
$$ -8953780 -8545268 -7473944 -5627591 -2340327 1561676 3079707 491060 -3307593
45153c307593J24986N640915P456713M429248j4628k209637j704559r51741k242974
$$ -3307593 -3182607 2458308 9915021 14344269 14329641 12120004 10415445 9463704 7220730
45144G220730m788643n400425k926917n82137j502354l271027r09394M594075
$$ 7220730 2432087 -2968338 -5895255 -6477392 -7979746 -11250773 -12160167 -7566092
45136g566092N824593n77638p600770o551901R63025N524268L272360K44890J864221
$$ -7566092 -1741499 -2319137 -9919907 -16471808 -15508783 -9984515 -6712155 -6467265 -4603044
45127d603044M474539J962490l454183l682897K921938Q254132N452162j902889
$$ -4603044 -128505 1833985 -1620198 -5303095 -2381157 5872975 11325137 9422248
45119I422248n268418k501839Q01719k3921l164387l854772k17477N392898Q857841
$$ 9422248 4153830 1651991 2453710 2429789 -734598 -4589370 -4806847 586051 9443892
45110I443892P678139L528515J091841K347065L078125j580197q882958j0681597
$$ 9443892 17122031 20650546 21742387 24089452 27167577 25587380 16704422 6022825
45102F022825m855228P97546q90270o549713p478434j727132M347102N420955
$$ 6022825 1167597 1965143 1074873 -5474840 -12953274 -14680406 -10333304 -4912349
45094d912349K857324M99544p10186j823210k293177r278N304363J0117769R563990
$$ -4912349 -2055025 -1555481 -2265667 -4088877 -6382054 -6391332 -1086969 9030800 18594790
45085A8594790K586568n792856q867410n079135J170814N404945O993105O807546
$$ 18594790 21181358 15388502 6521092 1441957 2612771 8017716 15010821 21818367
45077B1818367M859312K200997J400670K272485P63093m375802p603065m093810
$$ 21818367 26677679 28878676 30279346 32551831 33314924 28939122 21336057 17242247
45069A7242247K082440L313130l68521k348928n08614M46163j744812l069555
$$ 17242247 19324687 22637817 22269296 19920368 19411754 19857917 18113105 15043550
45061A5043550j070529M96901j476328l759388k266657J494855L840197M560079
$$ 15043550 13973021 14469922 12993594 9234206 6967549 8462404 12302601 16862680
45053A6862680M674066K718446j414177k752983K082922P168290L799138o134578
$$ 16862680 21536746 24255192 22841015 20088032 22170954 29339244 33138382 27003804
45045B7003804j1281408o498829L91628P65333k991413l370940k2490J353001
$$ 27003804 15722396 9223567 9615195 10380528 7389115 4018175 3995685 5348686
45037E348686k73434J36131L963392N405317O04499n616248o420194k120106J954854
$$ 5348686 5075252 5211383 9174775 14580092 15184591 9568343 3148149 1028043 2982897
45028B982897L450456L779349L466965K230828J882443L355452K571356l824774
$$ 2982897 6433353 10212702 13679667 15910495 17792938 21148390 23719746 19894972
45020A9894972r943473o707255L130351O273475j785522r531082p345767j823812
$$ 19894972 9951499 3244244 6374595 12648070 10862548 1331466 -6014301 -7838113
45012g838113k921256o405885j932050P737503J0191844L388183k291828j902872
$$ -7838113 -10759369 -17165254 -19097304 -11359801 -1167957 2220226 -71602 -1974474
45004a974474j632618m523691m357116J654284O555517N894956M859772O565598
$$ -1974474 -3607092 -8130783 -12487899 -10833615 -4278098 1616858 6476630 13042228
44996A3042228M621164m059565r659200l554524O487385P332130L19825k891210
$$ 13042228 17663392 13603827 3944627 390103 6877488 14209618 14529443 11638233
44988A1638233j02189k60971o268870r565079m574203K330589K917253j536234
$$ 11638233 11536044 11275073 5006203 -4558876 -9133079 -6802490 -3885237 -5421471
44980e421471l741554l70972N243187P506002L735185l057575o656127n012034
$$ -5421471 -9163025 -9533997 -4290810 3215192 6950377 3892802 -2763325 -7775359
44972g775359l036314m724062o134812k032029L981464M161570n14975j761020
$$ -7775359 -10811673 -15535735 -21670547 -23702576 -19721112 -15559542 -16074517 -17835537
44964a7835537J861877K691463j801983l170997M207212J2489612J1239511K748682
$$ -17835537 -15973660 -13282197 -15084180 -18255177 -14047965 -1558353 9681158 12429840
44956A2429840j983860Q16382M078070J535396m045918o114569l435470j057584
$$ 12429840 10445980 11262362 15340432 16875828 12829910 6715341 3279871 2222287
44948B222287l249768p474335o940565N14908Q505650R602004M601645J70949
$$ 2222287 -1027481 -8501816 -15442381 -14927473 -6421823 3180181 7781826 7952775
44940G952775r77263j672892k708447r57962L473073N436116K940207M18217M12970
$$ 7952775 6975512 5302620 2594173 1636211 5109284 10545400 13485607 13903824 14316794
44931A4316794q24861m851221n800334m51518L444264k027614j0905363j0641438
$$ 14316794 13491933 8640712 2840378 2388860 5833124 3805510 -7099853 -17741291
44923a7741291p30788P038346O612989M655178O973364Q473716K438822p527090
$$ -17741291 -18472079 -11433733 -4820744 -165566 6807798 15281514 17720336 10193246
44915A0193246j1670070o310675L393015J0084811R413185J464149q438999j2111157
$$ 10193246 -1476824 -7787499 -4394484 5690327 15103512 16567661 8128662 -3982495
44907c982495n918088M616792J0224210P121339q52202p370431q527597m558759
$$ -3982495 -9900583 -5283791 4940419 12061758 11209556 3839125 -4688472 -9247231
44899i247231M66404J874392n49573k394243j216424n3672j294928j154749M143727
$$ -9247231 -8780827 -6906435 -7456008 -9850251 -11066675 -11120347 -12415275 -13570024 -9426297
44890i426297R852898Q059467M55160k969051R03808L694657m05026n263092l860096
$$ -9426297 426601 8486068 8941228 5972177 6875985 10570642 10165616 4902524 1042428
44881A042428k57147j366471l491210J159027Q436703O370777m791806j0473882
$$ 1042428 785281 -581190 -4072400 -2913373 5523330 11894107 7102301 -3371581
44873c371581l190784O604860P125653J237147k285464l229557n276419n204035
$$ -3371581 -6562365 42495 7168148 8405295 6119831 2890274 -2386145 -7590180
44865g590180J036153P285373N121304j104779o81046M538859K690518o472764
$$ -7590180 -6554027 731346 5852650 4747871 4066825 8605684 11296202 4823438
44857D823438q771999J344887J0417620O556734k878316m605196L93167K276867
$$ 4823438 -3948561 -2603674 7813946 14370680 11492364 6887168 7280335 9557202
44849I557202r9285n61763L36005l521547j0264324j0702065l522740J734262
$$ 9557202 9457917 8896154 9232159 5710612 -4553712 -15255777 -18778517 -17044255
44841a7044255l63027l357823l07188N614481P480779N166531L468149L890196
$$ -17044255 -17407282 -20765105 -21072293 -15457812 -7977033 -2810502 657647 4547843
44833D547843M056855K913524J611179L50574j826387m487064n703447m349609
$$ 4547843 8604698 11518222 13129401 13479975 11653588 7166524 1463077 -2886532
44825b886532j034602K588421M392886K836307j294303n138176o615913n859456
$$ -2886532 -3921134 -1332713 3060173 5896480 4602177 -535999 -7151912 -13011368
44817a3011368l308891J393544O956983Q941259L727903o195459j3370756j2618874
$$ -13011368 -16320259 -14926715 -7969732 971527 4699430 -1496029 -14866785 -27485659
44809b7485659n861649Q33522L610884L102911J642833O11264Q27486L066532
$$ -27485659 -33347308 -32513786 -28902902 -25799991 -24157158 -23545894 -22718408 -19651876
44801a9651876O373951P526955M649198M48472q67395O74763J351926j68788j199299
$$ -19651876 -13277925 -5750970 -1101772 -653300 -1520695 -845932 505994 337206 -862093
44792h62093k68584K11625j569622l551232l594569l004780l268084k734800j89469
$$ -862093 -1130677 -919052 -2488674 -6039906 -9634475 -12639255 -15907339 -18642139 -18831608
44783a8831608J480794m79613l394538k742964J043680M139151N705390P343845
$$ -18831608 -17350814 -17830427 -21224965 -23967929 -22924249 -18785098 -13079708 -5735863
44775e735863P664888L607526k899345n576771k192314K612392M021674K139939
$$ -5735863 1929025 5536551 2637206 -2939565 -5131879 -2519487 1502187 3642126
44767C642126n57302k414513k141630N11374K532978M69335l489838l097677K649225
$$ 3642126 3084824 670311 -1471319 -959945 1573033 2042368 -1447470 -4545147 -1895922
44758a895922O834015L803855l462033q175364q012350n304108k247694O13781
$$ -1895922 4938093 8741948 5279915 -2895449 -10907799 -16211907 -18459601 -17845820
44750a7845820L216114N718997P690456O723990J025786n946157p943657m398000
$$ -17845820 -14629706 -8910709 -1220253 5503737 6529523 583366 -7360291 -11758291
44742a1758291j114430n27164K017222Q249646J0588448L044339o830862o129291
$$ -11758291 -12872721 -13399885 -11382663 -3133017 7455431 10499770 3668908 -2460383
44734b460383N413054J4501197J1551658J209533n874593n382594j093592R79927
$$ -2460383 2952671 17453868 29005526 30215059 24340466 18957872 17864280 18844207
44726A8844207k016483p130878p641258j019607N659002L224170o535700j1463501
$$ 18844207 16827724 9696846 2055588 1035981 6694983 9919153 3383453 -8080048
44718h080048m616572O675540J0801427N825804j159514m682705n142463m296288
$$ -8080048 -12696620 -6021080 4780347 10606151 9446637 4763932 -378531 -4674819
44710d674819k341562l3359N34682j131280k570302j333724J886314L918861K346631
$$ -4674819 -7016381 -7049740 -6515058 -7646338 -10216640 -11550364 -9664050 -5745189 -3398558
44701c398558k120099o110167o551383l333072J356581N885531R771746J1538181
$$ -3398558 -5518657 -11628824 -18180207 -21513279 -20156698 -14271167 -4499421 7038760
44693G038760Q880047K609212k189374j821910R40285Q77680j776962j853752
$$ 7038760 15918807 18528019 16338645 14516735 15457020 16334700 14557738 12703986
44685A2703986K202047N301736L424901j56335m46289P25912k538005r811782
$$ 12703986 14906033 20207769 23632670 23476335 23030046 23755958 21217953 11406171
44677A1406171j2977542p125618K272612O580243M695099K104338J692944J042574
$$ 11406171 -1571371 -8696989 -6424377 155866 4850965 6955303 8648247 9690821
44669I690821j310706k409362K05374L913883M329993J072140k463563l814796
$$ 9690821 8380115 5970753 6176127 10090010 14420003 15492143 13028580 9213784
44661I213784l529648l248820l813665n002503n512942l499082J290927O027468
$$ 9213784 5684136 2435316 -1378349 -6380852 -11893794 -15392876 -14101949 -8074481
44653h074481O993718L567317j042364l197405j997613J021204L967742N448326
$$ -8074481 -1080763 2486554 1444190 -1753215 -3750828 -2729624 1238118 6686444
44645F686444M251788o5956n644981q537427o066532m3443M670891N083102K172130
$$ 6686444 10938232 10872276 5227295 -3310132 -9376664 -9420107 -4749216 333886 2506016
44636B506016j906616n911134p507019k962283P081886J4047751R505417l324815
$$ 2506016 599400 -5311734 -12818753 -15781036 -8699150 5348601 14854018 11529203
44628A1529203j2019142j0136242m011918j829480k322664L27731N309493O356948
$$ 11529203 -489939 -10626181 -14638099 -16467579 -18790243 -18462512 -13153019 -6796071
44620f796071K223353j339046n21733J748270J598199k17876q85749J76778K069187
$$ -6796071 -4572718 -5911764 -6433497 -4685227 -3087028 -3304904 -4190653 -4013875 -1944688
44611a944688M359892N777178L605929k627310q443580q227240j387358O848150
$$ -1944688 2415204 8192382 11798311 9171001 727421 -7499819 -8887177 -2039027
44603b039027J0232641O349097j703236p115404m830243K508163N710572p03500
$$ -2039027 8193614 14542711 12839475 5724071 893828 3401991 9112563 8409063
44595H409063j0370155j1313103q67118J0116662J0536435K461837l426992l097366
$$ 8409063 -1961092 -13274195 -14141313 -4024651 6511784 8973621 5546629 2449263
44587B449263k742969o550638q821008l235831N774710Q454321L830294J52371
$$ 2449263 -293706 -6844344 -15665352 -18901183 -13126473 -4672152 -841858 -689487
44579f89487J434375K181344j912488o107832m714778p43354m78442k442036L39379
$$ -689487 744888 2926232 1013744 -5094088 -9808866 -10552220 -11030662 -13472698 -13133319
44570a3133319Q380957J3515051R644991O8874p673022r938171q004379m367404
$$ -13133319 -4752362 8762689 18407680 18476554 10803532 865361 -7139018 -11506422
44562a1506422n80493K612300M602929M501889K113898l06728M01927L396831
$$ -11506422 -12086915 -9474615 -4871686 -369797 1744101 1437373 1839300 5236131
44554E236131L545027j052928m891672l041639L32300j775615p000308o464114
$$ 5236131 8781158 7728230 2836558 -205081 127219 -1648396 -8648704 -15112818
44546a5112818M01813L683329j734706q039011o681940n99689K603437L044945
$$ -15112818 -14711005 -11027676 -12762382 -20801393 -27483333 -28083022 -25479585 -22434640
44538b2434640N612217R018460P305233P85523l420757k326413n76973j060847
$$ -22434640 -16822423 -7803963 -498730 286793 -3133964 -5460377 -6037350 -7098197
44530g098197N04713P340077J3544745J0452488r84396r926929q664506j831549
$$ -7098197 -6593484 746593 14291338 24743826 23759430 13832501 5167995 3336446
44522C336446J74735m937094q245652j803313R614067J3456125N305866n566533
$$ 3336446 3511181 -1425913 -9671565 -11474878 -1860811 11595314 16901180 11334647
44514A1334647q414463l745633K30847K6343l29471K262552M964304M005093K88008
$$ 11334647 2920184 -825449 -594602 -568259 -897730 1364822 6329126 10334219 10622227
44505A0622227k472343k622064j418533o21746r82786k211784l212386k748582
$$ 10622227 8149884 5527820 4109287 3487541 2504755 292971 -2919415 -5667997
44497e667997m28622L024809N943452N791865P93236o721056j0304176n939787
$$ -5667997 -6096619 -3071810 2871642 8663507 9456743 2735687 -7568489 -13508276
44489a3508276K120591N723168K984020j58518M79123J263802k420143p518364
$$ -13508276 -11387685 -5664517 -2680497 -2839015 -2359892 -1096090 -3516233 -11034597
44481a1034597p058704r09969L206323L92691m743194m646212J548145Q269113
$$ -11034597 -18093301 -19003270 -15796947 -15404256 -20147450 -24793662 -23245517 -14976404
44473a4976404J0969410R411915M766282k047589q469188j0661155p743707l193739
$$ -14976404 -4006994 5404921 10171203 8123614 -345574 -11006729 -18750436 -21944175
44465b1944175l62016J010355K160252K240340P42608K55854K911778N993690
$$ -21944175 -22306191 -21295836 -19135584 -16895244 -16152636 -15896782 -12985004 -6991314
44457f991314N448218K384627J185666K132487J760400M55269K707300P972082
$$ -6991314 -1543096 841531 2027197 4159684 5920084 6375353 9082653 17054735
44449A7054735Q465966J76661r800663j2013814o188184R78295N088627N440279
$$ 17054735 25520701 25697362 15896699 3882885 -2305299 -1327004 3761623 9201902
44441I201902J422740n517554r289672n689959O56951K811941K291851N029614
$$ 9201902 10624642 5107088 -4182584 -9872543 -9215592 -6403651 -4111800 917814
44433I17814R034258O800104j32131j070137O342841J0339835K755166p931700
$$ 917814 9952072 16752176 16620045 15549908 21892749 32232584 34987750 27056050
44425B7056050r682802m521946k860464o190685o740075j634269L307864L682613
$$ 27056050 17373248 12851302 9990838 3800153 -2939922 -4574191 -1266327 2416286
44417B416286J426908j044918l932601o168366n105585j282752K128383M873773
$$ 2416286 3843194 2798276 -1134325 -7302691 -12408276 -13691028 -11562645 -6688872
44409f688872Q604058J0607694O053836k593356o385306k449090J889737O17143
$$ -6688872 1915186 12522880 18576716 15983360 9598054 7148964 9038701 9655844
44401I655844l041187m343012m879055o793510o134580M61972P617060P816676
$$ 9655844 6614657 2271645 -2607410 -9400920 -15535500 -15073528 -7456468 360208
44393C60208K622045n64393m6330Q8669o12934J409878M735851K559383o434505
$$ 360208 2982253 2417860 2371530 2460199 1847265 3257143 7992994 10552377 4117872
44384D117872j3989091j2265815k800954O926529J1321519R150783K802834k666277
$$ 4117872 -9871219 -22137034 -24937988 -18011459 -6689940 2460843 5263677 2597400
44376B597400l458067j524228j689827m169081m889500l361045l508678n215002
$$ 2597400 -860667 -2384895 -4074722 -8243803 -13133303 -16494348 -20003026 -25218028
44368b5218028k741128M903930R553350N275290k224478m161519j430295j333449
$$ -25218028 -27959156 -23055226 -13501876 -8226586 -10451064 -14612583 -16042878 -17376327
44360a7376327n179688p011421l193843L396976Q077562Q096970L061661l508329
$$ -17376327 -22556015 -29567436 -32761279 -29364303 -21286741 -13189771 -10128110 -13636439
44352a3636439n055131M07972N880905M122375k005736m479286k339139p37562
$$ -13636439 -18691570 -18283598 -12402693 -8280318 -10286054 -14765340 -17104479 -17842041
44344a7842041p9287L833674R051530P684901p74154o361666k958665L111237
$$ -17842041 -17921328 -14087654 -5036124 2648777 1874623 -4487043 -7445708 -4334471
44336d334471L740816K66386j846827k380077l425209k731837K372232Q028043
$$ -4334471 -593655 -327269 -2174096 -4554173 -7979382 -10711219 -8338987 -310944
44328c10944P894313K045757l862880o339660n913852l334857R42446M688910
$$ -310944 7583369 9629126 5766246 -573414 -6487266 -9822123 -8879677 -4190767
44320d190767N508624L584516K54381l703022n863464k302587O011855J0996936
$$ -4190767 1317857 4902373 5156754 1453732 -4409732 -6712319 -700464 10296472
44312A0296472O842779j498062m521795j84768N479040P004068L390736l782222
$$ 10296472 17139251 15641189 11119394 10934626 16413666 23417734 26808470 23026248
44304B3026248j0293276j0028388k045506N556346N139417J1270j693202j90933
$$ 23026248 12732972 2704584 659078 6215424 11354841 11366111 9672909 9481976
44296I481976j855970o135580n751297k33750K029891k209077n586196k662839
$$ 9481976 7626006 1490426 -4260871 -4494621 -2464730 -4673807 -10260003 -12922842
44288a2922842J830331K466087J795817L275865L793208O94990j014758K884233
$$ -12922842 -11092511 -8626424 -6830607 -3554742 238466 933456 -81302 2802931
44280B802931O237098J214895p506315p995371Q88006P099545K417463o886971
$$ 2802931 9040029 10254924 2748609 -5246762 -4358756 2740789 5158252 -1728719
44272a728719r522541k935061O002752R772286O536306M19829k431205O5236L237960
$$ -1728719 -11251260 -14186321 -8183569 1588717 8125023 8544852 6113647 6178883 9416843
44263I416843J406263m119268o591429l455674M33021O33350r64383j038222r12881
$$ 9416843 10823106 6703838 112409 -3343265 -2910244 -2276894 -3241277 -4279499 -5192380
44254e192380k963766m314597l05974O781528Q864685L231990k987302k588104
$$ -5192380 -8156146 -12470743 -12776717 -5995189 2869496 6101486 3114184 526080
44246E26080J945356L060735l67622k141762J034712M570310L508608R7642l39195
$$ 526080 2471436 5532171 5164549 3022787 4057499 8627809 12136417 12234059 11894864
44237A1894864J899002J417146l748506q874085q980849n039049j697487r87638
$$ 11894864 13793866 15211012 11462506 2588421 -6392428 -11431477 -13128964 -14116602
44229a4116602p33930J383347M233375M580684J573881j234791L65370N441785
$$ -14116602 -14850532 -13467185 -9233810 -4653126 -3079245 -4314036 -3948666 1493119
44221A493119P712600K624742o471172j1213284p223205J244354N951050L246478
$$ 1493119 9205719 11830461 5359289 -5853995 -13077200 -11832846 -5881796 -2635318
44213b635318k298877l026740K774738Q243913O339217n08776l311343R11557
$$ -2635318 -4934195 -7960935 -5186197 3057716 9396933 8888157 5576814 6488371
44205F488371N170891L395194p64500p50136K439292L135350O80412j281163k883009
$$ 6488371 11659262 15054456 14289956 13539820 15979112 19114462 19794874 18513711 15630702
44196A5630702p104783j1387536q873498M11802P370335N713537l66145l609287
$$ 15630702 8525919 -2861617 -11735115 -11323313 -3952978 1760559 1394414 -2214873
44188b214873l095571k446782l142783l672884k681490k96001J751126P40095
$$ -2214873 -5310444 -7757226 -10900009 -14572893 -17254383 -17550384 -15799258 -15059163
44180a5059163l337428n301954p69969N979327O561997J099312j545512K309572
$$ -15059163 -18396591 -23698545 -24468514 -18489187 -11927190 -10827878 -12373390 -10063818
44172a0063818N778207L463714Q2791J425122M385216K833684k660529p569694
$$ -10063818 -4285611 -821897 -739106 686016 5071232 7904916 5244387 -2325307
44164b325307j0239395r697342k986626P845333J2445884M947524n263323n635975
$$ -2325307 -12564702 -22262044 -25248670 -17403337 -4957453 -9929 -5273252 -10909227
44156a0909227J204279K669949l347422o419688j897308K124112m03241l489610
$$ -10909227 -9704948 -7034999 -10382421 -16802109 -18699417 -16575305 -16978546 -20468156
44148b0468156M4591O801601R140472O977131N747961O266042L768179l686421
$$ -20468156 -20423565 -13621964 -4481492 2495639 8243600 14509642 18277821 14591400
44140A4591400j1100473j1942905n488466K069371L683330j201290o195770n698786
$$ 14591400 3490927 -8451978 -13940444 -11871073 -8187743 -9389033 -15584803 -21283589
44132b1283589j142036K512135L806375M427613M088711J231566k000789j398861
$$ -21283589 -22425625 -19913490 -16107115 -11679502 -7590791 -6359225 -8360014 -9758875
44124i758875K228610L298623J73529j833792J319949N856115N300388r17664
$$ -9758875 -7530265 -4231642 -4058113 -5891905 -4571956 1284159 6584547 5666883
44116E666883p305856q931388n546658k24765L876258N443864M877000K994089
$$ 5666883 -1638973 -10570361 -16117019 -16341784 -12465526 -7021662 -2144662 849427
44108H49427O41704o38785L87369K211498J667640j255683k828119j628309j164680
$$ 849427 1491131 852346 1239715 3451213 5118853 3863170 1035051 -593258 -1757938
44099a757938l533882n046065k532021N34097j60465k030375l09999L167247L297375
$$ -1757938 -5291820 -10337885 -12869906 -12335809 -12496274 -14526649 -14836648 -11669401 -8372026
44090h372026N64816j285267k909445n557677l417014Q326996J9939960J5948880
$$ -8372026 -7807210 -9092477 -12001922 -17559599 -20976613 -12649617 7290343 23239223
44082B3239223j308816j1708058n143452N182899M498441k319607k360126L259086
$$ 23239223 21930407 10222349 5078897 10261796 14760237 12440630 10080504 13339590
44074A3339590K815424o174967j3741184j2460765n230569J786778N724169O127659
$$ 13339590 16155014 9980047 -3761137 -16221902 -21452471 -19665693 -13941524 -7813865
44066g813865L998804K352453L266009M726960L843911J485653K27103J86262
$$ -7813865 -3815061 -1462608 1803401 6530361 10374272 11859925 12087028 12273290
44058A2273290O59128K619993N060170K664485o619857j4628975j1196980J379295
$$ 12273290 12932418 15552411 20612581 23277066 16657209 2028234 -9168746 -7789451
44050g789451R440904M843343n323405q527351j937994N847054O326658P14898
$$ -7789451 1651453 6494796 1171391 -7355960 -9293954 -3446900 2879758 3594656
44042C594656l115552j523870M70434k690567p965946p588077o65520N311177
$$ 3594656 479104 -1044766 -574332 -3264899 -11230845 -18818922 -19484442 -14173265
44034a4173265N188152K015276K22309p32825k469633k903837M03854N936110
$$ -14173265 -8985113 -6969837 -6747528 -7480353 -9949986 -12853823 -12449969 -6513859
44026f513859J0355877J1295128O466201m355873j4273351j3263719j336328Q917344
$$ -6513859 3842018 15137146 21603347 17247474 2974123 -10289596 -11625924 -2708580
44018b708580P781467J89092l118713J91961M788348O841086N795767J631480
$$ -2708580 5072887 5261979 2143266 2335227 7123575 13964661 19760428 21391908
44010B1391908l632562n853560m732424m578880n527994j876746O112232Q731764
$$ 21391908 17759346 11905786 7173362 2594482 -2933512 -4810258 1301974 10033738
44002A0033738K267820k857025J067952N120022r06521r649047q071681K03836
$$ 10033738 12301558 9444533 10512485 15632507 14725986 5076939 -2994742 -2790906
43994b790906J816042l118844l181753K548927L772689j144599k960613L00879
$$ -2790906 -974864 -4093708 -7275461 -4726534 -953845 -2098444 -5059057 -4758178
43986d758178N34038m011558o488477o526717r869372j2223014l218357J1492027
$$ -4758178 -4224140 -8235698 -14724175 -21250892 -31120264 -43343278 -46561635 -35069608
43978c5069608J3923888L914815K075120J5006896K2334391J0519446m757694
$$ -35069608 -21145720 -17230905 -15155785 -148889 22185502 32704948 27947254
43971B7947254o364669k826876p286810j0575639m37367R782462P64453j6420338
$$ 27947254 21582585 18755709 11468899 893260 455893 10238355 11002808 -5417530
43963e417530j4601393N132807J4944771N307746k750322M443722J2517881P234205
$$ -5417530 -20018923 -14886116 58655 5366401 2616079 7059801 19577682 26811887
43955B6811887j983017j780281K054419j586891p498847m391594L690736L832034
$$ 26811887 24828870 23048589 25103008 23516117 16017270 11625676 15316412 19148446
43947A9148446m034455q067071m270685p29081k153013k932623J575548O680910
$$ 19148446 15113991 7046920 2776235 2047154 -105859 -3038482 -1462934 5217976
43939E217976O106375J871810Q88820M229175N007641j760098j0453355j0338716
$$ 5217976 11324351 13196161 14084981 18314156 23321797 21561699 11108344 769628
43931G69628p6603Q585618N464085m428409q411514l766910R98357R49551K37247
$$ 769628 693025 9278643 14742728 10314319 1902805 -1864105 -865748 83803 321050
43922C21050J596022J238987j957833k528904O89565k89987q807698j4057816
$$ 321050 1917072 3156059 1198226 -1330678 -641113 -931100 -9738798 -23796614
43914b3796614n706338Q856303J3670717O433452o06816l1979K931416K676588
$$ -23796614 -29502952 -20646649 -6975932 -542480 -1149296 -1181275 1750141 4426729
43906D426729J353500J399957J76389l068998l393208J051802L723871l56359
$$ 4426729 5780229 7180186 7356575 4287577 894369 1946171 5670042 5313683
43898E313683n462877l402751L571029O140632J691043l338609m134739k957741
$$ 5313683 -149194 -3551945 19084 6159716 7850759 4512150 377411 -2580330
43890b580330l058411l805849l832398l555572k430085J223949N266951M017009
$$ -2580330 -5638741 -9444590 -13276988 -16832560 -19262645 -18038696 -12771745 -8754736
43882h754736k813816o484833M7579J1163732J4546359O613094l984508p997000
$$ -8754736 -11568552 -18053385 -18005806 -6842074 7704285 14317379 10332871 2335871
43874B335871m910372K63230L968849N284237M138780J558706m43710j305344
$$ 2335871 -2574501 -2311271 1657578 6941815 11080595 12639301 12195591 10890247
43866A0890247k314411l292875j670434L043346O438872L707943m389970j2205160
$$ 10890247 8575836 5282961 3612527 6655873 13094745 16802688 12412718 207558
43858B07558j4628763j0390654k045992N127950O314275K205893n69181K777944
$$ 207558 -14421205 -24811859 -26857851 -21729901 -15415626 -13209733 -13778914 -11000970
43850a1000970Q120318O899466k375643j1133183j0850502l101258L271715L459925
$$ -11000970 -2880652 4018814 1643171 -9490012 -20340514 -23441772 -20170057 -16710132
43842a6710132J629384L756714Q543608Q946703K491130m093403l381514K308087
$$ -16710132 -15080748 -11324034 -2780426 6166277 8657407 4564004 1182490 3490577
43834C490577L726495k356726q162058n114582M759450J1352742Q720646J165111
$$ 3490577 7217072 4860346 -3301712 -8416294 -3656844 7695898 16416544 17581655
43826A7581655l102248j690354M08506j412159m316947j653035O381615J0353880
$$ 17581655 14479407 12789053 13197559 11785400 7468453 5815418 12197033 22550913
43818B2550913L379659q580893j3990433j0719748o394975n083562k939660J623039
$$ 22550913 25930572 17349679 3359246 -7360502 -13755477 -18839039 -21778699 -20155660
43810b0155660L574654J311403J443643P003224R599546K123179p921044q389798
$$ -20155660 -16581006 -15269603 -13825960 -6822736 2776810 4899989 -3021055 -11410853
43802a1410853p80105L068294l38053l042585p88843J155055k67500K30601N729187
$$ -11410853 -12190958 -9122664 -9460717 -12503302 -13292145 -12137090 -12404590 -12173989 -6444802
43793f444802R753604N960402j557878m315742j150594K326052K838407K163179
$$ -6444802 3308802 9269204 7711326 3395584 2244990 4571042 7409449 9572628
43785I572628K231965K337878J193718j018210k697301j986040R95308K799567
$$ 9572628 11804593 14142471 15336189 14317979 11620678 9634638 10629946 13429513
43777A3429513n259n378748o765142j238274N970545P340479J705005m988126
$$ 13429513 13424254 8045506 1280364 42090 6012635 13353114 15058119 10069993
43769A0069993o486349k258064K838825M099475J862235j9579l27358j877186
$$ 10069993 3583644 1325580 4164405 8263880 10126115 10106536 9779178 7901992
43761G901992n106794m718493K628810J0803953J0898555L505748k842067m434586
$$ 7901992 2795198 -1923295 705515 11509468 22408023 25913771 23071704 18637118
43753A8637118n333266p192600n432126J353031O666741N735846K843668L368135
$$ 18637118 13303852 6111252 679126 2032157 8698898 14434744 17278412 20646547
43745B0646547M604916J252265m679253o949739n298198n132236p941829q859250
$$ 20646547 25251463 26503728 21824475 14874736 9576538 4444302 -3497527 -12356777
43737a2356777m762013M89682J225024k496124m719678l02299R115322J6163495
$$ -12356777 -17118790 -16629108 -15404084 -17900208 -22619886 -22922185 -13806863 2356632
43729B356632J5102893P439548p97729n757160p303478o012549l221303k772068
$$ 2356632 17459525 24899073 24101344 18344184 11040706 5028157 1806854 -965214
43721i65214o715115r579772m191619N754080P495200k888553j2924224j0196131
$$ -965214 -7680329 -17260101 -21451720 -15697640 -8202440 -11090993 -24015217 -34211348
43713c4211348R19212O786469L223673k259807l448723j307020J909396N722494
$$ -34211348 -33292136 -26505667 -23281994 -25541801 -28990524 -30297544 -28388148 -22665654
43705b2665654P981224N589323J69013k689129j079145J363689K191773L387277
$$ -22665654 -14684430 -9095107 -8926094 -11615223 -12694368 -11330679 -9138906 -5751629
43697e751629O075565O979686L211099k805799o414764o678753o273879o516701
$$ -5751629 323936 7303622 10514721 7708922 1294158 -5384595 -11658474 -18175175
43689a8175175n628536k607733j83470j091088k287918K577096J2849270J7972852
$$ -18175175 -23803711 -26411444 -26594914 -27686002 -29973920 -27396824 -14547554 3425298
43681C425298J0447035j823003m222063M687656J1516824P598745k56004k836021
$$ 3425298 13872333 12049330 7827267 12514923 24031747 31630492 31374488 28538467
43673B8538467k062017l998413o827908n273112j209012k93306k052371k227495
$$ 28538467 26476450 22478037 15650129 10377017 9168005 8874699 6822328 4594833
43665D594833j432814k658481l526258l16425L152377M34355n866150p284560
$$ 4594833 3162019 503538 -3022720 -3339145 -186768 247587 -5618563 -12903123
43657a2903123k834898J008390K455750N489587Q915648O043469k823632q506344
$$ -12903123 -15738021 -14729631 -12273881 -6784294 2131354 8174823 5351191 -3155153
43649c155153o440112k150856m25161J061261M055386N645740N566986P475018
$$ -3155153 -9595265 -11746121 -12171282 -11110021 -7054635 -1408895 4158091 11633109
43641A1633109Q960301J599739j3180684k0017139j0011815N051253R197608M075732
$$ 11633109 20593410 22193149 9012465 -11004674 -21016489 -15965236 -6767628 -2691896
43633b691896K216724N504435M634959k821858p880536m883233N21650J172552
$$ -2691896 -475172 5029263 9664222 6842364 -1038172 -5921405 -5399755 -4227203
43625d227203k391916n824688p272768o272680j644541N730447J1396933J1752941
$$ -4227203 -6619119 -12443807 -19716575 -25989255 -27633796 -21903349 -10506416 1246525
43617A246525Q107775M338058J951660q72867n800961j0868355j1395001n478623
$$ 1246525 9354300 13692358 15644018 14771151 8970190 -1898165 -13293166 -18771789
43609a8771789K201761M940881K601580J794687O025152J0116783P657069J79033
$$ -18771789 -16570028 -11629147 -9027567 -7232880 -1207728 8909055 16566124 16745157
43601A6745157n413307o082417m936361n654353q359931j0363206q629969k744853
$$ 16745157 11331850 5249433 313072 -5341281 -13701212 -24064418 -32694387 -35439240
43593c5439240L126838L903692R08046J524838Q631393J4904788J2188102K514499
$$ -35439240 -32312402 -28408710 -27500664 -25975826 -17344433 -2439645 9748457 12262956
43585A2262956n685589q893285r578891q647822m454344J155281L107964P54854
$$ 12262956 6577367 -2315918 -11894809 -20542631 -24996975 -23841694 -20733730 -19978876
43577a9978876m50426L238929Q704938J0254200N749991k462979r639347j1066239
$$ -19978876 -20429302 -17190373 -8485435 1768765 7518756 5055777 -4583570 -15649809
43569a5649809n579718K490403P154100O684741L920435J868387J663679L271934
$$ -15649809 -21229527 -18739124 -11585024 -4900283 -979848 888539 2552218 5824152
43561E824152M672464J893262n853885j2308370j0436419k180981L231986J155271
$$ 5824152 10496616 12389878 6535993 -5772377 -16208796 -18389777 -15157791 -14002520
43553a4002520l328294l280960J661181O629348P663612M448978n56922m075286
$$ -14002520 -17330814 -20611774 -18950593 -12321245 -4657633 -208655 -765577 -4840863
43545d840863m612116l678944l333725l486522l334311l390789l327214n23085
$$ -4840863 -9452979 -13131923 -16465648 -19952170 -23286481 -26677270 -30004484 -30527569
43537c0527569N107663P738148K796615m707522n885413o88518K782210J349416
$$ -30527569 -25419906 -17681758 -14885143 -19592665 -25478078 -26166596 -23384386 -22034970
43529b2034970M56565L378162N595872L336150j53058j217775j757230l757024
$$ -22034970 -21578405 -18200243 -12604371 -9268221 -9421279 -10639054 -12396284 -16153308
43521a6153308m155055m27331M193879O172645O877249P226344L398958n395313
$$ -16153308 -20308363 -20735694 -16541815 -10369170 -3491921 3734423 7133381 1738068
43513A738068j0752987n196869N625175R699603M743122j351200l775784m501540
$$ 1738068 -9014919 -14211788 -8586613 1112990 5856112 4504912 729128 -3772412
43505c772412l598292K050506R393414R088629p27243r223952p191778N80249
$$ -3772412 -7370704 -5320198 4073216 13161845 12434602 3210650 -3981128 -3400879
43497c400879L831690J634266N33130J936574P60681m025084o293461k396627
$$ -3400879 430811 2065077 2598207 4534781 5295462 1270378 -5023083 -7419710
43489g419710K906027L736002J229411r759J23644j719186m933075m404201J676002
$$ -7419710 -4513683 -777681 451730 441971 565615 -1153571 -6086646 -10490847 -8814845
43480h814845P967475Q183586K167896n243744r579896q641593k352309N459143
$$ -8814845 -847370 7336216 9504112 4260368 -5319528 -13961121 -16313430 -10854287
43472a0854287P734829J740972n418398m557101K725236N621581k04089n952133
$$ -10854287 -3119458 -1378486 -6796884 -11353985 -8628749 -3007168 -3211257 -9163390
43464i163390k545683O519773J1128161Q258934K673206k438440p360668j0239094
$$ -9163390 -11709073 -5189300 5938861 14197795 16871001 14432561 7071893 -3167201
43456c167201q160651l975883l771394o210362k920083P369770J3654140P478323
$$ -3167201 -11327852 -15303735 -19075129 -25285491 -28205574 -20835804 -7181664 296659
43448B96659l943269p141368l90224O208183O271810L691516L216564L026267
$$ 296659 -3646610 -10787978 -11178202 -4970019 1301791 4993307 8209871 11236138
43440A1236138k6564m048465n411526m420264l519881k762376j112198m8477j568746
$$ 11236138 11209574 7161109 1749583 -2670681 -6190562 -8952938 -10065136 -10113613 -11682359
43431a1682359l890607l418131m06501J670979K293387M326655P107629N056174
$$ -11682359 -15572966 -18991097 -19397598 -17726619 -15433232 -11106577 -3998948 1057226
43423A057226k808158p218262K84743J2975471J4577861J029444j1987324q861731
$$ 1057226 -1750932 -8969194 -8684451 4291020 18868881 19898325 7911001 -950730
43415i50730N213360J1920132M796549m006491k934396L405218L467773l977429
$$ -950730 4262630 16182762 20979311 16972820 14038424 17443642 20911415 16933986
43407A6933986r937043q785876l619678Q67631L474813L941095J849825k86803
$$ 16933986 6996943 -1788933 -5408611 -4540980 -1066167 2874928 4724753 4437950
43399D437950J494427N897570O329432J84438o866556r145403q431462q589423
$$ 4437950 5932377 11829947 18159379 18343817 11477261 2331858 -6099604 -14689027
43391a4689027p524855j220440O809811P777989j29051p960035o607799K899810
$$ -14689027 -22213882 -23434322 -16624511 -8846522 -8975573 -16935608 -23543407 -20643597
43383b0643597J1745967J2879092O319172k709679q801828j0235280q753884n909019
$$ -20643597 -8897630 3981462 10300634 7590955 -1210873 -11446153 -20200037 -26109056
43375b6109056j423713L690630N538202K524218k07357L301456J0320680J1488352
$$ -26109056 -27532769 -23842139 -18303937 -15779719 -15987076 -12685620 -2364940 9123412
43367I123412L001951q292942j3233235r417613j084253N480182N451631p15982
$$ 9123412 12125363 3832421 -9400814 -18818427 -19902680 -14422498 -8970867 -9686849
43359i686849n828665l303182L285135M216278j741023m721715J112992Q446329
$$ -9686849 -15515514 -18818696 -15533561 -11317283 -13058306 -17780021 -16667029 -8220700
43351h220700Q333117L021302j4132j95897j542648l504648l131724k381620m201317
$$ -8220700 112417 3133719 3119587 2923690 1381042 -2123606 -5255330 -7636950 -11838267
43342a1838267m905979j63523M595932Q58301p576534q017252J725369R602645
$$ -11838267 -16744246 -16907769 -12311837 -11453536 -19030070 -27047322 -25321953 -15719308
43334a5719308P817467L326515M665387Q532177O787041o04394p181800r649248
$$ -15719308 -7901841 -4575326 90061 8622238 15409279 14804885 7623085 -2026163
43326b026163r459291q283298p119677o981844o530291k300119N282193R945565
$$ -2026163 -11485454 -19768752 -26888429 -33870273 -40400564 -42700683 -37418490 -27472925
43318b7472925P465308K000886O04329M243962P868014P152337K436991k083819
$$ -27472925 -20007617 -18006731 -17402402 -13158440 -5290426 1861911 4298902 2215083
43310B215083j637022M095495Q748932N782012k695401q350562p661644m417884
$$ 2215083 578061 4673556 13422488 19204500 16509099 8158537 496893 -3920991
43302c920991j503517J716218L039090j891821r932275j1428361m584475J528150
$$ -3920991 -5424508 -3708290 -669200 -2561021 -12493296 -23921657 -28506132 -26977982
43294b6977982K551111N213204J1798058J2166684J712403o125390M05757J0462764
$$ -26977982 -24426871 -19213667 -7415609 4751075 6463478 338088 743845 11206609
43286A1206609O691264o373028r655724l61074N536180Q32553l780809j420614
$$ 11206609 17897873 11524845 1869121 1508047 7044227 7876780 4095971 2675357
43278B675357k67708o175812j0756155n958931K698176O595703O544998O185537
$$ 2675357 2407649 -3768163 -14524318 -20483249 -17785073 -11189370 -4644372 1541165
43270A541165L185028l728491p848462m097986J658224J755049j315517p32800
$$ 1541165 4726193 997702 -6850760 -10948746 -9290522 -7535473 -8850990 -9583790
43262i583790K759167L667446J776002P69855L72410k217596n583877n660483
$$ -9583790 -6824623 -3157177 -1381175 -611320 -238910 -2456506 -8040383 -13700866
43254a3700866k180001J642411L563905K599080j430412m949645k230348N816464
$$ -13700866 -15880867 -14238456 -10674551 -8075471 -9505883 -14455528 -16685876 -10869412
43246a0869412J0210840O166344K90109l80401O40829k942118q161084p982915
$$ -10869412 -658572 5507772 5797881 5417480 6058309 3116191 -5044893 -13027808
43238a3027808l331726L6796K406424P449524J2144651J0378698M537434K485345
$$ -13027808 -16359534 -16322738 -13916314 -6466790 5677861 16056559 20593993 23079338
43230B3079338M121957K069258m391901p406704l918480k55297r16517k557136
$$ 23079338 27201295 29270553 24878652 17471948 13553468 13298171 12381654 9824518
43222I824518k073724j524885j709414M82478M777146N915376K946868J657416
$$ 9824518 7750794 6225909 4516495 4998973 9776119 15691495 18638363 20295779
43214B0295779L716035K444731n154232j1141629q779363m088502o234361j2210910
$$ 20295779 24011814 26456545 21302313 10160684 1381321 -2707181 -8941542 -21152452
43206b1152452j1282320j701658O861277P197796K539449m84069j96161J081448
$$ -21152452 -32434772 -34136430 -27275153 -20077357 -17537908 -18021977 -18218138 -17136690
43198a7136690J818452K649713N046968R453906J3344555J1975059L564178o814706
$$ -17136690 -15318238 -12668525 -7621557 1832349 15176904 27151963 30716141 23901435
43190B3901435j1296177p473016o53656K371650L56726k005601m5835N005391
$$ 23901435 12605258 5132242 4478586 6850236 7206962 5201361 5155526 10160917
43182A0160917P042667K856500k911888l552147K47003J409970k859532p023301
$$ 10160917 17203584 20060084 17148196 13596049 13843052 15253022 12393490 5370189
43174E370189n844088j562507J118543K221528L706384L557155r53613o106185
$$ 5370189 -473899 -2036406 -917863 1303665 5010049 8567204 7613591 1507406
43166A507406m576858M112677J1416392R883939J867092m026067l045478J365241
$$ 1507406 -3069452 1043225 12459617 22343556 24210648 20184581 17139103 18504344
43158A8504344K896813J70270k531358k322625k286457n804040r066115n468611
$$ 18504344 21401157 21571427 19040069 16717444 14430987 8626947 -439168 -5907779
43150e907779K956630O251744R69550m040852r75800N335430O127268K441336
$$ -5907779 -2951149 3300595 4270145 229293 -746507 4588923 10716191 13157527
43142A3157527J151103K075663k61480m426067l128940L159068M852268j610179
$$ 13157527 14308630 16384293 16122813 11696746 8567806 11726874 16579142 14968963
43134A4968963p294679m232642L002446N207225J605114j624483j485810l83168
$$ 14968963 7674284 3441642 6444088 11651313 13256427 11631944 10146134 9762966
43126I762966n52962j429384j342676J294917O596648J0823342Q654261N09585
$$ 9762966 9210004 7780620 6437944 7732861 14329509 25152851 33807112 34316697
43118C4316697o179349o299464l524442l330387m035085q77113M141359L876719
$$ 34316697 28137348 21837884 18313442 14983055 10947970 10070857 14212216 18088935
43110A8088935l074194r692687r735876m534700P01021L157225L370553L090075
$$ 18088935 15014741 5322054 -4413822 -8948522 -8247501 -5090276 -1719723 1370352
43102A370352L779785N305840N547446L002949o67993k895679m033857n982418
$$ 1370352 5150137 10455977 16003423 19006372 18338379 15442700 11408843 5426425
43094E426425p926959p176741l827843n89414J905857N158589P894398O349263
$$ 5426425 -2500534 -9677275 -13505118 -14094532 -12188675 -7030086 864312 7213575
43086G213575J069487j816248Q98118M299700K621544k066361l299332J66898
$$ 7213575 8283062 6466814 7364932 11664632 14286176 12219815 8920483 9087381
43078I087381L516127L547786J898988L95509j770090m533825m748425l59725
$$ 9087381 12603508 16151294 18050282 18445791 16675701 12141876 7393451 7033726
43070G033726N586939P996739N725140K301063J235262K509072L613190K608082
$$ 7033726 12620665 20617404 26342544 28643607 29878869 32387941 36001131 38609213
43062C8609213j088j633194k30447K630072K137843m365721j2810127j5692767
$$ 38609213 38608125 36974931 36744484 39374556 41512399 37146678 24336551 8643784
43054H643784j0484742k357723K327073K381247Q6892l126576n668918l761403
$$ 8643784 -1840958 -4198681 -1871608 509639 596531 -2530045 -8198963 -11960366
43046a1960366L767401J0190720P354737k047217o004287O58520R125420R828696
$$ -11960366 -8192965 1997755 9352492 7305275 1300988 1959508 11084928 20913624
43038B0913624N358478L464465L844953J253109k734776k045744J766080J393586
$$ 20913624 26272102 29736567 33581520 34834629 32099853 30054109 31820189 33213775
43030C3213775k010984R84966J0555074J3024367R45176j3013251j2259370J206202
$$ 33213775 31202791 32187757 42742831 55767198 56712374 43699123 31439753 32645955
43022C2645955J1474999J1016568O779307O255904Q872879J2009651J5736244
$$ 32645955 44120954 55137522 61916829 68172733 77045612 89055263 104791507
43015A04791507J8892852J8045055J3405841J0036684J0707848J2562205J2618534
$$ 104791507 123684359 141729414 155135255 165171939 175879787 188441992 201060526
43008B01060526J1374571R156039M434609j684806m573363k903271j807274n670838
$$ 201060526 212435097 221591136 226025745 224340939 219767576 216864305 215057031 209386193
43000B09386193j1565333j3440272r742779l586192J803045M609375M007462J434741
$$ 209386193 197820860 184380588 174637809 171051617 172854662 177464037 181471499 182906240
42992A82906240L59769K387556N687825Q868873J2972919J7383672J8095947J3942173
$$ 182906240 183266009 185653565 191341390 200210263 213183182 230566854 248662801 262604974
42984B62604974J0629269J3382666J8304194J6863890P589828k617965q617097
$$ 262604974 273234243 286616909 304921103 321784993 329374821 326756856 318139759
42977C18139759j2546204j7751526k2290579k1874909j6849173j2921608j4771995
$$ 318139759 305593555 287842029 265551450 243676541 226827368 213905760 199133765
42970A99133765k0295491k2359307j7091643r391888p267490j0562770j0190636
$$ 199133765 178838274 156478967 139387324 129995436 122727946 112165176 101974540
42963A01974540j483600O868364L530554q784050j5517299r438810N37383K864893
$$ 101974540 100490940 107359304 110889858 102105808 86588509 77149699 77687082 80551975
42955H0551975j451924l214070o8577P34343n465320j2584703j1324811j576521
$$ 80551975 79100051 75885981 75817404 76551747 71086427 58501724 47176913 45600392
42947D5600392O872260N886866j802185o502516l103888L676673N695764Q56528
$$ 45600392 52472652 58359518 56557333 50054817 46950929 50627602 56323366 57179894
42939E7179894n204438n886041o73650M509946L637893k427441n900809p77639
$$ 57179894 51975456 46089415 45415765 49925711 53563604 51136163 45235354 44457715
42931D4457715Q826506J2232414N071664n097490q573271n275996k386841k817968
$$ 44457715 53284221 65516635 70588299 65490809 56917538 51641542 49254701 46436733
42923D6436733k176639K536834P047364N555248j029987o073788n288912j171754
$$ 46436733 44260094 46796928 53844292 59399540 58369553 52295765 47006853 45835099
42915D5835099P38495j676871n433353o736301n320682l351835j481641J236664
$$ 45835099 46573594 44896723 39463370 32727069 27406387 24054552 22572911 23809575
42907B3809575M083931N131251N385691P864160J1013373Q660216K2555n964419
$$ 23809575 27893506 33024757 38410448 46274608 57287981 65948197 65970752 60006333
42899F0006333k034840O426556Q982454N152893L354913O903194J0636902J1682049
$$ 60006333 57971493 64398049 73380503 78533396 81888309 88791503 99428405 111110454
42891A11110454J3836274J8665411K0995700J7628201J3507798J4112309J6975939
$$ 111110454 124946728 143612139 164607839 182236040 195743838 209856147 226832086
42884B26832086J5808952R308550J775329k048138m7088N745094Q511566K072518
$$ 226832086 242641038 251949588 253724917 251676779 251629691 257374785 265886351 267958869
42876B67958869j0501306j8675427j7801045j5064518j8052056k3196123k1672586
$$ 267958869 257457563 238782136 220981091 205916573 187864517 164668394 142995808
42869A42995808j2806139n028205n052682j0904997j4852657j0670123K4655P339964
$$ 142995808 130189669 125161464 120108782 109203785 94351128 83681005 83705660 91045624
42861I1045624K958603q378885j3399240q396411m157226p978164j1007495l118483
$$ 91045624 94004227 85625342 72226102 63829691 59672465 51694301 40686806 37568323
42853C7568323Q227968P640903l985565r729654j315377J0088347J1214708L490098
$$ 37568323 45796291 53437194 49451629 39721975 38406598 48494945 59709653 63199751
42845F3199751l065630m173883l037688l062458m576548o166571n816090k555937
$$ 63199751 60134121 55960238 52922550 49860092 45283544 39116973 33300883 30744946
42837C0744946J640648L755598L427220J924794j231100o320735r636174p193044
$$ 30744946 32385594 36141192 39568412 41493206 40262106 33941371 24305197 17112153
42829A7112153j184484L132338N484710Q383658Q498056k21617j4169494k0918587
$$ 17112153 15927669 19060007 24544717 32928375 41426431 41204814 27035320 6116733
42821F116733j5297304n562750j55137K417505N845659P527160M614764J031637
$$ 6116733 -9180571 -14743321 -14898458 -12480953 -6635294 891866 5506630 6538267
42813F538267J018305J537333j750793n973768n503048p13325M077171P273629
$$ 6538267 7556572 9093905 7343112 1369344 -4133704 -4847029 -769858 6503771
42805F503771Q555205N434605j815104o022644j542157O272490P431361P16890
$$ 6503771 15058976 20493581 18678477 12655833 11113676 17386166 24817527 25534417
42797B5534417o290958q346042o708400m101238k357500l555516p109612p502597
$$ 25534417 19243459 10897417 4189017 87779 -2269721 -5825237 -12934849 -20437446
42789b0437446j190778O545783Q403387N934688N775388P737607O219651K012597
$$ -20437446 -21628224 -15082441 -6679054 -744366 5031022 12768629 18988280 21000877
42781B1000877J884842N681012M752042l764789j0963321r028070j955024J625414
$$ 21000877 22885719 28566731 33318773 29553984 18590663 9562593 7607569 9232983
42773I232983k58010l640142n128370l461993N94725K859408m08264n032983k422323
$$ 9232983 8974973 5334831 206461 -3255532 -2660807 198601 -209663 -5242646 -7664969
42764g664969O490220R539339P76711r396203r163811j983452J522027J047029
$$ -7664969 -1174749 8364590 9141301 -254902 -9418713 -11402165 -9880138 -8833109
42756h833109L416565O678029K123279q272098j1022965j165853R551031J0095841
$$ -8833109 -5416544 1261485 3384764 -4887334 -15910299 -17076152 -7525121 2570720
42748B570720M685963K498604K647259o08126m697974k493925M002260N183303
$$ 2570720 7256683 9755287 12402546 11794420 7096446 4602521 8604781 13788084
42740A3788084j027971n793494l200499J336228L52517m930535p890357n556040
$$ 13788084 12760113 6966619 3766120 5102348 5454865 524330 -7366027 -12922067
42732a2922067R9781N934579Q517720M947679k750284p242706m429948O93965
$$ -12922067 -12822286 -6887707 1630013 6577692 3827408 -3415298 -7845246 -7151281
42724g151281J513641l08466J299599N727908O347715J741275j755777j58542
$$ -7151281 -5637640 -5946106 -4646507 1081401 7429116 9170391 7414614 7256072
42716G256072K765913K756842J283846J124034J140648p62598l699311n866538
$$ 7256072 10021985 12778827 14062673 15186707 16327355 15564757 11865446 5998908
42708E998908o551431m005651L423430J1537742J1995165L589461m607343n945661
$$ 5998908 -552523 -4558174 -1134744 10402998 22398163 25987624 21380281 15434620
42700A5434620m894961o957060p785764j648842N692853M420863k457828k311801
$$ 15434620 10539659 3582599 -4203165 -5852007 -159154 4261709 1803881 -507920
42692e07920P448674J5059973J1769290K670359l293945m597884l848429j472283
$$ -507920 6940754 22000727 33770017 36440376 33146431 28548547 24700118 23227835
42684B3227835J782829K216218j660707n718512n805620k688262J131474M629237
$$ 23227835 25010664 27226882 25566175 19847663 14042043 11353781 12485255 17114492
42676A7114492N940148K514082l494371n724260k581779K52968n79940r90064
$$ 17114492 23054640 25568722 22074351 16350091 13768312 14021280 13441340 12451276
42668A2451276J795775K843016j788359o616701m875523M4275m7820m759883o073527
$$ 12451276 14247051 17090067 15301708 8685007 3809484 3853759 3805939 -953944 -7027471
42659g027471j206903L995452M824920L476676L431181L853786K191841r75411
$$ -7027471 -8234374 -4238922 585998 4062674 7493855 11347641 13539482 12564071
42651A2564071j900388K313175R601964J2902211O875005m415899j0545186p319852
$$ 12564071 10663683 12976858 22578822 35481033 42356038 37940139 27394953 20075101
42643B0075101j345217P32320R49988K888403K933871k931645r023102p033738
$$ 20075101 18729884 19462204 20412192 23300595 26234466 23302821 14279719 7245981
42635G245981j93258Q53498m551909n587228K254154R232711O152877k118021
$$ 7245981 7052723 7906221 3354312 -2232916 21238 9253949 15406826 13288805
42627A3288805m656957L12561N278558M838592R40175j776803j245281J139233
$$ 13288805 8631848 8944409 14222967 19061559 20001734 18224931 16979650 18118883
42619A8118883K409580J122540q76763j278986j451579m435093q711040q461992
$$ 18118883 20528463 21651003 20774240 19495254 18043675 13608582 4897542 -3564450
42611c564450j619749O464187R613335P574773L977920J123786l74762J63749
$$ -3564450 -5184199 1279988 10893323 18468096 22446016 23569802 23195040 23358789
42603B3358789K227751L035161P81308k167067j801734K381400O488885O230788
$$ 23358789 25586540 28621701 29403009 27235942 25434208 27815608 34304493 40535281
42595D0535281J042095n412502q766057q378635p278547o876226m202938K827615
$$ 40535281 41577376 36164874 27398817 19020182 11741635 4865409 662471 3490086
42587C490086R887279J0585109N178901j36148k186011l449407n338708n053768
$$ 3490086 13377365 23962474 29141375 29005227 26819216 23369809 18031101 12977333
42579A2977333j224175K737720L801092L367604L286486K011769j899184n817649
$$ 12977333 11753158 14490878 18291970 21659574 24946060 26957829 25058645 19240996
42571A9240996n987543k146372L206894P781972R805373Q049535L592732o83975
$$ 19240996 13253453 11107081 14313975 22095947 31901320 39950855 43543587 42859612
42563D2859612l564923n878047o967175m614366N64368M807816O425950O896174
$$ 42859612 39294689 33416642 26449467 21835101 22399469 27207285 33633235 40529409
42555D0529409N853004O24303p340309j1586751r107892m094289m62343K995562
$$ 40529409 46382413 47006716 39666407 28079656 18971764 14877475 14415132 17410694
42547A7410694O493898N559060j066193o387018m733045r26858k718998q642459
$$ 17410694 23904592 29463652 28397459 22010441 17277396 16350538 13631540 4989081
42539D989081j0819902o179667K115474J0605693J5791524J2818531K248455n738854
$$ 4989081 -5830821 -12010488 -9895014 710679 16502203 29320734 31569189 25830335
42531B5830335l172031L027162M73456r301507j2971937o227327P44733R34215
$$ 25830335 22658304 25685466 26158922 16857415 3885478 -2341849 -1597116 -662901
42523f62901P28307O840684J3930046J3183630N736897l25334j298920N27028
$$ -662901 65406 6906090 20836136 34019766 39756663 39431329 38132409 38659437
42515C8659437K563290L284171J210669k314714k458028K347705O323261L897611
$$ 38659437 41222727 44506898 45717567 43402853 40944825 43292530 49615791 53513402
42507E3513402j939639m283155k515731j626674k861031j852440L101921O748384
$$ 53513402 51573763 47290608 44774877 43148203 40287172 38434732 41536653 48285037
42499D8285037L810476l038660n569345Q3744Q083321Q818949P3445r426597r384239
$$ 48285037 52095513 49056853 43487508 43571252 51654573 60473522 60546967 51120370 41736131
42490D1736131J01474Q613408P297943k297050j1454385j2889248n459997N531156
$$ 41736131 41837605 50451013 57748956 55451906 43997521 31108273 25648276 31179432
42482C1179432J0874301M475340q992714j6751756j1721223p84158M526529K496485
$$ 31179432 42053733 46529073 37536359 20784603 9063380 8279222 12805751 15302236
42474A5302236Q69505L791328O298056L602745k88729J879447R244777J2495540
$$ 15302236 16171741 19963069 26261125 29863870 29575141 31454588 40699365 53194905
42466E3194905N584998o122231j1933535q182316j385004P47013j954411m196543
$$ 53194905 58779903 52657672 40724137 32541821 31156817 31903830 29949419 25752876
42458B5752876l401842k072726k301179j805766K315609P844966Q679183K488123
$$ 25752876 22351034 20278308 17977129 16171363 18486972 26331938 35011121 37499244
42450C7499244n052234o029074J20569N733874M795307K58433j703517j250050
$$ 37499244 32447010 26417936 26538505 32272379 37067686 37326119 35622602 34372552
42442C4372552k593642m265818m59084O902135P458303j619611q657251m153462
$$ 34372552 31778910 27513092 27054008 33956143 41414446 39794835 31137584 26984122
42434B6984122M328481M634541K58945M072710J5185108J7815240M983375j0761444
$$ 26984122 31312603 35947144 36206089 40278799 55463907 73279147 78262522 67501078
42426F7501078j4970760q041805J169705P992900J1400008R693643M433652K158907
$$ 67501078 52530318 44488513 45658218 53651118 65051126 74744769 79178421 81337328
42418H1337328N519773Q559369O563860L898045N475679P321684L791492j514151
$$ 81337328 86857101 95416470 101980330 105878375 111354054 118675738 122467230 120953079
42410A20953079j182563L607600N344822K634293J640915N616011J0448900J1320951
$$ 120953079 119770516 123378116 128722938 131357231 132998146 138614157 149063057 160384008
42402A60384008Q343838M999757M743739Q873293J4902220J8007467J5950291
$$ 160384008 168727846 173727603 178471342 187344635 202246855 220254322 236204613
42395B36204613J0671810M611233k21003M81924R121298J7319921J1645995o373612
$$ 236204613 246876423 251487656 251266653 251748577 260869875 278189796 289835791 283462179
42387B83462179j7026125q079577O838141P585030l986408j0281032o416523m355643
$$ 283462179 266436054 258356477 265194618 272779648 268793240 258512208 252095685 247740042
42379B47740042r932128j3574305p441727K653209P685759O776693L606310P46182
$$ 247740042 237807914 224233609 216791882 219445091 227130850 233907543 237513853 238260035
42371B38260035R50191N466075Q861577M549181l193169l175523M929385Q486348
$$ 238260035 239210226 244676301 253537878 258087059 254893890 251718367 256647752 265134100
42363B65134100R27692r037924j2055017j0386988r556940q664747o048187m829548
$$ 265134100 266061792 257023868 244968851 234581863 225024923 216360176 210311989 205482441
42355B05482441n859640m446817o16969k373478j1352917j6283081j0047571k476175
$$ 205482441 199622801 195175984 194559015 192185537 180832620 164549539 154501968 152025793
42347A52025793m906254j1961737j1856483o397456n845642r880642r316109l386986
$$ 152025793 147119539 135157802 123301319 116903863 111058221 101177579 91861470 88474484
42339H8474484r7486q64861N66335M174941L072155j990406j848792M201676M396019
$$ 88474484 88376998 87512137 88078472 92253413 95325568 93335162 91486370 95688046 100084065
42330A00084065p232647k0209101k1777029j2302050k95598R188907J4197682
$$ 100084065 92851418 72642317 50865288 38563238 38267640 47456547 61654229
42323F1654229J1671502K024225o818703p379363j749244K607112K898564J860146
$$ 61654229 73325731 75349956 68531253 61151890 59402646 62009758 64908322 66768468
42315F6768468J927182L777928P832439J2043425J0787556J524575r254940j2553351
$$ 66768468 68695650 72473578 80306017 92349442 103136998 104661573 95406633 82853282
42307H2853282q575785o034138r242115j1928218o871445K778364O832736J547526
$$ 82853282 74277497 68243359 59001244 47073026 40201581 42979945 49812681 51360207
42299E1360207n082930l333788N955658J2372411Q319565l004528j2519768j4756908
$$ 51360207 46277277 42943489 48899147 61271558 69591123 66586595 54066827 39309919
42291C9309919j0631724l868498J890386L836762J544352j812505j917299K439076
$$ 39309919 28678195 24809697 26700083 30536845 32081197 30268692 28351393 30790469
42283C0790469Q256754J0963875P827040L58401n932988o225587j591199L015806
$$ 30790469 39047223 50011098 57838138 58196539 52263551 46037964 44446765 47462571
42275D7462571O154551J0625085J5546563J4569723O508626R07163N304939J2182827
$$ 47462571 53617122 64242207 79788770 94358493 100867119 101774282 107079221 119262048
42267A19262048Q640532l628587r499661k130545P841816Q658377L218710K182672
$$ 119262048 127902580 124273993 114774332 112643787 120485603 129143980 132362690 134545362
42259A34545362Q316732J5037658J6607289J3229789P937154L537028J751194
$$ 134545362 142862094 157899752 174507041 187736830 195673984 199211012 200962206
42252B00962206J850750J016302j705595l621265k805494j916777m532867r447364
$$ 200962206 202812956 203829258 202123663 198502398 195696904 193780127 189247260 179799896
42244A79799896j1994059j0252169o851261m640610l359828j748250j076151m076053
$$ 179799896 167805837 157553668 150702407 146061797 142701969 140953719 139877568 135801515
42236A35801515r979330j3196831r746718l579408k091007n528715o875966l745467
$$ 135801515 125822185 112625354 102878636 99299228 97208221 91679506 84803540 81058073
42228H1058073k588206o658809q399223j935934M665120J170482o762225n740516
$$ 81058073 78469867 71811058 63411835 61475901 66141021 67311503 60549278 54808762
42220E4808762K429913K884974o719513j1040724k496958O002836K923076l750078
$$ 54808762 57238675 60123649 53404136 42363412 39866454 45869290 48792366 45042288
42212D5042288k911149m29647o601865j4570695j0111187L476143R449954L865655
$$ 45042288 42131139 41701492 35099627 20528932 10417745 13893888 23343842 27209497
42204B7209497j135419n04250l680338j4256254j9753545j0654115L644857Q311687
$$ 27209497 26074078 25569828 21889490 7633236 -12120309 -22774424 -19129567 -10817880
42196a0817880K912612k573524m102496m776632m196549J910756J1682716J5925764
$$ -10817880 -7905268 -10478792 -14581288 -19357920 -23554469 -21643713 -9960997 5964767
42188E964767R381383k320487r295995p571373r69876M348759N052162J768498
$$ 5964767 15346150 13025663 3729668 -3841705 -4811581 -462822 4589340 6357838
42180F357838k478748m392479k428777J620117L413733N15937l636403k850010
$$ 6357838 3879090 -513389 -2942166 -1322049 2091684 2607621 -1028782 -3878792
42172c878792L677117R453422Q926328M186282M96933j131927k543297l079815
$$ -3878792 -201675 9251747 18178075 22364357 22861290 21729363 19186066 16106251
42164A6106251j510490r96749n442798j1735362j2195399m879057M551702J1182371
$$ 16106251 14595761 13599012 8156214 -3579148 -15774547 -20653604 -16101902 -4919531
42156d919531J4570731J3882912O947367l578701r994814q935498n477588m703670
$$ -4919531 9651200 23534112 30481479 26902778 16907964 7972466 2494878 -2208792
42148b208792m458645k21933P287617J3228197J4118896R606022K163377l201731
$$ -2208792 -6667437 -6889370 398247 13626444 27745340 37351362 39514739 36313008
42140C6313008l111491j067430l256619p802302n631734M567071J0680965L159338
$$ 36313008 33201517 32134087 28877468 21075166 15443432 20010503 30691468 33850806
42132C3850806j0070588j3300609l550873P402376R469723M381705m41603j050021
$$ 33850806 23780218 10479609 6928736 14331112 23800835 28182540 27740937 26690916
42124B6690916J220016K312534r13141o569718q330377l259423L319862M793089
$$ 26690916 27910932 30223466 29310325 22740607 14410230 11150807 14470669 19263758
42116A9263758K091031N12033J059928J487606K961037P465857J0257802M234501
$$ 19263758 21354789 21866822 22926750 24414356 27375393 34841250 45099052 49333553
42108D9333553p856556j4811592j2143060o677866l486650J566423J0740665J5421639
$$ 49333553 41476997 26665405 14522345 7844479 4357829 5924252 16664917 32086556
42100C2086556P283877p230596j3197011n783023N470139J0101645P352375K893359
$$ 32086556 39370433 32139837 18942826 13159803 18629942 28731587 36083962 38977321
42092C8977321J039827K102210L611044K499309j756506n731011n558431j366200
$$ 38977321 40017148 42119358 45730402 48229711 46473205 40742194 35183763 33817563
42084C3817563L535834O442517N884128O91022p648210j3162817j0685158k780682
$$ 33817563 37353397 43795914 49680042 50371064 42722854 29560037 18874879 16094197
42076A6094197K944070L416483K297488K315179J111800l069694o829526o600283
$$ 16094197 19038267 22454750 24752238 27067417 28179217 25109523 18279997 11679714
42068A1679714m454563m590614o482758o009419k193524J377148J839293N82530
$$ 11679714 7225151 2634537 -3848221 -9857640 -12051164 -10674016 -8834723 -8252193
42060h252193J045084M876326J0121158J2006106P065471j590595n544078j153975
$$ -8252193 -7207109 -2330783 7790375 19796481 26861952 25271357 19727279 18573304
42052A8573304L871877n09790j1757667j5732323m930879J0537785J5177513P110355
$$ 18573304 22445181 21935391 10177724 -5554599 -10485478 52307 15229820 22340175
42044B2340175j630141k316798J02712l798946j3574388j9029748j3787600l717627
$$ 22340175 20710034 18393236 18495948 14697002 1122614 -17907134 -31694734 -35412361
42036c5412361Q59576j478320k599133K408655P759187O140940M64794m87793
$$ -35412361 -34552785 -36031105 -38630238 -36221583 -28462396 -22321456 -21856662 -22344455
42028b2344455M355255P743295P010553P807102J2064853J2423506M846957k520792
$$ -22344455 -17989200 -10245905 -3235352 4571750 16636603 29060109 33907066 31386274
42020C1386274j987154L55862m514342j0934975o614341M885664O920628l293256
$$ 31386274 29399120 29754982 25240640 14305665 7691324 12576988 19497616 16204360
42012A6204360q081746L440095J7217180J4441556k314482j6223612k0086800
$$ 16204360 8122614 11562709 28779889 43221445 40906963 24683351 4596551
42005D596551j8475418j2814537j095855R809813Q248914l784082j0627539n028556
$$ 4596551 -13878867 -26693404 -27789259 -17979446 -9730532 -13514614 -24142153 -29170709
41997b9170709K891976L702656K498880O651062J1422442Q938506K988329K313966
$$ -29170709 -26278733 -22576077 -20077197 -13426135 -2003693 6934813 9923142 12237108
41989A2237108M689665J154318o509400o843258J534328N260477l116600j1665360
$$ 12237108 16926773 18081091 11571691 4728433 6262761 11523238 8406638 -3258722
41981c258722n582960J0655822J8709904J0508345l631264j0742311r250367m719996
$$ -3258722 -8841682 1814140 20524044 31032389 27401125 16658814 7408447 2688451
41973B688451j04715M153001N637944K295132k536927k821368K510837Q312435
$$ 2688451 2583736 6736737 12374681 14669813 12132886 9311518 11822355 20134790
41965B0134790R708214O754940K431441j125629l469226m822114n198241m056377
$$ 20134790 29843004 36597944 39029385 37903756 34434530 29612416 24414175 20357798
41957B0357798j241287J340363Q56188k219473l517537r98651J059656j632884
$$ 20357798 19116511 20456874 21313062 19093589 15576052 14577401 15637057 14004173
41949A4004173n656056m200507K228095O168562M439956J893143K334933K911938
$$ 14004173 8348117 4147610 6375705 12544267 16984223 18877366 21212299 24124237
41941B4124237O44776k145988k986858l523726l971848J53512R424318J4604034
$$ 24124237 24769013 22623025 19636167 16112441 12140593 12294105 21718423 36322457
41933C6322457P609691n693858j2472572j0081475o860723o802612l771299O423668
$$ 36322457 43932148 38238290 25765718 15684243 8823520 2020908 -1750391 4673277
41925D673277J6759565J6962426O137204o871619j3347155j1969653p404127l619876
$$ 4673277 21432842 38395268 44532472 37660853 24313698 12344045 4939918 1320042
41917A320042M08198O975368J2641312J0422510J344802l099279L837142J2713057
$$ 1320042 1728240 8703608 21344920 31767430 33112232 30012953 33850095 46563152
41909D6563152J0606683L98609m032916P21101M076207j22939n199119n293778
$$ 46563152 57169835 57568444 53535528 54256629 58332836 58209897 53010778 47717000
41901D7717000m816124q164712j0830158q175721m144092l521632l360672O5386
$$ 47717000 42900876 34736164 23906006 15730285 11586193 8064561 4703889 4769275
41893D769275L034730J481876j91551L577086Q734359P359931J44307n556765
$$ 4769275 7804005 9285881 9094330 12671416 21405775 28765706 28910013 23353248
41885B3353248o606277m779007k48146O820908J1141862P768072P24630k049318
$$ 23353248 16746971 11967964 11719818 18540726 29682588 37450660 38175290 36125972
41877C6125972l12623K5962k361309l827848m042504n428501n824094j205827
$$ 36125972 35813349 35839311 33478002 29650154 25607650 20179149 14355055 13149228
41869A3149228N295858O804180M294711M495943O665241K983986o717295j2509227
$$ 13149228 18445086 25249266 29543977 34039920 40705161 43689147 36971852 24462625
41861B4462625r540349m396148k476631k06175M941326P328111K861278l296257
$$ 24462625 14922276 10526128 8049497 7843322 12784648 20112759 22974037 19677780
41853A9677780n721158o998085r689316q462548Q02488J0864686J1761711M794539
$$ 19677780 13956622 6958537 -2730779 -11193327 -10390839 473847 12235558 17030097
41845A7030097j172844l289012n384452q078113p653105l821154m43811J496070
$$ 17030097 15857253 12568241 7183789 -894324 -8547429 -12368583 -12812394 -11316324
41837a1316324M877813J0060720J3070187J0766123M059412l627212q298734p569671
$$ -11316324 -6438511 3622209 16692396 27458519 31517931 27890719 19591985 12022314
41829A2022314l681057j749929k673953k032268J237975J493756l395532n678769
$$ 12022314 8341257 6591328 3917375 1885107 3123082 4616838 1221306 -4457463
41821d457463Q27609R188568Q592613L32939n450266n073934k776772l28607L128583
$$ -4457463 -3629854 5558714 14151327 14484266 9034000 3960066 1183294 854687 3983270
41812C983270L415736l557648j0143717m428552R911808J5798909P450371k107939
$$ 3983270 7399006 3841358 -6302359 -10730911 -819103 14979806 22430177 20322238
41804B0322238k976778k194244p385130j1293494m662628O664095J0809524P937602
$$ 20322238 17345460 15151216 7766086 -3527408 -8190036 -1525941 9283583 17221185
41796A7221185O208350O066402K014264m238560n760630l380541m442111r718898
$$ 17221185 23429535 29495937 31510201 27271641 21511011 18130470 13688359 3969461
41788C969461j2946258j2512528j2071379r824902K73392J4792799K0616639J2760553
$$ 3969461 -8976797 -21489325 -33560704 -43385606 -43112214 -28319415 -7702776 5057777
41780E057777K028121k17743M067593O368575M007169m10299m959841p305529
$$ 5057777 7085898 6868155 10935748 17304323 21311492 20901193 15941352 8635823
41772H635823l466736N754901J1885372Q581038J96942n220794p012591r330402
$$ 8635823 5169087 10923988 22809360 31390398 31587340 26366546 19353955 10023553
41764A0023553j1556917r314656l087264J782323L177101L728545M562495L934917
$$ 10023553 -1533364 -10848020 -13935284 -12152961 -8975860 -5247315 -684820 3250097
41756C250097K379007K812374M262254J642257n578910r660502l614114Q779002
$$ 3250097 5629104 8441478 12703732 14345989 8767079 -893423 -4507537 4271465
41748D271465J5776617J0028847l854037j4154741j3738881o389553q78105N4550
$$ 4271465 20048082 30076929 26222892 12068151 -1670730 -8060283 -8938388 -8883838
41740h883838J204690N079991O659162K053005l425248k915669P49071N71485
$$ -8883838 -7679148 -2599157 4060005 6113010 2687762 -227907 521164 1092649
41732A092649j186948L066971R806305O303301p444260j3790134k888941J0750480
$$ 1092649 -94299 2972672 12778977 19082278 11638018 -2152116 -5041057 5709423
41724E709423R925230J354829L446095J4871313J6121775J596282j0917069q298743
$$ 5709423 15634653 16989482 20435577 35306890 51428665 53024947 42107878 33809135
41716C3809135r10299l259414j1286949j2469052p214053m710207m656854N75294
$$ 33809135 32898836 29639422 18352473 5883421 -1330632 -6040839 -10697693 -10122399
41708a0122399Q697946Q482405j185403p607896l274889L788634M191821J048735
$$ -10122399 -1424453 7057952 5872549 -1735347 -5010236 -1221602 2970219 4018954
41700D018954K008870N381152L434097m442476j0271776q271942j056292N191011
$$ 4018954 6027824 11408976 14843073 10400597 128821 -8143121 -9199413 -4008402
41692d008402P686868Q441246J0564748J3427927J1752106J737013j1788174j8083074
$$ -4008402 3678466 12119712 22684460 36112387 47864493 49601506 37813332 19730258
41684A9730258j2046860J15810Q306136Q160497J919113n719584r953788q416544
$$ 19730258 7683398 7799208 16105344 24265841 26184954 20465370 10511582 2095038
41676B095038m498727m112992o443522l378427P739094J7016325J4281126L467891
$$ 2095038 -2403689 -6516681 -12960203 -16338630 -8599536 8416789 22697915 26165806
41668B6165806l214752j897186R34684P10695n95824j770179m584491p070958
$$ 26165806 22951054 21053868 21988552 22699247 22103423 20333244 15748753 8677795
41660H677795l538480N316733R782906K990648r848335j7685990j5053630n006928
$$ 8677795 5139315 10456048 20238954 23229602 13381267 -4304723 -19358353 -24365281
41652b4365281N023599Q648098O111193N040934J0473841J5133985Q101041o647953
$$ -24365281 -19341682 -10693584 -4582391 458543 10932384 26066369 34167410 27519457
41644B7519457j1774190m00671J3419457J4795345O916722J46365o460275j8226215
$$ 27519457 15745267 15344596 28764053 43559398 50476120 50622485 44162210 25935995
41636B5935995k7150836j8953941L451574J9812758J8410751Q366400K178880
$$ 25935995 -1214841 -20168782 -16717208 3095550 21506301 29872701 32051581
41629C2051581r83181p623642j6006511j8995488j4814756p187839J409344J0123126
$$ 32051581 31068400 23444758 7438247 -11557241 -26371997 -33559836 -32150492 -22027366
41621b2027366J5988626J5535374R374998K025294j990511q47773L390074N768485
$$ -22027366 -6038740 9496634 18871632 20896926 18906415 18058642 21448716 27217201
41613B7217201L852198J845826M568673Q135067M171187n943026j0671543n787286
$$ 27217201 31069399 32915225 37483898 45618965 49790152 43847126 33175583 27388297
41605B7388297j900455p435526j3714496p907055N807646J1237448L878686l622531
$$ 27388297 25487842 18052316 4337820 -3569235 2238411 13475859 17354545 13732014
41597A3732014j006859O522016R035437N938461K743533M96388l899716r760008
$$ 13732014 12725155 19247171 28282608 34221069 36964602 37460990 33561274 23801266
41589B3801266j1779653p127359P62196O041952N682102O80496n713559r916638
$$ 23801266 12021613 4894254 5656450 11698402 17380504 18061000 12347441 2430803
41581B430803r415721m243011K121610M652912J722692k096240p39169N428195
$$ 2430803 -6984918 -11227929 -9106319 -4453407 -2730715 -4826955 -5566124 -137929
41573a37929R448664O650855K26827m018770m770034m033705k393993N32663L419696
$$ -137929 9310735 15961590 16188417 12169647 7399613 3365908 971915 1504578 4924274
41564D924274M809187N089961L820896j273444q674183j1121585n160698J912239
$$ 4924274 9733461 14823422 18644318 17370874 8696691 -2424894 -7585592 -5673353
41556e673353K095939o57241K621733R635052R392477M34364o276710m680276
$$ -5673353 -3577414 -4234655 -1612922 8022130 17414607 17848971 11572261 6891985
41548F891985j177422q88195Q34880O534067Q383575J109951o928766o284486
$$ 6891985 5714563 4826368 5661248 12195315 20578890 21688841 14760075 8475589
41540H475589j607347k551374o644663m633741J914272K722512l514588p582784
$$ 8475589 6868242 4316868 -2327795 -6961536 -5047264 -2324752 -5839340 -13422124
41532a3422124n814719m062706m115613J02032Q938389J2694391O955525O33586
$$ -13422124 -19236843 -23299549 -27415162 -27313130 -18374741 -5680350 1275175 1908761
41524A908761J230255K710794k546235q858665n940599L563591P630700L108054
$$ 1908761 3139016 5849810 3303575 -5555090 -11495689 -7932098 -301398 2806656
41516B806656j380507k65661K314206K331853K268652L943253L381357j701342
$$ 2806656 1426149 1160488 3474694 5806547 8075199 12018452 15399809 13698467
41508A3698467n598253k369236L858149L261315n904182j3891198j1272116j62540
$$ 13698467 8100214 5730978 9589127 12850442 6946260 -6944938 -18217054 -18379594
41500a8379594Q868438Q987523L318194n70698N79315L906395N135315K169634
$$ -18379594 -9511156 -523633 2794561 2223863 2803178 6709573 11844888 14014522
41492A4014522n001635j4001214j9061701j4814054l679562M411977L573792n4229
$$ 14014522 9012887 -4988327 -24050028 -38864082 -42543644 -38131667 -34557875 -34612104
41484c4612104L032254J1667085J5445531R532196N18438m035856m474300l930663
$$ -34612104 -31579850 -19912765 -4467234 5064962 5583400 1547544 -2926756 -6857419
41476f857419j377412M201011P823531M199636l118214n519107j273536L195158
$$ -6857419 -8234831 -4033820 3789711 7989347 4871133 -647974 -1921510 1273648
41468A273648L798719L278110L874035K843835j226958l825364j179933K962513
$$ 1273648 5072367 8350477 12224512 15068347 13841389 10016025 8836092 11798605
41460A1798605K675605j244358l475947l087504l862289o236775n475417M15295
$$ 11798605 14474210 13229852 9753905 6666401 2804112 -3432663 -8908080 -8492785
41452h492785O323877O644508K553007o95371j129420r05569j077880K67014L718359
$$ -8492785 -2168908 4475600 7028607 6333236 5203816 4298247 3220367 3487381 7205740
41443G205740N510265J470680o679858j1544632p843581J251592P300162N551070
$$ 7205740 12716005 14186685 7506827 -4037805 -11881386 -10629794 -3329632 2221438
41435B221438j241644p412129r534008o409858J643210J0281281J1449942J465367
$$ 2221438 979794 -6432335 -15966343 -22376201 -20732991 -10451710 998232 2463599
41427B463599j2196626j6967458q424816N889512J5433451J5598640Q404342m69023
$$ 2463599 -9733027 -26700485 -35125301 -29235789 -13802338 1796302 10200644 9731621
41419I731621m505295j198244M290123M517203k33889k467078Q21340L648695
$$ 9731621 5226326 4028082 8318205 12835408 12601519 10134441 10955781 14604476
41411A4604476J367758j597250K04153L587856K327630k053650l117171k69806
$$ 14604476 15972234 14374984 14579137 18166993 20494623 18440973 15323802 15053996
41403A5053996J564894J346525K424245M082432J420746n121766q622010o614047
$$ 15053996 16618890 17965415 20389660 24472092 25892838 20771072 12149062 5535015
41395E535015n196597q348583j0501224n353681L460269O896001K445797l991367
$$ 5535015 338418 -8010165 -18511389 -23865070 -20404801 -13508800 -11063003 -15054370
41387a5054370o098156k413579M572510J0342943J0581104N067048j401023m208461
$$ -15054370 -21152526 -23566105 -18993595 -8650652 1930452 6997500 5596477 1388016
41379A388016l351087q71351K868104P202320Q818448N840759J902905J596782
$$ 1388016 -1963071 -2834422 33682 7236002 16054450 21895209 23798114 25394896
41371B5394896L826026M321439K718358J669596M92795l842372r639419j1064693
$$ 25394896 29220922 33542361 36260719 37930315 38423110 34580738 24941319 13876626
41363A3876626o894930k371831n03046J996784O867699Q766673K973238n820819
$$ 13876626 6981696 4609865 4106819 6103603 12971302 21737975 24711213 18890394
41355A8890394q728127m335495Q58076K521187K836636M220846M573304J623823
$$ 18890394 10162267 5826772 6684848 9206035 12042671 16263517 20836821 22460644
41347B2460644j869721j083830M094387Q311318O825404M73807n929636q972927
$$ 22460644 20590923 19507093 23601480 31912798 38738202 39212009 33282373 24309446
41339B4309446r354225r380007r163448o850321k334435J504429K367593J358130
$$ 24309446 14955221 5575214 -3588234 -10438555 -12772990 -11268561 -8900968 -7542838
41331g542838M20537j025617l861595n183432j051764O161034Q053363P07941
$$ -7542838 -7122301 -8147918 -12009513 -17192945 -18244709 -12083675 -4030312 -3322371
41323c322371q526630q891723N27233R287178P511621l348965j2303496r974755
$$ -3322371 -11849001 -20740724 -20213491 -10926313 -3414692 -6763657 -19067153 -29041908
41315b9041908K037342J2203570J0568540j9945o728698k636193M202312K353017
$$ -29041908 -27004566 -14800996 -4232456 -4252401 -10981099 -13617292 -9414980 -7061963
41307g061963n942148p569005J898754J1000886Q661323m72693l762777J838602
$$ -7061963 -13004111 -20573116 -18674362 -7673476 987847 515154 -3247623 -1409021
41299a409021P969472P823564K937172k330130n777831n920290j953569K686956
$$ -1409021 6560451 14384015 17321187 14991057 9213226 3292936 1339367 4026323
41291D026323J839544n369262j1432974q288785L454279J4786157J6727754Q143860
$$ 4026323 5865867 496605 -10936369 -19225154 -15770875 -984718 15743036 23886896
41283B3886896l386747q429080m566588K283354O002631O605214O127291K796362
$$ 23886896 20500149 12071069 7504481 9787835 15790466 22395680 28522971 31319333
41275C1319333m984098j2048077j1445168n007470j407252l677789o331298n542723
$$ 31319333 26335235 14287158 2841990 -2165480 -3572732 -7250521 -13581819 -19124542
41267a9124542l954357l478390j588020K245159M164709L170014K957540L393389
$$ -19124542 -23078899 -26557289 -28145309 -25900150 -21735441 -18565427 -15607887 -12214498
41259a2214498r31079r418067j2535827o037214J908620M902685Q510010J6418213
$$ -12214498 -13145577 -22563644 -35099471 -41136685 -39228065 -34325380 -25815370 -9397157
41251i397157J8012603M184754j3284983j5215625k635248O761168O567217O756290
$$ -9397157 8615446 12800200 -484783 -15700408 -18335656 -11574488 -5007271 1749019
41243A749019J0796453Q383100l782778j2869222j0088395l701756k162658J14426
$$ 1749019 12545472 20928572 17145794 4276572 -5811823 -9513579 -11676237 -11561811
41235a1561811Q002203J1339909J191018j0957379q437835L561265N529404n220898
$$ -11561811 -3559608 7780301 8971319 -1986060 -10423895 -6862630 -1333226 -6554124
41227f554124j0946225k441011P473738N854865j054778o41162N637385O756963
$$ -6554124 -17500349 -19941360 -12467622 -6612757 -7667535 -8308697 -2671312 4085651
41219D085651K61833o025591p551335p617553q298169n822916K094923J0576816
$$ 4085651 4347484 -1678107 -9229442 -16846995 -25145164 -30968080 -28873157 -18296341
41211a8296341J3282938J0320148O594008M175982M96422n551462r424002n789940
$$ -18296341 -5013403 5306745 11900753 16076735 16573157 11021695 1597693 -4192247
41203d192247L411185R088862M860711m842561r098926l060237O200631Q069146
$$ -4192247 -781062 8307800 13168511 8325950 -772976 -3833213 2367418 10436564
41195A0436564J055749n950655n319099O5980J848292k345062p211069q382658
$$ 10436564 11492313 5541658 222559 288539 2136831 -208231 -7419300 -15801958
41187a5801958o750406l434253K610992Q765233P741915j492360q066090k980826
$$ -15801958 -22552364 -25986617 -23375625 -14610392 -6868477 -8360837 -16426927 -19407753
41179a9407753O213303N199334n245290r822362k003999O436460L952595m459282
$$ -19407753 -13194450 -7995116 -13240406 -23062768 -25066767 -18630307 -14677712 -19136994
41171a9136994p160665k931687R24160J051258m71510k643465n116138m598938
$$ -19136994 -26297659 -29229346 -28305186 -27253928 -27725438 -30368903 -35485041 -40083979
41163d0083979N60040N033898L227688j024638J108000J0748212J9652327K0160763
$$ -40083979 -39523939 -34490041 -31262353 -32286991 -31178991 -20430779 -778452 19382311
41155A9382311J1233280l504652j7725298k4106039k0062253j0725063j896004
$$ 19382311 30615591 27110939 9385641 -14720398 -34782651 -45507714 -47403718
41148d7403718O763361J6264296K0766027J3780348q04782j2197288j5452426
$$ -47403718 -40640357 -24376061 -3610034 10170314 9365532 -2831756 -18284182
41141a8284182j3275087p879062l7329N785361N181374J974687L453875Q402276
$$ -18284182 -31559269 -39438331 -39475660 -33690299 -28508925 -26534238 -23080363 -14678087
41133a4678087R427869N894959L690383L038986j128308o478952m583747L101614
$$ -14678087 -5250218 644741 4335124 7374110 6245802 -233150 -4816897 -1715283
41125a715283M820063j965128m997738K900061J2312470J3062809Q130077L112820
$$ -1715283 3104780 1139652 -3858086 -958025 11354445 24417254 32547331 35660151
41117C5660151m489054j4518926j5986141l595370Q597766N671897m923575n521624
$$ 35660151 31171097 16652171 666030 -2929340 5668426 11340323 6416748 895124
41109H95124L304592N353037l320315q746454k933016M264736K543107l685336
$$ 895124 4199716 9552753 6232438 -2514016 -5447032 -1182296 1360811 -2324525
41101b324525m774914n44658J664455k201095q604644r428344R76031J6960036
$$ -2324525 -7099439 -7644097 -5979642 -8180737 -16785381 -26213725 -25237694 -8277658
41093h277658K2345005Q174393j2548761j8291249o015117P156258R167124N673130
$$ -8277658 14067347 22241740 9692979 -8598270 -14613387 -7457129 1709995 7383125
41085G383125M601216L419700r26115k890180Q44427K329578m550085j0788733
$$ 7383125 11984341 15404041 14477926 11587746 12432173 14761751 10211666 -577067
41077e77067m714052Q414471J2521787L389098p338526j0057804p443183n413394
$$ -577067 -5291119 3123352 15645139 19034237 11695711 1637907 -5805276 -11218670
41069a1218670m333202k784213j940053j643725J845152R306820J4073786R484621
$$ -11218670 -15551872 -18336085 -20276138 -21919863 -20074711 -10767891 3305895 12790516
41061A2790516j079980o606668j347637Q188437J0908749L703233o318241j1170595
$$ 12790516 11710536 5103868 3756231 11944668 22853417 26556650 20238409 9067814
41053I067814r626646m693328J381462N717700L333404n887658j1820174m903258
$$ 9067814 -558832 -5252160 -3870698 1847002 5180406 -707252 -12527426 -17430684
41045a7430684Q302014J0904851q67544j1238705p105593M285278Q346712M244977
$$ -17430684 -9128670 1776181 908637 -10330068 -17435661 -13150383 -4803671 -558694
41037e58694J569422K972336L636821M264116J0020332J6637239J1916885n199646
$$ -558694 1010728 3983064 7619885 11884001 21904333 38541572 50458457 45258811
41029D5258811j9304205j8124814p575070m96809R24421K864787O294307N915434
$$ 45258811 25954606 7829792 254722 -242087 682334 3547121 9841428 15756862
41021A5756862O14722l838517l336380n31567J12243j883026l853651l947650
$$ 15756862 16371584 12533067 9196687 8665120 8777363 6894337 3040686 -906964
41013i06964k685183j696861j516940m28081L625979R391838J2199886Q932084
$$ -906964 -3592147 -5289008 -6805948 -7234029 -3608050 5783788 17983674 26915758
41005B6915758J748094m595420p587279p311994l775936K906071R768392J1390621
$$ 26915758 28663852 24068432 16481153 9169159 5393223 8299294 18067686 29458307
40997B9458307M766792o708393j4940694j3489803l211173Q089397J2439492Q579305
$$ 29458307 34225099 27516706 12576012 -913791 -4124964 3964433 16403925 24983230
40989B4983230J694682k900831l857218k016391J897038O079140P024278L066897
$$ 24983230 26677912 23777081 19919863 17903472 19800510 25879650 32903928 35970825
40981C5970825k782098n972745n302772k600682P12323L571738L113422l006638
$$ 35970825 33188727 27215982 21913210 19312528 20024851 23596589 26710011 23703373
40973B3703373j1574940j5135904j0289656j855547L349285M396612N089310O697909
$$ 23703373 12128433 -3007471 -13297127 -15152674 -11803389 -7406777 -2317467 4380442
40965D380442N785195j15359p536396r891495m698014L319765O780234L076557
$$ 4380442 10165637 10050278 2513882 -7377613 -12075627 -8755862 -1975628 1100929
40957A100929l219907n756622l481125p70911o55038q19271J700010M526104K728531
$$ 1100929 -2118978 -7875600 -11356725 -12127636 -12782674 -13601945 -11901935 -7375831 -4647300
40948d647300l170286o664238l848072J762902N146933O213143O714045M729881
$$ -4647300 -7817586 -14481824 -18329896 -16566994 -11420061 -5206918 1507127 6237008
40940F237008k044412r684053j1387366p277444m147397m220969j419026P543579
$$ 6237008 4192596 -5491457 -16878823 -24156267 -28303664 -32524633 -33943659 -26400080
40932b6400080J5055585J2024013J340201n295802k558968L164919L888187l39598
$$ -26400080 -11344495 679518 2019719 -3276083 -5835051 -2670132 1218055 878457
40924H78457l618141j968307L006088N988440K998054l423563n192201J731122
$$ 878457 -2739684 -4707991 -1701903 4286537 7284591 3861028 -1331173 399949
40916C99949J0188769R523690J6265o865604m005457K454076L125775k043759
$$ 399949 10588718 20112408 20128673 13263069 9257612 11711688 14837463 12793704
40908A2793704o442790p144295o286915n124390k935141l75445J267272K755934
$$ 12793704 6350914 -793381 -7080296 -12204686 -15139827 -15515272 -14248000 -11492066
40900a1492066M289239K662847l301052p164098k232931P001163R576834M176038
$$ -11492066 -7202827 -4539980 -7841032 -15005130 -17238061 -10236898 -660064 3515974
40892C515974N30721K800200K970497l520834o913818J784429J3151934J0385253
$$ 3515974 4046695 6846895 9817392 6296558 -617260 1167169 14319103 24704356
40884B4704356n488347j5528381q949304L569193O833572M71459n419089n693145
$$ 24704356 19216009 3687628 -5261676 -1692483 5141089 5612548 193459 -5499686
40876e499686l036145n64162M28898j800775o799942q626725j856277R494898
$$ -5499686 -8535831 -9099993 -8671095 -10471870 -17271812 -25898537 -27754814 -18259916
40868a8259916J4902032R915199J296093j475373L456405R408659Q521459j85881
$$ -18259916 -3357884 6557315 7853408 6378035 9834440 19243099 27764558 27578677
40860B7578677r123078r924211l777994l21716l966822o833020q04974Q606668
$$ 27578677 18455599 8531388 4753394 4431678 464856 -6368164 -7173138 1433530
40852A433530R235438K96240o850808n889137k780165l310019l868119K6010M733638
$$ 1433530 10668968 10965208 4114400 -1774737 -4554902 -7864921 -11733040 -11707030 -6973392
40843f973392N067092L417401M953321Q278905P953941L275047j494239l219936
$$ -6973392 -1906300 1511101 6464422 14743327 22697268 25972315 24478076 21258140
40835B1258140j520195K539143N025863O40992r317902j5164227j0824378k585054
$$ 21258140 19737945 22277088 27302951 27943943 18626041 3461814 -7362564 -9947618
40827i947618R76173K024414P125328J2812257R540659j677546q934993o675669
$$ -9947618 -8971445 -6947031 178297 12990554 22531213 20853667 11918674 5243005
40819E243005j934998j005752p11222K900766O596651N919148J862284k735793
$$ 5243005 3308007 2302255 1591033 4491799 11088450 17007598 18869882 16134089
40811A6134089o798173p744749k405767M938282M001654o632485j4481739r835693
$$ 16134089 9335916 1591167 -814600 4123682 8125336 1492851 -12988888 -22824581
40803b2824581L54802L505824n57533k473467O49210L000796J800945R54047K630131
$$ -22824581 -22469779 -18963955 -19521488 -21994955 -21345745 -18344949 -16544004 -15589957 -12959826
40794a2959826L725110K195027K47261l30588o36416j229430q88797K92333P70030
$$ -12959826 -9234716 -7039689 -6792428 -7123016 -7759432 -8988862 -9877659 -9585326 -8815296
40785h815296J122842L616538P416221Q220922M061320j627864m249468l339015
$$ -8815296 -7692454 -4075916 3340305 11561227 15622547 13994683 9745215 6406200
40777F406200k320664l759312n483010k253798P075375J5025493J2265043k76308
$$ 6406200 4085536 326224 -5156786 -7410584 -335209 14690284 26955327 26679019
40769B6679019j1023954j1657715o065248k201958j116589N35316K465451K279522
$$ 26679019 15655065 3997350 -2067898 -4269856 -5386445 -4851129 -2385678 -106156
40761a06156J314688J940157K019850j027457l645123j195502K927158J486406
$$ -106156 1208532 3148689 5168539 4141082 495959 -699543 2227615 3714021
40753C714021m897664q618153o717058l221246l80369L498928P008291N498644
$$ 3714021 -1183643 -9801796 -16518854 -19740100 -20120469 -16621541 -9613250 -4114606
40745d114606k66705l651674k589631k582305o468672q754339m132647M098294
$$ -4114606 -4381311 -8032985 -10622616 -13204921 -19673593 -28427932 -32560579 -28462285
40737b8462285P997877L802278m806974r106083k190268J1761414J8023975Q657136
$$ -28462285 -20464408 -16662130 -21469104 -30575187 -32765455 -21004041 -2980066 5677070
40729E677070m117471k642509J0480420J5491600M804243o825337o106198P31115
$$ 5677070 1559599 -1082910 9397510 24889110 29693353 22868016 16761818 17492933
40721A7492933K087373j014867k149455k949430o900905q819245l123053M518857
$$ 17492933 19580306 18565439 16415984 13466554 6565649 -2253596 -5376649 -857792
40713h57792N728696L170335M001493N776284J507478o065412q043347l788531
$$ -857792 4870904 8041239 12042732 17819016 19326494 13261082 5217735 1429204
40705A429204J8504J373283K507683J325010m409014q026242k424223N612236
$$ 1429204 1447708 2820991 5328674 6653684 2244670 -5781572 -8205795 -2593559
40697b593559L888286m985804p634263k651911j476711n556444k173204J1639656
$$ -2593559 1294727 -3691077 -11325340 -13977251 -15453962 -21010406 -23183610 -11543954
40689a1543954K0018212J2542882J034181r996M221636M94545r063281j1358576
$$ -11543954 8474258 21017140 22051321 22041325 26262961 26757506 17694225 6335649
40681F335649m362981O13653l013927r459617j1265871p526233m64731P776857
$$ 6335649 1972668 2586321 -427606 -9887223 -21153094 -28679327 -29144058 -21367201
40673b1367201J3336496J2357513O547543K267653K633756M217495K618068j799830
$$ -21367201 -8030705 4326808 10874351 13142004 15775760 19993255 22611323 20811493
40665B0811493n002376m346814j473932j93752j411707j472672K381748O531085
$$ 20811493 15809117 11462303 9988371 9794619 8382912 6910240 9291988 15823073
40657A5823073N181090n22480l027337R73770N719236M095821m295935j4184310
$$ 15823073 21004163 20481683 17454346 18428116 24147352 28243173 23947238 9762928
40649I762928j9196262j4811534k531127Q063655Q038890R95409j250523M085715
$$ 9762928 -9433334 -24244868 -26775995 -18712340 -10673450 -9678041 -10928564 -6842849
40641f842849P405718L172043j648927j059302l26924m241508n661559K758067
$$ -6842849 562869 3734912 2085985 1026683 699759 -3541749 -9203308 -6445241
40633f445241J3418289J3228247L222220l786157k136243J983919L187079K939579
$$ -6445241 6973048 20201295 23423515 19637358 17501115 19485034 22672113 25611692
40625B5611692K851187J446633j616240n237958r837125j3993314j1208293J467283
$$ 25611692 28462879 29909512 28293272 23055314 13218189 -775125 -11983418 -10516135
40617a0516135J4516622J5496996N633833k868255m096303k400555q49102K212700
$$ -10516135 4000487 19497483 25131316 22263061 18166758 15766203 14917101 17129801
40609A7129801N047396L016923j563589j458266K337093J281173n278565q180640
$$ 17129801 22177197 25194120 23630531 22172265 24509358 25790531 20511966 12331326
40601A2331326m826454l906843q883871j0342193k165573O892274O745812P30766
$$ 12331326 7504872 3598029 -5285842 -15628035 -17793608 -10901334 -4155522 -3424756
40593c424756k574925l153308n144078o286537k254804L869291N811230L523225
$$ -3424756 -5999681 -9152989 -14297067 -20583604 -22838408 -18969117 -13157887 -9634662
40585i634662Q25922j414359k703739N24781P996335J1366231N501929j915147
$$ -9634662 -8808740 -10223099 -12926838 -12402057 -4405722 6960509 12462438 10547291
40577A0547291j367251L655188L267593k272557m387069j421596L3374k067743
$$ 10547291 9180040 12835228 16102821 13830264 9443195 8021599 8054973 5987230
$$ [...]
##END NTUPLES=NMR SPECTRUM
##END=
