##TITLE=31Pdec_DE-92_TFA
 CDCl3, 64 sc
 28.4.2025
##JCAMPDX= 6.0         $$ Bruker NMR JCAMP-DX V2.0
##DATA TYPE= NMR SPECTRUM
##DATA CLASS= NTUPLES
##ORIGIN= UXNMR, Bruker Analytische Messtechnik GmbH
##OWNER= root
$$ XWIN-NMR		Version 3.5
$$ Mon Apr 28 15:44:20 2025 Russian Standard Time (UT+4h)  she@DPX200
##.OBSERVE FREQUENCY= 81.013821
##.OBSERVE NUCLEUS= ^31P
##.ACQUISITION MODE= SIMULTANEOUS
##.ACQUISITION SCHEME= undefined
##.AVERAGES= 64
##.DIGITISER RES= 17
##SPECTROMETER/DATA SYSTEM= spect
##.PULSE SEQUENCE= zgpg30
##.SOLVENT NAME= CDCl3
##.SHIFT REFERENCE= (INTERNAL, CDCl3, 0, 198.062)
##AUDIT TRAIL= $$ (NUMBER, WHEN, WHO, WHERE, WHAT)
$$ ##TITLE= Audit trail, XWIN-NMR		Version 3.5
$$ ##JCAMPDX= 5.01
$$ ##ORIGIN= Bruker BioSpin GmbH
$$ ##OWNER= she
$$ F:/spectra/data/she/nmr/P31/2/pdata/1/auditp.txt
$$ ##AUDIT TRAIL=  $$ (NUMBER, WHEN, WHO, WHERE, WHAT)
(   1,<2025-04-28 15:43:00.73 +0400>,<she>,<DPX200>,
      <created by zg, POWCHK disabled, PULCHK disabled
       configuration hash MD5:
       00 E9 B6 7A A2 85 ED C7 34 08 36 98 17 FE 4E 26
       data hash MD5: 32K
       08 69 85 E9 75 5C 06 E9 6B 60 2A 0C F7 12 18 CB>)
(   2,<2025-04-28 15:43:04.34 +0400>,<she>,<DPX200>,
      <Start of raw data processing
       efp BC_mod = 2 LB = 1.5 FT_mod = 6 PKNL = 1 PHC0 = 1769.002 PHC1 = -880.9069 SI = 64K 
       data hash MD5: 64K
       56 FA 58 E0 22 CB B1 C9 3D FF 27 85 97 40 6A 8A>)
(   3,<2025-04-28 15:43:45.15 +0400>,<she>,<DPX200>,
      <pk PHC0 = -24.66565 PHC1 = 6.800068 
       data hash MD5: 64K
       65 40 99 B8 CE 81 12 5F F4 CD B2 FB F8 DC 4C 2F>)
(   4,<2025-04-28 15:43:49.57 +0400>,<she>,<DPX200>,
      <abs ABSG = 5 
       data hash MD5: 64K
       85 16 E6 37 8C 1C CA B6 D7 DB 5F 9A 52 3F 97 03>)
$$ ##END=
$$ 
$$ hash MD5
$$ B9 58 9A 53 07 97 31 0C 7E 06 22 46 9E E3 3F DC
##$RELAX= 
##$RELAX= 
##$RELAX= 
##$RELAX= 
##$RELAX= 
##$RELAX= 
##$RELAX= 
##$RELAX= 
$$ Bruker specific parameters
$$ --------------------------
##$DU= <F:/spectra>
##$EXPNO= 2
##$NAME= <P31>
##$PROCNO= 1
##$TYPE= <nmr>
##$USER= <she>
##$AMP= (0..31)
100 100 100 100 100 100 100 100 100 100 100 100 100 100 100 100 100 100 
100 100 100 100 100 100 100 100 100 100 100 100 100 100 
##$AQSEQ= 0
##$AQ_mod= 1
##$AUNM= <au_zg>
##$AUTOPOS= <>
##$BF1= 81.014009
##$BF2= 200.13
##$BF3= 200.13
##$BF4= 200.13
##$BF5= 200.13
##$BF6= 200.13
##$BF7= 200.13
##$BF8= 200.13
##$BYTORDA= 1
##$CFDGTYP= 0
##$CFRGTYP= 5
##$CHEMSTR= <none>
##$CNST= (0..31)
1 1 145 1 1 1 1 1 1 1 1 1 1 1 1 1 1 1 1 1 1 1 1 1 1 1 1 1 1 1 1 1 
##$CPDPRG= <waltz16>
##$CPDPRG1= <>
##$CPDPRG2= <waltz16>
##$CPDPRG3= <>
##$CPDPRG4= <mlev>
##$CPDPRG5= <mlev>
##$CPDPRG6= <mlev>
##$CPDPRG7= <mlev>
##$CPDPRG8= <mlev>
##$CPDPRGB= <>
##$CPDPRGT= <>
##$D= (0..31)
0 1 0 0 0 0 0 0 0 0.06 0 0.03 2e-05 3e-06 0 0 0.0002 0 0 0 0 0 0 0 0 0 
0 0 0 0 0 0 
##$DATE= 1745840580
##$DBL= (0..7)
120 120 120 11 120 120 24 19 
##$DBP= (0..7)
150 150 150 150 150 150 150 150 
##$DBP07= 0
##$DBPNAM0= <>
##$DBPNAM1= <>
$$ [...]
##$SUBNAM3= <"">
##$SUBNAM4= <"">
##$SUBNAM5= <"">
##$SUBNAM6= <"">
##$SUBNAM7= <"">
##$SUBNAM8= <"">
##$SUBNAM9= <"">
##$SW= 400.765351723535
##$SWIBOX= (0..15)
0 1 3 0 0 0 0 0 0 0 0 0 0 0 0 0 
##$SW_h= 32467.5324675325
##$TD= 32768
##$TD0= 1
##$TE= 0
##$TE2= 300
##$TE3= 300
##$TEG= 300
##$TL= (0..7)
0 120 53 12 22 120 120 120 
##$TP= (0..7)
150 150 150 150 150 150 150 150 
##$TP07= 0
##$TPNAME0= <>
##$TPNAME1= <>
##$TPNAME2= <>
##$TPNAME3= <>
##$TPNAME4= <>
##$TPNAME5= <>
##$TPNAME6= <>
##$TPNAME7= <>
##$TPOAL= (0..7)
0.5 0.5 0.5 0.5 0.5 0.5 0.5 0.5 
##$TPOFFS= (0..7)
0 0 0 0 0 0 0 0 
##$TUNHIN= 0
##$TUNHOUT= 0
##$TUNXOUT= 0
##$USERA1= <user>
##$USERA2= <user>
##$USERA3= <user>
##$USERA4= <user>
##$USERA5= <user>
##$V9= 5
##$VALIST= <valist>
##$VCLIST= <CCCCCCCCCCCCCCC>
##$VD= 0
##$VDLIST= <DDDDDDDDDDDDDDD>
##$VPLIST= <PPPPPPPPPPPPPPP>
##$VTLIST= <TTTTTTTTTTTTTTT>
##$WBST= 1024
##$WBSW= 4
##$XGAIN= (0..3)
0 0 0 0 
##$XL= 0
##$YL= 0
##$YMAX_a= 4019
##$YMIN_a= -18038
##$ZGOPTNS= <>
##$ZL1= 120
##$ZL2= 120
##$ZL3= 120
##$ZL4= 120
##$ABSF1= 198.0616
##$ABSF2= -202.7028
##$ABSG= 5
##$ABSL= 3
##$ALPHA= 0
##$AQORDER= 0
##$ASSFAC= 0
##$ASSFACI= 0
##$ASSFACX= 0
##$ASSWID= 0
##$AUNMP= <proc_1d>
##$AZFE= 0.1
##$AZFW= 0.5
##$BCFW= 0
##$BC_mod= 2
##$BYTORDP= 0
##$COROFFS= 0
##$CY= -3
##$DATMOD= 1
##$DC= 0
##$DFILT= <>
##$DTYPP= 0
##$F1P= 0
##$F2P= 0
##$FCOR= 1
##$FTSIZE= 65536
##$FT_mod= 6
##$GAMMA= 0
##$GB= 0
##$INTBC= 1
##$INTSCL= 9.790993e-09
##$ISEN= 30
##$LB= 1.5
##$LEV0= 0
##$LPBIN= 0
##$MAXI= 10000
##$MC2= 0
##$MEAN= 0
##$ME_mod= 0
##$MI= 50
##$NCOEF= 0
##$NC_proc= -8
##$NLEV= 6
##$NOISF1= 182.463
##$NOISF2= 159.3651
##$NSP= 0
##$NTH_PI= 0
##$NZP= 0
##$OFFSET= 198.0616
##$PC= 4
##$PHC0= 1744.336
##$PHC1= -874.1069
##$PH_mod= 1
##$PKNL= yes
##$PPARMOD= 0
##$PSCAL= 0
##$PSIGN= 0
##$REVERSE= no
##$SF= 81.0140089999434
##$SI= 65536
##$SIGF1= 159.3651
##$SIGF2= -187.1042
##$SINO= 113.3802
##$SIOLD= 16384
##$SREGLST= <1H.CDCl3>
##$SSB= 0
##$STSI= 65536
##$STSR= 0
##$SW_p= 32467.5324675325
##$SYMM= 0
##$S_DEV= 0
##$TDeff= 32768
##$TDoff= 0
##$TI= <>
##$TILT= no
##$TM1= 0
##$TM2= 0
##$TOPLEV= 0
##$USERP1= <user>
##$USERP2= <user>
##$USERP3= <user>
##$USERP4= <user>
##$USERP5= <user>
##$WDW= 1
##$XDIM= 65536
##$YMAX_p= 146733644
##$YMIN_p= -207784908
$$ End of Bruker specific parameters
$$ ---------------------------------
##NTUPLES= NMR SPECTRUM
##VAR_NAME=  FREQUENCY,     SPECTRUM/REAL,   SPECTRUM/IMAG
##SYMBOL=    X,             R,               I
##VAR_TYPE=  INDEPENDENT,   DEPENDENT,       DEPENDENT
##VAR_FORM=  AFFN,          ASDF,            ASDF
##VAR_DIM=   65536,         65536,           65536
##UNITS=     HZ,            ARBITRARY UNITS, ARBITRARY UNITS
##FACTOR=    0.49542278885378, 1,            1
##FIRST=     16045.7642231865, 0,            0
##LAST=      -16421.768244346, 0,            0
##MIN=       -16421.768244346, -207784908,   0
##MAX=       16045.7642231865, 146733644,    0
$$ Real data points
##PAGE= N=1
##DATA TABLE= (X++(R..R)), XYDATA
$$ [...]
$$ plain form
7505 -668871 -1897701 -1663979 -269171 1689601 4228213 7267502 9269315 8630221 6685616
7496 6685616 6841980 9813399 12287656 11758936 10045918 9914218 10709633 10177751 8624564
7487 8624564 7922700 7636013 5607783 1872691 -1234087 -2705730 -3668948 -4643277 -4887508
7478 -4887508 -4574579 -4769317 -4979650 -3543194 -833451 793700 817360 1300624 2870079
7469 2870079 3032613 179694 -3329030 -4199661 -2508344 -960277 -1093517 -1962897 -1817921
7460 -1817921 144015 3057760 4741173 3596782 506895 -2206170 -3632282 -4451477
7452 -4451477 -4422332 -2161757 2007611 5530711 6995218 7681476 8549186 8137629 5148153
7443 5148153 995427 -2031440 -3369315 -3390038 -2043430 -117573 123183 -2342847 -5584125
$$ packed form
7505f68871j228830K33722J394808J958772K538612L039289K001813o39094j944605
7496F685616J56364K971419K474257n28720j713018j31700P95415n31882j553187
7487H624564p01864k86687k028230l735092l106778j471643r63218r74329k44231
7478d887508L12929j94738k10333J436456K709743J627151K3660M83264J569455
7469B870079J62534k852919l508724q70631J691317J548067j33240q69380J44976
7460a817921J961936K913745J683413j144391l089887k713065j426112q19195
7452d451477K9145K260575M169368L523100J464507O86258Q67710m11557k989476
7443E148153m152726l026867j337875k0723J346608J925857K40756k466030l241278
$$ plain form
7434 -5584125 -7602410 -9040906 -10901105 -11653799 -9502827 -6095094 -4971047 -7038567
7426 -7038567 -10077761 -12073738 -12823570 -12978011 -13526573 -15322555 -17229637 -16112598 -10875874
7417 -10875874 -4911192 -1890519 -822582 1483711 4633988 5366891 3291979 1742504
7409 1742504 2891247 5776495 9279000 13221606 16131987 15823242 13032282 10849945
7401 10849945 9715030 6807786 1549737 -2351876 -2186713 136339 1850897 3127659
7393 3127659 4583367 4440261 1437422 -2020447 -2933671 -1961431 -1592473 -1925860 -1389968
7384 -1389968 -103815 627041 918559 1370070 716706 -2294628 -5507435 -5287047 -1670023
7375 -1670023 1576724 2153410 1480398 1355078 1328858 502909 -424587 -335582 577482 1380823
$$ packed form
7434e584125k018285j438496j860199p52694K150972L407733J124047k067520
7426g038567l039194j995977p49832j54441n48562j795982j907082J117039N236724
7417a0875874N964682L020673J067937K306293L150277P32903k074912j549475
7409A742504J148743K885248L502505L942606K910381l08745k790960k182337
7401A0849945j134915k907244n258049l901613J65163K323052J714558J276762
7393C127659J455708j43106l002839l457869r13224R72240L68958l33387N35892
7384a389968J286153P30856K91518M51511o53364l011334l212807K20388L617024
7375a670023L246747N76686o73012j25320k6220q25949r27496Q9005R13064Q03341
$$ plain form
7365 1380823 1615684 1138243 -308957 -2598969 -4847944 -6015022 -5685186 -4440933 -3819568
7356 -3819568 -5302954 -8600353 -11528988 -12391426 -11668057 -10466384 -8587309 -5744094 -3492232
7347 -3492232 -3601745 -5021168 -4879438 -2510467 -232761 121908 -695410 -1191363 -1052699
7338 -1052699 -564936 106880 370399 -415280 -1397917 -776508 1427464 2922617 2310617
7329 2310617 851913 -4 -877752 -2718525 -4420709 -4395397 -3357156 -3299507 -4200533
7320 -4200533 -4033747 -2200149 -850694 -1914296 -4252401 -5015911 -3190158 -593249 655051
7311 655051 656888 1082503 2452691 3133399 1483451 -1692189 -3636565 -2351397 1790868
7302 1790868 6743359 10188554 10535294 7809944 3945895 1335030 654758 641407 129869
$$ packed form
7365A380823K34861m77441j447200k290012k248975j167078L29836J244253O21365
7356c819568j483386l297399k928635q62438P23369J201673J879075K843215K251862
7347c492232j09513j419423J41730K368971K277706L54669q17318m95953J38664
7338a052699M87763O71816K63519p85679r82637O21409K203972J495153o12000
7329B310617j458704q51917q77748j840773j702184K5312J038241N7649r01026
7320d200533J66786J833598J349455j063602k338105p63510J825753K596909J248300
7311F55051J837M25615J370188O80708j649948l175640j944376J285168M142265
7302A790868M952491L445195L46740k725350l864049k610865o80272j3351n11538
$$ plain form
7293 129869 -378480 569626 3600725 7587344 10226935 9901690 7474227 5589672 5378552
7284 5378552 4851689 2074206 -1117418 -1068278 2307873 4970940 4128375 1353813 -698365
7275 -698365 -1728949 -2086508 -449657 3836238 7913664 8154469 4939331 1807260 377342
7266 377342 -879524 -2871145 -4074692 -3382142 -2075983 -1474703 -609197 1904357 4873658
7257 4873658 5355033 2284291 -2009231 -4110968 -2698654 664563 3384318 4111437 3225721
7248 3225721 1548959 -677203 -3343811 -5770935 -7095750 -6989847 -5575143 -3194415
7240 -3194415 -746286 514644 244272 -631775 -1541245 -3285971 -6418009 -9628973 -11140626
7231 -11140626 -10790923 -9213834 -6044381 -1103385 3443664 4862045 3727101 3281615
$$ packed form
7293A29869n08349R48106L031099L986619K639591l25245k427463j884555k11120
7284E378552n26863k777483l191624M9140L376151K663067q42565k774562k052178
7275f98365j030584l57559J636851M285895M077426K40805l215138l132071j429918
7266C77342j256866j991621j203547O92550J306159O01280Q65506K513554K969301
7257D873658M81375l070742m293522k101737J412314L363217K719755P27119q85716
7248C225721j676762k226162k666608k427124j324815J05903J414704K380728
7240c194415K448129J260930k70372q76047r09470j744726l132038l210964j511653
7231a1140626L49703J577089L169453M940996M547049J418381j134944m45486
$$ plain form
7223 3281615 4488419 4511198 1185106 -3554840 -6312488 -6265185 -4837754 -3114064 -1570262
7214 -1570262 -1060130 -1894753 -2626216 -1662813 219748 543297 -1866881 -5761945 -9120280
7205 -9120280 -10841242 -11052956 -10731478 -10851467 -11228496 -10578185 -8271561 -5330473 -3006878
7196 -3006878 -1261112 487088 2066162 3038504 3432202 2806126 -121782 -5119561 -8795497
7187 -8795497 -7738241 -3085777 332820 -235997 -2471392 -2316809 1295724 5840783 8132909
7178 8132909 7062371 4111172 1728345 970520 850409 229621 -571847 -968771 -1714926
7169 -1714926 -3531320 -5008040 -4238771 -2211864 -1913881 -3832286 -5175768 -4449035 -3995216
7160 -3995216 -6296504 -10018481 -11865199 -10795240 -8322245 -5901301 -4217229 -4200669 -6407223
$$ packed form
7223C281615J206804K2779l326092m739946k757648M7303J427431J723690J543802
7214a570262N10132q34623p31463R63403J882561L23549k410178l895064l358335
7205i120280j720962k11714L21478j19989l77029O50311K306624K941088K323595
7196c006878J745766J748200J579074R72342L93698o26076k927908m997779l675936
7187h795497J057256M652464L418597n68817k235395J54583L612533M545059K292126
7178H132909j070538k951199k382827p57825j20111o20788q01468l96924p46155
7169a714926j816394j476720P69269K026907K97983j918405j343482P26733M53819
7160c995216k301288l721977j846718J069959K472995K420944J684072J6560k206554
$$ plain form
7151 -6407223 -9477184 -11027129 -10277941 -8615427 -7549625 -7090223 -6087475 -3574510 -158432
7142 -158432 1597285 -633118 -5513865 -8328905 -6233823 -1853206 389224 239133 1079337
7133 1079337 4021198 5926331 4084387 -27072 -3179923 -4437607 -4918501 -5017873 -3971338
7124 -3971338 -1701643 552966 1572298 1232824 182562 -1058621 -2567780 -4579112
7116 -4579112 -6457380 -6619668 -4281857 -880402 1427165 2406092 3399672 4555131 4496080
7107 4496080 3144616 2483318 3355134 3784934 2289698 857816 2220898 5605415 7900258
7098 7900258 8049922 7305399 5729799 2075574 -2377989 -3559378 3962 4391675 5337408
7089 5337408 3962579 4554430 7927393 10387353 9310266 6604507 5451066 5937845 5795817
$$ packed form
7151f407223l069961j549945P49188J662514J065802M59402J002748K512965L416078
7142a58432J755717k230403m880747k815040K095082M380617K242430j50091Q40204
7133A079337K941861J905133j841944m111459l152851j257684m80894r9372J046535
7124c971338K269695K254609J019332l39474j050262j241183j509159k011332
7116d579112j878268j62288K337811L401455K307567R78927R93580J155459n9051
7107D496080j351464o61298Q71816M29800j495236j431882J363082L384517K294843
7098G900258J49664p44523j575600l654225m453563j181389L563340M387713R45733
7089E337408j374829N91851L372963K459960j077087k705759j153441M86779j42028
$$ plain form
7080 5795817 4147329 2407625 1657667 875072 -1552824 -5418055 -8551871 -8911341 -6414481
7071 -6414481 -2794338 16674 1280219 1573483 1936595 2933096 4163417 4433092 2685500
7062 2685500 -816522 -4395922 -6520037 -7341667 -8087396 -9001761 -8890078 -7130122 -5147766
7053 -5147766 -4876369 -6214179 -7054605 -5673143 -2180894 2100808 5440135 5943393 2795727
7044 2795727 -1859133 -3719747 -559125 4925659 7867905 6556679 3736730 2772227
7036 2772227 4059414 5688162 6260335 5887461 4964933 3207780 293772 -3028090 -5095771
7027 -5095771 -4944242 -3598205 -3163974 -4400788 -5821655 -5674521 -4064747 -2221976 -357972
7018 -357972 2309984 5602995 8053283 8862941 8760190 8345462 7002489 4386683 1749667
$$ packed form
7080E795817j648488j739704p49958p82595k427896l865231l133816l59470K496860
7071f414481L620143K811012J263545K93264L63112R96501J230321K69675j747592
7062B685500l502022l579400k124115q21630p45729r14365J11683J759956J982356
7053e147766K71397j337810q40426J381462L492249M281702L339327N03258l147666
7044B795727m654860j860614L160622N484784K942246j311226k819949r64503
7036B772227J287187J628748N72173l72874r22528j757153k914008l321862k067681
7027e095771J51529J346037M34231j236814j420867J47134J609774J842771J864004
7018c57972K667956L293011K450288Q09658j02751m14728j342973k615806k637016
$$ plain form
7009 1749667 455118 -39957 -1323375 -3536059 -5068452 -4698644 -2917197 -993384 340648
7000 340648 1020275 1239635 1327670 1582616 1871209 1619325 453482 -1228649 -2490221
6991 -2490221 -2726877 -2245082 -1720010 -1022959 789686 3740178 5907379 5485725 3633764
6982 3633764 3509610 6007168 8209050 7095659 3213565 -739092 -3483342 -5303001
6974 -5303001 -5641178 -3150698 1660154 5867864 6964141 5104646 2198683 -113302
6966 -113302 -1195837 -1145679 -387733 744253 1938980 2200677 167318 -3787696 -6698885
6957 -6698885 -5980055 -2792741 -613739 -732866 -1254373 -563957 567008 923253 764707
6948 764707 933614 1805007 3775617 6804470 8713401 6355722 -28611 -5729132 -6672849
$$ packed form
7009A749667j294549m95075j283418k212684j532393L69808J781447J923813J334032
7000C40648O79627K19360Q8035K54946K88593k51884j165843j682131j261572
6991b490221k36656M81795N25072O97051J812645K950492K167201m21654j851961
6982C633764j24154K497558K201882j113391l882094l952657k744250j819659
6974e303001l38177K490480M810852M207710J096277j859495k905963k311985
6966a13302j082535N0158P57946J131986J194727K61697k033359l955014k911189
6957f698885P18830L187314K179002j19127n21507O90416J130965L56245j58546
6948G64707J68907Q71393J970610L028853J908931k357679o384333n700521r43717
$$ plain form
6939 -6672849 -3889332 -1052285 552134 2113281 3758205 3932979 2053048 -642856
6931 -642856 -2925181 -4315651 -4054145 -1330204 3039316 6601934 7356456 5116124 1194518
6922 1194518 -2234432 -3185541 -1803945 -786454 -2370840 -5474246 -7409004 -7569343 -7225800
6913 -7225800 -6395921 -3843654 -283747 1446793 391716 -860002 153622 2412175
6905 2412175 3128477 1261526 -1961252 -4705159 -5558181 -4078944 -1387517 667073 1478992
6896 1478992 1739416 1444132 -207159 -2431576 -2796588 -772202 922071 184816 -1360397
6887 -1360397 -1112927 643347 2038652 3018491 4506468 5324395 3174846 -1563400 -5818433
6878 -5818433 -7618829 -7421045 -5706695 -2083953 2536453 5356036 4579625 1460254 -1335164
$$ packed form
6939f672849K783517K837047J604419J561147J644924J74774j879931k695904
6931f42856k282325j390470K61506K723941M369520L562618P54522k240332l921606
6922A194518l428950r51109J381596J017491j584386l103406j934758j60339L43543
6913g225800Q29879K552267L559907J730540j055077j251718J013624K258553
6905B412175P16302j866951l222778k743907q53022J479237K691427K054590Q11919
6896A478992K60424k95284j651291k224417l65012K024386J694273p37255j545213
6887a360397K47470J756274J395305R79839J487977Q17927k149549m738246m255033
6878e818433j800396J97784J714350L622742M620406K819583p76411l119371k795418
$$ plain form
6869 -1335164 -2258573 -1538284 -710153 -1624932 -4347082 -6010046 -3681108 1465657 5055954
6860 5055954 5030454 3739812 3613268 3530260 1451658 -1592885 -2766829 -1437359 504220
6851 504220 1572433 1636392 358146 -2921520 -7300488 -10029015 -8932381 -4530346 345408
6842 345408 2644995 1444401 -855086 -262144 4640276 10612702 13009028 10735012 6715827
6833 6715827 3899257 2535851 1477242 328098 -539037 -1021792 -1508217 -2511478 -4302351
6824 -4302351 -6334494 -7093021 -5402761 -1984978 1122141 2711499 3103242 2892658 2324670
6815 2324670 2003058 2687993 3846449 3785391 1994423 160954 20661 1309707 2719798
6806 2719798 3691347 4144229 3620700 2214798 1449766 2449119 3757094 2912372 100214
$$ packed form
6869a335164r23409P20289Q28131r14779k722150j662964K328938N146765L590297
6860E055954k5500j290642j26544q3008k078602l044543j173944J329470J941579
6851E04220J068213O3959j278246l279666m378968k728527J096634M402035M875754
6842C45408K299587j200594k299487N92942M902420N972426K396326k274016m019185
6833F715827k816570j363406j058609j149144q67135m82755m86425j003261j790873
6824d302351k032143p58527J690260L417783L107119J589358L91743k10584n67988
6815B324670l21612O84935J158456o1058j790968j833469j40293J289046J410091
6806B719798R71549M52882n23529j405902p65032R99353J307975q44722k812158
$$ plain form
6797 100214 -1783508 -1198964 -231382 -1691312 -5259709 -7935478 -7696540 -5411798 -3294535
6788 -3294535 -2610401 -3162124 -4189225 -5137868 -5719138 -5689496 -4910419 -3752436 -3255423
6779 -3255423 -4435584 -7176004 -10030506 -11437311 -11069504 -9808398 -8580339 -7627002 -6880500
6770 -6880500 -6432011 -6161279 -5290606 -3160053 -605816 330011 -1163878 -3087924 -2697193
6761 -2697193 -155981 1251666 -678931 -3738455 -3490588 1579766 8384772 12694204
6753 12694204 13032586 10844672 8180035 6317764 5930983 7136170 9069591 10176474
6745 10176474 9375598 6824467 3701511 1708245 2520624 6534730 11480885 13241961
6737 13241961 9537122 2827682 -1793110 -2146959 -1173714 -2632822 -5932537 -7253119
$$ packed form
6797A00214j883722N84544R67582j459930l568397k675769K38938K284742K117263
6788c294535O84134n51723j027101r48643n81270K9642P79077J157983M97013
6779c255423j180161k740420k854502j406805L67807J261106J228059R53337P46502
6770f880500M48489K70732Q70673K130553K554237R35827j493889j924046L90731
6761b697193K541212J407647j930597l059524K47867N070354O805006M309432
6753A2694204L38382k187914k664637j862271l86781J205187J933421J106883
6745A0176474q00876k551131l122956j993266Q12379M014106M946155J761076
6737A3241961l704839o709440m620792l53849R73245j459108l299715j320582
$$ plain form
6729 -7253119 -5254442 -2896351 -2702961 -2840967 -205456 4206559 6106643 3936807 1116089
6720 1116089 1309942 3870221 5667577 5656497 5307260 5373728 4810646 3212195 2208736
6711 2208736 3307339 5552769 6554663 5268332 2745350 474153 -986635 -1725066
6703 -1725066 -1774430 -1058247 515476 3129503 6587128 9460232 9640689 6746876 3450916
6694 3450916 3011694 5364149 6986694 5177368 1204827 -1708269 -2388201 -2276507 -2745568
6685 -2745568 -3642460 -4447258 -5150144 -5453501 -4444947 -1855991 1184003 3237705 3757960
6676 3757960 2978179 1614422 1032067 2435394 5093281 6517408 5452180 3667044 3484608
6667 3484608 4409492 3918371 1254249 -1388828 -1828673 -627849 -93304 -1307700 -2924790
$$ packed form
6729g253119J998677K358091J93390j38006K635511M412015J900084k169836k820718
6720A116089J93853K560279J797356j1080l49237O6468n63082j598451j003459
6711B208736J098603K245430J001894j286331k522982k271197j460788p38431
6703a725066m9364P16183J573723K614027L457625K873104J80457k893813l295960
6694C450916m39222K352455J622545j809326l972541k913096o79932J11694m69061
6685b745568q96892q04798p02886l03357J008554K588956L039994K053702N20255
6676C757960p79781j363757n82355J403327K657887J424127j065228j785136j82436
6667C484608R24884m91121k664122k643077m39845J200824N34545j214396j617090
$$ plain form
6658 -2924790 -2823887 -704851 1124310 -2309 -3890021 -7317748 -7762004 -6388514 -6079928
6649 -6079928 -7195950 -7208026 -4641471 -1404591 -237392 -1216259 -2053850 -1109978 1112513
6640 1112513 3148818 4179063 4376135 4353557 4543438 4885004 4990438 4625664 4005915
6631 4005915 3675998 4086766 4944010 4872624 2511901 -1354067 -3552667 -1739828 2516088
6622 2516088 5460084 5871119 6063293 7695278 8974880 7741935 5431168 5230319 6969098
6613 6969098 6858462 3047414 -1042527 -735933 3847661 7805601 7255531 3318160 -127025
6604 -127025 -1047522 -344948 673218 1933720 3463495 4378050 4137197 3692252 3957877
6595 3957877 3849324 1540176 -2536559 -5759445 -6726102 -6910967 -8148225 -9856116 -9863796
$$ packed form
6658b924790J00903K119036J829161j126619l887712l427727m44256J373490L08586
6649f079928j116022j2076K566555L236880J167199r78867q37591R43872K222491
6640A112513K036305J030245J97072k2578J89881L41566J05434l64774o19749
6631D005915l29917M10768Q57244p1386k360723l865968k198600J812839M255916
6622B516088K943996M11035J92174J631985J279602j232945k310767k00849J738779
6613F969098j10636l811048m089941L06594M583594L957940n50070l937371l445185
6604a27025r20497P02574J018166J260502J529775R14555k40853m44945K65625
6595C957877j08553k309148m076735l222886r66657j84865j237258j707891p680
$$ plain form
6586 -9863796 -7137484 -2783641 965158 2137576 351165 -2416509 -3234501 -1201279
6578 -1201279 1802209 3893497 5296665 6604896 6636061 4084424 333468 -1679234 -1114687
6569 -1114687 250888 953144 1200339 1272606 749316 -155461 -406875 34887 -34353 -771077
6559 -771077 -527610 1600169 4097574 5156221 5106931 5374443 6172114 6731443 6945365
6550 6945365 7226408 7232733 6105982 3694657 511739 -3057768 -6456701 -8457757 -8299298
6541 -8299298 -6996174 -6182791 -5777692 -4120602 -555557 3311046 5315582 4926892 3461804
6532 3461804 2638241 2951424 3060026 1048976 -3140757 -7015772 -8085542 -6604767 -4706015
6523 -4706015 -3366122 -1774052 521198 2676503 4082523 5088215 5558354 4376659
$$ packed form
6586i863796K726312M353843L748799J172418j786411k767674q17992K033222
6578a201279L003488K091288J403168J308231L1165k551637l750956k012702N64547
6569a114687J365575P02256K47195P2267n23290r04777k51414M41762o9240p36724
6559g71077K43467K127779K497405J058647m9290K67512P97671N59329K13922
6550F945365K81043O325j126751k411325l182918l569507l398933k001056J58459
6541h299298J303124Q13383M05099J657090L565045L866603K004536l88690j465088
6532C461804q23563L13183J08602k011050m189733l875015j069770J480775J898752
6523d706015J339893J592070K295250K155305J406020J005692M70139j181695
$$ plain form
6515 4376659 1445989 -1185725 -1544207 -240431 360945 -1206269 -4580182 -8366243 -10766384
6506 -10766384 -10368321 -7701901 -5290053 -4747468 -4599520 -2625884 484786 2120148 1976462
6497 1976462 2467180 4407071 5221400 3010194 -34192 -532083 1444722 3165542 3513256
6488 3513256 3547448 3208301 744919 -3635583 -6330326 -4566168 -498301 1094090 -1389207
6479 -1389207 -4839508 -5767058 -4393274 -3599923 -4957744 -7180414 -8357768 -8353130 -8161944
6470 -8161944 -7698788 -5744992 -2345505 194189 -178220 -2576756 -4322556 -4317025 -3808766
6461 -3808766 -3924947 -4078095 -3293001 -1808296 -686516 -706940 -1970223 -3586427 -3635892
6452 -3635892 -963409 2588299 3614492 1703311 467819 2467306 5183822 4505415
$$ packed form
6515D376659k930670k631714l58482J303776O01376j567214l373913l786061k400141
6506a0766384L98063K666420K411848N42585J47948J973636L110670J635362j43686
6497A976462M90718J939891Q14329k211206l044386m97891J976805J720820L47714
6488C513256L4192l39147k463382m380502k694743J764158M067867J592391k483297
6479a389207l450301r27550J373784P93351j357821k222670j177354M638J91186
6470h161944M63156J953796L399487K539694l72409k398536j745800N531N08259
6461c808766j16181j53148P85094J484705J121780k0424j263283j616204m9465
6452c635892K672483L551708J026193j911181j235492J999487K716516o78407
$$ plain form
6444 4505415 645928 -2492449 -3045765 -2833060 -3241186 -3103065 -1887449 -1786926 -4394666
6435 -4394666 -7454872 -7410453 -4011190 -223426 1685497 1991446 1883935 1834441 1618085
6426 1618085 697534 -1333592 -3761284 -4741956 -3535817 -2204497 -3441393 -6861901 -9143558
6417 -9143558 -8047003 -4670251 -1267595 1468761 3905414 5570733 5332790 3118602
6409 3118602 236393 -2120919 -3941755 -5794540 -7680307 -8819977 -8504535 -6985616
6401 -6985616 -5328014 -4234579 -3243748 -1538705 510948 1305473 -62963 -2252084 -2683184
6392 -2683184 -241010 3345423 5056427 3530073 374360 -1537262 -988225 620717
6384 620717 1236918 540543 -154374 -72826 -179198 -1866882 -4967338 -7598483 -7922163
$$ packed form
6444D505415l859487l138377n53316K12705m08126J38121J215616J00523k607740
6435d394666l060206M4419L399263L787764J908923L05949j07511m9494k16356
6426A618085r20551k031126k427692r80672J206139J331320j236896l420508k281657
6417i143558J096555L376752L402656K736356K436653J665319k37943k214188
6409C118602k882209k357312j820836j852785j885767j139670L15442J518919
6401f985616J657602J093435R90831J705043K049653P94525j368436k189121m31100
6392b683184K442174L586433J711004j526354l155713j911622N49037J608942
6384F20717O16201o96375o94917Q1548j06372j687684l100456k631145l23680
$$ plain form
6375 -7922163 -5787101 -2712550 -483490 275305 398164 1243460 3458644 6524178 9243940
6366 9243940 10458123 9410380 5928751 684342 -4789946 -8805428 -10646642 -11016117
6358 -11016117 -11139283 -11395788 -11084616 -9608665 -7463468 -5666450 -4543332 -3714436 -3134886
6349 -3134886 -3287150 -4109940 -4597870 -4095149 -3381169 -3651173 -4750929 -5325307 -4674235
6340 -4674235 -3595816 -3199569 -3660623 -4528734 -5574557 -6659297 -7143935 -6222554 -3937879
6331 -3937879 -1393719 186866 345994 -643556 -2258509 -4007382 -5589156 -6959712 -7920043
6322 -7920043 -7605090 -5158431 -1400207 1118420 913026 -192162 738688 3556503 5188037
6313 5188037 4374373 3558814 4495837 4711234 1371343 -3230642 -4206908 -1577943 -643736
$$ packed form
6375g922163K135062L074551K229060P58795J22859Q45296K215184L065534K719762
6366I243940J214183j047743l481629n244409n474288m015482j841214l69475
6358a1016117j23166k56505L11172J475951K145197J797018J123118Q28896N79550
6349c134886j52264q22790m87930N02721P13980k70004j099756n74378O51072
6340d674235J078419L96247m61054q68111j045823j084740m84638R21381K284675
6331c937879K544160J580585J59128r89550j614953j748873j581774j370556r60331
6322g920043L14953K446659L758224K518627k05394j105188R30850K817815J631534
6313E188037q13664q15559R37023K15397l339891m601985r76266K628965R34207
$$ plain form
6304 -643736 -3854928 -6843351 -5155771 -1191542 -583765 -4074955 -7335478 -7739391 -6896172
6295 -6896172 -6409668 -5401038 -3536545 -2966652 -5085018 -7798054 -8360532 -7308555 -7223364
6286 -7223364 -8525161 -8856428 -6599002 -3119265 -944120 -852604 -1530450 -1573857 -1019082
6277 -1019082 -749171 -987134 -1090448 -715315 -214417 381383 1558770 2793783 2309617
6268 2309617 -178888 -1861890 -188696 3128277 4235383 2850799 2565144 5014320
6260 5014320 7328681 6928055 5528543 5820067 6804831 5730334 3014470 1714061 2709083
6251 2709083 3701432 3087627 1877207 1124088 4778 -2352350 -4906202 -5849850 -4702990
6242 -4702990 -2427023 -275414 881623 829122 122124 -525195 -1057605 -1738834 -2191817
$$ packed form
6304f43736l211192k988423J687580L964229O07777l491190l260523m03913Q43219
6295f896172M86504J008630J864493N69893k118366k713036n62478J051977Q5191
6286g223364j301797l31267K257426L479737K175145R1516o77846m3407N54775
6277a019082K69911k37963j03314L75133N00898N95800J177387J235013m84166
6268B309617k488505j683002J673194L316973J107106j384584k85655K449176
6260E014320K314361m00626j399512K91524R84764j074497k715864j300409R95022
6251B709083R92349o13805j210420p53119j119310k357128k553852r43648J146860
6242d702990K275967K151609J157037n2501p06998o47319n32410o81229m52983
$$ plain form
6233 -2191817 -1642470 -27530 1983046 3864494 5240328 5447650 4361830 3266800 3330449
6224 3330449 3454331 1540516 -2021453 -4259306 -3522818 -1288987 864338 3698243 7847234
6215 7847234 10820132 9270439 3848557 -620050 -378760 3189493 5277318 2692626
6207 2692626 -3103120 -7497471 -7105322 -2875720 1169540 2106818 395420 -1817084 -3220605
6198 -3220605 -3498950 -2418999 -262998 1538200 1672049 585933 -243906 -336193 -416433
6189 -416433 -1026239 -2133166 -3753443 -5569466 -6087138 -3668656 1325722 6494829 9619512
6180 9619512 10050108 8194537 5040919 2223940 1132018 1637374 2759116 4361761 6588984
6171 6588984 7801710 5491973 61216 -4498411 -5075104 -2882154 -1017601 -294714 608528
$$ packed form
6233b191817N49347J614940K010576J881448J375834K07322j085820j095030O3649
6224C330449J23882j913815l561969k237853P36488K233831K153325K833905M148991
6215G847234K972898j549693n421882m468607K41290L568253K087825k584692
6207B692626n795746m394351L92149M229602M045260R37278j711398k212504j403521
6198c220605k78345J079951K156001J801198J33849j086116q29839r2287q0240
6189d16433o09806j106927j620277j816023n17672K418482M994378N169107L124683
6180I619512M30596j855571l153618k816979j091922N05356J121742J602645K227223
6171F588984J212726k309737n430757m559627n76693K192950J864553P22887R03242
$$ plain form
6162 608528 2166562 3366623 3402907 2153314 -484983 -3998504 -6573134 -6829955 -5758975
6153 -5758975 -5105305 -4481026 -2336035 676947 2074961 1415210 927461 1636479 1820374
6144 1820374 640127 353479 2631645 4928840 3395237 -1762071 -6426249 -7388648 -4723319
6135 -4723319 -31704 5013961 8355032 8348258 5714563 2967184 1207398 -1017575 -4972837
6126 -4972837 -9256132 -11016472 -8782238 -3439084 2692589 7046999 7947975 5623265
6118 5623265 2034309 -672880 -1484159 -555034 1245219 2656890 2701792 1500086 55430
6109 55430 -879882 -1302863 -1465343 -1573131 -1868971 -2233899 -1918346 -726994 -293312 -2742734
6099 -2742734 -7883662 -13137018 -16541349 -18243192 -18643744 -17280141 -14873223 -14384240 -17632952
$$ packed form
6162F08528J558034J200061L6284j249593k638297l513521k574630k56821J070980
6153e758975O53670O24279K144991L012982J398014o59751m87749P09018J83895
6144A820374j180247k86648K278166K297195j533603n157308m664178r62399K665329
6135d723319M691615N045665L341071o774k633695k747379j759786k224973l955262
6126d972837m283295j760340K234234N343154O131673M354410R00976k324710
6118E623265l588956k707189q11279R29125J800253J411671M4902j201706j444656
6109E5430r35312m22981j62480j07788k95840l64928L15553J191352M33682k449422
6099b742734n140928n253356l404331j701843m00552J363603K406918M88983l248712
$$ plain form
6090 -17632952 -21904650 -22430411 -18002396 -11870229 -6981777 -2800179 2138259 6648836
6082 6648836 8071589 6406036 5144958 7186986 11046161 12468060 9699827 5712467
6074 5712467 4309623 5201834 4797024 1523887 -2046028 -3114875 -2296021 -1651788 -1228675
6065 -1228675 -234178 -248764 -3701646 -9151113 -11580012 -8585074 -3477159 -584233 78157
6056 78157 1243155 3497681 4876673 4506923 3829457 4112608 4952881 5526447 5455058 4156079
6046 4156079 1232140 -2008358 -3279932 -2232633 -785942 179416 2166460 5664929
6038 5664929 7913650 6762189 5001012 7247341 13035716 16785667 15249850 11377654
6030 11377654 9210099 8303529 5954492 2473035 693081 1315334 2126852 1725822 1112521
$$ packed form
6090a7632952m271698n25761M428015O132167M888452M181598M938438M510577
6082F648836J422753j665553j261078K042028L859175J421899k768233l987360
6074E712467j402844Q92211m04810l273137l569915j068847Q18854O44233M23113
6065a228675R94497j4586l452882n449467k428899K994938N107915K892926O62390
6056G8157J164998K254526J378992l69750o77466K83151Q40273N73566p1389j298979
6046D156079k923939l240498j271574J047299J446691R65358J987044L498469
6038E664929K248721j151461j761177K246329N788375L749951j535817l872196
6030A1377654k167555r06570k349037l481457j779954O22253Q11518m01030o13301
$$ plain form
6021 1112521 1257855 1659144 1962728 2794547 4130245 4744179 4182006 3625487 3976371
6012 3976371 4691713 5273673 6105119 6832183 5896201 3196258 1503598 3294304 7325052
6003 7325052 10228179 10602448 9609864 8206835 5966903 2758615 -104739 -958837 665712
5994 665712 3573654 5489876 4649884 1552428 -1414122 -2694983 -2999378 -3271109 -2651326
5985 -2651326 -10888 3566278 5753500 5939803 5573833 6017475 7575766 9994204 12176134
5976 12176134 12150910 9490267 7219205 8755478 13010102 15305978 13693024 11499562
5968 11499562 12242830 14472220 13876316 9140276 3446358 522236 978213 2758562 3893839
5959 3893839 4003531 3552094 2693163 1568996 1263643 3065456 6400259 8864608 9125341
$$ packed form
6021A112521J45334M01289L03584Q31819J335698O13934n62173n56519L50884
6012C976371P15342N81960Q31446P27064r35982k699943j692660J790706M030748
6003G325052K903127L74269r92584j403029k239932l208288k863354q54098J624549
5994F65712K907942J916222q39992l097456k966550j280861l04395k71731O19783
5985b651326K640438L577166K187222J86303l65970M43642J558291K418438K181930
5976A2176134k5224k660643k271062J536273M254624K295876j612954k193462
5968A1499562P43268K229390n95904m736040n693918k924122M55977J780349J135277
5959C893839J09692m51437q58931j124167l05353J801813L334803K464349K60733
$$ plain form
5950 9125341 8453904 8398750 8568178 8178776 7940052 8213693 7067385 3058115 -1422861
5941 -1422861 -2904394 -1847360 -1164164 -660493 2390765 7174678 9034272 6459801 3445204
5932 3445204 2991908 3196045 2462742 3542496 8243333 12319404 10747363 5299271 1749545
5923 1749545 1569268 1578384 447333 55222 741513 512579 -492146 359268 2884174
5914 2884174 2912398 -1570343 -6719604 -7630560 -4184059 43505 2478739 3018107 2578249
5905 2578249 2363100 3485694 5515444 6111617 3502047 -1175620 -4984990 -6131928 -5072761
5896 -5072761 -3254048 -1503447 438578 2945609 5039964 4659818 1253195 -2717949
5888 -2717949 -4334474 -3681929 -3014784 -3058010 -2506759 -1129625 -648402 -1801778 -3003828
$$ packed form
5950I125341o71437n5154J69428l89402k38724K73641j146308m009270m480976
5941a422861j481533J057034O83196N03671L051258M783913J859594k574471l014597
5932C445204m53296K04137p33303J079754M700837M076071j572041n448092l549726
5923A749545j80277R116j131051l92111O86291k28934j004725Q51414K524906
5914B884174K8224m482741n149261r10956L446501M227564K435234N39368m39858
5905B578249k15149J122594K029750N96173k609570m677667l809370j146938J059167
5896e072761J818713J750601J942025K507031K094355l80146l406623l971144
5888b717949j616525O52545O67145m3226N51251J377134M81223j153376j202050
$$ plain form
5879 -3003828 -3074216 -3079522 -3965759 -4296480 -2213695 1656048 4949983 6179032 5111690
5870 5111690 1753176 -3140065 -7228120 -8276322 -6671867 -4812127 -3998683 -3258517 -1339220
5861 -1339220 1451008 3875364 5253530 5638586 5134828 3863380 2434482 1607188 1158857
5852 1158857 -190983 -2945734 -5409701 -5403980 -3429474 -2486489 -4040270 -5833004 -5035077
5843 -5035077 -2029455 831195 2871370 4879820 6030952 4246372 28012 -3047910
5835 -3047910 -2923905 -1861015 -3094554 -6378411 -8498445 -7145087 -2900493 1836975
5827 1836975 4723102 4766964 2709535 116267 -1853132 -2380001 -520854 3609975 7573139
5818 7573139 8559037 6741912 4739728 3744081 2659036 1338696 1589998 3836166 5801848
$$ packed form
5879c003828p0388n306q86237l30721K082785L869743L293935J229049j067342
5870E111690l358514m893241m088055j048202J604455J859740Q13444P40166J919297
5861a339220K790228K424356J378166L85056n03758j271448j428898q27294m48331
5852A158857j349840k754751k463967N721J974506R42985j553781j792734P97927
5843e035077L005622K860650K040175K008450J151132j784580m218360l075922
5835c047910J24005J062890j233539l283857k120034J353358M244594M737468
5827A836975K886127M3862k057429k593268j969399n26869J859147M130829L963164
5818G573139R85898j817125k002184r95647j085045j320340K51302K246168J965682
$$ plain form
5809 5801848 6179441 6667660 8227907 8292522 4700205 -49112 -2011388 -1405712 -1105031
5800 -1105031 -910455 1979023 6783049 8170382 3205976 -4159101 -7814610 -6465877
5792 -6465877 -3699196 -2673546 -3138590 -3271332 -2519918 -2087036 -3331896 -6159077 -9037240
5783 -9037240 -10568648 -10665772 -9835326 -7831781 -3913260 1605275 6763094 9086969 7196488
5774 7196488 1830394 -4130249 -7156312 -5503809 -314316 5718691 10198654 11593803
5766 11593803 9508783 5516170 2725135 3151065 5850014 8361741 9208597 8254308 5859754
5757 5859754 2974309 1022627 329213 -391403 -1745806 -2227308 -690802 1279723 1695622
5748 1695622 1467762 2629950 4292585 3633091 604093 -1689614 -1646432 -1081475 -1770385
$$ packed form
5809E801848L77593M88219J560247O4615l592317m749317j962276O05676L00681
5800a105031J94576K889478M804026J387333m964406p365077l655509J348733
5792f465877K766681J025650m65044j32742P51414M32882j244860k827181k878163
5783i037240j531408r7124Q30446K003545L918521N518535N157819K323875j890481
5774G196488n366094n960643l026063J652503N189493O033007M479963J395149
5766A1593803k085020l992613k791035M25930K698949K511727Q46856r54289k394554
5757E859754k885445j951682o93414p20616j354403m81502J536506J970525M15899
5748A695622k27860J162188J662635o59494l028998k293707M3182N64957o88910
$$ plain form
5739 -1770385 -2975652 -3435276 -3169011 -2100595 644874 4622117 7396073 7490397 6157916
5730 6157916 4906840 3257273 521005 -2066020 -2867715 -2151993 -1260824 -719032 -558757
5721 -558757 -1129866 -2114411 -2141023 -892237 -100960 -808161 -1294983 168930 2069631
5712 2069631 1723036 -483803 -1765014 -1335856 -1254422 -2742074 -4303839 -4181396 -2587413
5703 -2587413 -718205 781705 1655191 1768477 1629491 1909188 2074193 971173 -800074
5694 -800074 -917225 1235843 2813559 797608 -3928698 -7502619 -7710883 -6133655 -5533708
5685 -5533708 -6391408 -6658977 -4346239 202144 4435300 5784792 3918241 1002216 -358360
5676 -358360 482456 1912741 2033212 579387 -1234572 -2332159 -2656990 -2549280 -2026732
$$ packed form
5739a770385j205267m59624K66265J068416K745469L977243K773956R4324j332481
5730F157916j251076j649567k736268k587025q01695P15722Q91169N41792J60275
5721e58757n71109r84545k6612J248786P91277p07201m86822J463913J900701
5712B069631l46595k206839j281211M29158Q1434j487652j561765J22443J593983
5703b587413J869208J499910Q73486J13286j38986K79697J65005j103020j771247
5694h00074j17151K153068J577716k015951m726306l573921k08264J577228N99947
5685e533708q57700k67569K312738M548383M233156J349492j866551k916025j360576
5676c58360Q40816J430285J20471j453825j813959j097587l24831J07710N22548
$$ plain form
5667 -2026732 -1127715 -436052 -560038 -1261239 -1709694 -1486668 -734690 462143 1908025
5658 1908025 2499683 850021 -2611945 -5110594 -4216911 -823875 1492153 228966 -3431573
5649 -3431573 -5940987 -5073532 -2168752 -678053 -2498556 -6055109 -8294898 -8032267 -6419779
5640 -6419779 -4501367 -1925218 1405873 3959448 4120009 2234452 -124802 -2238546
5632 -2238546 -4228289 -5578565 -5468727 -4593277 -4856715 -6645049 -7884987 -6772362 -4281782
5623 -4281782 -2799364 -3165784 -4517791 -6451805 -9390079 -12495834 -13114001 -9601060 -3731267
5614 -3731267 1060015 3224939 3528681 2558956 -32769 -3446128 -5114165 -3624306 -809334
5605 -809334 754219 1249466 2645697 4913591 5583868 3251416 -555494 -3551549 -4951520
$$ packed form
5667b026732Q99017O91663j23986p01201m48455K23026P51978J196833J445882
5658A908025N91658j649662l461966k498649Q93683L393036K316028j263187l660539
5649c431573k509414Q67455K904780J490699j820503l556553k239789K62631J612488
5640f419779J918412K576149L331091K553575J60561j885557k359254k113744
5632b238546j989743j350276J09838Q75450k63438j788334j239938J112625K490580
5623d281782J482418l66420j352007j934014k938274l105755o18167L512941N869793
5614c731267M791282K164924L03742r69725k591725l413359j668037J489859K814972
5605h09334J563553M95247J396231K267894O70277k332452l806910k996055j399971
$$ plain form
5596 -4951520 -4945712 -3825162 -2687131 -3246903 -5412285 -6407233 -4113927 -383275 899904
5587 899904 -1389042 -4623019 -6118154 -5886158 -5210201 -4219982 -2133783 923565 3583371
5578 3583371 4582452 3684975 1354232 -1676346 -4261108 -5084463 -3930748 -2505880 -2978662
5569 -2978662 -5400689 -7475843 -7417696 -6048407 -5169773 -4922235 -4288540 -3449645 -3572032
5560 -3572032 -4380406 -4112561 -2272415 -316740 1095518 3315729 6903567 9670373 9380020
5551 9380020 6911956 4737092 3362908 1428578 -1352888 -3530242 -4090131 -3582618 -3108652
5542 -3108652 -3601869 -5866248 -9669123 -12736215 -12261859 -7941140 -2530629 852583 1235839
5533 1235839 -243316 -1783026 -2192255 -1582885 -1010048 -1091719 -1388807 -1614431 -2531831
$$ packed form
5596d951520N808J120550J138031n59772k165382r94948K293306L730652J283179
5587H99904k288946l233977j495135K31996O75957R90219K086199L057348K659806
5578C583371R99081q97477k330743l030578k584762q23355J153715J424868m72782
5569b978662k422027k075154N8147J369289Q78634K47538O33695Q38895j22387
5560c572032q08374K67845J840146J955675J412258K220211L587838K766806k90353
5551I380020k468064k174864j374184j934330k781466k177354n59889N07513M73966
5542c108652m93217k264379l802875l067092M74356M320719N410511L383212L83256
5533A235839j479155j539710m09229O09370N72837q1671k97088k25624r17400
$$ plain form
5524 -2531831 -4551778 -6236141 -5700261 -3145217 -623762 423306 110426 -979420 -2308369
5515 -2308369 -3073161 -2925105 -2868379 -3982889 -5442049 -5314322 -3107016 83185 3563913
5506 3563913 7165764 9547764 8812426 5346486 1994751 755412 1077284 1782102 2489814
5497 2489814 2527026 868701 -1684397 -2585570 -1287805 -730968 -3229641 -6812733 -7861380
5488 -7861380 -5814475 -2836674 -120651 2601053 4437829 3280641 -1085791 -5996218
5480 -5996218 -8784239 -9091742 -7841015 -5657515 -3295468 -2196955 -3088356 -4507796 -4055654
5471 -4055654 -1241711 1804531 2813334 1845598 572031 -404611 -2138185 -4939055 -6955644
5462 -6955644 -6510561 -4778440 -4197107 -4718666 -3983409 -1448618 100961 -1782192 -5980866
$$ packed form
5524b531831k019947j684363N35880K555044K521455J047068l12880j089846j328949
5515b308369p64792J48056N6726j114510j459160J27727K207306L190201L480728
5506C563913L601851K382000p35338l465940l351735j239339L21872P04818P07712
5497B489814L7212j658325k553098r01173J297765N56837k498673l583092j048647
5488g861380K046905K977801K716023K721704J836776j157188m366432m910427
5480e996218k788021l07503J250727K183500K362047J098513q91401j419440M52142
5471d055654K813943L046242J008803r67736j273567r76642j733574k800870k016589
5462f955644M45083J732121N81333n21559P35257K534791J549579j883153m198674
$$ plain form
5453 -5980866 -9521235 -10864562 -10190205 -8048598 -5396318 -3674727 -3179034 -2428094 -611487
5444 -611487 707757 21382 -1573213 -2413235 -3212979 -5046699 -5727824 -2034300 4695925
5435 4695925 9200498 9279115 8334671 9438948 10624469 8793778 5318732 4076949 5503449
5426 5503449 6312379 4645009 2071774 234609 -1274730 -2636226 -2286354 290934 2196840
5417 2196840 120014 -4987341 -8609857 -8126571 -5437561 -3480624 -2254688 -119994
5409 -119994 2252491 1878361 -2346667 -7653377 -10627994 -10736597 -9258599 -6366335 -1628886
5400 -1628886 3344577 5629474 4843222 3823909 4380721 4646693 2476772 -464522 -778269
5391 -778269 1392403 2282258 6323 -2809251 -3253462 -2514571 -3675994 -6559396 -7631171
$$ packed form
5453e980866l540369j343327O74357K141607K652280J721591M95693P50940J816607
5444f11487J319244o86375j594595q40022p99744j833720o81125L693524O730225
5435D695925M504573P8617r44444J104277J185521j830691l475046j241783J426500
5426E503449Q08930j667370k573235j837165j509339j361496L49872K577288J905906
5417B196840k076826n107355l622516M83286K689010J956937J225936K134694
5409a19994K372485l74130m225028n306710k974617j08603J477998K892264M737449
5400a628886M973463K284897p86252j019313N56812K65972k169921k941294l13747
5391g78269K170672Q89855k275935k815574m44211P38891j161423k883402j071775
$$ plain form
5382 -7631171 -4957596 -723107 1927191 2520710 2502619 2468882 1944110 1099109 805896
5373 805896 1051711 834971 -159177 -1143703 -1903001 -3588311 -7026552 -11134320 -13926094
5364 -13926094 -14517208 -13296852 -10704403 -7014507 -3223991 -891504 -481054 -546317 637044
5355 637044 2802593 3862212 2655677 838340 1106973 3691074 5801819 5074071 2394309
5346 2394309 229328 -819947 -1980170 -3265529 -2825616 -15862 2880554 3380968 1943439
5337 1943439 964157 1683600 3645925 6388697 9714332 12412091 12549044 9626354 5430591
5328 5430591 2367143 1668026 3241936 6198379 9060669 10214083 8803906 5253732
5320 5253732 1107382 -1521670 -1231289 945952 1757251 -876843 -4942295 -6433353 -4385683
$$ packed form
5382g631171K673575M234489K650298N93519j8091l3737n24772q45001k93213
5373H05896K45815k16740r94148r84526p59298j685310l438241m107768k791774
5364a3926094n91114J220356K592449L689896L790516K332487M10450o5263J183361
5355F37044K165549J059619j206535j817337K68633K584101K110745p27748k679762
5346B394309k164981j049275j160223j285359M39913K809754K896416N00414j437529
5337A943439r79282P19443J962325K742772L325635K697759J36953k922690m195763
5328E430591l063448o99117J573910K956443K862290J153414j410177l550174
5320E253732m146350k629052K90381K177241Q11299k634094m065452j491058K047670
$$ plain form
5311 -4385683 -1900912 -1656891 -2563238 -2285321 -1197494 -1445691 -2924716 -2848027 321131
5302 321131 4635439 7282932 7831342 7604334 7059730 5574645 3477682 2486230 3528656
5293 3528656 5216839 5269205 2946025 -453082 -3043021 -3782802 -2891630 -1442467 -303082
5284 -303082 853642 2927601 5340770 5636583 2380608 -2259930 -4593892 -3864249 -2691238
5275 -2691238 -2910591 -3310682 -2476508 -1509579 -1965840 -2884264 -2417661 -1357535 -2156645
5266 -2156645 -4654356 -5662893 -3495076 -496689 126611 -1790139 -3908438 -4364067 -2879185
5257 -2879185 -124425 2547660 3599744 3008046 2842473 4707531 7098521 6971988 3930731
5248 3930731 1224254 2059282 6108336 10354989 12434604 12212064 10683720 8581966 6311561
$$ packed form
5311d385683K484771K44021r06347K77917J087827k48197j479025P6689L169158
5302C21131M314308K647493N48410k27008n44604j485085k096963r91452J042426
5293C528656J688183N2366k323180l399107k589939p39781Q91172J449163J139385
5284c03082J156724K073959K413169K95813l255975m640538k333962P29643J173011
5275b691238k19353m00091Q34174R66929m56261r18424M66603J060126p99110
5266b156645k497711j008537K167817K998387O23300j916750k118299m55629J484882
5257b879185K754760K672085J052084n91698j65573J865058K390990j26533l041257
5248C930731k706477Q35028M049054M246653K079615k22540j528344k101754k270405
$$ plain form
5239 6311561 4457998 3649691 3907262 4467774 4448866 3648540 2618602 2020712 2047622 2449787
5229 2449787 2896744 3121539 2773101 1382423 -1261582 -4580017 -7179394 -7715137 -6063890
5220 -6063890 -3560265 -1754139 -785418 794977 4237541 8563929 10793159 8869433
5212 8869433 4416715 1759311 3566869 8012224 11075151 11126099 9881104 9018956 7804891
5203 7804891 4916691 971685 -2290918 -4341348 -5794994 -6763905 -6997381 -7144133 -7896917
5194 -7896917 -8058342 -5715550 -1769098 -4285 -2495749 -6786299 -9051380 -8459450 -6722276
5185 -6722276 -4869016 -2815874 -1234253 -1193269 -2086292 -2416983 -2798498 -5397370 -9575634
5176 -9575634 -11041422 -7279395 -1457354 1637010 1711984 1917015 3001623 2479979 -420019
$$ packed form
5239F311561j853563q08307K57571N60512j8908q00326j029938n97890K6910M02165
5229B449787M46957K24795l48438j390678k644005l318435k599377n35743J651247
5220f063890K503625J806126R68721J580395L442564M326388K229230j923726
5212H869433m452718k657404J807558M445355L062927N0948j244995q62148j214065
5203G804891k888200l945006l262603k050430j453646r68911k33476j46752p52784
5194g896917j61425K342792L946452J764813k491464m290550k265081N91930J737174
5185f722276J853260K053142J581621M0984q93023l30691l81515k598872m178264
5176i575634j465788L762027N822041L094364P4974K05031J084608n21644k899998
$$ plain form
5167 -420019 -3036881 -3629725 -3735464 -4310420 -3140372 919220 4141962 2317567 -2985465
5158 -2985465 -6734694 -7720029 -8860874 -10734503 -10145187 -6288654 -3317682 -4245113 -6337222
5149 -6337222 -5689622 -3059642 -1500504 -763776 1729250 5659190 7664712 6307215 3912649
5140 3912649 3115190 4023858 5157480 5251290 3901870 1877907 681396 679089 432632
5131 432632 -840244 -1474875 115480 2583050 3702576 3878999 4693555 5182966 3107143
5122 3107143 -698767 -2974430 -2884599 -2414473 -1810628 1092907 5991281 8780811 7100338
5113 7100338 3770354 2565760 3588895 5053270 6724326 8914521 10460953 10479404 10231382
5104 10231382 10680012 10041002 6520913 1941422 -253101 442401 1616658 1544368 216633
$$ packed form
5167d20019k616862n92844j05739n74956J170048M059592L222742j824395n303032
5158b985465l749229r85335j140845j873629N89316L856533K970972r27431k092109
5149f337222O47600K629980J559138P36728K493026L929940K005522j357497k394566
5140C912649p97459R08668J133622R3810j349420k023963j196511k307k46457
5131D32632j272876o34631J590355K467570J119526J76423Q14556M89411k075823
5122C107143l805910k275663Q9831M70126O03845K903535M898374K789530j680473
5113G100338l329984j204594J023135J464375J671056K190195J546432J8451k48022
5104A0231382M48630o39010l520089m579491k194523O95502J174257p2290j327735
$$ plain form
5095 216633 -2268219 -5513788 -7518050 -6366634 -3291303 -1659928 -2724714 -4465447
5087 -4465447 -4832780 -4038577 -3171145 -2472668 -1805723 -1383764 -1183555 -650143 295070 750509
5077 750509 58581 -946494 -664646 1178477 2561730 952338 -3521955 -7320255 -7000322
5068 -7000322 -3184383 406013 1720900 2161884 3181532 3612495 2003990 -310697 -703080
5059 -703080 1195872 3387050 4293667 3939201 2870102 1556812 626594 404833 446840
5050 446840 356287 374177 295986 -1049405 -3894188 -6197640 -5933445 -3963554 -2877158
5041 -2877158 -3472597 -4140305 -3509049 -2082277 -1164490 -1347775 -2144717 -2412443 -1422553
5032 -1422553 -28212 -36050 -1797386 -3468760 -3516645 -2766336 -2874467 -3965609 -5035606
$$ packed form
5095B16633k484852l245569k004262J151416L075331J631375j064786j740733
5087d465447l67333P94203Q67432O98477O66945M21959K00209N33412R45213M55439
5077G50509o91928j005075K81848J843123J383253j609392m474293l798300L19933
5068g000322L815939L590396J314887M40984J019648M30963j608505k314687l92383
5059g03080J898952K191178R06617l54466j069099j313290r30218k21761M2007
5050D46840r0553J7890p8191j345391k844783k303452K64195J969891J086396
5041b877158n95439o67708O31256J426772R17787j83285p96942k67726R89890
5032a422553J394341p838j761336j671374m7885P50309j08131j091142j069997
$$ plain form
5023 -5035606 -5559713 -5398846 -4221022 -2323948 -994137 -977144 -1824478 -3509638 -6671754
5014 -6671754 -10120824 -10698016 -7562283 -4073880 -3049725 -2821815 -958704 952953 297499
5005 297499 -1091374 653882 4713704 6300558 3869331 862441 -78833 -103331 -457551
4996 -457551 6728 2180782 4918311 7175187 8985232 9467019 7050456 2711581 -102149
4987 -102149 148210 1660789 2946959 4537491 5996715 4904800 678726 -3626000 -5158003
4978 -5158003 -4205962 -1869094 1932430 6073791 7093102 3317300 -2174783 -5385527
4970 -5385527 -6221924 -6916577 -7549993 -6228576 -2764507 586707 1858133 960457 -1212156
4961 -1212156 -3805377 -6311360 -8777139 -11368760 -13270413 -12858241 -9592888 -4991633
$$ packed form
5023e035606n24107J60867J177824J897074J329811J6993q47334j685160l162116
5014f671754l449070n77192L135733L488403J024155K27910J863111J911657o55454
5005B97499j388873J745256M059822J586854k431227l006890r41274k4498l54220
4996d57551M64279K174054K737529K256876J810045M81787k416563m338875k813730
4987a02149K50359J512579J286170J590532J459224j091915m226074m304726j532003
4978e158003R52041K336868L801524M141361J019311l775802n492083l210744
4970e385527q36397o94653o33416J321417L464069L351214J271426q97676k172613
4961a212156k593221k505983k465779k591621j901653M12172L265353M601255
$$ plain form
4953 -4991633 -1248075 476154 329008 -784343 -2051047 -3753546 -6846812 -10693390
4945 -10693390 -12551836 -10919424 -7859846 -5872243 -4264984 -1535655 636128 -254827
4937 -254827 -2741094 -3559534 -3450712 -5493226 -8383435 -7576141 -3487263 -2008652 -5283593
4928 -5283593 -8290266 -7043416 -4277988 -3911596 -5282136 -6376598 -7931934 -10687946
4920 -10687946 -12830383 -13503286 -14747009 -16964966 -16923591 -13330833 -9718815 -8580603 -7643680
4911 -7643680 -5472735 -5378199 -9473414 -14015052 -15339265 -15514437 -17263709 -18258142 -15809014
4902 -15809014 -12635670 -12477336 -14145315 -15014939 -15966457 -17841995 -17873920 -14859075 -12793123
4893 -12793123 -14245542 -15880381 -15692268 -17682103 -23376655 -26715573 -24514109 -23339935
$$ packed form
4953d991633L743558J724229j47146j113351j266704j702499l093266l846578
4945a0693390j858446J632412L059578J987603J607259K729329K171783q90955
4937b54827k486267q18440J08822k042514k890209Q07294M088878J478611l274941
4928e283593l006673J246850K765428L66392j370540j094462j555336k756012
4920a0687946k142437o72903j243723k217957M1375L592758L612018J138212R36923
4911g643680K170945R4536m095215m541638j324213j75172j749272r94433K449128
4902a5809014L173344J58334j667979q69624r51518j875538l1925L014845K065952
4893a2793123j452419j634839J88113j989835n694552l338918K201464J174174
$$ plain form
4885 -23339935 -27882918 -32254112 -32279794 -35081727 -44688383 -51129395 -49071064 -52921087
4877 -52921087 -73375027 -94526094 -101795087 -117005293 -164549935 -207784908 -170895691
4870 -170895691 -41176626 94812003 146733644 119037187 81567572 71816973 70770306
4863 70770306 59669590 50183496 53002339 56045291 48458315 39630120 40103504 43339000
4855 43339000 39492303 31901425 28098185 26793464 24209812 22939146 25141526 25919030
4847 25919030 21942806 18741301 21643133 26667243 27676803 25896091 25220622 24245877
4839 24245877 20284777 16227626 16222723 18320239 17771176 14595745 12351711 12031574 12033079
4830 12033079 11880397 11838215 10966625 8958836 7708226 8291343 8861972 7825456 6252198
$$ packed form
4885b3339935m542983m371194k5682k801933r606656o441012K058331l850023
4877e2921087k0453940k1151067p268993j5210206m7544642m3234973L6889217
4870a70895691J29719065J35988629N1921641k7696457l7469615r750599j046667
4863G0770306j1100716r486094K818843L042952p586976q828195M73384L235496
4855D3339000l846697p590878l803240j304721k583652j270666K202380P77504
4847B5919030l976224l201505K901832N024110J009560j780712o75469r74745
4839B4245877l961100m057151m903K097516n49063l175431k244034l20137J505
4830A2033079j52682m2182q71590k007789j250610N83117N70629j036516j573258
$$ plain form
4821 6252198 5190106 4000319 3281658 5383794 9611325 11199594 8029577 4290236
4813 4290236 4256472 6391388 7148892 6871911 7967305 10284378 12075431 13022903 13223302
4804 13223302 11925375 10089655 10978922 15147932 18185747 16699911 13162882 11429880
4796 11429880 11078931 10062696 9294850 10050103 10080254 7301951 4622140 5919491 9455428
4787 9455428 10564109 9124409 8939727 10856730 11938016 11103663 10544921 11226510 11253698
4778 11253698 9260658 6100051 3050710 1162635 1771376 4688623 6864465 6072657
4770 6072657 4674415 6094449 8971733 9142024 6371752 4284384 4046341 3222050 1205383
4761 1205383 716624 2732503 4418804 3676367 1910530 766915 -308066 -1648436 -1823903
$$ packed form
4821F252198j062092j189787p18661K102136M227531J588269l170017l739341
4813D290236l3764K134916P57504k76981J095394K317073J791053R47472K00399
4804A3223302j297927j835720Q89267M169010L037815j485836l537029j733002
4796A1429880l50949j016235p67846P55253L0151k778303k679811J297351L535937
4787I455428J108681j439700j84682J917003J081286q34353n58742O81589K7188
4778A1253698j993040l160607l049341j888075O08741K917247K175842p91808
4770F072657j398242J420034K877284J70291k770272k087368k38043q24291k016667
4761A205383m88759K015879J686301p42437j765837j143615j074981j340370j75467
$$ plain form
4752 -1823903 -266117 1344770 1791110 1812387 1741494 502200 -1660793 -2207098 341342
4743 341342 4344913 7600799 9683964 10742211 10487609 9508254 9076511 8657893 6394619
4734 6394619 3117233 2581873 5971623 9378995 9121654 6773546 6208434 7923030 9159074
4725 9159074 8033009 5009089 1674850 249251 2707640 8009767 11625928 10284230
4717 10284230 6055850 3470832 3801197 4633400 4055569 2662343 1963798 3046116 6279021
4708 6279021 10335326 12223403 10455632 7552460 7199387 9465689 11077777 9954819
4700 9954819 7145126 4606916 3485607 4450523 7254334 9762427 9692026 7556537 5715081
4691 5715081 4457401 1722080 -2741633 -5850071 -5271363 -2670560 -1061676 -817767 -412883
$$ packed form
4752a823903J557786J610887M46340K1277p0893j239294k162993n46305K548440
4743C41342M003571L255886K083165J058247k54602r79355m31743m18618k263274
4734F394619l277386n35360L389750L407372k57341k348108n65112J714596J236044
4725I159074j126065l023920l334239j425599K458389N302127L616161j341698
4717A0284230m228380k585018L30365Q32203n77831j393226o98545J082318L232905
4708F279021M056305J888077j767771k903172l53073K266302J612088j122958
4700I954819k809693k538210j121309R64916K803811K508093p0401k135489j841456
4691E715081j257680k735321m463713l108438N78708K600803J608884K43909M04884
$$ plain form
4682 -412883 295151 35396 -1058103 -882074 1879482 5824951 8331315 8263609 6618740
4673 6618740 4776049 2735487 -457211 -4655184 -7913767 -8630718 -7667905 -6987661 -6560401
4664 -6560401 -4499177 -509532 2926277 3889635 3692622 4581886 6293827 7015417 6766103
4655 6766103 7314504 8994526 10125746 9947897 9696037 9832348 8525076 4604796 366323
4646 366323 -724440 1676242 4686721 5879263 5240600 3864237 2792895 3218937 5614201
4637 5614201 8033566 7397281 3580025 338013 719002 3354036 5226406 6315139 8531705
4628 8531705 11082250 10726748 7223386 4880394 6762702 10160036 10538485 8081239 6969877
4619 6969877 8913834 10937982 10234000 8149683 7601292 8569499 8489871 6290066 3816771
$$ packed form
4682d12883P08034k59755j093499J76029K761556L945469K506364o7706j644869
4673F618740j842691k040562l192698m197973l258583p16951R62813O80244M27260
4664f560401K061224L989645L435809R63358j97013Q89264J711941P21590k49314
4655F766103N48401J680022J131220j77849k51860J36311j307272l920280m238473
4646C66323j090763K400682L010479J192542o38663j376363j071342M26042K395264
4637E614201K419365o36285l817256l242012L80989K635034J872370J088733K216566
4628H531705K550545l55502l503362k342992J882308L397334L78449k457246j111362
4619F969877J943957K024148p03982k084317n48391R68207p9628k199805k473295
$$ plain form
4610 3816771 3090477 3823237 4328384 3709198 2144698 -245857 -3367767 -5873789 -5431564
4601 -5431564 -1496545 2877314 3679951 643549 -2224259 -1558190 1414728 3254370 3302080
4592 3302080 3940821 6293987 8480721 8981470 9227111 11033088 13217040 13094036 10497599
4583 10497599 8024381 7468896 8047566 8272502 7636270 5990637 3108154 -278430 -2517599
4574 -2517599 -3126195 -3581979 -5013097 -6314879 -5822539 -3846773 -2139931 -1623328 -2108817
4565 -2108817 -3575492 -5932071 -7769339 -7251941 -4639938 -2453538 -2566040 -4266601 -5758219
4556 -5758219 -6528631 -7411326 -8845437 -9822762 -8651493 -4853441 -455015 1206626 -1229132
4547 -1229132 -5407071 -7630076 -6483663 -3146093 962858 4972273 7547582 7548097 5982743
$$ packed form
4610C816771p26294P32760N05147o19186j564500k390555l121910k506022M42225
4601e431564L935019M373859Q02637l036402k867808O66069K972918J839642M7710
4592C302080O38741K353166K186734N00749K45641J805977K183952j23004k596437
4583A0497599k473218n55485N78670K24936o36232j645633k882483l386584k239169
4574b517599o08596m55784j431118j301782M92340J975766J706842N16603m85489
4565b108817j466675k356579j837268N17398K612003K186400j12502j700561j491618
4556e758219p70412q82695j434111r77325J171269L798052M398426J661641k435758
4547a229132m177939k223005J146413L337570M108951M009415K575309N15j565354
$$ plain form
4538 5982743 5051199 4768346 2938292 -812913 -3736449 -4031090 -3441708 -3855284 -4028564
4529 -4028564 -2363953 -477251 -557374 -1003137 1318461 5458470 7234626 5524658 3564064
4520 3564064 3466625 3548916 2345812 1405885 2091203 2925662 2538026 2357245 3604099 4124150
4510 4124150 1596215 -1836171 -1875930 1649375 4413741 3787218 2214473 3197289 6293931
4501 6293931 8055942 6905460 5196102 6102794 9414706 11370893 8888904 3167484
4493 3167484 -1849622 -4070023 -4740445 -5371260 -5300202 -3351728 -174830 2600081 4319642
4484 4319642 4959015 4010848 1508473 -656413 -339923 2139964 4232499 3811161 684250
4475 684250 -3678946 -6684084 -5884666 -1403957 3498531 5623264 4779556 2437606 -798463
$$ packed form
4538E982743r31544k82853j830054l751205k923536k94641N89382m13576j73280
4529d028564J664611J886702q0123m45763K321598M140009J776156j709968j960594
4520C564064r7439Q2291j203104r39927O85318Q34459l87636j80781J246854N20051
4510D124150k527935l432386l9759L525305K764366o26523j572745R82816L096642
4501F293931J762011j150482j709358R06692L311912J956187k481989n721420
4493C167484n017106k220401o70422o30815P1058J948474L176898K774911J719561
4484D319642O39373r48167k502375k164886L16490K479887K092535m21338l126911
4475F84250m363196l005138P99418M480709M902488K124733q43708k341950l236069
$$ plain form
4466 -798463 -4286371 -5802462 -4151036 -2205640 -3648666 -7110783 -7543996 -3671878 157883
4457 157883 638271 -231512 404557 1473919 705597 -878234 -761078 754226 1476489
4448 1476489 1238677 1618530 2667320 3079741 3103283 4209664 5980482 6232988 4545479
4439 4545479 3011555 2838554 2489050 162796 -3579774 -6579296 -7294886 -5804864 -3679614
4430 -3679614 -2946860 -3913474 -4117843 -1082973 3870913 6492458 4644967 519796 -2815125
4421 -2815125 -4944203 -6942576 -8591197 -8686487 -7166809 -5142083 -3149302 -750023 2215950
4412 2215950 4963092 6401078 5961790 4010600 1792393 555637 379469 366393 244266
4403 244266 950759 3075883 5541048 6679838 6168232 5161552 4881009 5660047 7013810
$$ packed form
4466g98463l487908j516091J651426J945396j443026l462117m33213L872118L829761
4457A57883M80388q69783O36069J069362p68322j583831J17156J515304P22263
4448A476489k37812L79853J048790M12421K3542J106381J770818K52506j687509
4439D545479j533924j73001l49504k326254l742570k999522p15590J490022K125250
4430c679614P32754r66614k04369L034870M953886K621545j847491m125171l334921
4421b815125k129078j998373j648621r5290J519678K024726J992781K399279K965973
4412B215950K747142J437986m39288j951190k218207j236756j76168j3076j22127
4403B44266P06493K125124K465165J138790n11606j006680k80543P79038J353763
$$ plain form
4394 7013810 8076883 8251031 7795579 7408414 7036153 5817624 3583496 1574980 1065393
4385 1065393 2014503 3722375 6005148 8912693 11978722 14574873 16372862 16766002 14765829
4376 14765829 10475316 5771949 2353404 -20006 -2030772 -2658052 -565543 2901678
4368 2901678 4424979 2674271 -312482 -2093022 -2443093 -2514508 -3007934 -3901978 -4675866
4359 -4675866 -4207781 -1738172 1566909 3398160 3123109 2259291 1637864 136317 -2664694
4350 -2664694 -4653064 -3837780 -1286711 553037 1234779 1935598 2714578 2431953 851732
4341 851732 -1254798 -3560770 -5625419 -5577311 -2044122 2784354 4878527 3465842 1628564
4332 1628564 1372470 1305470 319961 71849 1519190 2034956 -860490 -5052409 -6631985
$$ packed form
4394G013810J063073J74148m55452l87165l72261j218529k234128k008516n09587
4385A065393R49110J707872K282773K907545L066029K596151J797989L93140k000173
4376A4765829m290513m703367l418545k373410k010766o27280K092509L467221
4368B901678J523301j750708k986753j780540l50071p1415m93426q94044p73888
4359d675866M68085K469609L305081J831251k75051q63818o21427j501547k801011
4350b664694j988370Q15284K551069J839748O81742P00819P78980k82625j580221
4341H51732k106530k305972k064649M8108L533189M828476K094173j412685j837278
4332A628564k56094o7000r85509k48112J447341N15766k895446m191919j579576
$$ plain form
4323 -6631985 -5698127 -5631485 -7406742 -8690590 -8644499 -9379646 -11421530 -11618689 -7841077
4314 -7841077 -2748185 -114964 394390 1829621 4929416 7694147 9165287 10413226
4306 10413226 11757493 11907078 10441637 8708823 7468363 5852525 3679224 2681540
4298 2681540 3907653 5501879 4829864 1855151 -1082274 -2078549 -972667 1295399 3217041
4289 3217041 3373514 2066768 1599485 3342581 5312393 4690045 2140877 1064295 2602747
4280 2602747 4304938 4435001 4535223 6045869 7202260 5921002 3673817 3266582 4023049
4271 4023049 2744629 -884468 -3511280 -3309812 -2486676 -3149345 -3766450 -2060662 874724
4262 874724 2170855 1577158 1461383 2955031 4633641 5057187 4478062 3695044 2945923
$$ packed form
4323f631985R33858O6642j775257j283848M6091p35147k041884j97159L777612
4314g841077N092892K633221N09354J435231L099795K764731J471140J247939
4306A0413226J344267J49585j465441j732814j240460j615838k173301r97684
4298B681540J226113J594226o72015k974713k937425r96275J105882K268066J921642
4289C217041J56473j306746m67283J743096J969812o22348k549168j076582J538452
4280B602747J702191J30063J00222J510646J156391j281258k247185m07235P56467
4271D023049j278420l629097k626812K01468Q23136o62669o17105J705788K935386
4262H74724J296131n93697j15775J493648J678610M23546n79125p83018p49121
$$ plain form
4253 2945923 2331253 1906192 1076384 -724662 -2568797 -2753519 -1308604 -190316 -415283
4244 -415283 -612868 627405 2329591 2276533 -219720 -3646598 -5784867 -5277511 -2493051
4235 -2493051 628887 2424085 3517773 5779920 8949949 10173628 7914737 4369004
4227 4369004 2352706 1654315 733441 379174 2496005 5898952 6768857 3884875 611647
4218 611647 588818 3552044 6522826 7358048 6019390 3871777 2812341 3768671 5139243
4209 5139243 4091367 292102 -3200667 -3891865 -3099357 -3711843 -6024371 -7699498 -7140869
4200 -7140869 -5083984 -3079992 -1891721 -1407812 -1082510 -407785 499267 1135919 1834180
4191 1834180 3800780 7089947 9557106 9151422 6568743 4228832 3081437 1892643
$$ packed form
4253B945923o14670m25061q29808j801046j844135j84722J444915J118288k24967
4244d15283j97585J240273J702186n3058k496253l426878k138269N07356K784460
4235b493051L121938J795198J093688K262147L170029J223679k258891l545733
4227D369004k016298o98391r20874l54267K116831L402947Q69905k883982l273228
4218F11647k2829K963226K970782Q35222j338658k147613j059436R56330J370572
4209E139243j047876l799265l492769o91198P92508o12486k312528j675127N58629
4200g140869K056885K003992J188271M83909L25302O74725R07052O36652O98261
4191A834180J966600L289167K467159m05684k582679k339911j147395j188794
$$ plain form
4183 1892643 -464144 -3408954 -5514087 -5905705 -4575313 -2104414 574332 2526892
4175 2526892 3208711 2701904 1877910 2054501 3702540 5594187 6114777 5118956 3338062
4166 3338062 737264 -2401474 -3507424 -211749 5048071 6928420 4721952 3567168
4158 3567168 6272975 9006784 8343394 7289108 9475072 12401861 12699355 13399350 18213018
4149 18213018 23091147 23810092 28646081 49467728 78781266 90461796 70393548 34932208
4141 34932208 10182753 2693866 1199040 -1285574 -1588335 1006200 1119636 -1927235
4133 -1927235 -1171466 6430169 14102295 14874729 10296062 5738870 2877316 858726 75298
4124 75298 467787 -430434 -3954188 -7392229 -7590921 -5110330 -2296117 350784 3287239
$$ packed form
4183A892643k356787k944810k105133l91618J330392K470899K678746J952560
4175B526892O81819n06807q23994J76591J648039J891647N20590r95821j780894
4166C338062k600798l138738j105950L295675N259820J880349k206468j154784
4158C567168K705807K733809o63390j054286K185964K926789K97494O99995M813668
4149A8213018M878129P18945M835989K0821647K9313538J1680530k0068248l5461340
4141C4932208k4749455p488887j494826k484614l02761K594535J13436l046871
4133a927235P55769P601635P672126P72434m578667m557192k861554k018590p83428
4124G5298L92489q98221l523754l438041j98692K480591K814213K646901K936455
$$ plain form
4115 3287239 5433007 5069339 2028851 -2442302 -6550816 -7954922 -5183980 -87215
4107 -87215 3466393 4262687 4615011 5937908 6770602 6359630 6428905 7378146 6393767 2049134
4097 2049134 -2454288 -3673033 -2672566 -2190155 -1816201 190702 2424200 1873076 -1112706
4088 -1112706 -3157785 -2690165 -1315672 -803070 -1534567 -3578320 -6574434 -8642213 -7755835
4079 -7755835 -4334916 -838332 944342 943691 65170 -200412 1413522 4066264 5130959
4070 5130959 3779064 2264492 1964036 801041 -2777890 -5978564 -5340852 -1999464 647841
4061 647841 2438609 5059788 6976400 5310909 2133473 2970459 8381309 12549799 11721825
4052 11721825 8845287 7587990 6545342 2629344 -3407227 -8263025 -10390990 -10076243
$$ packed form
4115C287239K145768l63668l040488m471153m108514j404106K770942N096765
4107h7215L553608P96294L52324J322897Q32694m10972O9275R49241r84379m344633
4097B049134m503422j218745J000467M82411L73954K006903K233498n51124k985782
4088a112706k045079M67620J374493N12602p31497k043753k996114k067779Q86378
4079g755835L420919L496584J782674o51q78521k65582J613934K652742J064695
4070E130959j351895j514572l00456j162995l578931l200674O37712L341388K647305
4061F47841J790768K621179J916612j665491l177436Q36986N410850M168490q27974
4052A1721825k876538j257297j042648l915998o036571m855798k127965L14747
$$ plain form
4044 -10076243 -7374766 -2851293 1151647 2487079 1535954 125439 -483668 538325
4036 538325 3604896 7072912 7765594 4937077 1699086 761769 1034683 514355 36785
4027 36785 1275769 2981132 2507967 -52432 -2258252 -2883839 -2212131 254134 4972508
4018 4972508 9510450 9943965 5755290 650333 -2198435 -3234001 -3985260 -4002987 -2045381
4009 -2045381 1297770 4028397 5102408 5001205 4371283 3371995 2452103 2739598 4900581
4000 4900581 7750416 8740518 6425877 2182742 -1269692 -2912587 -3979672 -5477213
3992 -5477213 -6640201 -6457026 -5203148 -3335344 -265566 4108359 7637628 7662949 4188895
3983 4188895 -369512 -4282220 -7428316 -9212171 -7999771 -3781640 336912 1024972
$$ packed form
4044a0076243K701477M523473M002940J335432r51125j410515o09107J021993
4036E38325L066571L468016O92682k828517l237991r37317K72914n20328m77570
4027C6785J238984J705363m73165k560399k205820o25587O71708K466265M718374
4018D972508M537942M33515m188675n104957k848768j035566p51259j7727J957606
4009b045381L343151K730627J074011j01203o29922r99288r19892K87495K160983
4000D900581K849835R90102k314641m243135l452434j642895j067085j497541
3992e477213j162988J83175J253878J867804L069778M373925L529269K5321l474054
3983D188895m558407l912708l146096j783855J212400M218131M118552O88060
$$ plain form
3975 1024972 -1617455 -4743525 -6631053 -8122129 -9927827 -10424717 -7857298 -3913198
3967 -3913198 -2727010 -5616991 -8748497 -7631192 -2650909 1890378 3390616 3086103
3959 3086103 2783475 2392552 1610673 1401133 2028077 1542375 -1679953 -6012014 -8046795
3950 -8046795 -6316150 -2208510 1880891 3922223 2894936 -108493 -2101964 -1216231
3942 -1216231 1089660 2351259 2747305 4405944 7671942 10444404 11284785 10975574 10528286
3933 10528286 9599869 7672853 5232224 2846141 279700 -2526112 -4438708 -4016559
3925 -4016559 -1059127 3170644 6917716 8920774 8919214 7545698 5656822 3858811 2714977
3916 2714977 2761501 3734917 4323782 3486897 1729812 445853 353331 1107856 1863171 1604460
$$ packed form
3975A024972k642427l126070j887528j491076j805698m96890K567419L944100
3967c913198J186188k889981l131506J117305M980283M541287J500238l04513
3959C086103l02628l90923p81879k09540O26944m85702l222328m332061k034781
3950h046795J730645M107640M089401K041332j027287l003429j993471Q85733
3942a216231K305891J261599L96046J658639L265998K772462Q40381l09211m47288
3933A0528286r28417j927016k440629k386083k566441k805812j912596M22149
3925d016559K957432M229771L747072K003058j560j373516j888876j798011j143834
3916B714977M6524R73416N88865q36885j757085j283959r2522P54525P55315k58711
$$ plain form
3906 1604460 -271644 -2867427 -4103027 -3104572 -1434561 -912469 -1227145 -979891 19637
3897 19637 1064946 2013431 2571739 1331092 -2065601 -4756828 -3626818 -97542 1154274
3888 1154274 -1504323 -4700198 -5001417 -2751261 154903 3296931 6674179 9035902
3880 9035902 9462965 9015255 8941205 8629525 7012664 4662817 2846807 1768789 1320011
3871 1320011 2145085 4129365 5220762 3991797 2342890 3201422 6108302 7660958 6362735
3862 6362735 4587231 5049007 7245894 8457570 7066861 3869187 688305 -1546237
3854 -1546237 -3400005 -5709806 -7791441 -7612016 -4469605 -720424 570634 -531480
3846 -531480 -871281 1683639 5615408 7893188 7522711 5956490 4807360 4460236 4723405
$$ packed form
3906A604460j876104k595783j235600R98455J670011N22092l14676K47254R99528
3897A9637J045309R48485N58308j240647l396693k691227J130010L529276J251816
3888A154274k658597l195875l01219K250156K906164L142028L377248K361723
3880I035902M27063m47710p4050l11680j616861k349847j816010j078018m48778
3871A320011Q25074J984280J091397j228965j648907Q58532K906880J552656j298223
3862F362735j775504M61776K196887J211676j390709l197674l180882k234542
3854a546237j853768k309801k081635J79425L142411L749181J291058j102114
3846e31480l39801K554920L931769K277780l70477j566221j149130l47124K63169
$$ plain form
3837 4723405 5504915 6305266 5913907 3577529 277263 -2069076 -2879743 -3552542 -5347522
3828 -5347522 -7455203 -8108217 -7025350 -5487531 -4244780 -2845185 -1199917 -188643
3820 -188643 9118 755264 2990295 5441994 6037210 4448417 2135258 496905 173523
3811 173523 1551398 4416986 7273818 8478703 8193959 7946996 8178487 7778276 6518506
3802 6518506 6196917 8035683 10185016 9709834 6686928 4382251 4947122 6622055 6200387
3793 6200387 2982583 -1031398 -3849376 -4643820 -2934849 968191 4522594 4531262 1349989
3784 1349989 -697708 1151374 4171958 4177000 1801410 1419331 4435175 7395401 7372042
3775 7372042 5717808 4908965 4665478 3549323 2169664 1955349 2014397 121653 -3473051
$$ packed form
3837D723405P81510Q00351l91359k336378l300266k346339q10667o72799j794980
3828e347522k107681o53014J082867J537819J242751J399595J645268J011274
3820a88643J97761P46146K235031K451699N95216j588793k313159j638353l23382
3811A73523J377875K865588K856832J204885k84744k46963K31491m00211j259770
3802F518506l21589J838766K149333m75182l022906k304677N64871J674933m21668
3793F200387l217804m013981k817978p94444J708971L903040L554403Q668l181273
3784A349989k047697J849082L020584N042k375590l82079L015844K960226k3359
3775G372042j654234q08843k43487j116155j379659k14315N9048j892744l594704
$$ plain form
3766 -3473051 -5717374 -4587166 -1448436 906622 1278503 604719 406799 1199280 2043343
3757 2043343 1569275 -360056 -2393481 -3472026 -4129889 -5167807 -5728621 -4106152 -456350
3748 -456350 2557926 2324470 -1130322 -5354962 -7730837 -7308197 -4995846 -2581700 -1625166
3739 -1625166 -2766119 -5299129 -7148817 -6170093 -2549911 519520 -95380 -3815254 -7139913
3730 -7139913 -7991459 -7361268 -6313644 -3821995 916736 5981172 8633032 8562830 7364770
3721 7364770 5923307 4462883 4191557 6145967 8540650 7977412 3981331 186308 -5942
3712 -5942 2717263 5207101 6015209 6463670 8105204 10449311 11516634 10168936 7508395
3703 7508395 5762911 5847081 6546570 6357862 5387194 4725061 4606545 4302984 3608337 3341230
$$ packed form
3766c473051k244323J130208L138730K355058L71881o73784j97920P92481Q44063
3757B043343m74068j929331k033425j078545o57863j037918n60814J622469L649802
3748d56350L014276k33456l454792m224640k375875M22640K312351K414146R56534
3739a625166j140953k533010j849688R78724L620182L069431o14900l719874l324659
3730g139913q51546O30191J047624K491649M738731N064436K651860p0202j198060
3721G364770j441463j460424k71326J954410K394683n63238l996081l795023j92250
3712e942K723205K489838Q08108M48461J641534K344107J067323j347698k660541
3703G508395j745484Q4170O99489j88708r70668o62133j18516l03561o94647k67107
$$ plain form
3693 3341230 4209489 5827324 6877424 5819216 1839290 -4048240 -8952001 -9986977
3685 -9986977 -6546786 -664774 4604948 7194924 7289667 7024955 8138516 9586000 8639969
3676 8639969 4846560 1270134 697119 2243335 3354891 3609845 4269577 5142130 4554210
3667 4554210 2174579 -441731 -2082095 -2650183 -1929439 222619 2443261 2853683 1722229
3658 1722229 1114230 1761728 2479597 2861666 3964685 5591627 5473887 2519426 -1142914
3649 -1142914 -2842037 -2560416 -2163420 -2756036 -3977476 -4844094 -4435213 -2801049 -1630579
3640 -1630579 -2548512 -4398177 -4242250 -1745076 -111702 -1311263 -2882785 -1690317 1195076
3631 1195076 2125623 56961 -2853698 -5157492 -7512356 -9917277 -10418038 -7852294 -3970374
$$ packed form
3693C341230Q68259J617835J050100j058208l979926n887530m903761j034976
3685i986977L440191N882012N269722K589976R4743k64712J113561J447484r46031
3676H639969l793409l576426n73015J546216J111556K54954O59732Q72553n87920
3667D554210k379631k616310j640364n68088P20744K152058K220642M10422j131454
3658A722229o07999O47498P17869L82069J103019J626942j17740k954461l662340
3649a142914j699123K81621L96996n92616j221440q66618M08881J634164J170470
3640a630579r17933j849665J55927K497174J633374j199561j571522J192468K885393
3631A195076R30547k068662k910659k303794k354864k404921n00761K565744L881920
$$ plain form
3622 -3970374 -1192836 701615 3900418 8694002 11942170 10481897 5380872 1212373
3614 1212373 724601 1782635 796775 -2225215 -4146617 -3412562 -1619583 -377642 509391
3605 509391 963554 -301008 -2902312 -3494346 186810 5615961 8366305 7661570 6519232
3596 6519232 6933616 7523997 6196088 2972539 -623769 -3606009 -5990313 -7787942 -8249609
3587 -8249609 -6441426 -2865640 -168694 -1059569 -5169559 -9145827 -10367978 -9257256
3579 -9257256 -7353125 -5039183 -2631078 -1963839 -4608839 -9242213 -12736755 -13494489 -12258305
3570 -12258305 -10387613 -9023183 -9144966 -10323344 -9797992 -5036141 2636234 8821632
3562 8821632 10698744 9258497 6877713 4693652 2982789 2203195 2316727 2141504 694371
$$ packed form
3622c970374K777538J894451L198803M793584L248168j460273n101025m168499
3614A212373m87772J058034r85860l021990j921402P34055J792979J241941Q87033
3605E09391M54163j264562k601304n92034L681156N429151K750344p04735j142338
3596F519232M14384N90381j327909l223549l596308k982240k384304j797629m61667
3587h249609J808183L575786K696946q90875m109990l976268j222151J110722
3579i257256J904131K313942K408105O67239k645000m633374l494542p57734J236184
3570a2258305J870692J364430j21783j178378N25352M761851P672375O185398
3562H821632J877112j440247k380784k184061j710863p79594J13532j75223j447133
$$ plain form
3553 694371 -1175367 -1408306 962076 4546707 6815446 6560530 4940268 3770709 3162044
3544 3162044 1823362 -417963 -2013136 -2219236 -2547040 -4381862 -6494675 -6558270 -4232918
3535 -4232918 -1159059 1310642 2716778 2571724 702497 -1795634 -3499026 -4201586 -4228767
3526 -4228767 -3069252 -504900 1687752 1483661 -200618 -392255 1708987 3546804 2676345
3517 2676345 -476566 -3793092 -5589945 -4936992 -1548425 3566909 8238554 10650117
3509 10650117 10422563 8447295 6419080 6010531 7294474 8364261 7684264 6178193 5612643
3500 5612643 5819414 5410219 4411616 3845026 3225073 1098178 -2048867 -4020250 -4158349
3491 -4158349 -3855253 -3736425 -3047076 -2112995 -2463533 -3783533 -3601282 -1073689 1507559
$$ packed form
3553F94371j869738k32939K370382L584631K268739k54916j620262j169559o08665
3544C162044j338682k241325j595173k06100l27804j834822k112813o3595K325352
3535d232918L073859K469701J406136j45054j869227k498131j703392p02560k7181
3526d228767J159515K564352K192652k04091j684279j91637K101242J837817q70459
3517B676345l152911l316526j796853O52953L388567N115334M671645K411563
3509A0650117k27554j975268k028215m08549J283943J069787o79997j506071n65550
3500E612643K06771m09195r98603n66590o19953k126895l147045j971383j38099
3491d158349L03096J18828O89349R34081l50538j320000J82251K527593K581248
$$ plain form
3482 1507559 2131034 1585772 1448050 1836363 2196680 2045718 122637 -4547629 -9777215
3473 -9777215 -11340779 -8333898 -4562271 -3261422 -3648618 -4327760 -6289359 -9763128 -11543435
3464 -11543435 -9032079 -4401965 -1235759 668740 3422226 6063949 5740451 2797776
3456 2797776 741428 1511186 3917646 6098797 6629763 4304240 85636 -1822671 1541873
3447 1541873 7237257 9966313 9376044 9543036 11778861 12976684 11647549 10549823 11598344
3438 11598344 12502927 10837324 8012912 6730105 7177587 7995582 8629296 8584212 6448968
3429 6448968 1787311 -3548742 -7483258 -9429634 -8985672 -5419075 -41222 3383194
3421 3383194 2686805 -130959 -2037259 -2423660 -1671937 941496 5164284 7954288 7034411
$$ packed form
3482A507559O23475n45262j37722L88313L60317j50962j923081m670266n229586
3473i777215j563564L006881L771627J300849l87196o79142j961599l473769j780307
3464a1543435K511356M630114L166206J904499K753486K641723l23498k942675
3456B797776k056348P69758K406460K181151N30966k325523m218604j908307L364544
3447A541873N695384K729056n90269J66992K235825J197823j329135j097726J048521
3438A1598344R04583j665603k824412j282807M47482Q17995O33714m5084k135244
3429F448968m661657n336053l934516j946376M43962L566597N377853L424416
3421C383194o96389k817764j906300l86401P51723K613433M222788K790004r19877
$$ plain form
3412 7034411 4571241 3991748 4588261 3009111 -745588 -2806460 -981399 2736373 5620978
3403 5620978 6784556 5571264 949725 -5703151 -10029665 -9281483 -5835503 -4139269
3395 -4139269 -5451248 -7499497 -8245485 -7781437 -6837335 -5437312 -3485805 -1424806 259525
3386 259525 1486204 2125208 1614569 -403251 -3078078 -4411161 -2879004 667750 3069797
3377 3069797 1575523 -3268652 -7905565 -9224535 -7393436 -5005947 -3861784 -3223668
3369 -3223668 -1292347 2209482 5583075 7319782 7965153 9028078 10373595 10034511 7146728
3360 7146728 3884590 3249255 5466915 7848801 8066388 6362633 4459644 3502180 3513252
3351 3513252 3905569 3874870 2820246 858042 -1333248 -3157238 -4027277 -2880615 1000064
$$ packed form
3412G034411k463170n79493N96513j579150l754699k060872J825061L717772K884605
3403E620978J163578j213292m621539o652876m326514P48182L445980J696234
3395d139269j311979k048249p45988M64048R44102J400023J951507K060999J684331
3386B59525J226679O39004n10639k017820k674827j333083J532157L546754K402047
3377C069797j494274m844175m636913j318970J831099K387489J144163O38116
3369c223668J931321L501829L373593J736707O45371J062925J345517l39084k887783
3360G146728l262138o35335K217660K381886K17587j703755j902989r57464J1072
3351C513252L92317l0699j054624j962204k191290j823990q70039J146662L880679
$$ plain form
3342 1000064 6265982 9760407 9418333 6374538 3619331 3193264 5183999 8479210 11440127
3333 11440127 12462603 11089254 8447811 5878966 3575723 1366098 83272 749428
3325 749428 2702397 4013582 3816634 2924118 2122072 1344166 791143 1284167 2868252
3316 2868252 4404928 5191792 5632303 5658385 4178616 1236342 -942544 -702171 577268
3307 577268 613633 -365514 -523114 250960 521003 300551 905110 1732606 432871 -2707201
3297 -2707201 -3634408 286936 6342020 10008202 10589014 10724144 11588752 11542276 9227282
3288 9227282 5362359 1196266 -2636099 -5285931 -5732006 -4411553 -3163648 -2665414 -1348297
3279 -1348297 2056563 6040642 7732305 6289751 3778818 2806801 4034494 5960719
$$ packed form
3342A000064N265918L494425l42074l043795k755207m26067J990735L295211K960917
3333A1440127J022476j373349k641443k568845k303243k209625j282826O66156
3325G49428J952969J311185j96948q92516q02046p77906n53023M93024J584085
3316B868252J536676P86864M40511K6082j479769k942274k178886K40373J279439
3307E77268L6365r79147j57600P74074K70043k20452O04559Q27496j299735l140072
3297b707201r27207L921344O055084L666182N80812J35130Q64608m6476k314994
3288I227282l864923m166093l832365k649832m46075J320453J247905M98234J317117
3279a348297L404860L984079J691663j442554k510933r72017J227693J926225
$$ plain form
3271 5960719 6575524 5192911 3069640 2328823 4036707 7139650 9225890 8428711 4911747
3262 4911747 753424 -1746827 -1860379 -544879 1008216 2335787 3155728 2865398 1378243
3253 1378243 -135301 -242175 1298902 3683405 6084088 7717195 7622121 5666987 3372432
3244 3372432 2359981 2188783 1130132 -1061107 -2718662 -2638192 -1208884 1006542 3904000
3235 3904000 6452391 6711240 4543249 2774647 4079800 7663512 10372527 10212008 7420122
3226 7420122 2978151 -2155468 -6573825 -8776151 -8344176 -6064795 -2989505 62624
3218 62624 2538905 4491073 6483701 8471607 9340537 8312815 6060528 3543733 741255
3209 741255 -2197021 -3643518 -2271442 497357 1981212 1928901 2424530 4035700 4706239
$$ packed form
3271E960719O14805j382613k123271p40817J707884L102943K086240p97179l516964
3262D911747m158323k500251j13552J315500J553095J327571Q19941k90330j487155
3253A378243j513544j06874J541077K384503K400683J633107r5074j955134k294555
3244C372432j012451j71198j058651k191239j657555Q0470J429308K215426K897458
3235C904000K548391K58849k167991j768602J305153L583712K709015j60519k791886
3226G420122m441971n133619m418357k202326M31975K279381L075290L052129
3218F2624K476281J952168J992628J987906Q68930j027722k252287k516795k802478
3209G41255k938276j446497J372076K768799J483855n2311M95629J611170O70539
$$ plain form
3200 4706239 3377983 2190279 3307921 5376553 5322449 2755390 496105 930803 3480218
3191 3480218 5835729 6525329 5923718 5360337 5500352 5616310 4830339 3926504 4757354
3182 4757354 7439693 9549751 9047144 6628567 3952667 1142707 -1963314 -3559938
3174 -3559938 -1832548 1386713 2192148 201870 -614296 2203493 5961839 6854503 4944332
3165 4944332 2656788 583103 -2031262 -4051440 -3305597 -368530 1795207 2289988 3339904
3156 3339904 6002804 7650429 5400052 180471 -4257449 -5106768 -2080872 3300133
3148 3300133 8452905 10872687 10209469 8696348 8357143 8466843 6935116 3460017 -81367
3139 -81367 -1956300 -2038068 -1244237 -627443 -795068 -1282919 -782394 1170593 3173083 3542119
$$ packed form
3200D706239j328256j187704J117642K068632n4104k567059k259285M34698K549415
3191C480218K355511O89600o01611n63381J40015J15958p85971r03835Q30850
3182D757354K682339K110058n02607k418577k675900k809960l106021j596624
3174c559938J727390L219261Q05435j990278q16166K817789L758346Q92664j910171
3165D944332k287544k073685k614365k020178P45843K937067K163737M94781J049916
3156C339904K662900J647625k250377n219581m437920q49319L025896N381005
3148C300133N152772K419782o63218j513121l39205J09700j531727l475099l541384
3139h1367j874933q1768P93831O16794j67625m87851N00525J952987K002490L69036
$$ plain form
3129 3542119 2445124 1445832 1424712 2057791 2852260 3379443 2830883 830352 -1313412
3120 -1313412 -1529927 573675 3189935 4366956 3739426 2255032 1112636 994931 1554554
3111 1554554 1722325 1143624 845919 1624787 2413132 1465239 -1332435 -4516936 -6723946
3102 -6723946 -6964137 -4307502 544637 4095102 3162330 -823447 -3183575 -1872344 619965
3093 619965 1625982 1580967 1876878 2311133 2400651 2939851 4398660 5608386 5652621 5243851
3083 5243851 4779852 3231484 757094 38749 2573799 5698533 6079060 4397884 3537581
3074 3537581 3683657 2793488 973715 544255 1841805 2570968 1838652 1635204 3462110
3065 3462110 6250762 8516038 9983984 10115148 7650570 3120789 -311259 -154391 2721140
$$ packed form
3129C542119j096995r99292k1120O33079P94469N27183n48560k000531k143764
3120a313412k16515K103602K616260J177021o27530j484394j142396j17705N59623
3111A554554J67771n78701k97705P78868P88345r47893k797674l184501k207010
3102f723946k40191K656635M852139L550465r32772l985777k360128J311231K492309
3093F19965J006017m5015K95911M34255Q9518N39200J458809J209726M4235m08770
3083E243851m63999j548368k474390p18345K535050L124734L80527j681176q60303
3074C537581J46076q90169j819773m29460J297550P29163p32316k03448J826906
3065C462110K788652K265276J467946J31164k464578m529781l432048J56868K875531
$$ plain form
3056 2721140 5853398 8106673 9687121 10798081 11598292 12311576 12362119 10673523 7710716
3047 7710716 5649307 5355670 4830456 2175154 -1354545 -3060640 -2406731 -959066 383130
3038 383130 1883316 3010687 2228734 -750439 -4049437 -5666871 -5525525 -5012922 -5204684
3029 -5204684 -6009663 -6609381 -6256612 -4667021 -1888485 1761772 5214782 6578950 4761250
3020 4761250 1387654 -180928 1479169 4177068 4983554 3763681 2596247 2455438 2076852
3011 2076852 31533 -3358221 -6371250 -7384237 -6091458 -3947092 -3170423 -4577809
3003 -4577809 -6741378 -8019093 -8668849 -9646456 -10006424 -7588725 -2513353 1988086 3092702
2994 3092702 1268463 -1210181 -3055444 -3936222 -3075239 -6355 3654146 5214521 4075928
$$ packed form
3056B721140L132258K253275J580448J110960Q00211P13284N0543j688596k962807
3047G710716k061409k93637n25214k655302l529699j706095O53909J447665J342196
3038C83130J500186J127371p81953k979173l298998j617434J41346N12603j91762
3029e204684q04979n99718L52769J589591K778536L650257L453010J364168j817700
3020D761250l373596j568582J660097K697899Q06486j219873j167434j40809l78586
3011B076852k045319l389754l013029j012987J292779K144366P76669j407386
3003d577809k163569j277715o49756r77607l59968K417699N075372M501439J104616
2994C092702j824239k478644j845263q80778Q60983L068884L660501J560375j138593
$$ plain form
2985 4075928 2468076 2562318 4126554 5659478 6539786 6915310 6420306 4591349 2360001
2976 2360001 1650583 3098351 5163930 5917321 4805676 2211841 -1636979 -6245903 -9956203
2967 -9956203 -10796430 -8374900 -4162656 140647 3794180 6575984 8143837 8384630 7871149
2958 7871149 7369966 6984680 6078620 4078815 1372469 -607693 -578756 1007892 2149974
2949 2149974 1826074 1793592 4479775 9139711 11882948 10311264 6552008 4262297 3873574
2940 3873574 2924308 589993 -804079 338717 1796538 420069 -3003402 -4351018
2932 -4351018 -1830583 1367770 1470662 -606208 -731302 2369367 5376249 5524195 4884958
2923 4884958 7262590 12247842 15260779 13510297 9267016 6257595 5001114 3476141
$$ packed form
2985D075928j607852R4242J564236J532924Q80308L75524m95004j828957k231348
2976B360001p09418J447768K065579P53391j111645k593835l848820m608924l710300
2967i956203q40227K421530M212244M303303L653533K781804J567853K40793n13481
2958G871149n01183l85286r06060j999805k706346j980162K8937J586648J142082
2949B149974l23900l2482K686183M659936K743237j571684l759256k289711l88723
2940C873574r49266k334315j394072J142796J457821j376469l423471j347616
2932d351018K520435L198353J02892k076870j25094L100669L006882J47946o39237
2923D884958K377632M985252L012937j750482m243281l009421j256481j524973
$$ plain form
2915 3476141 979296 -980323 -1376131 -1213850 -1748706 -2434125 -1625083 1074320 3818759
2906 3818759 3972523 626831 -4080399 -6390356 -4353369 21191 2630009 1510475
2898 1510475 -1376136 -2818583 -1873873 114414 2146445 4516745 7061201 8327234
2890 8327234 7652505 6757454 7541283 8998803 8420390 5611258 3549700 3975896 4561101
2881 4561101 2280073 -1980070 -4526296 -3839965 -2085617 -1751605 -2981509 -4512714 -5158019
2872 -5158019 -3746722 324179 5330987 7708429 5726043 1527225 -1671628 -3114709
2864 -3114709 -3830733 -3833388 -2220530 447326 2072407 1577919 -40258 -1443555 -2281538
2855 -2281538 -2541163 -2096135 -1483800 -1782474 -2949111 -3453416 -2464227 -1345029 -1884278
$$ packed form
2915C476141k496845j959619l95808J62281n34856o85419Q09042K699403K744439
2906C818759J53764l345692m707230k309957K036987M374560K608818j119534
2898A510475k886611j442447R44710J988287K032031K370300K544456J266033
2890H327234o74729q95051P83829J457520n78413k809132k061558M26196N85205
2881D561101k281028m260143k546226O86331J754348L34012j229904j531205o45305
2872e158019J411297M070901N006808K377442j982386m198818l198853j443081
2864c114709p16024k655J612858K667856J625081m94488j618177j403297q37983
2855b281538k59625M45028O12335k98674j166637n04305R89189J119198n39249
$$ plain form
2846 -1884278 -3898602 -5805364 -6812392 -7039639 -6011269 -2990505 985220 3292934
2838 3292934 2762708 1042969 -7127 -731349 -1996390 -2511026 -190848 4164601 6917313
2829 6917313 5796746 2284076 -750850 -2102053 -2169686 -1497027 -510252 429705 1622711
2820 1622711 3542242 5116289 4190083 803760 -1849115 -1365061 739377 1849747 2368740
2811 2368740 4222968 6681212 7172297 5780610 5276546 6353097 6416819 4228992 2461505
2802 2461505 3706918 6416053 7035691 4617930 1297093 -850228 -1792559 -2877137 -5072062
2793 -5072062 -7464154 -7569991 -4344000 -528583 177723 -1634376 -1492876 2490956 6599587
2784 6599587 6597360 3113353 -159482 -1244168 -514925 1249890 2790424 2180586 -497851
$$ packed form
2846a884278k014324j906762j007028k27247J028370L020764L975725K307714
2838C292934n30226j719739j050096p24222j265041n14636K320178M355449K752712
2829F917313j120567l512670l034926j351203o7633O72659R86775R39957J193006
2820A622711J919531J574047r26206l386323k652875M84054K104438J110370N18993
2811B368740J854228K458244M91085j391687n04064J076551O3722k187827j767487
2802B461505J245413K709135O19638k417761l320837k147321r42331j084578k194925
2793e072062k392092j05837L225991L815417P06306j812099J41500L983832M108631
2784F599587k227l484007l272835j084686P29243J764815J540534o09838k678437
$$ plain form
2775 -497851 -1866687 515034 4059865 4359101 1312495 -1214080 -1048824 381922 1466833
2766 1466833 2285899 2803340 2263257 1033978 546294 845838 431176 -1113909 -2503732
2757 -2503732 -3019595 -3236442 -3349601 -3036803 -3046552 -4427958 -6029326 -5480261 -3007736
2748 -3007736 -1394450 -1618173 -1738885 -1113343 -2215256 -6288705 -10244383 -10551731 -8012149
2739 -8012149 -5893203 -4965497 -3330090 -320492 2208163 2512298 951618 -835697 -1523107
2730 -1523107 -884383 178361 651067 913755 2426077 5337829 7614094 7531395 5856831
2721 5856831 4305022 3036703 1376084 108240 966905 3944211 6893628 8082970
2713 8082970 7737574 6729449 5181883 3218632 2000068 2598968 4023299 3734084 772900
$$ packed form
2775d97851j368836K381721L544831K99236l046606k526575J65256J430746J084911
2766A466833Q19066N17441n40083j229279m87684K99544m14662j545085j389823
2757b503732n15863k16847j13159L12798r749j381406j601368N49065K472525
2748c007736J613286k23723j20712O25542j101913m073449l955678l07348K539582
2739h012149K118946R27706J635407L009598K528655L04135j560680j787315o87410
2730a523107O38724J062744M72706K62688J512322K911752K276265q2699j674564
2721E856831j551809j268319j660619j267844Q58665K977306K949417J189342
2713H082970l45396j008125j547566j963251j218564N98900J424331k89215k961184
$$ plain form
2704 772900 -2626897 -3741286 -3028932 -3300583 -5270315 -6386656 -5168741 -4127091 -5989601
2695 -5989601 -8986106 -9127975 -6082861 -3121117 -1523336 942372 5205670 8454510
2687 8454510 8335442 6487885 5723252 6212039 6746789 7537376 9109348 10039692 8434475
2678 8434475 4692965 656936 -2996462 -6437792 -8765220 -8722281 -6883296 -5164375 -4452322
2669 -4452322 -4297573 -4439012 -4943838 -5221103 -4549299 -3395489 -2790409 -2581648 -1627127
2660 -1627127 352120 2192725 2525113 900594 -2006832 -4760254 -6203120 -6550691 -6758888
2651 -6758888 -6679591 -5110618 -1957726 1343145 4078177 6870945 9217199 8938835 5727886
2642 5727886 2772900 2561689 3189058 1561763 -1500577 -2532272 -685091 1461258 1865814
$$ packed form
2704G72900l399797j114389P12354k71651j969732j116341J217915J041650j862510
2695e989601k996505j41869L045114K961744J597781K465708M263298L248840
2687H454510j19068j847557p64633M88787N34750P90587J571972R30344j605217
2678H434475l741510m036029l653398l441330k327428M2939J838985J718921P12053
2669d452322J54749j41439n04826k77265O71804J153810O05080K08761R54521
2660a627127J979247J840605L32388j624519k907426k753422j442866l47571k08197
2651f758888P9297J568973L152892L300871K735032K792768K346254k78364l210949
2642E727886k954986k11211O27369j627295l062340j031695J847181K146349M04556
$$ plain form
2633 1865814 912165 -509366 -2185272 -3682437 -4337787 -4275556 -3984270 -3363923 -2601617
2624 -2601617 -2914066 -4618500 -5800560 -5112644 -4415392 -5895173 -7952940 -7225493 -3659807
2615 -3659807 -105835 2262496 4314145 5469470 4279406 2544290 4232889 9363749
2607 9363749 13237399 13090734 11418099 10973991 10558035 8259775 5442887 4579471 5641249
2598 5641249 7241055 9148302 11214943 11799276 9713512 6236845 3290584 1229955
2590 1229955 11494 443338 2380899 3754496 3379726 2658564 2560399 1470607 -1397610
2581 -1397610 -3079382 -811470 3046470 3904348 1547904 -61607 1043269 2865136
2573 2865136 3687331 4301945 5020734 3984870 264269 -3908331 -5989639 -6417159 -7058923
$$ packed form
2633A865814r53649j421531j675906j497165o55350O2231K91286O20347P62306
2624b601617l12449j704434j182060O87916O97252j479781k057767P27447L565686
2615c659807L553972K368331K051649J155325j190064j735116J688599N130860
2607I363749L873650j46665j672635m44108m15956k298260k816888q63416J061778
2598E641249J599806J907247K066641N84333k085764l476667k946261k060629
2590A229955j218461M31844J937561J373597l74770p21162r8165j089792k868217
2581a397610j681772K267912L857940Q57878k356444j609511J104876J821867
2573B865136Q22195O14614P18789j035864l720601m172600k081308m27520o41764
$$ plain form
2564 -7058923 -7624786 -5877768 -1290182 3320906 4608868 2430092 -63601 -16481 2194754
2555 2194754 4102420 4595972 5065559 7004035 9578567 10233159 7283895 1755403 -2944237
2546 -2944237 -3582392 -384519 2599054 1829680 -1394297 -2888901 -1550935 -555852 -2088750
2537 -2088750 -4114179 -4052322 -2759566 -2362105 -2374572 -910841 1641656 2997988 2244962
2528 2244962 374205 -1689967 -3339643 -3262852 -469029 3993496 8118801 11120090 12910461
2519 12910461 12588125 9674567 5946373 3628911 2447621 837858 -681007 -96273
2511 -96273 2469731 4466222 4348206 2983693 1627135 671933 279674 40642 -1721565
2502 -1721565 -5947298 -10477013 -12245611 -11453410 -10644263 -9984060 -7073178 -1889976 1833298
$$ packed form
2564g058923n65863J747018M587586M611088J287962k178776k493693M7120K211235
2555B194754J907666M93552M69587J938476K574532O54592k949264n528492m699640
2546b944237o38155L197873K983573p69374l223977j494604J337966R95083j532898
2537b088750k025429O1857J292756L97461j2467J463731K552497J356332p53026
2528B244962j870757k064172j649676P6791K793823M462525M125305L001289J790371
2519A2910461l22336k913558l728194k317462j181290j609763j518865N84734
2511i6273K566004J996491j18016j364513j356558r55202l92259k39032j762207
2502a721565m225733m529715j768598P92201Q09147O60203K910882N183202L723274
$$ plain form
2493 1833298 1563803 -725105 -1681770 -421891 2039728 4555122 5571281 3591497 -488412
2484 -488412 -3664764 -4685021 -5195629 -5915095 -4828911 -1182653 1878263 1520547 -436412
2475 -436412 -575090 708552 304679 -2402058 -4908399 -5606646 -5287955 -4764292 -3738726
2466 -3738726 -2252502 -1053478 -299821 382748 628833 -266543 -1902066 -3221511 -3974012
2457 -3974012 -4303125 -3749311 -2444483 -2231333 -4228379 -6165725 -5033136 -1974573 -1322792
2448 -1322792 -4473409 -7948414 -8522423 -7273488 -6930088 -7707548 -7904582 -6964482 -5835802
2439 -5835802 -5221817 -5113069 -5373982 -5555567 -4857083 -3328405 -2268690 -2402186 -2624231
2430 -2624231 -1750339 -554178 -629220 -1955152 -3139081 -3571479 -3708338 -3432525 -1870526
$$ packed form
2493A833298k69495k288908r56665J259879K461619K515394J016159j979784m079909
2484d88412l176352j020257n10608p19466J086184L646258L060916l57716j956959
2475d36412j38678J283642m03873k706737k506341o98247L18691N23663J025566
2466c738726J486224J199024P53657O82569K46085q95376j635523j319445p52501
2457c974012l29113N53814J304828K13150j997046j937346J132589L058563O51781
2448a322792l150617l475005n74009J248935L43400p77460j97034R40100J128680
2439e835802O13985J08748k60913j81585O98484J528678J059715j33496k22045
2430b624231Q73892J196161p5042j325932j183929m32398j36859K75813J561999
$$ plain form
2421 -1870526 838427 2998317 3204524 1868836 485357 137216 1020439 2545110 3381438
2412 3381438 2210479 -787113 -3637549 -4482940 -3498228 -2266000 -1596680 -947178 1177
2403 1177 419467 -260333 -893085 129170 2377036 3527689 2375253 350546 -835006
2394 -835006 -1755420 -3876604 -6481002 -7304331 -6324810 -6429037 -9206963 -12272472 -12633225
2385 -12633225 -10978898 -10063748 -9954195 -8132719 -4299138 -1618670 -2006643 -3276332 -3088057
2376 -3088057 -3055650 -5777328 -9536179 -9912752 -6448632 -3882067 -5764914 -10078941 -12860341
2367 -12860341 -13383742 -13332214 -12917326 -10892887 -7530567 -4667897 -2850502 -863837 1656197
2358 1656197 3442165 4061629 5052055 7424259 9647814 9581586 7391500 5100776 3806948
$$ packed form
2421a870526K708953K159890K06207j335688j383479l48141Q83223J524671Q36328
2412C381438j170959k997592k850436q45391R84712J232228O69320O49502R48355
2403A177M18290o79800o32752J022255K247866J150653j152436k024707j185552
2394h35006r20414k121184k604398q23329R79521j04227k777926l065509l60753
2385a2633225J654327R15150J09553J821476L833581K680468l87973j269689J88275
2376c088057L2407k721678l758851l76573L464120K566565j882847m314027k781400
2367a2860341n23401N1528M14888K024439L362320K862670J817395J986665K520034
2358A656197J785968O19464R90426K372204K223555o6228k190086k290724j293828
$$ plain form
2349 3806948 2732117 969682 -913712 -1358687 521717 3869152 6543670 6887065 5272972
2340 5272972 3728863 3931412 5879019 8456057 10535839 11277921 10285810 8250988 6807410
2331 6807410 6804456 7081057 5923538 3533333 1911315 2147873 3028694 3004180 2550382 3306588
2321 3306588 5173045 5761655 3385117 -423963 -2568451 -2255589 -1935264 -4044369 -7902634
2312 -7902634 -10685929 -10828676 -9379097 -8112888 -7357121 -6112786 -3757805 -1031232 674069
2303 674069 691284 -485941 -2098162 -3973856 -6113925 -7999411 -9278491 -10772715 -13286285
2294 -13286285 -15339421 -14079749 -9347557 -4858829 -3760505 -4752601 -4670206 -3237100 -2426470
2285 -2426470 -2295402 -1001059 1252291 1910617 282757 -1335091 -1655169 -2033045 -2738504
$$ packed form
2349C806948j074831j762435j883394m44975J880404L347435K674518L43395j614093
2340E272972j544109K02549J947607K577038K079782P42082r92111k034822j443578
2331F807410k954K76601j157519k390205j622018K36558Q80821k4514m53798P56206
2321C306588J866457N88610k376538l809080k144488L12862L20325k109105l858265
2312g902634k783295j42747J449579J266209P55767J244335K354981K726573J705301
2303F74069J7215j177225j612221j875694k140069j885486j279080j494224k513570
2294a3286285k053136J259672M732192M488728J098324r92096Q2395J433106Q10630
2285b426470J31068J294343K253350O58326j627860j617848l20078l77876p05459
$$ plain form
2276 -2738504 -1387557 2472710 4730484 2111456 -2492267 -4068608 -2859386 -3179097
2268 -3179097 -5908776 -7072371 -4311565 -387226 1185593 526936 -250544 -209652 670615
2259 670615 2499227 4331504 4012204 1005127 -2271594 -3536493 -3306923 -2818656 -1387170
2250 -1387170 1705738 4383394 3895181 963443 -1181203 -1558242 -2131870 -3588990 -3789844
2241 -3789844 -1626370 627942 901923 804429 2739470 5251785 4717844 1190704 -1084931
$$ packed form
2276b738504J350947L860267K257774k619028m603723j576341J209222l19711
2268c179097k729679j163595K760806L924339J572819o58657p77480M0892Q80267
2259F70615J828612J832277l19300l007077l276721j264899K29570M88267J431486
2250a387170L092908K677656m88213k931738k144646l77039n73628j457120k00854
2241c789844K163474K254312K73981r7494J935041K512315n33941l527140k275635
$$ [...]
##END NTUPLES=NMR SPECTRUM
##END=
