##TITLE=31Pdec_DE-92K_TFA
 CDCl3, 64 sc
 29.4.2025
##JCAMPDX= 6.0         $$ Bruker NMR JCAMP-DX V2.0
##DATA TYPE= NMR SPECTRUM
##DATA CLASS= NTUPLES
##ORIGIN= UXNMR, Bruker Analytische Messtechnik GmbH
##OWNER= root
$$ XWIN-NMR		Version 3.5
$$ Tue Apr 29 16:28:44 2025 Russian Standard Time (UT+4h)  she@DPX200
##.OBSERVE FREQUENCY= 81.013821
##.OBSERVE NUCLEUS= ^31P
##.ACQUISITION MODE= SIMULTANEOUS
##.ACQUISITION SCHEME= undefined
##.AVERAGES= 64
##.DIGITISER RES= 17
##SPECTROMETER/DATA SYSTEM= spect
##.PULSE SEQUENCE= zgpg30
##.SOLVENT NAME= DMSO
##.SHIFT REFERENCE= (INTERNAL, DMSO, 0, 198.062)
##AUDIT TRAIL= $$ (NUMBER, WHEN, WHO, WHERE, WHAT)
$$ ##TITLE= Audit trail, XWIN-NMR		Version 3.5
$$ ##JCAMPDX= 5.01
$$ ##ORIGIN= Bruker BioSpin GmbH
$$ ##OWNER= she
$$ F:/spectra/data/she/nmr/P31/2/pdata/1/auditp.txt
$$ ##AUDIT TRAIL=  $$ (NUMBER, WHEN, WHO, WHERE, WHAT)
(   1,<2025-04-29 16:27:37.04 +0400>,<she>,<DPX200>,
      <created by zg, POWCHK disabled, PULCHK disabled
       configuration hash MD5:
       00 E9 B6 7A A2 85 ED C7 34 08 36 98 17 FE 4E 26
       data hash MD5: 32K
       BE 9B AB A1 C7 4E 8C B5 A0 41 BC 10 6B 2E 52 DB>)
(   2,<2025-04-29 16:27:39.62 +0400>,<she>,<DPX200>,
      <Start of raw data processing
       efp BC_mod = 2 LB = 1.5 FT_mod = 6 PKNL = 1 PHC0 = 1778.789 PHC1 = -935.9069 SI = 64K 
       data hash MD5: 64K
       B9 A9 98 04 6E 2D 2D E3 B7 64 2A F5 3B 97 D2 04>)
(   3,<2025-04-29 16:27:56.53 +0400>,<she>,<DPX200>,
      <pk PHC0 = -7.154769 PHC1 = 0 
       data hash MD5: 64K
       9B 4D E9 B1 AF E5 25 EA 25 7D 57 81 27 D2 C4 F5>)
(   4,<2025-04-29 16:28:02.81 +0400>,<she>,<DPX200>,
      <abs ABSG = 5 
       data hash MD5: 64K
       F3 19 3F A8 89 95 B9 62 B9 DF 1C CB E9 23 CD C4>)
$$ ##END=
$$ 
$$ hash MD5
$$ B6 12 15 1F 6B 8C D4 6E 61 2C EF C8 CF 59 1A 9E
##$RELAX= 
##$RELAX= 
##$RELAX= 
##$RELAX= 
##$RELAX= 
##$RELAX= 
##$RELAX= 
##$RELAX= 
$$ Bruker specific parameters
$$ --------------------------
##$DU= <F:/spectra>
##$EXPNO= 2
##$NAME= <P31>
##$PROCNO= 1
##$TYPE= <nmr>
##$USER= <she>
##$AMP= (0..31)
100 100 100 100 100 100 100 100 100 100 100 100 100 100 100 100 100 100 
100 100 100 100 100 100 100 100 100 100 100 100 100 100 
##$AQSEQ= 0
##$AQ_mod= 1
##$AUNM= <au_zg>
##$AUTOPOS= <>
##$BF1= 81.014009
##$BF2= 200.13
##$BF3= 200.13
##$BF4= 200.13
##$BF5= 200.13
##$BF6= 200.13
##$BF7= 200.13
##$BF8= 200.13
##$BYTORDA= 1
##$CFDGTYP= 0
##$CFRGTYP= 5
##$CHEMSTR= <none>
##$CNST= (0..31)
1 1 145 1 1 1 1 1 1 1 1 1 1 1 1 1 1 1 1 1 1 1 1 1 1 1 1 1 1 1 1 1 
##$CPDPRG= <waltz16>
##$CPDPRG1= <>
##$CPDPRG2= <waltz16>
##$CPDPRG3= <>
##$CPDPRG4= <mlev>
##$CPDPRG5= <mlev>
##$CPDPRG6= <mlev>
##$CPDPRG7= <mlev>
##$CPDPRG8= <mlev>
##$CPDPRGB= <>
##$CPDPRGT= <>
##$D= (0..31)
0 1 0 0 0 0 0 0 0 0.06 0 0.03 2e-05 3e-06 0 0 0.0002 0 0 0 0 0 0 0 0 0 
0 0 0 0 0 0 
##$DATE= 1745929656
##$DBL= (0..7)
120 120 120 11 120 120 24 19 
##$DBP= (0..7)
150 150 150 150 150 150 150 150 
##$DBP07= 0
##$DBPNAM0= <>
##$DBPNAM1= <>
$$ [...]
##$SUBNAM3= <"">
##$SUBNAM4= <"">
##$SUBNAM5= <"">
##$SUBNAM6= <"">
##$SUBNAM7= <"">
##$SUBNAM8= <"">
##$SUBNAM9= <"">
##$SW= 400.765351723535
##$SWIBOX= (0..15)
0 1 3 0 0 0 0 0 0 0 0 0 0 0 0 0 
##$SW_h= 32467.5324675325
##$TD= 32768
##$TD0= 1
##$TE= 0
##$TE2= 300
##$TE3= 300
##$TEG= 300
##$TL= (0..7)
0 120 53 12 22 120 120 120 
##$TP= (0..7)
150 150 150 150 150 150 150 150 
##$TP07= 0
##$TPNAME0= <>
##$TPNAME1= <>
##$TPNAME2= <>
##$TPNAME3= <>
##$TPNAME4= <>
##$TPNAME5= <>
##$TPNAME6= <>
##$TPNAME7= <>
##$TPOAL= (0..7)
0.5 0.5 0.5 0.5 0.5 0.5 0.5 0.5 
##$TPOFFS= (0..7)
0 0 0 0 0 0 0 0 
##$TUNHIN= 0
##$TUNHOUT= 0
##$TUNXOUT= 0
##$USERA1= <user>
##$USERA2= <user>
##$USERA3= <user>
##$USERA4= <user>
##$USERA5= <user>
##$V9= 5
##$VALIST= <valist>
##$VCLIST= <CCCCCCCCCCCCCCC>
##$VD= 0
##$VDLIST= <DDDDDDDDDDDDDDD>
##$VPLIST= <PPPPPPPPPPPPPPP>
##$VTLIST= <TTTTTTTTTTTTTTT>
##$WBST= 1024
##$WBSW= 4
##$XGAIN= (0..3)
0 0 0 0 
##$XL= 0
##$YL= 0
##$YMAX_a= 8961
##$YMIN_a= -27562
##$ZGOPTNS= <>
##$ZL1= 120
##$ZL2= 120
##$ZL3= 120
##$ZL4= 120
##$ABSF1= 198.0616
##$ABSF2= -202.7028
##$ABSG= 5
##$ABSL= 3
##$ALPHA= 0
##$AQORDER= 0
##$ASSFAC= 0
##$ASSFACI= 0
##$ASSFACX= 0
##$ASSWID= 0
##$AUNMP= <proc_1d>
##$AZFE= 0.1
##$AZFW= 0.5
##$BCFW= 0
##$BC_mod= 2
##$BYTORDP= 0
##$COROFFS= 0
##$CY= -3
##$DATMOD= 1
##$DC= 0
##$DFILT= <>
##$DTYPP= 0
##$F1P= 0
##$F2P= 0
##$FCOR= 1
##$FTSIZE= 65536
##$FT_mod= 6
##$GAMMA= 0
##$GB= 0
##$INTBC= 1
##$INTSCL= 9.790993e-09
##$ISEN= 30
##$LB= 1.5
##$LEV0= 0
##$LPBIN= 0
##$MAXI= 10000
##$MC2= 0
##$MEAN= 0
##$ME_mod= 0
##$MI= 50
##$NCOEF= 0
##$NC_proc= -8
##$NLEV= 6
##$NOISF1= 182.463
##$NOISF2= 159.3651
##$NSP= 0
##$NTH_PI= 0
##$NZP= 0
##$OFFSET= 198.0616
##$PC= 4
##$PHC0= 1771.634
##$PHC1= -935.9069
##$PH_mod= 1
##$PKNL= yes
##$PPARMOD= 0
##$PSCAL= 0
##$PSIGN= 0
##$REVERSE= no
##$SF= 81.0140089999434
##$SI= 65536
##$SIGF1= 159.3651
##$SIGF2= -187.1042
##$SINO= 113.3802
##$SIOLD= 16384
##$SREGLST= <1H.CDCl3>
##$SSB= 0
##$STSI= 65536
##$STSR= 0
##$SW_p= 32467.5324675325
##$SYMM= 0
##$S_DEV= 0
##$TDeff= 32768
##$TDoff= 0
##$TI= <>
##$TILT= no
##$TM1= 0
##$TM2= 0
##$TOPLEV= 0
##$USERP1= <user>
##$USERP2= <user>
##$USERP3= <user>
##$USERP4= <user>
##$USERP5= <user>
##$WDW= 1
##$XDIM= 65536
##$YMAX_p= 144188714
##$YMIN_p= -291971757
$$ End of Bruker specific parameters
$$ ---------------------------------
##NTUPLES= NMR SPECTRUM
##VAR_NAME=  FREQUENCY,     SPECTRUM/REAL,   SPECTRUM/IMAG
##SYMBOL=    X,             R,               I
##VAR_TYPE=  INDEPENDENT,   DEPENDENT,       DEPENDENT
##VAR_FORM=  AFFN,          ASDF,            ASDF
##VAR_DIM=   65536,         65536,           65536
##UNITS=     HZ,            ARBITRARY UNITS, ARBITRARY UNITS
##FACTOR=    0.49542278885378, 1,            1
##FIRST=     16045.7642231865, 0,            0
##LAST=      -16421.768244346, 0,            0
##MIN=       -16421.768244346, -291971757,   0
##MAX=       16045.7642231865, 144188714,    0
$$ Real data points
##PAGE= N=1
##DATA TABLE= (X++(R..R)), XYDATA
$$ [...]
##PAGE= N=2
##DATA TABLE= (X++(I..I)), XYDATA
7520G755223K190965j197743n211610n534294k323216P81971J647842J220691
7512f70171Q55271M88042l08169j118962j171572l30788P09956J072592O56245
7503A82444L86723R61065J542989Q15396o79546q72463O19253J395466l80029
7494C971298l030905l455811j221901J177481J675917O60924j64754L57440K039752
7485B009441L426486K928301P04595j152012j221946o42095j097959k049051j906673
7476I99087j041579j006337j198934N17433L454747L804326K21655l388005l001302
7467f38909J58338K230763K526890L142443M142512L305002N68433j258717j058001
7458A3118754j130017l002428m693611m020018j917062l35160Q13896K264108
$$ y = [7755223, 9946188, 8748445, 3536835, -1997459, -4320675, -3538704, -1890862, -670171, 185100, 673142, 364973, -753989, -1925561, -2256349, -1546393, -473801, 182444, 569167, 1530232, 3073221, 3888617, 3209071, 2336608, 2955861, 4351327, 3971298, 940393, -2515418, -3737319, -2559838, -883921, -222997, -387751, -30311, 2009441, 5435927, 8364228, 9068823, 7916811, 6694865, 6052770, 4954811, 2905760, 999087, -42492, -1048829, -2247763, -1730330, 1724417, 5528743, 5750398, 2362393, -638909, -480571, 1750192, 4277082, 7419525, 11562037, 14867039, 15435472, 14176755, 13118754, 11988737, 8986309, 4292698, 272680, -1644382, -1979542, -1165646, 1098462]
7450A098462L021129J994226L89992j19587k19441j315578k421934j613874L77022
7441A190417R97789l44984k086410l257548l533643j624369K762093O120765M510887
7432D734997m12081l043069j700023j81506q37078j362398k08795J42357j861871
7423d729467l393682k125255j96079L62941J733577N347928P073946L037637l003952
7414D107594m397389j465509m9662j510593j256218K528524N448717L935163K72870
7405G613497j572522r20204O62432J686774O46154k842263n748298m243117M84051
7396d233496L163579K166584J488313L407112M474721J763836j760715k048856
7388H421078k31362J54139r54935j390416j363626k435859l711166l199190j566884
$$ y = [1098462, 4119591, 6113817, 6503809, 6384222, 6164781, 4849203, 2427269, 813395, 1190417, 2188206, 1843222, -243188, -3500736, -7034379, -8658748, -5896655, 224110, 4734997, 4322916, 1279847, -420176, -601682, -1438760, -2801158, -3009953, -2867596, -4729467, -8123149, -10248404, -10444483, -10081542, -8347965, -3000037, 4073909, 7111546, 4107594, -289795, -1755304, -1804966, -3315559, -4571777, -2043253, 3405464, 7340627, 7613497, 6040975, 5120771, 5783203, 7469977, 8116131, 5273868, -474430, -4717547, -4233496, -1069917, 1096667, 2584980, 5992092, 10466813, 12230649, 10469934, 8421078, 8189716, 8343855, 7388920, 5998504, 4634878, 2199019, -1512147, -4711337, -6278221]
7379f278221p28912q6052K001001M270895M130461K232024J402453J646277M60037
7370I049963k070020k882753j161222K42698l19600q50613L11043J544550R99311
7361D863357l37512q97242j413655l032653m398767l324213k82509K205750L019423
7352c598021L036157K715203J446484m56254j269502k54356J052460J077371N07177
7343D256719Q98645J851810J479539m20853j708361j061523P3812p8768r37917
7334D353103j080675r72709j806729k653610j653131M07471Q86466k47357j91293
7325b958464J729512K560590P46970r63095q8893J360478M20734j697408j682383
7316e71959N28587K217665K396704K153557J514994j80772j423713r1982K264402
$$ y = [-6278221, -7007133, -7093185, -5092184, -821289, 3309172, 5541196, 6943649, 8589926, 9049963, 6979943, 4097190, 2935968, 3178666, 2859066, 2008453, 2319496, 3864046, 4863357, 4525845, 3628603, 2214948, -817705, -5216472, -8540685, -8823194, -6617444, -3598021, -561864, 2153339, 3599823, 3143569, 1874067, 1619711, 2672171, 3749542, 4256719, 5155364, 7007174, 8486713, 8065860, 6357499, 5295976, 5369788, 5291020, 4353103, 3272428, 2299719, 492990, -2160620, -3813751, -3406280, -2519814, -2767171, -2958464, -1228952, 1331638, 2078608, 1115513, 1026620, 2387098, 2807832, 1110424, -571959, -43372, 2174293, 4570997, 6724554, 8239548, 8058776, 6635063, 6543081, 8807483]
7307H807483J850686j230683k493361O7332K663559J370771k257389l873839k187102
7298B717457N79750K330461K569496J372750o76050k048978j698103n94698l83813
7289D168272r82279j000474j70208K71061k94956p83539k0407J450839J962043
7280D600352Q38128q31412j766796k165568k952830l730485k946515m83629J567272
7271g871483J767626J371437J916033K338015Q58069j349988j319848J144216
7263a145923K991394K281020K58109j385379k423892k444615m01296K591343K937690
7254C258451o45124m338655l899197l49107J882143J176492j39592k64967n4740
7245c374296k08202M92647K583424L852564K040741j547175l283415j800183N93370
$$ y = [8807483, 10658169, 9427486, 6934125, 7001457, 9665016, 11035787, 8778398, 4904559, 2717457, 3297207, 5627668, 8197164, 9569914, 8893864, 6844886, 5146783, 4552085, 4168272, 3185993, 2185519, 2015311, 2286372, 1991416, 1207877, 1187470, 2638309, 4600352, 5438480, 4607068, 2840272, 674704, -2278126, -6008611, -8955126, -9438755, -7871483, -6103857, -4732420, -2816387, -478372, 379697, -970291, -2290139, -1145923, 1845471, 4126491, 4384600, 2999221, 575329, -1869286, -2270582, 320761, 3258451, 2613327, -1725328, -5624525, -5973632, -4091489, -2914997, -3054589, -3319556, -3374296, -3582498, -3089851, -506427, 3346137, 5386878, 3839703, 556288, -1243895, -650525]
7236f50525J434715J237728J864753L070524K748676M48329j540379j416589l53456
7227F843776l80406j260356j315402l63602K46569J6070l61384q04655j907034
7218G13576l140740l033425j436661K34468J303733K430954L485421K890807J2075
7209C460208l366151m781085l201057P28289M976095O686219M545402R15773m85076
7200I478617P36824J644651P15471n34913j218681k624641m619750m331245q31610
7191a585277K330602K228403R91796J734741L093152K025970m06499q99667P5552
7182I588773p84491l423876m341944k711262j488557j698841o57472K478149M081892
7173A042371J570705k211689l062608j018081R51518J460304J068595O3314j214659
$$ y = [-650525, 784190, 2021918, 3886671, 6957195, 9705871, 10154200, 8613821, 7197232, 6843776, 6463370, 5203014, 3887612, 3524010, 3770579, 3786649, 3425265, 2620610, 713576, -2427164, -5460589, -6897250, -6662782, -5359049, -2928095, 557326, 3448133, 3460208, 94057, -4687028, -7888085, -7159796, -2183701, 4502518, 9047920, 9963693, 9478617, 10215441, 11860092, 12575563, 12040650, 10821969, 8197328, 3577578, -753667, -1585277, 745325, 2973728, 3965524, 5700265, 8793417, 10819387, 10412888, 9513221, 9588773, 8804282, 5380406, 1038462, -1672800, -3161357, -4860198, -5517670, -3039521, 1042371, 2613076, 401387, -2661221, -3679302, -2727784, -1267480, -198885, -135571, -1350230]
7164a350230j175803J164666L984406M566438K696688K98972j349574k115625
7156F719938j784944n42167J13382q49587j905115q81379J560525K733409J929071
7147G093133J104165J448729J766678Q59207o60872j696426j948744j263648L86121
7138G088343J673641Q44653j304896j785142N1723J018535r54203l136985k174447
7129A321222M27019Q23157p49620o84236J349705J547754j288454l124762j138314
7120a516529J571301J087396j053687q73514J328966J987440N80416O6980J330007
7111D508776J850153N05844n66376r3443K28144o00841o71851J179852K572517
7102H912775J041673k052737l692018l314916k185961m66908K128160M007057
$$ y = [-1350230, -2526033, -1361367, 2623039, 7189477, 9886165, 10185137, 8835563, 6719938, 4934994, 4392827, 4506209, 3656622, 1751507, 870128, 2430653, 5164062, 7093133, 8197298, 9646027, 11412705, 12271912, 11611040, 9914614, 7965870, 6702222, 7088343, 8761984, 9606637, 8301741, 6516599, 6568322, 7586857, 6632654, 3495669, 1321222, 1748241, 2571398, 1821778, 1137542, 2487247, 4035001, 2746547, -378215, -1516529, 54772, 1142168, 88481, -785033, 543933, 2531373, 3111789, 3178769, 4508776, 6358929, 6864773, 6298397, 6204954, 6433098, 5832257, 5160406, 6340258, 8912775, 9954448, 7901711, 4209693, 894777, -1291184, -1758092, 370068, 4377125]
7094D377125L138896L70282j353739r09710J77332O48846Q49196R34083Q0265
7085H312576j660284k462882q89306J926702L267153J849164o40454j304662N40508
7076H938515K224346R46444k271137l664840j942803l1959n51786k101494k103036
7067e57750j040508r35797j259622P0237K312237K285237n03422k507267j060913
7058c197568K092973L699914L219235K346158J870357J070401l28849j359381
7050I413240j290397r52239j823093l764346m412671j862311K227806L845316
7042A381305J529281j724886k603551j531044p28857k84581Q92303J619610k88747
7033a739167l540491l952602l80794L197353L027280M09105o80473J042324L175292
$$ y = [4377125, 7516021, 7886303, 6532564, 5622854, 5800186, 6449032, 7298228, 8232311, 8312576, 6652292, 4189410, 3300104, 5226806, 8493959, 10343123, 9702669, 8398007, 8938515, 11162861, 12109305, 9838168, 6173328, 4230525, 4198566, 3646780, 1545286, -557750, -1598258, -2534055, -3793677, -3723440, -1411203, 874034, 370612, -2136655, -3197568, -1104595, 2595319, 5814554, 8160712, 10031069, 11101470, 10772621, 9413240, 8122843, 7170604, 5347511, 1583165, -2829506, -4691817, -2464011, 1381305, 2910586, 1185700, -1417851, -2948895, -3677752, -3962333, -3070030, -1450420, -1739167, -5279658, -9232260, -9613054, -6415701, -3388421, -2979316, -3659789, -2617465, 557827]
7024E57827L129869J071191n25866K98095K560755L156079O83575k487804l257000
7015E186721j759893l63958J72345Q60581J575900J185696L48937P98376J713604
7006I718309M69171k480092l462235j511332k70885j981764l616815j938491J074273
6997c999861J471101n92402j842652j184772k67086J84735J104270K562487L384431
6988H20251L130311K312340J150404M7293L60008K443775L834228J924402k047438
6979A3975574m104309k396131J113929L512381L494515J387264j405754l069698
6971A2507771k991983k369696k118689j383776L07184J089644n80375k724901
6963A735179k299479Q2560J106909j04475j239371j097624j079699j802595j617142
$$ y = [557827, 3687696, 4758887, 4233021, 4531116, 7091871, 10247950, 10931525, 8443721, 5186721, 3426828, 3062870, 3235215, 4095796, 5671696, 6857392, 7206329, 8004705, 9718309, 10187480, 7707388, 4245153, 2733821, 2462936, 481172, -3135643, -5074134, -3999861, -2528760, -3121162, -4963814, -6148586, -6415672, -6230937, -5126667, -2564180, 820251, 3950562, 6262902, 7413306, 7460599, 7820607, 10264382, 14098610, 16023012, 13975574, 9871265, 7475134, 8589063, 12101444, 15595959, 16983223, 15577469, 12507771, 9515788, 7146092, 5027403, 3643627, 3950811, 5040455, 4460080, 1735179, -564300, -481740, 625169, 520694, -718677, -1816301, -2896000, -4698595, -6315737]
6954f315737L16216K314794K877278K687586K631881K067431M69553j163300j918343
6945C967359k237355k388726j510932M85964J845507J325095R9599k15703J7374
6936A388182l33971r04470o67345l2434j16266n60843j00558R64354R14758n02556
6926D8851j247311N8441J810900J507513n72194j492400L45973K935464L344217
6917F739454J398553q62967k412378l561948l472705n55828L690335M580100L23964
6908E866580m445927m331199l47165K139603J184918k34308N1709O71652K73653
6899H29516l13389o89070j939348l582248l009371J33864K392806J612336L80989
6890d183915J574974L408379K405385q86258k918111k498183j454825p51377M57586
$$ y = [-6315737, -5999521, -3684727, -807449, 1880137, 4512018, 6579449, 7049002, 5885702, 3967359, 1730004, -658722, -2169654, -1683690, 161817, 1486912, 1586511, 1370808, 1388182, 1054211, 149741, -517604, -550038, -666304, -1227147, -1327705, -363351, 551407, 48851, -1198460, -1140019, 670881, 2178394, 1606200, 113800, 459773, 3395237, 6739454, 8138007, 7275040, 4862662, 1300714, -2171991, -2727819, 962516, 5542616, 5866580, 1420653, -2910546, -3257711, -1118108, 66810, -167498, -115789, 555863, 829516, 516127, -172943, -2112291, -5694539, -8703910, -8570046, -6177240, -4564904, -4183915, -2608941, 799438, 3204823, 2318565, -599546, -3097729, -4552554, -5303931, -4846345]
6881d846345K036440K429225J401156M95269K62150n05219k093963k672040q75647
6872d368974J905301K876835P57417k983542n170021l478659J037174M338736
6864e085733L469051k06594l005215l331911k320869r09628J125984L148733L295365
6855c820817J117144j204649j276108J007317L774999M810831K890805q97264
6847F402258l223913j886514Q99710J034169j466008k194053R24482M277141M139374
6838H906646K075327J289933O04322k958208p139219n987234P90048N601884K879126
6829F062625l052765l941156J277944N875226M808021L02601k632869k474923
6821F224704j124422j42023N65816J404248K333582L050911K809312P31200k578128
$$ y = [-4846345, -2809905, -380680, 1020476, 1515745, 1777895, 1272676, -821287, -3493327, -4368974, -2463673, 413162, 1170579, -1812963, -6982984, -10461643, -9424469, -5085733, -1616682, -1823276, -4828491, -8160402, -10481271, -11390899, -10264915, -7116182, -3820817, -2703673, -3908322, -5184430, -4177113, -402114, 4408717, 7299522, 6402258, 3178345, 1291831, 2191541, 3225710, 1759702, -434351, 490131, 4767272, 8906646, 10981973, 12271906, 12876228, 9918020, 2778801, -3208433, -2418385, 3183499, 6062625, 3009860, -931296, 346648, 6221874, 11029895, 11332496, 8699627, 6224704, 5100282, 4958259, 5524075, 6928323, 9261905, 12312816, 15122128, 15853328, 13275200]
6812A3275200m566977l404073n74776Q59568K93275p2949R89924J882122J065675
6803I746989k60470j85260O07502j61498k569717m001675k789749m53434N12791
6794D45479k98199j350068j422337p05608j34791l42732r10868l89049K086343
6785c021830M786300M368298P4198m233213m147950k94030K408371J193973j255411
6776a21294j101076J204715J974470j94049k472727j753472J326468L438839K740276
6767E042150P30273p4585O33797Q57550o95457k567055k441962m76224Q50473
6758A858960L31204l81767K86298J155394L75151j149460q84185J247307K470205
6749E309107J194319q07314j101698K76597J405757R18147r66060k848865l120061
$$ y = [13275200, 8708223, 5304150, 4729374, 5588942, 5882217, 5809268, 6799192, 8681314, 9746989, 9486519, 9301259, 9908761, 9747263, 7177546, 3175871, 386122, -67312, 445479, 147280, -1202788, -2625125, -3330733, -3465524, -3808256, -4719124, -5108173, -3021830, 1764470, 6132768, 6206966, 1973753, -2174197, -2468227, -59856, 1134117, -121294, -1222370, -17655, 1956815, 1762766, -709961, -2463433, -1136965, 2301874, 5042150, 5772423, 5697838, 6331635, 7189185, 6493728, 3926673, 1484711, 1008487, 1858960, 2190164, 1808397, 2094695, 3250089, 3625240, 2475780, 1591595, 2838902, 5309107, 6503426, 5696112, 4594414, 4871011, 6276768, 7194915, 6228855, 3379990, 259929]
6740B59929j530055R4754K1587p22917J35307K108074K355473N88243k2448J610256
6730D898203J901180j518391m845172l334247R73610J906126j528599l891280
6722e438570j707622K026479L291173K495916J971139J570537m0263j983284k221594
6713c6089q64672J47451L3272k28279M7030K86359k09608j220677j767264r34346
6703d746823J158998L084364L397446K222679Q14137j75422q53593r41445j21643
6694C838698P02999M24629j28525P04496K196383J784310q03864k894464l044422
6685B780240k714962k683508j317477J663571L176485J245274j472777j676230
6677i99384k93585k7933m84020L52286J659612J035519r72744j728653j103840
$$ y = [259929, -1270126, -1175372, -1153785, -1876702, -1741395, 366679, 2722152, 3310395, 3287947, 4898203, 6799383, 5280992, 435820, -2898427, -1924817, -18691, -1547290, -5438570, -7146192, -5119713, -1828540, 667376, 2638515, 4209052, 4168789, 2185505, -36089, -900761, -753310, -720038, -948317, -901287, -614928, -824536, -2045213, -3812477, -4746823, -3587825, -503461, 2893985, 5116664, 5930801, 5755379, 4901786, 3960341, 3838698, 4541697, 4966326, 4837801, 5542297, 7738680, 9522990, 8719126, 5824662, 2780240, 65278, -2618230, -3935707, -2272136, 904349, 2149623, 676846, -999384, -1292969, -1320902, -1804922, -1452636, 206976, 1242495, 269751, -1458902, -2562742]
6668b562742j126764j651050p43049P79549j05368k888422l013898J284297N751975
6659d275472N946572K877310L23745n71527j136032j670171j158746M00482J666676
6650B402837J656040N44049o75949o94817R25335K617447K281079K60412r93075
6641H323358o45687m52936j202415j101839O51258J642156P1304j755840r01216
6632D628143J289655J404001k92143m83653J200581J190133k075646n052140m023994
6623b215063m00233J433441n4867k296515k496764o52311J327471K037207J699710
6614a617924J540021K257254K987980K142678m88387l086744l742113k382971
6606b390206j86908K031489L717782L682637J190299k051997k965049q92210J381216
$$ y = [-2562742, -3689506, -5340556, -6083605, -5304056, -5409424, -8297846, -11311744, -10027447, -4275472, 1671100, 4548410, 4872155, 4300628, 3164596, 1494425, 335679, 736161, 2402837, 4058877, 4602926, 3926977, 3232160, 4157495, 6774942, 9056021, 9316433, 8323358, 7677671, 7224735, 6022320, 4920481, 5571739, 7213895, 7285199, 5529359, 4628143, 5917798, 7321799, 7029656, 6546003, 7746584, 8936717, 6861071, 1808931, -2215063, -2615296, -1181855, -1236722, -3533237, -6030001, -6682312, -5354841, -3317634, -1617924, -77903, 2179351, 5167331, 7310009, 6821622, 3734878, -7235, -2390206, -2577114, -545625, 3172157, 6854794, 8045093, 5993096, 3028047, 2135837, 3517053]
6597C517053J449348L53803J59440J96171j575181m378158n075243k889355l92312
6588h634434R25843K564399M932796N063493J343774k502611k095181R47791J402277
6579C948147j610655l739079k383612J05873J129472J385813J998254J893140
6571B727353L40087r53777o57042j22039o47277j019707j96158J80666j196480
6562a544374k204907o00300J622471J054857j359983j649858O73510J842300O0503
6553b105781j591500L6084L653280N706978M782422K090992o56087k236364k133462
6544G546562j163742q54226j275530q04202J013206K004517L52605k275836k617821
6535A925533k38627K014250K095245J365473K167685M097162M260474J093387
$$ y = [3517053, 4966401, 5320204, 5479644, 5675815, 4100634, -277524, -5352767, -8242122, -8634434, -7708591, -5144192, -211396, 4852097, 6195871, 3693260, 1598079, 2545870, 3948147, 2337492, -1401587, -3785199, -3679326, -2549854, -1164041, 834213, 2727353, 3067440, 2113663, 1456621, 1334582, 687305, -332402, -528560, -347894, -1544374, -3749281, -4349581, -2727110, -1672253, -3032236, -4682094, -4008584, -2166284, -2105781, -3697281, -3661197, -7917, 5699061, 10481483, 12572475, 11916388, 9680024, 7546562, 6382820, 5528594, 4253064, 3448862, 4462068, 6466585, 6819190, 4543354, 1925533, 1686906, 3701156, 5796401, 7161874, 9329559, 13426721, 17687195, 18780582]
6527A8780582l446235o089023n729259l747091j583783M42485J968417K085443
6519B681536Q11170l91593o01875o54230j232243j219312L83767K193762K222251
6510D193233R92565N06616P18751k44564k408846l341989j873742O6638L54767
6501a036571o22881j187984n07105J364229L740335M765131K668521j317706l377086
6492D488883j822119O30728Q43068o29060j371391r74913n52035j27048O19628
6483A105741L41468k079695m524605l913957j112318M41j466937k083373K36562
6474a3496673K886259K866744J353413J223387K208495J708534o11608k145381
6466d006830j251853O84039J676837J711440J906657K322878J830223o5460k086787
$$ y = [18780582, 15334347, 9245324, 3516065, -231026, -1814809, -1372324, 596093, 2681536, 3492706, 3101113, 2499238, 1845008, 612765, -606547, -222780, 1970982, 4193233, 5185798, 5692414, 6411165, 6166601, 3757755, 415766, -1457976, -1391338, -1036571, -1659452, -2847436, -3354541, -1990312, 1750023, 6515154, 9183675, 7865969, 4488883, 2666764, 3297492, 4140560, 3511500, 2140109, 1165196, 613161, 486113, 1105741, 1447209, -632486, -5157091, -9071048, -10183366, -10182925, -11649862, -13733235, -13496673, -10610414, -7743670, -6390257, -5166870, -2958375, -1249841, -1861449, -4006830, -5258683, -4574644, -2897807, -1186367, 720290, 3043168, 4873391, 4807931, 2721144]
6457B721144k307312l77503J840459K391463J644759J575836K632276K753821
6449A2874943K92190l265280m723917k784141P80092L130575K752018L59244j696024
6440G719700j351012J049325K994417K749367J255503L65010L29440K81575P9481
6431A5472806m8174q19417k835116m708489m368434k022214J75699J124186J258480
6422C229327M49496j710919l465731k096843J542161L102659R29548j214785J3667
6413G78580K209935J164103k264774l370349n91612K740861L514571K168821N46615
6404F896751n33925q27899k16293N69002O04445K96145L74689j56638k426622
6395D579655m441522k913719J264416L166621P09236k339712k206901l51469L3434
$$ y = [2721144, 413832, 36329, 1876788, 4268251, 5913010, 7488846, 10121122, 12874943, 13167133, 9901853, 5177936, 2393795, 3173887, 6304462, 9056480, 9415724, 7719700, 6368688, 7418013, 10412430, 13161797, 14417300, 14782310, 15111750, 15393325, 15472806, 15424632, 14605215, 11770099, 7061610, 2693176, 670962, 846661, 1970847, 3229327, 3678823, 1967904, -1497827, -3594670, -2052509, 1050150, 1979698, 764913, 778580, 2988515, 4152618, 1887844, -1482505, -2074117, 666744, 4181315, 6350136, 6896751, 6362826, 5534927, 5318634, 5887636, 6492081, 6788226, 7162915, 7006277, 4579655, 138133, -2775586, -1511170, 1655451, 2364687, 24975, -2181926, -2533395, -2499961]
6386b499961m26074Q67687L142406L112675M91217j395274q08431M8492j096589
6377A436148l074760l145588p03623K232541L360997K138516O3039p94547p091
6368A505632P60954K30039m25109N01903K031947J561073r01747k280479j123612
6359A860601q6709j759820m077046k813666K092069N828198M930795J610139K53801
6350G838362J455561J950949j48032k741930l061338j430029j59352o7448k3685
6341C613058O59496J277064J105116J81272j237762k569302k547382p83088N86569
6332B85041q10369l527808l450352J56345K942226J659130j007423o39629K344382
6323b048457L943428K836237J373203Q42342k03309k352394l638228k699988q54815
$$ y = [-2499961, -2926035, -2058348, 1084058, 4196733, 4687950, 3292676, 2484245, 2532737, 1436148, -1638612, -4784200, -5487823, -3255282, 105715, 2244231, 2307270, 1512723, 1505632, 2266586, 2496625, 2071516, 2573419, 4605366, 6166439, 5264692, 2984213, 1860601, 1773892, 14072, -4062974, -6876640, -4784571, 1043627, 5974422, 7584561, 7838362, 9293923, 11244872, 11096840, 8354910, 5293572, 3863543, 3704191, 3636743, 3613058, 4272554, 5549618, 6654734, 6836006, 5598244, 3028942, 481560, -301528, 285041, -525328, -4053136, -7503488, -7347143, -4404917, -2745787, -3753210, -4392839, -2048457, 1894971, 4731208, 6104411, 6946753, 6743444, 4391050, 752822, -1947166, -2801981]
6314b801981L74847J432008K902154L585727K230718j83492j570661j266036j90600
6305D512684O41631O54886m21181k048965k790050j679097O35869K644758L323492
6296E474027K402813K31348j978136k630970j326248N75298J523297J295882M99850
6287F067161n10520j390359j292789K34217K135201K664178J370737m42301j360902
6278G474623j347567j254922j299965p94488L82895Q84714m75614k541113k816775
6269a788212r32608O84512M37053j63121N61519J301163J64096j343767j94843
6260a274208K953254M181293K165862j48141o50315j032475k841183m099187k619535
6251c364635L7291J073005R15681J821623L365804K902091J20750k167623k167497
$$ y = [-2801981, -2427134, -995126, 1907028, 5492755, 7723473, 7539981, 5969320, 4703284, 4512684, 5154315, 5809201, 5388020, 3339055, 549005, -1130092, -494223, 2150535, 5474027, 7876840, 8108188, 6130052, 3499082, 2172834, 2748132, 4271429, 5567311, 6067161, 5556641, 4166282, 2873493, 3107710, 5242911, 7907089, 9277826, 8835525, 7474623, 6127056, 4872134, 3572169, 2777681, 3160576, 4045290, 3569676, 1028563, -1788212, -2720820, -2036308, -1599255, -1762376, -1200857, 100306, 264402, -1079365, -1274208, 1679046, 5860339, 8026201, 7878060, 7227745, 6195270, 3354087, -745100, -3364635, -3327344, -2254339, -1338658, 482965, 3848769, 6750860, 6871610, 4703987, 2536490]
6242B536490j274490j337477j950004j609513j42174J151679J123757m6028r71526
6233b519286l50029J456281K475371J393149p21512j779074j211817j45949M44185
6224i58681N38003L51928O3120J16193P22526J212579Q92268K44149J53387L13016
6214C648488j99571r83041o23222Q58327J559512M07924j080806q32639Q88576
6205C643548J827332O92243j256511j772586j83121K002937K832065J799169r5655
6196I489421j650975k289555j986625j285509j277024k487421l670763k933596
6188h092047m08490J570188J609098J105919J911902L537666M114931L019305
6180H368472R78625j403399l433250l533392q69833K545064L519762J538367q88955
$$ y = [2536490, 1262000, -75477, -2025481, -3634994, -3777168, -2625489, -1501732, -1547760, -2519286, -2869315, -1413034, 1062337, 2455486, 1733974, -45100, -1256917, -1402866, -958681, -420678, -68750, -5630, 110563, 833089, 2045668, 2937936, 3182085, 3335472, 3648488, 3448917, 2465876, 1842654, 2700981, 4260493, 4668417, 3587611, 2754972, 3643548, 5470880, 6163123, 4906612, 3134026, 2950905, 4953842, 7785907, 9585076, 9489421, 7838446, 5548891, 3562266, 2276757, 999733, -1487688, -5158451, -8092047, -8500537, -6930349, -5321251, -4215332, -2303430, 1234236, 5349167, 8368472, 9347097, 7943698, 4510448, 977056, 107223, 2652287, 6172049, 7710416, 6821461]
6171F821461j740577j353690o18017L82873J113088J78289k300755l540994j253731
6162b312053K855492M598959K216048j688818l385202k079311j27736J57548r87550
6153g52623j626047q34177K17880J7787j191565j737102o59262J190094K265155
6144c109860K017831J243947R97432J418734J747943J473380J107293J403425
6136H300125K087852K102919J055814l77911j494162k101010k047495j362557
6128F163575r29711j628774k598834k023057p7697Q57824k35472j334790n12260
6119b319196J329229K431871K776976K789799J675593n03758j285578N81252J961572
6110I437760m71921m411390m690035j063996J645017J203817N27532J444773J255981
$$ y = [6821461, 5080884, 3727194, 3109177, 3492050, 4605138, 4783427, 2482672, -1058322, -2312053, 543439, 5142398, 7358446, 5669628, 2284426, 205115, 77379, 234927, -752623, -2378670, -3212847, -2994967, -2977180, -4168745, -5905847, -6565109, -5375015, -3109860, -1092029, 151918, 1149350, 2568084, 4316027, 5789407, 6896700, 8300125, 10387977, 12490896, 13546710, 13168799, 11674637, 9573627, 7526132, 6163575, 5233864, 3605090, 1006256, -1016801, -1094498, -236674, -472146, -1806936, -2319196, -989967, 1441904, 4218880, 7008679, 8684272, 8180514, 6894936, 7476188, 9437760, 8965839, 4554449, -135586, -1199582, 445435, 1649252, 2176784, 3621557, 4877538]
6101D877538j792337m194125k250225J739683K637147m4922j979004n89477J997283
6092D01561K773945J581851J97541j93005L77822J261792J580529O94682j120017
6083G556701k687728k884452j664386k13842J79709l25575l21342N17870M23774
6074E80729j670079l479674k005810J736483L654512K319439M08243k06132r14826
6065D22885k291430j650703K213767N216214L012306k279996m685269k488218
6057b530444N22432J398482J222429J476243J351983K43551k92051Q76878K087074
6048F356577J115577j573165l466994l014881q08569J473231K368718J608422
6040D058916N60452R80589K659183L180805R14576k494948l779185j917597P44020
$$ y = [4877538, 3085201, -1108924, -3359149, -1619466, 1017681, 972759, -1006245, -1595722, 401561, 3175506, 4757357, 4954898, 4761893, 5139715, 6401507, 7982036, 8676718, 7556701, 4868973, 1984521, 320135, 106293, 286002, -39573, -360915, 156955, 580729, -1089350, -4569024, -6574834, -4838351, -1183839, 1135600, 1543843, 1337711, 422885, -1868545, -3519248, -1305481, 3910733, 6923039, 4643043, -42226, -2530444, -2008012, -609530, 612899, 2089142, 3441125, 3684676, 3392625, 4269503, 6356577, 7472154, 5898989, 2431995, -582886, -1391455, 81776, 2450494, 4058916, 4619368, 5599957, 8259140, 11439945, 12354521, 9859573, 6080388, 4162791, 4906811]
6031D906811J401282j02060j629047j598640n22401K76559L89254J36520m51688
6022B806590j353668j743850p70647R99137K161276K372600K307395J905532M41244
6013I125609j546544k372005j702048r98164r79091q00397l44244p62550j777337
6004b156771j294313Q65400J939512Q87438O96175L186606M912479K220964k380697
5995H876793l678654j581889k78492q53049n19536J016150M85266k583376m122386
5986c239173k180321j81897q50858j595221N31072L225052K499699q76630k677399
5977e345676j237807J497307L643864M698278M142171J902396l39895r36756p09267
5968G314615j184170j431330M02397L086355L120969k64403l770834m254133k016932
$$ y = [4906811, 6308093, 6206033, 4576986, 2978346, 2455945, 2732504, 3121758, 3258278, 2806590, 1452922, -290928, -1061575, -62438, 2098838, 4471438, 6778833, 8684365, 9125609, 7579065, 5207060, 3505012, 2506848, 1527757, 727360, 383116, -379434, -2156771, -3451084, -2585684, -646172, 241266, 937441, 4124047, 9036526, 11257490, 8876793, 5198139, 3616250, 3337758, 2484709, 1965173, 2981323, 3466589, 883213, -3239173, -5419494, -5601391, -6452249, -8047470, -7516398, -4291346, -1791647, -2668277, -5345676, -6583483, -5086176, -1442312, 3255966, 7398137, 9300533, 8960638, 8023882, 7314615, 6130445, 4699115, 5101512, 8187867, 11308836, 11044433, 7273599, 3019466, 1002534]
5959A002534O13061J911955J409916k38442j434322j141848m07927q20883j603109
5950g09065m39984K549692M206834K638196k19274j733565k115486k918423l815842
5941b556917l351315j851709r64778o56422O94936K913977L351657P98833k002272
5932c624010j640810J393061L474901K662831P04693J39882J297377K809508L514094
5923A0731527K882919Q71757j470390k296758j170111o0079o91655j835179j185167
5914E776864O94226Q25308j580067l573125k627086j46762R06341K57896k9688
5905E03907O59588M74623j818621m525634m768021j751782K477388N212100N432433
5896A895981M045755K355374Q22281o23868j667603j678588o53029M20969K89201
$$ y = [1002534, 1615595, 3527550, 4937466, 4699024, 3264702, 2122854, 1714927, 894044, -709065, -1149049, 1400643, 5607477, 8245673, 8026399, 6292834, 4177348, 1258925, -2556917, -5908232, -7759941, -8724719, -9381141, -8686205, -5772228, -2420571, -1621738, -3624010, -5264820, -3871759, -396858, 2265973, 2970666, 3110548, 4407925, 7217433, 10731527, 13614446, 14486203, 13015813, 10719055, 9548944, 9488865, 8797210, 6962031, 5776864, 6471090, 7296398, 5716331, 2143206, -483880, -630642, 275699, 533595, 503907, 1163495, 1638118, -180503, -4706137, -9474158, -11225940, -8748552, -3536452, 1895981, 5941736, 8297110, 9119391, 8495523, 6827920, 5149332, 4496303, 4917272, 5206473]
5887E206473j516635l982121m811814k212156K727878O218877N498507J828841
5879H957850j385022k644449k867105k738819k081351j658114k729944m240510
5871a1387464l272425N46074L735391L601761J702121Q26784R98598R48349J382134
5862i18677L543546N764969M827554N77278l518607m573114k997989j075536o32292
5853I97132j945671l311811k159293J710566M786314L843353M45228j119211K28981
5844C475588J522643P21315p94825j325133j305200j464098j223590l75600m4306
5835h13206n25397l61248Q55991R62943j428431l847865k720351J654447N084842
5826a138275M295706K84244l090032k988555j77042J990904J576245N66372J872361
$$ y = [5206473, 3689838, -292283, -5104097, -7316253, -4588375, 1630502, 7129009, 8957850, 7572828, 4928379, 2061274, -677545, -2758896, -4417010, -7146954, -11387464, -14659889, -14113815, -10378424, -6776663, -5074542, -4247758, -3249160, -2300811, -918677, 2624869, 8389838, 13217392, 13794670, 10276063, 5702949, 2704960, 1629424, 997132, -948539, -4260350, -6419643, -4709077, 77237, 3920590, 4365818, 3246607, 3475588, 4998231, 5719546, 4924721, 3599588, 2294388, 830290, -393300, -768900, -813206, -1338603, -1699851, -843860, 119083, -1309348, -5157213, -7877564, -6223117, -1138275, 3157431, 3441675, 351643, -2636912, -2813954, -823050, 753195, 1319567, 3191928]
5817C191928M308618L524560j278846n008103l412018P25911J597166j343862
5809B305354l283378j619209P73297P65640l55441L38872K474007K921359L43816
5800D664317l026335m110114k071160J448558M126671M568169K759656k81705
5792H078057l055814m196725l259054j102760R33328K325636L259100L319361
5784F301129J577074j438524l228375k075185N91725J982901J413295M63878K17465
5775E805383J02812n78894j600746k439934k598020j298032J575731M098424L652750
5766F719474L03003k706107k699786n91095P68302J61256j195519j713553j122096
5757b076121k34484K23757M00812J028032K281663L244474K956975J598557n3034
$$ y = [3191928, 7500546, 11025106, 9746260, 4738157, 1326139, 2052050, 3649216, 2305354, -978024, -2597233, -1823936, -1058296, -1413737, -1074865, 1399142, 4320501, 4664317, 1637982, -2472132, -4543292, -3094734, 1031937, 5600106, 8359762, 8078057, 5022243, 825518, -2433536, -3536296, -2602968, -277332, 2981768, 6301129, 7878203, 6439679, 3211304, 1136119, 1727844, 3710745, 5124040, 5587918, 5805383, 5908195, 5329301, 3728555, 1288621, -1309399, -2607431, -1031700, 3066724, 6719474, 7022477, 4316370, 1616584, 1025489, 1793791, 1955047, 759528, -954025, -2076121, -2310605, -2086848, -1686036, -658004, 1623659, 4868133, 7825108, 9423665, 9370631]
5748I370631j727204l170635l309937j580551M04865N77296m53472m25948M58249
5739A43294l77263k900566l214954N94624M638729M456856J582995R16735L002390
5730H842840L408210j62592m256806m460325q70943K794916L644834J828907m24799
5721A0344242j113326n28410r13825l041682m149735j526061K715935L728741
5713E515879P81315j665503n58785J879463K529658J855036J460964N71538j700643
5704A0668922l255405j964473K65326L38064o83035O09423L727828M529654J767342
5695A6003646j094378j459961q68043j277832j873566j485370r43538r22308l47060
5686E731590Q94236N75473j966525l392623j067200K167972J789127j438639k564149
$$ y = [9370631, 7643427, 4472792, 1162855, -417696, -12831, 564465, 110993, -314955, 143294, -233969, -3134535, -6349489, -5754865, -1116136, 3340720, 4923715, 5840450, 8842840, 12251050, 12088458, 7831652, 3371327, 2500384, 5295300, 8940134, 10769041, 10344242, 9230916, 8702506, 7788681, 4746999, 597264, -928797, 1787138, 5515879, 6297194, 4631691, 4072906, 5952369, 8482027, 10337063, 11798027, 12369565, 10668922, 7413517, 5449044, 5714370, 6052434, 5369399, 5978822, 9706650, 14236304, 16003646, 14909268, 13449307, 12581264, 11303432, 9429866, 7944496, 7000958, 6078650, 5731590, 6625826, 7201299, 5234774, 1842151, 774951, 2942923, 4732050, 3293411, 729262]
5677G29262N3513K677642K158436Q6374m33065R02064K269912K421548R69169
5668A1834855k065908n155856n376959j740453K646498L840075J873809K90537
5660F146598J120421K521932K016959J77615m59383O64637J119400j084449m342114
5651G881616n117264k471912O67931J364419K60458o6536Q80385J350026P31402
5642E480525M62259J022513O24963j651467l584890k728504q1091J448290J175839
5633B168437P45944P40693l955j553876k047437n64603J349364K084566K018599
5624D937732K000171J553856J24764j267729j301061l68014J52150j22979o62217
5615E046673j295885k007561k147820j250758l4370O27077Q83034Q33302l51736
$$ y = [729262, 782775, 3460417, 5618853, 5705227, 5272162, 6174226, 8444138, 10865686, 11834855, 9768947, 4613091, -763868, -2504321, 142177, 3982252, 5856061, 6146598, 7267019, 9788951, 11805910, 11983525, 11524142, 12188779, 13308179, 12223730, 7881616, 2764352, 292440, 960371, 2324790, 2585248, 2518712, 3399097, 4749123, 5480525, 5942784, 6965297, 7590260, 5938793, 2353903, -374601, -455692, 992598, 2168437, 2914381, 3655074, 3651119, 2097243, 49806, -514797, 834567, 2919133, 4937732, 6937903, 8491759, 8616523, 7348794, 6047733, 5679719, 5831869, 5708890, 5046673, 3750788, 1743227, -404593, -1655351, -1689721, -1062644, -179610, 653692, 301956]
5606C01956k375428k441334J185511N250075M708331k39088m028632l243025l96724
5597a278358J089275J627455K634481K586717l26664l898071m232306j245921
5589c043392J654358K562733K373863J732040K89263j014740m43381J243823J176485
5580F531052j178632k983167k470048j456965j932336k819471k101536o9990J607131
5571f873962K451964K833397K373988P34889q44404o75582J040134K384943K050648
5562E476015N74992n25190l29767M71518J43536j778909l147014j738319J132643
5553B79505J887261j46300j653267m49425J345824J132480q2407j37527K45371
5544B421515o37337j323244R43494M810499N453775J245690l684515m837843k576574
$$ y = [301956, -2073472, -4514806, -3329295, 1920780, 6629111, 6390023, 2361391, -881634, -1278358, -189083, 1438372, 4072853, 6659570, 6332906, 2434835, -1797471, -3043392, -1389034, 1173699, 3547562, 5279602, 5568865, 4554125, 4110744, 5354567, 6531052, 5352420, 2369253, -100795, -1557760, -3490096, -6309567, -8411103, -8481093, -6873962, -4421998, -1588601, 785387, 1520276, 675872, 290, 1040424, 3425367, 5476015, 6051007, 5525817, 5196050, 5667568, 5811104, 4032195, 885181, -853138, 279505, 2166766, 2020466, 367199, -82226, 1263598, 2396078, 2313671, 2176144, 2421515, 1784178, 460934, 1404428, 6214927, 11668702, 12914392, 9229877, 4392034, 1815460]
5535A815460m08728j79669r03305j181644r00141o78381p92136r41415p56063
5526d926022k83113J90863O43629J134375J278608Q44057P39817J906337L149642
5517D678193K255278j56517o70963J581149K743209k2309l590969l400179n16675
5508B900217M69628r18617r26034J202741J594721j411663m048610l096586o59659
5499d893862Q022k34074J154441L422370L765406J965944L80720R0523n1205q31547
5489D776738j488476j223685l73164P2195n70045j856928k177946n07357J769928
5480a578740K379268J534882J484788K343698J471233j748900l849073k306862
5472b69706L01364J99336j846984k126990K34702K608047L119609K333307J061230
$$ y = [1815460, 1406732, 1227063, 323758, -857886, -1758027, -2436408, -3228544, -4169959, -4926022, -5209135, -5018272, -4374643, -3240268, -1961660, -1117603, -377786, 1528551, 4678193, 6933471, 6776954, 6105991, 7687140, 10430349, 10408040, 6817071, 3416892, 2900217, 3369845, 2451228, 1525194, 2727935, 4322656, 2910993, -1137617, -4234203, -4893862, -4885840, -5119914, -3965473, -543103, 3222303, 5188247, 5568967, 5659490, 5608285, 4776738, 3288262, 2064577, 1691413, 1763608, 1193563, -663365, -2841311, -3348668, -1578740, 800528, 2335410, 3820198, 6163896, 7635129, 5886229, 2037156, -269706, 31658, 230994, -1615990, -3742980, -3508278, -900231, 2219378, 4552685, 5613915]
5463E613915n90772k039322k463489k168812j884809j296556j20594M41959l68579
5454d877059p05325J258345L539553K570310j214122l565429k400580j96928K02946
5445e388289j017592k401259l365457l278762j015837K936493N899793N973575
5437a657335M042702J877042n654j590126k320960k091437j827487j950059j528130
5428g051444O3487J856279K566354K136950J348020Q47343R26112J246212P70755
5419D710068q29436k052269j498937l54568o42461j564936o61630J555385J922665
5410E83881J77039n3957K562627M157553J657331k087951k670519n45064Q04893
5401D585833O24655N77668N33515q54324k437046j799575L32406J029728J36410
$$ y = [5613915, 5023143, 2983821, 520332, -1648480, -3533289, -4829845, -4950439, -4508480, -4877059, -5582384, -4324039, -784486, 1785824, 571702, -2993727, -5394307, -5591235, -5388289, -6405881, -8807140, -12172597, -15451359, -16467196, -13530703, -7630910, -1657335, 2385367, 4262409, 4256755, 2666629, 345669, -1745768, -3573255, -5523314, -7051444, -6987957, -5131678, -2565324, -428374, 919646, 1766989, 2693101, 3939313, 4710068, 3880632, 1828363, 329426, -25142, -667603, -2232539, -2894169, -1338784, 583881, 760920, 706963, 3269590, 7427143, 9084474, 6996523, 4326004, 3780940, 4585833, 5210488, 5788156, 6321671, 5467347, 3030301, 1230726, 1563132, 2592860, 2729270]
5392B729270J08515J038341M54617j385449q80151K651408M670345J955794k409479
5383H933211l733256k265294j474762k119228k002719m48471Q01601R48155J159705
5374b01058J860531J615994m83656l141278m295587l131734m42322K007578K631569
5365c579963J638949J067879J907322K042071p77223m524872m585677l99909K897985
5356d313438J352041k123139j883865K409659N530275M025780K25388j890593
5348C332108j693588r84834l88023Q30345K390141K825133J598703k54310j619581
5339F036094k136035j635584j50342J368483J595270L89784j170233k359319l220171
5330a282053l381334k051124K63546J526150N68656j397921k452257j993332l83681
$$ y = [2729270, 2837785, 3876126, 4330743, 2945294, 2065143, 4716551, 9386896, 11342690, 8933211, 5199955, 2934661, 1459899, -659329, -2662048, -3110519, -2308918, -1360763, -201058, 1659473, 3275467, 2791811, -349467, -4645054, -7776788, -8219110, -6211532, -3579963, -1941014, -873135, 1034187, 3076258, 2299035, -2225837, -6811514, -7211423, -4313438, -2961397, -5084536, -6968401, -4558742, 971533, 4997313, 5222701, 3332108, 1638520, 653686, 265663, 1096008, 3486149, 6311282, 7909985, 7655675, 6036094, 3900059, 2264475, 2114133, 3482616, 5077886, 5467670, 4297437, 1938118, -1282053, -4663387, -6714511, -6450965, -4924815, -4356159, -5754080, -8206337, -10199669, -10583350]
5321a0583350J924993L731614L122619j4370k635144j756964J640315L939391
5313f30896L549756K049989J039529M03436o3266J56007P24161L02688j058516
5304F472888j466185k26262P24881j86244j732819k106878j669254j475044q50717
5295b515634J047334K681960K050199K49871K8391J205045R03759j441605k837950
5286A371370j545176K02024J49114k46568J289512L420810K944574j17303k465526
5277E002831k407161j715981j996911k022056k76180J892304J908785j33879j478470
5268a226718o81957M11736l59710j986597j478139J885479N271858N659418L032142
5259A0527512m54664l020766l840410k550246l570J480893O80208m91583K24054
$$ y = [-10583350, -8658357, -4926743, -1804124, -1818494, -4453638, -6210602, -4570287, -630896, 2918860, 4968849, 6008378, 6411814, 6348548, 6504555, 7228716, 7531404, 6472888, 5006703, 4780441, 5505322, 5319078, 3586259, 1479381, -189873, -1664917, -2515634, -1468300, 1213660, 3263859, 3513730, 3542121, 4747166, 5650925, 4209320, 1371370, -173806, 28218, 177332, -69236, 1220276, 4641086, 7585660, 7468357, 5002831, 2595670, 879689, -1117222, -3139278, -3415458, -1523154, 385631, 251752, -1226718, -1908675, -1496939, -1856649, -3843246, -5321385, -3435906, 1835952, 7495370, 10527512, 10072848, 7052082, 3211672, 661426, 657856, 2138749, 2818957, 2327374, 2551428]
5250B551428J459679J53242k953130l730904j263206L26237j466188l355200j862215
5241a0140257Q52545R67619m22901J57897J777224O96985k367965k801894M0130
5232a1240617J714533N24080L16307L247100N576640M006484J131976N75991J059437
5223F911931j82239j799449j086844O44505N72008k36123O92864J438698j563903
5214E391448o143498o291953j620406J504027l26327k711571q85596L153153M439444
5205c491279K105385r94599k886820l243603j684599J405371L781878L754130
5197a254136K466913J665778Q94751o94634j594432m7673K373439K550560N22483
5188F883049p81472k80658L7205r35105j398941R8081J819757J136861j698061
$$ y = [2551428, 4011107, 4164349, 1211219, -2519685, -3782891, -3456654, -4922842, -8278042, -10140257, -9287712, -8320093, -8742994, -8585097, -6807873, -6110888, -8478853, -11280747, -11240617, -9526084, -9002004, -8685697, -5438597, 138043, 4144527, 5276503, 5852494, 6911931, 6729692, 4930243, 3843399, 4487904, 5059912, 4823789, 5516653, 6955351, 5391448, -752050, -7044003, -8664409, -7160382, -7486709, -10198280, -11083876, -7930723, -3491279, -1385894, -2380493, -5267313, -8510916, -10195515, -8790144, -5008266, -1254136, 1212777, 2878555, 3773306, 3078672, 1484240, 1436567, 3810006, 6360566, 6883049, 6101577, 5820919, 5858124, 4923019, 3524078, 3622159, 5441916, 6578777, 4880716]
5179D880716l789381k989578J72896L515939N100056M309081J970196l89441j771146
5170A1009338k262611k311816j850581o50166O78212Q88808l11960j538354j362425
5161B288445l36137l21357j764962k904525k233472n22895N77321Q38951J066796
5152c311835J417042J750888K815923M963012O107140L416310k624045p920010
5144F614425r069255o226953j605535K541041M069776K002671j268511j482780
5136d425121K023929M783067L188817m25841j466923K97744J335806K96005o08797
5127D998686n8750K93580q66679k139056j784091l35213N69315L85576m82517
5118E80851j664026k548729k207161o60241P10033R43361P95371J334673K129407
$$ y = [4880716, 1091335, -1898243, -1725347, 1790592, 6890648, 11199729, 13169925, 12780484, 11009338, 8746727, 6434911, 4584330, 3934164, 4612376, 5501184, 5189224, 3650870, 2288445, 1952308, 1630951, -134011, -3038536, -5272008, -5794903, -5217582, -4378631, -3311835, -1894793, -143905, 2672018, 7635030, 13742170, 17158480, 14534435, 6614425, -2454830, -8681783, -10287318, -7746277, -3676501, -1673830, -2942341, -4425121, -2401192, 2381875, 5570692, 5144851, 3677928, 3975672, 5311478, 5607483, 4998686, 4939936, 5233516, 4366837, 2227781, 443690, 108477, 677792, 1063368, 580851, -1083175, -3631904, -5839065, -6499306, -5789273, -4845912, -4050541, -2715868, -586461]
5109e86461J960008P75643k43229m59050o28815j667868l053913k999622n07635
5100g410942K865720M010930J616258j978606l164254j024246K062076L521739
5092D98675K947943J272806p89724k618149l202211k028101J1663J451267J675942
5083g79889R88862j40308j174720j437552q29259k21892k96802m47138J39627
5074d199071P67115M1357j658916k166894m95579J690389K461885K074286J709983
5065B24555J060319q11441k815078k466992M60187L087384L200770K042179J886392
5056E868275K325154J069225k074181m187403k821061O73644K378724J84891l658733
5047b41465m851253j980408J671361K199732J07668p24086J179323K976499K235045
$$ y = [-586461, 1373547, 2149190, 1905961, 1446911, 818096, -849772, -3903685, -6903307, -7410942, -4545222, -534292, 1081966, -896640, -4060894, -5085140, -3023064, 498675, 3446618, 4719424, 3929700, 1311551, -1890660, -3918761, -3907098, -2455831, -779889, 208973, 68665, -1106055, -2543607, -3372866, -3594758, -3891560, -4338698, -4199071, -3431956, -3390599, -5049515, -7216409, -7711988, -6021599, -3559714, -1485428, 224555, 1284874, 473433, -2341645, -4808637, -4348450, -1261066, 1939704, 3981883, 5868275, 8193429, 9262654, 7188473, 3001070, 180009, 853653, 3232377, 3417268, -241465, -5092718, -7073126, -5401765, -3202033, -3094365, -3818451, -2639128, 337371, 2572416]
5038B572416M95326R3914K05971r91151k400273j819804j57542L1064q22498l13623
5028c106200R06555j39616k821414k854909M97158K354450j03567k638610m21268
5019h327421M211487N096836J173340k534459k059476J268962L694348L120242
5011E643859J13307k915422l389711j101287J134867P40648j363714k279413j074629
5002d491495N91272J151559O17795k21230m84246N60532K521870L531013K121660
4993E898730q95765l374596m017544k854158o06292J390019J749099O92948J31216
4984a886343J081334K207301J949078P60148R8781M61357J329647J672096j0194
4975G663205m019400p233318n450637P04832N323636M527955J066324o92850q22507
$$ y = [2572416, 3067742, 3161656, 3367627, 2376476, -23797, -1843601, -2001143, -1970079, -2792577, -3106200, -2199645, -2339261, -5160675, -8015584, -7518426, -5163976, -5267543, -7906153, -8327421, -4115934, 980902, 2154242, -380217, -2439693, -1170731, 2523617, 5643859, 5757166, 2841744, -547967, -1649254, -514387, 226261, -1137453, -3416866, -4491495, -3900223, -2748664, -2130869, -2352099, -2836345, -2275813, 246057, 3777070, 5898730, 5002965, 1628369, -2389175, -5243333, -5849625, -4459606, -2710507, -2017559, -1886343, -805009, 1402292, 3351370, 4111518, 4210299, 4671656, 6001303, 7673399, 7663205, 3643805, -3589513, -9040150, -8335318, -3011682, 1516273, 2582597, 1889747, 1067240]
4966A067240j564853k201852n41616K425595L572036K232504K98591j099681j827556
4957B360408j090765J160718K546790J196132j066339j575759j046293j502015
4949I82877k014476n51651J599895J580937j14126o92347n416k70613j688698
4940a173618k314776j603681n71489N38193J509926Q11639j560864k240140N37820
4931f066990K868608P79306l010640l380600j041586l04296j153395l57040J534981
4922a0131652J410640J92741J047477K570307J216377j058432L67075L636224
4914g49243K693649k130090m624118l262867k285857k656200j335250O42507q19749
4905a4527218l787571k337714K245969K916536m84334j352604R08116O30721j410480
$$ y = [1067240, -497613, -2699465, -3241081, -815486, 2756550, 4989054, 5287645, 4187964, 2360408, 1269643, 2430361, 4977151, 6173283, 5106944, 3531185, 2484892, 982877, -1031599, -1583250, 16645, 1597582, 1483456, 791109, 785693, 515080, -1173618, -3488394, -5092075, -5663564, -5125371, -3615445, -2803806, -4364670, -6604810, -6066990, -3198382, -2419076, -5429716, -8810316, -9851902, -10156198, -11309593, -11666633, -10131652, -8721012, -8528271, -7480794, -4910487, -3694110, -4752542, -4385467, -749243, 1944406, -185684, -4809802, -8072669, -10358526, -13014726, -14349976, -13707469, -14527218, -18314789, -20652503, -18406534, -15489998, -15974332, -17326936, -16418820, -15788099, -17198579]
4896a7198579J275257O652945N492520j508245l824430l64683j172767p062784
4888a7710766p063651n46833m15388p919192p851273K362397M525452p442180
4880d2061434j4242394o406918k580130j2508814j5780732n505622j4890548n6756523
4872a70733115p1830904m46643J11605926J50563338Q2213489n984771k8624081
4865F6763239l349353O025129j0028632j5615360k331177L999519m831784r462171
4857C1169410k043513K964098j591050n632661l918511k938176l779681P4588
4849A4304504O322311N004424k628536m713416P01138L160517r96270l817960
4841A7336712j862534j043149l036454k024469K257080K548915j831225k522017
$$ y = [-17198579, -15923322, -9270377, -3777857, -5286102, -9110532, -9475215, -10647982, -17710766, -24774417, -25321250, -25736638, -33655830, -41507103, -39144706, -34619254, -42061434, -56303828, -62710746, -65290876, -77799690, -93580422, -99086044, -113976592, -170733115, -242564019, -243010662, -131404736, 19158602, 101372091, 95387320, 66763239, 63413886, 69439015, 59410383, 43795023, 41463846, 45463365, 40631581, 31169410, 29125897, 32089995, 30498945, 24866284, 20947773, 18009597, 14229916, 14304504, 20626815, 25631239, 23002703, 18289287, 18990425, 22150942, 21154672, 17336712, 15474178, 14431029, 11394575, 9370106, 11627186, 14176101, 12344876, 9822859]
4833I822859K914043O467794L771053M75777O04425J12130l495082n678310l557710
4824A1436979p74489J82164J657180L677943K197794k313367l536996J61451K678203
4815A5366862P54339j366451j027559j533093l680899k426021L310543O490210
4807A5887931K879763k145332l044420k290780l382914l522090J15711L553397
4799H051266K310793j015264j772590q05005j066336j490676l4934J530352J249012
4790F956618J110306K545551K431595j134647l759433j230953L169468L801649
4782A3890154J300179K6075L35132l52849j555454r57975N08896M99771J57768
4773A3851697J718387L161864Q87111l709029n781611m209734k192363j463984
$$ y = [9822859, 12736902, 19204696, 22975749, 23451526, 24055951, 24168081, 20672999, 14994689, 11436979, 10662490, 10844654, 12501834, 16179777, 18377571, 16064204, 12527208, 12688659, 15366862, 16121201, 14754750, 13727191, 12194098, 8513199, 6087178, 9397721, 15887931, 18767694, 16622362, 13577942, 11287162, 7904248, 4382158, 4497869, 8051266, 10362059, 9346795, 7574205, 6769200, 5702864, 4212188, 4177254, 5707606, 6956618, 8066924, 10612475, 13044070, 11909423, 8149990, 6919037, 10088505, 13890154, 15190333, 15216408, 15551540, 15198691, 13643237, 12685262, 13194158, 13693929, 13851697, 15570084, 18731948, 19619059, 15910030, 10128419, 5918685, 3726322, 2262338]
4765B262338p27430N88920J401975J583392J789676J230963r07204k667950j531320
4756C023360J412717K989051K672357K211558J576275p01139l658437m364799
4748E160943k322422j4222J001994J423907J610427P48314r76637j903778j088088
4739C640438P33730K238234K180998j46814l461856m696708k566003M40608J581381
4730e5992J555100K250669K901557J774356N9365L17294J953614J946663k59045
4721A2443581j973273j374963M46178J550299R01359j526242m206248m496492
4713A764199j895449M49226M3043r89735M03160K522060J392219k381833m316637
4704c009747l118253j703478r62693J691479O106576P452087L384889j588444
$$ y = [2262338, 1534908, 2123828, 3525803, 5109195, 6898871, 8129834, 7222630, 4554680, 3023360, 4436077, 7425128, 10097485, 12309043, 13885318, 13184179, 9525742, 5160943, 2838521, 2824299, 3826293, 5250200, 6860627, 7608941, 6632304, 4728526, 3640438, 4374168, 6612402, 8793400, 8646586, 5184730, 488022, -2077981, -1637373, -55992, 1499108, 3749777, 6651334, 8425690, 8485055, 8802349, 10755963, 12702626, 12443581, 10470308, 9095345, 9541523, 11091822, 11993181, 10466939, 6260691, 1764199, -131250, 317976, 361019, -628716, -225556, 2296504, 3688723, 1306890, -3009747, -6128000, -7831478, -8794171, -7102692, -996116, 6455971, 9840860, 8252416]
4696H252416k501753q67316j188387l519323m159279k205679p28986j379949j728392
4687a0026648P98240M886701O875370N090628J318372j603385k599483k532179
4679B207616k257496j497600P8248J647650K154143J920311K115521K808858K827999
4670A2005250J632136J44603n29662k62604L86128P12912K8985j735990l332999
4661I048759k977374l14086K783057L663063J272656k510257m045117j515010
4653E405691K445253L271063K56722k242802q25984K044793J722118j852935m478458
4644E745461l877568j815493j15067J547627K971762K261835p29225k673714r64436
4635B351182K274799K874861J68151k504459k333464J8905K154535K925906K867594
$$ y = [8252416, 5750663, 4883347, 3694960, 175637, -3983642, -6189321, -6918307, -8298256, -10026648, -9228408, -4341707, 2533663, 7624291, 8942663, 7339278, 4739795, 2207616, -49880, -1547480, -1469232, 178418, 2332561, 4252872, 6368393, 9177251, 12005250, 13637386, 13781989, 13252327, 12989723, 13375851, 14088763, 14117748, 12381758, 9048759, 6071385, 5757299, 8540356, 12203419, 13476075, 10965818, 6920701, 5405691, 7850944, 11122007, 11378729, 9135927, 8309943, 10354736, 12076854, 10223919, 5745461, 1867893, 52400, -62667, 1484960, 4456722, 6718557, 5989332, 3315618, 2351182, 4625981, 7500842, 7668993, 5164534, 2831070, 2849975, 5004510, 7930416, 10798010]
4626A0798010K460582J154754j365024l574624l235930o33034R14579p24392l076197
4617B718724k184726J573723L711400J879474j108927j655477q9112R25853O53054
4608F423986M99981J045076J267480N28415n94440j575594k496204k998469k015711
4599H4520O97378L485830M083320J978963q45701j703701J96185K891216L531258
4590A4399268J258814j846117k904935j307494P22050Q79340l98884p77270M61627
4581A0486399J302404J64320j511076j606154q71524j490334k896855k372819
4573A204361R9126J290361M0963o85301J051726K690177J581494n46586r86343
4564E739978p75086j869431k403217J40039L062925J669868k498947k926969J847584
$$ y = [10798010, 13258592, 14413346, 13048322, 9473698, 6237768, 5604734, 6519313, 5794921, 2718724, 533998, 2107721, 5819121, 7698595, 6589668, 4934191, 4845079, 5770932, 6423986, 6923967, 7969043, 9236523, 9764938, 9170498, 7594904, 5098700, 2100231, 84520, 781898, 4267728, 8351048, 10330011, 9484310, 7780609, 7976794, 10868010, 14399268, 15658082, 13811965, 10907030, 9599536, 10321586, 11200926, 10802042, 10024772, 10486399, 11788803, 11953123, 10442047, 8835893, 7964369, 6474035, 3577180, 1204361, 1303487, 2593848, 2634811, 1949510, 3001236, 5691413, 7272907, 6726321, 5739978, 4964892, 3095461, 692244, 832283, 3895208, 5565076, 3066129, 139160, 1986744]
4555A986744N568525L470750j264888l036619j359442L72745L03163r17392k162788
4546B960798k209587j31774K707161L305917J320600q193J027399J796534L3344
4537A0802199k000435j313609O85111O26145j343251k383855j811537j367158
4529A893610j572237j306729m87101q2138J22505J053262K169425K277371J789804
4520E857772J675146J183338n56572j775416k30121K621668L150055Q51505j464311
4511A1313064k489290l440854m140338k509447Q77706K045797m65566k619056
4503a427984n62016L605623M860014K045090j506665k950498k546474j701564
4495a84474r46288k16987M19517P32479L52815r27788k337975k303133k83856
$$ y = [1986744, 7555269, 11026019, 9761131, 6724512, 5365070, 5737815, 6040978, 5123586, 2960798, 751211, 619437, 3326598, 6632515, 7953115, 7944922, 8972321, 10768855, 10802199, 8801764, 7488155, 8173266, 8799411, 7456160, 5072305, 3260768, 1893610, 321373, -985356, -1472457, -1554595, -1432090, -378828, 1790597, 4067968, 5857772, 7532918, 8716256, 8159684, 6384268, 6154147, 8775815, 11925870, 12777375, 11313064, 8823774, 5382920, 1242582, -1266865, -389159, 1656638, 1191072, -1427984, -1990000, 1615623, 6475637, 8520727, 7014062, 4063564, 1517090, -184474, -1130762, -1347749, -928232, -195753, 157062, -770726, -3108701, -5411834, -5695690]
4486e695690K181458L153992K490067J547713J227009J193239P79444n5815o60003
4477F161414l95605M00691M64043o97343j609607o52750J232471J497011k67755
4468F132570j697926j309807m12450l52415l80180J01172l09977k271745l366040
4459c866798j455947J418847J865398M78570N51020K313595K790978J365100Q50561
4450F311324K055375J914073r13319k903388j181869J467356Q88627j989175l256617
4441B392387k515717k488433l165776j432184L066735O265436N314437K229727
4433I666612K16290n26477j339898k092623j961676j392282j151938p85454K13430
4424H45984R76527O82168J81372N29055R95795K59141j306526k164958j766329
$$ y = [-5695690, -3514232, -360240, 2129827, 3677540, 4904549, 6097788, 6877232, 6821417, 6161414, 5765809, 6166500, 6630543, 5933200, 4323593, 3670843, 4903314, 6400325, 6132570, 4434644, 3124837, 2712387, 2359972, 1979792, 2080964, 1770987, -500758, -3866798, -5322745, -3903898, -2038500, -1559930, -1008910, 1304685, 4095663, 5460763, 6311324, 8366699, 10280772, 9367453, 6464065, 5282196, 6749552, 7638179, 5649004, 2392387, -123330, -2611763, -5777539, -7209723, -4142988, 2122448, 7436885, 9666612, 9882902, 9356425, 8016527, 5923904, 3962228, 2569946, 1418008, 632554, 845984, 1822511, 2504679, 2686051, 3215106, 4210901, 4470042, 3163516, 998558, -767771]
4415g67771p74630J76650P64429P87952P24847J443785K390964J565680j306322
4406E005584l246207j625404K080120M264894L689943J767626l27540k096605
4398I512411k298094k57389J837192J119591j533309k473222r18768j59001k118173
4389B711238m061189k663002J153574L747215L518783J959469Q62137M74455K81903
4380G984583K15301N93429J200928Q86923j194290l759018m102482j592936R95873
4371A228311J200023K67449N37431J150075j88138k272064j530611J907973L730334
4362F030783J978961j43949L55292K001266K094145O93294j060708l334398n568771
4353C045915n063067p83195L743187M469610J917224n23271j379237j327704o50707
$$ y = [-767771, -1542401, -1365751, -601322, 186630, 911477, 2355262, 4746226, 6311906, 5005584, 1759377, 133973, 2214093, 6478987, 10168930, 11936556, 11609016, 9512411, 7214317, 6956928, 8794120, 9913711, 8380402, 5907180, 4988412, 4829411, 2711238, -1349951, -4012953, -2859379, 887836, 4406619, 6366088, 7228225, 7702680, 7984583, 8199884, 8793313, 9994241, 10881164, 9686874, 5927856, 1825374, 232438, 1228311, 2428334, 2695783, 3233214, 4383289, 4195151, 1923087, 392476, 2300449, 6030783, 8009744, 7865795, 8221087, 10222353, 12316498, 13009792, 11949084, 8614686, 3045915, -2017152, -2800347, 942840, 5412450, 7329674, 6806403, 5427166, 4099462, 3448755]
4344C448755L37222n4704k575721m667835l483985q9234K238248K556366K116977
4335a73911J198493m68974j393213j69179J309727L36721j697015j087045J826010
4326c18386K632491l16726l462065l617266j964577p35376M69491K661752M516276
4317a34386M030075J520568r52428j956522j276411M44805J632536Q73080r64678
4308C216639j271427P28280K620461K052476k92944k105898k312289j355871l5843
4299A243584P05429Q4586j230551j283912N24904K089072J265641r74076j622148
4290H02529M17294K785891K380208j037761m371680m395527j222511J968841K725470
4281E2754J780081J157190J267730J329535J420144J991504K079094L95160k014882
$$ y = [3448755, 3785977, 3731273, 1155552, -3512283, -6996268, -7085502, -4847254, -2290888, -173911, 1024582, 555608, -837605, -1006784, 302943, 639664, -1057351, -2144396, -318386, 2314105, 1997379, -1464686, -5081952, -7046529, -7781905, -7312414, -4650662, -134386, 3895689, 5416257, 4463829, 2507307, 1230896, 1675701, 3308237, 4181317, 3216639, 1945212, 2673492, 5293953, 7346429, 7053485, 4947587, 2635298, 1279427, 1243584, 1949013, 2033599, 803048, -480864, 44040, 2133112, 3398753, 2424677, 802529, 1219823, 4005714, 6385922, 5348161, 976481, -3419046, -4641557, -2672716, 52754, 1832835, 2990025, 4257755, 5587290, 7007434, 8998938, 11078032, 11473192, 9458310]
4272I458310k603021r27049Q46974J282081J163815J224137Q29698k16959q55710
4263A0202276q11413j306197k483607k260181M90437L301263K811036p08443l440937
4254E794234k546176P32147K763288J676565p07793j326618J65373J187658L34529
4245H073207l83174R69143K623874J877624p9527L6868J678495Q99576k753421
4236A2942665m536865j618867K285941K290040r18304l061079k643729j747830
4228B991972j757220j669192m50281J321892K303234J627929k80477j441356k8314
4219B618187K896198M025032K141353k43034q01162m15612m51962J73084K332080
4210A2274164L549594J247951k472269l330669j277410j94332j369383j772822
$$ y = [9458310, 6855289, 5928240, 6775214, 8057295, 9221110, 10445247, 11274945, 11057986, 10202276, 9390863, 8084666, 5601059, 3340878, 3831315, 7132578, 9943614, 9235171, 5794234, 3248058, 3980205, 6743493, 8420058, 7712265, 6385647, 6551020, 7738678, 8073207, 7690033, 8659176, 11283050, 13160674, 13081147, 13118015, 14796510, 15696086, 12942665, 8405800, 6786933, 9072874, 11362914, 10444610, 7383531, 4739802, 2991972, 1234752, -434440, -884721, 437171, 2740405, 4368334, 4087857, 2646501, 2618187, 5514385, 9539417, 11680770, 11437736, 10636574, 10220962, 9769000, 9942084, 12274164, 15823758, 17071709, 14599440, 11268771, 9991361, 9797029, 8427646, 6654824]
4202F654824J97185J597299j86270k920152k947865p40269M38764J6615M69715
4193B579846K401722L120167J331158r8726J539924M187621L871229O30156k023003
4184A7540094k758525l349155l859710j812778K287147L571810k2456l687793
4176G908634k823208K067J54677r21285Q80548L737793K398463k113057l337170
4167E887462Q1775K615748J429399j80175l51952j478110l210452j071547M743931
4158H466079P527086M775555K210057K988670K565896l80436J138707Q981428
4150C8273042J3142241R150078R880893K4284865L4643000J6442880k2876420
4143A22940579m7841175m0190973j9117702r625807j0808140p906579L92264L725253
$$ y = [6654824, 6852009, 8449308, 8263038, 5342886, 2395021, 1654752, 2093516, 2110131, 2579846, 4981568, 8101735, 9432893, 9334167, 10874091, 15061712, 18932941, 19563097, 17540094, 14781569, 11432414, 7572704, 5759926, 8047073, 11618883, 11596427, 7908634, 5085426, 5087493, 5242170, 4320885, 5201433, 8939226, 11337689, 9224632, 5887462, 5969237, 8584985, 10014384, 9834209, 9482257, 8004147, 4793695, 3722148, 8466079, 15993165, 20768720, 22978777, 25967447, 28533343, 28152907, 29291614, 38273042, 51415283, 60565361, 70446254, 94731119, 129374119, 145816999, 122940579, 75099404, 34908431, 15790729, 6164922, -4643218, -12549797, -12157533, -8432280]
4135h432280J13006k215867K72351K841060K678945K130792K008991L78905j877896
4126b101993j607283M01302J61409k477794l410603j074476J652142K626360K715265
4117c115671K630156J844706Q79404P63266L78923j785798l703077j920415K519017
4108a509489M681768K644424l65174j348083j031667r48277p21093J74760P90414
4099B367583L48736m81086p94296k65839J266699L085927K984777l2484l027043
4090E452974k333989Q06206J546567j434750m162026l611996j558006m71546L49400
4081e417166J912288K315630r6376k806679k101589J407164L723826L130981J523096
4072C591175L54140j221285l408274m144128k210824K14667L68514j038858j055218
$$ y = [-8432280, -8319274, -10535141, -10262790, -7421730, -4742785, -2611993, -603002, -224097, -2101993, -3709276, -3307974, -3146565, -5624359, -9034962, -10109438, -8457296, -5830936, -3115671, -485515, 1359191, 2238595, 3001861, 3380784, 1594986, -2108091, -4028506, -1509489, 3172279, 5816703, 5451529, 4103446, 3071779, 2123502, 1402409, 1577169, 2367583, 2716319, 2235233, 1440937, 1175098, 2441797, 5527724, 8512501, 8480017, 5452974, 3118985, 3925191, 5471758, 4037008, -125018, -3737014, -5295020, -5766566, -5417166, -3504878, -1189248, -1285624, -4092303, -6193892, -4786728, -1062902, 2068079, 3591175, 3945315, 2724030, -684244, -4828372, -7039196, -6824529, -6456015, -7494873, -8550091]
4063h550091O99950J257275q77804k687885n88572M072717O303148M068196P81457
4054D478391K97796J879001J975876n98733l515391m293165k802467m39766J538485
4045a479973K432276J971664M71679j178091k015753j674411p58285l22659m78676
4036c032229O8018K113500M053346L484081O16784j776422k008363j023765l3075
4027B461875Q92886J215770j79412k251396k036113O10770J788905m29317k197191
4018a23223K44344L894792K947319k363215n935810m247267N6288K995059L308723
4009G77010J349814j857540l715030k041582J263974K203194Q00284J002019L614109
4000C396252M298550P63452k825851k026112J158405J863634q8876p64188J197991
$$ y = [-8550091, -7850141, -6592866, -7470670, -10158555, -10747127, -6674410, -371262, 3696934, 4478391, 4776187, 6655188, 8631064, 8032331, 4516940, 223775, -2578692, -3018458, -1479973, 952303, 2923967, 3395646, 2217555, 201802, -1472609, -2230894, -2553553, -3032229, -2964211, -850711, 3202635, 6686716, 7303500, 5527078, 3518715, 2494950, 2461875, 3354761, 4570531, 4391119, 2139723, 103610, 714380, 2503285, 2073968, -123223, 121121, 4015913, 6963232, 4600017, -1335793, -5583060, -5526772, -2531713, 777010, 2126824, 269284, -3445746, -5487328, -4223354, -2020160, -1219876, -217857, 3396252, 7694802, 8458254, 5632403, 3606291, 4764696, 6628330, 6539454, 5775266, 6973257]
3991F973257K818528J591508j361282l445243l445029j651354R91184L083569
3983E555138L203189R38825k483012m628113l499019J89165K779719J465579j786655
3974A734816k381756N60120K886648J525513j211761j593115r535M49594q59986
3965A100538j704731q46019O05678J454924J601030J024824l15005j514811j391132
3956A5296k16294N44390J74855o70413j011945l64616R32708J556999M19192j285288
3946I4884r25502J554894K643567K13045k719483k025858J411253L040676J233758
3937D521234j038265j034297N59211J724226J599859K83605j465143j920246j08177
3928C122007J967187J417927r28255j056955K219489M902560L232557j041417
$$ y = [6973257, 9791785, 11383293, 10022011, 6576768, 3131739, 1480385, 2471569, 5555138, 8758327, 9697152, 7214140, 2586027, -912992, -723827, 2055892, 3521471, 1734816, -646940, -86820, 2799828, 4325341, 3113580, 1520465, 1510930, 1960524, 1100538, -604193, -1450212, -844534, 610390, 2211420, 3236244, 2921239, 1406428, 15296, -200998, 343392, 518247, -152166, -1164111, -1528727, -596019, 960980, 1380172, 94884, -830618, 724276, 3367843, 3580888, 861405, -1164453, 246800, 3287476, 4521234, 3482969, 2448672, 3007883, 4732109, 6331968, 6615573, 5150430, 3230184, 3122007, 5089194, 6507121, 5578866, 4521911, 6741400, 11643960, 14876517, 13835100]
3920A3835100l085054j101210K110772K900035M16612l088339m563567k974895
3912D449454j73202J401417J462509J262218R66897k98662k027348k433990j327140
3903C282153m63803n41624l67116L61498K75012p16539p44703M03863K62161j842313
3893i1411k714428l65263K109818J176696j461067j919121n26090m04378j214499
3884e409743L35357M027618N510728L065414K85883L56318J723881J583833J82413
3875A1661702q37248j558575k625189l112716k135429r72417j248929k235274
3867c064075k018240l25879J565692K660591K390590K49288k874851m207307k023015
3858g647206J720198L586860K774066J197710L29710J24571N63311J861364L016855
$$ y = [13835100, 10750046, 9648836, 11759608, 14659643, 15076255, 11987916, 7424349, 4449454, 4276252, 5677669, 7140178, 8402396, 9369293, 9070631, 7043283, 4609293, 3282153, 2818350, 2276726, 1909610, 2271108, 2546120, 1829581, 1084878, 1488741, 1750902, -91411, -2805839, -3171102, -1061284, 115412, -1345655, -3264776, -3790866, -4195244, -5409743, -5074386, -1046768, 4463960, 7529374, 7815257, 8171575, 9895456, 11479289, 11661702, 10824454, 9265879, 6640690, 3527974, 1392545, 420128, -828801, -3064075, -5082315, -5408194, -3842502, -1181911, 1208679, 1457967, -1416884, -5624191, -7647206, -5927008, -2340148, 433918, 1631628, 1961338, 2085909, 2649220, 4510584, 7527439]
3849G527439K279198l09092k301052j434808J898453M861483M346741l58099o074736
3840A0435527p809786l847940J948099M535050L426594J882323J378134J40696
3832A2088697k702722m949890m591155k590312q86756J35421O69571K30781p88913
3823c385278m50287J643833K590578K54376k582284j565203K553527M356531J189709
3814D605502l374784m708996k733111m65554N87758J063280J254689P88263L87732
3805b595221J488267L681520M440311K248760j221923k983161k027143M6660J157344
3796D235414O30606p98427j986532k179312j378609l09680J86087L2568J09770
3787a458115J246671K951297L518099J862381q29728j988955o60741J001110K47454
$$ y = [7527439, 9806637, 9497545, 7196493, 5761685, 7660138, 12521621, 16868362, 16510263, 10435527, 2625741, -1222199, 725900, 5260950, 8687544, 10569867, 11948001, 12088697, 9385975, 4436085, -155070, -2745382, -3632138, -3496717, -2827146, -2596365, -3385278, -3835565, -2191732, 398846, 653222, -1929062, -3494265, -940738, 3415793, 4605502, 1230718, -3478278, -6211389, -6676943, -6089185, -5025905, -3771216, -2982953, -2595221, -1106954, 2574566, 7014877, 9263637, 8041714, 5058553, 3031410, 3078070, 4235414, 4866020, 4067593, 2081061, -98251, -1476860, -1786540, -1600453, -1567885, -1458115, -211444, 2739853, 6257952, 8120333, 7290605, 5301650, 4640909, 5642019, 5889473]
3778E889473k483662l768221j720907J230834J554837n17697j529821P7765J943775
3769F76376J654224K26457o375P96647O57289o45393j199782j57118Q92779L07610
3759C202714j461508k761655k579373j035288Q26029J380083k10883k493854k790944
3750g924679l60218K604567L688419K801163J368115K80829l02606j54706P45485
3741B746369J652314J767183J161192L14395p41159k105202l287959l464235k212852
3732d169954J46908K357047K483323k54062l555707l638715K13722M180619M333260
3723B096441J226029j560075k255821k127527k460280k710938k040713q68900
3715a0701784p6447L21582J029812K469721M193884N061600M184203K034023K19082
$$ y = [5889473, 3405811, -362410, -2083317, -852483, 702354, 184657, -1345164, -1267399, 676376, 2330600, 2557057, 2550682, 3347329, 4004618, 3359225, 2159443, 2002325, 2895104, 3202714, 1741206, -1020449, -3599822, -4635110, -3809081, -2428998, -2639881, -5133735, -7924679, -8284897, -5680330, -1991911, 809252, 2177367, 2458196, 2155590, 2000884, 2746369, 4398683, 6165866, 7327058, 7641453, 6900294, 4795092, 1507133, -1957102, -4169954, -4023046, -1665999, 817324, 563262, -2992445, -6631160, -6417438, -2236819, 2096441, 3322470, 1762395, -493426, -2620953, -5081233, -7792171, -9832884, -10701784, -10778231, -10456649, -9426837, -6957116, -2763232, 2298368, 6482571, 8516594, 8735676]
3706H735676k49896P2278J99301p0046o73480j888595l359854l564587j634372
3697b433575J022101K262401J720205N03310p36938j811018j857421k37433J703792
3688A35424J734229k90388k182491k289121j110667R5016Q76489J390822J720302
3679G9615J731154J099352k45701j271739m69703J744109K659777Q73015j217619
3670D982260o95811J430077J883184K87099o30724K62317J089166O78952L21045
3661I607565P75697O17266r07460j964492r12226R52864J237924l05364j878032
3652G223742k048890j046394k96319j032247k666163k939766r17214J073337N04865
3643b145049j343194j286063O05996J269214j75225j404558j259981r60868m47670
$$ y = [8735676, 8485780, 8558058, 8757359, 8687313, 8013833, 6125238, 2765384, -799203, -2433575, -1411474, 850927, 2571132, 3074442, 2337504, 526486, -1330935, -1568368, 135424, 1869653, 1579265, -603226, -2892347, -4003014, -3907998, -3031509, -1640687, 79615, 1810769, 2910121, 2664420, 1392681, 922978, 2667087, 5326864, 6199879, 4982260, 4286449, 5716526, 7599710, 7886809, 7256085, 7518402, 8607568, 9286520, 9607565, 10383262, 11000528, 10093068, 8128576, 7216350, 8169214, 9407138, 9101774, 7223742, 5174852, 4128458, 3832139, 2799892, 133729, -2806037, -3723251, -2649914, -2145049, -3488243, -4774306, -4168310, -2899096, -3074321, -4478879, -5738860, -6699728, -7147398]
3634g147398J829885M399986L185563j577199m077972j459470J583648N00982
3626b761975j876640p47616K367626K697444M68536k17141J137933J230196o71840
3617A626523j868261j468885j347968j889847j536033o19016j053750k078740
3609a0235977r04743J999118K833118N01314j504940l73005K522698M344126L799311
3600B981020R44852k755531m081043j332615K188915K018072n09161q0518L740280
3591C114271N378725K205471j461846j739417p87945j660380k741483j515168
3583G92228L82807L17804n70602k1397R65672N88632J91808J400238K007542n49421
3573E505311l851824l627767n56608J152707Q39532J716349M389863N299087K451480
$$ y = [-7147398, -5317513, -917527, 2268036, 690837, -3387135, -4846605, -3262957, -2761975, -4638615, -5386231, -3018605, -321161, 147375, -69766, 1068167, 2298363, 1626523, -241738, -1710623, -3058591, -4948438, -6484471, -7103487, -8157237, -10235977, -11140720, -9141602, -6308484, -5807170, -7312110, -7685115, -5162417, -818291, 2981020, 3925872, 1170341, -2910702, -4243317, -2054402, -36330, -545491, -626009, 3114271, 8492996, 10698467, 9236621, 7497204, 6709259, 5048879, 2307396, 792228, 1175035, 1492839, 922237, 900840, 1866512, 2455144, 2646952, 4047190, 6054732, 5505311, 1653487, -1974280, -2530888, -1378181, -538649, 1177700, 5567563, 10866650, 13318130]
3564A3318130j626447l840330l930207k974737j688359j069563j771474k130649
3556e713636J63382L813581M681623J823830p33465Q8360K056502J548702r62661
3547F766218k294076j484715k44385M38756J140811J786174J276156l46900j500440
3538E537599j462707j487741k653684l873169l178895l54864K711766M073322
3530f88373L385011J686159K53681k55844j14181j49967o90040r67911k39856
3521B218679O84324K31953j402541k116382j081397j89980o86659l22015L199880
3512E35862P128657N981178o54862o471682o239272k082235L43564o34174j982590
3503d075554j192797R07533K243272K011387R00330J85442O02913J390569J044854
$$ y = [13318130, 11691683, 7851353, 3921146, 946409, -741950, -1811513, -3582987, -5713636, -5550254, -1736673, 2944950, 4768780, 4035315, 4123675, 6180177, 7728879, 6766218, 4472142, 2987427, 2743042, 3181798, 4322609, 6108783, 7384939, 7038039, 5537599, 4074892, 2587151, -66533, -3939702, -7118597, -7473461, -4761695, -688373, 2696638, 4382797, 4636478, 4380634, 4266453, 4116486, 3426446, 2458535, 2218679, 2903003, 3134956, 1732415, -383967, -1465364, -1655344, -2342003, -2664018, 535862, 7664519, 13645697, 12990835, 6519153, 279881, -1802354, -1458790, -2092964, -4075554, -5268351, -4360818, -2117546, -106159, 794171, 979613, 1582526, 2973095, 4017949]
3494D017949m19906j193711l89617O42240Q00736R66468J613019R99854j764825
3485E272207l949984k731094N2246M29915j308046j029115K271017M319759J971077
3476E297982j868244k283590R59878L505847K166475j685083m346389l849172
3468b102296j390350N95777J152555J225398J630440J767610R82131l2094m16192
3459C412979o50877j333477j470714O2607K105223K409396Q57890n84272p65734
3450D043021j24813R35407K087077J937031m37322l000673k758504l14547P68863
3441C135540m38766q43213J374855L638487L075475O72078r95241j603875k147379
3432E867961k342107j670664j295152k210400k845304j245884J338705J806691
$$ y = [4017949, 3598043, 2404332, 2014715, 2656955, 3457691, 4424159, 6037178, 7037032, 5272207, 1322223, -1408871, -1356625, -926710, -2234756, -3263871, -992854, 3326905, 5297982, 3429738, 1146148, 2106026, 5611873, 7778348, 6093265, 1746876, -2102296, -3492646, -2896869, -1744314, -518916, 1111524, 2879134, 3861265, 3829171, 3412979, 2762102, 1428625, -42089, 20518, 2125741, 4535137, 5393027, 4808755, 4043021, 3918208, 4853615, 6940692, 8877723, 8440401, 5439728, 2681224, 2366677, 3135540, 2696774, 1853561, 3228416, 6866903, 9942378, 10614456, 9619215, 8015340, 5867961, 3525854, 1855190, 560038, -1650362, -4495666, -5741550, -4402845, -2596154]
3424b596154l47859k434663k262269k77458J954177L428755L661726K607421J006598
3415D740274k16555r38316j442621j531029j067257q02775j345651j805450r24401
3406e333781P64420J428114M97906o83161q66610k82939J84830J44987k20252
3397d366486l81676L19020J889710L123259K668838P89602p00387m74594Q26349
3388C693635J291442l30565l261572n067632l841481l64709K427638K542451Q35107
3379b075686o28789j139491j328183j448273j060950j38959P69998J474028K239179
3370c337126K937445K959811K081624P76824l35875q71110p22992l18613n25442
3361B644546j557424k174310q33213K244155M775526M472390J273022k420776
$$ y = [-2596154, -2944013, -5378676, -7640945, -7918403, -5964226, -2535471, 1126255, 3733676, 4740274, 4523719, 3585403, 2142782, 611753, -455504, -1258279, -2603930, -4409380, -5333781, -4569361, -3141247, -2643341, -3326502, -4193112, -4476051, -4291221, -4146234, -4366486, -4748162, -4429142, -2539432, 583827, 3252665, 4042267, 3341880, 2867286, 3693635, 4985077, 4654512, 1392940, -3674692, -7516173, -7880882, -5453244, -2910793, -2075686, -2704475, -3843966, -5172149, -6620422, -7681372, -7820331, -7050333, -5576305, -3337126, -399681, 2560130, 4641754, 5418578, 5082703, 4211593, 3488601, 3169988, 2644546, 1087122, -1087188, -1920401, 323754, 5099280, 9571670, 10844692, 8423916]
3353H423916l764863k121095K93127R55937J11932J87512J978700L056495J052332
3344A0173993k755799m717118l040532O60479L624717M352305K986004P08926
3336A1992975r91573j376349j014243q74702j132540j406235j676210k152598
3328A368525k575357k379454j251922Q98136L751100N804496N057048J662826
3320A2335398j312753j477141m24189j308790l816336m340097j450123J623301
3312a70730J351997j301063k420889m01987K381561L073090J750545N50066L99093
3303E211683O2030j408125k687653j960466M5720P54861l86192r20489P25907
3294e62724K472217J586434j096880k350077j134431M24584M66604l81649m90358
$$ y = [8423916, 4659053, 2537958, 2831085, 3787022, 3898954, 4086466, 6065166, 9121661, 10173993, 7418194, 2701076, -339456, 321023, 3945740, 8298045, 11284049, 11992975, 11001402, 9625053, 8610810, 7736108, 6603568, 5197333, 3521123, 1368525, -1206832, -3586286, -4838208, -3940072, -188972, 5615524, 10672572, 12335398, 11022645, 9545504, 9121315, 7812525, 3996189, -343908, -1794031, -170730, 1181267, -119796, -2540685, -2942672, -561111, 2511979, 4262524, 4812590, 5211683, 5273713, 3865588, 1177935, -782531, -736811, 18050, -368142, -1288631, -562724, 1909493, 3495927, 2399047, 48970, -1085461, -660877, -194273, -575922, -1066280]
3285a066280O96440K334281K834169J133814j559472k125320P26806M026424M036677
3276A1037539J310185m98627l07012o96231l039915n017517m217252j374738J385677
3267a417891L073304L270936J545743j018930j974855p53774M08255J31675j70558
3258C093905L24480k90662k764482l758472n94211L390387K778912j796884m248665
3249c865692j749886J778804K047219J36620l45723J215655K564342K472014J838378
3240F091731J489687R55635l84544k076410k857821j926117k8226Q72910l78834
3231A758011k530898l142721j395811J188972K796619K996796K288353J218531
3223E177852L95562K96847M78619j58656j765697k991333k596563r24392P95763
$$ y = [-1066280, -369840, 1964441, 4798610, 5932424, 4372952, 2247632, 2974438, 7000862, 11037539, 12347724, 11849097, 11542085, 10845854, 7805939, 2788422, -1428830, -2803568, -1417891, 1655413, 4926349, 6472092, 5453162, 3478307, 2724533, 3132788, 3264463, 3093905, 3418385, 3127723, 363241, -3395231, -3989442, -599055, 2179857, 382973, -3865692, -5615578, -3836774, -1789555, -1652935, -1998658, -783003, 1781339, 4253353, 6091731, 7581418, 8537053, 8152509, 6076099, 3218278, 1292161, 1263935, 2136845, 1758011, -772887, -3915608, -5311419, -4122447, -1325828, 1670968, 3959321, 5177852, 5573414, 5870261, 6348880, 6190224, 4424527, 1433194, -1163369, -2087761, -1291998]
3214a291998J931925K558013K612598J825210M63810m79032k43241O08903M88632
3205H474820j305853l148121k567537M79353L027641K703560P37521k3766R13227
3196I290845J642383J141161K83579l51838j250416k077350j426019N62990J495666
3187I311001J6850j992192k053226m20624Q34996P51128k03123j553717k750924
3178A940169k612270p13948J344160J811722J208987J047707R68799m87305k649176
3169A858845k909529n14828K182097K961446K183929J191649K81618n59615o92865
3160E982747p4571m9868j332606k388412j572922P4907K14570j125554j565629
3151a837338l04551L08497j592991l973662l280459M15599L157650K539391R79031
$$ y = [-1291998, 639927, 3197940, 5810538, 7635748, 8099558, 7620526, 7377285, 7986188, 8474820, 7168967, 4020846, 1453309, 1932662, 4960303, 7663863, 8401384, 8377618, 9290845, 10933228, 12074389, 12357968, 12006130, 10755714, 8678364, 7252345, 7815335, 9311001, 9327851, 7335659, 5282433, 4861809, 5696805, 6447933, 6244810, 4691093, 1940169, -672101, -1386049, -41889, 1769833, 2978820, 4026527, 4995326, 4508021, 1858845, -1050684, -1565512, 616585, 3578031, 5761960, 6953609, 7235227, 6675612, 5982747, 5908176, 5858308, 4525702, 2137290, 564368, 639275, 853845, -271709, -1837338, -2141889, -1833392, -3426383, -7400045, -10680504, -10264905, -7107255, -4567864, -3588833]
3142c588833J691121L276211J630931l144468n740927l035762J169019J802695
3134e940013k8873M31707L428436M423557J914088j16825P95909J409280j291910
3125E025356m398462l557117P9795K097720J788445J919571K922615K524983Q00559
3116I203465M24190J404246N46596k598183m061119j768988Q98301O56780n11137
3107D194151P03870K989546K614715l83392k452399k027913q68151j52808J035951
3098E653570K741925K807135o7927l874022n273093l133387N64500K699972J695285
3089C813958j157782l047611k645697j220341m11339j08779N24460J280652J597504
3080a374975J799130K010868J131562j085555k234833j95068L022415L423653
$$ y = [-3588833, -1897712, 1378499, 3009430, -135038, -5875965, -8911727, -7742708, -5940013, -5968886, -5537179, -2108743, 2314814, 4228902, 4112077, 4907986, 6317266, 5025356, 626894, -2930223, -2850428, -752708, 1035737, 2955308, 5877923, 8402906, 9203465, 9627655, 11031901, 11578497, 8980314, 4919195, 3150207, 4048508, 4705288, 4194151, 4898021, 7887567, 10502282, 10118890, 7666491, 5638578, 4770427, 4617619, 5653570, 8395495, 11202630, 11134703, 7260681, 1987588, -1145799, -581299, 2118673, 3813958, 2656176, -391435, -3037132, -4257473, -4668812, -4777591, -4253131, -2972479, -1374975, 424155, 2435023, 3566585, 2481030, 246197, 51129, 3073544, 6497197]
3072F497197P26598j327607o42262N83015o3016j526385j539261k51290N34761
3063B991750L05001N816O1036j46346j068919k223674k503495j114015J224108
3054b468738K269211O73434j816843k255086n01754P98732M36786J67321J112971
3045a583966J474977k79089k248186j580882J297856L289515K623779L62654j380041
3036A976617j183060Q33517K513586J228563k533797m677331k589304R23271J469061
3027b038877n82199j082977J189476K814017J353782j021750j251083K06420R07310
3018D94119L00068l07873k83748J49968J392233L796684N848029N244832K120209
3009A8754521o85700j263601r84858k128864m341873n032210k952425Q8400J374132
$$ y = [6497197, 7223795, 5896188, 5253926, 5836941, 5773925, 4247540, 2708279, 2456989, 2991750, 3296751, 3302567, 3363603, 3217257, 2148338, -75336, -2578831, -3692846, -2468738, -199527, 473907, -1342936, -3598022, -4099776, -3301044, -2864258, -2696937, -1583966, -108989, -388078, -2636264, -4217146, -2919290, 370225, 2994004, 3356658, 1976617, 793557, 1627074, 4140660, 5369223, 2835426, -1841905, -4431209, -3507938, -2038877, -2621076, -3704053, -2514577, 299440, 1653222, 631472, -619611, -413191, 494119, 794187, 486314, 202566, 352534, 1744767, 5541451, 11389480, 16634312, 18754521, 18068821, 16805220, 15820362, 13691498, 9349625, 4317415, 1364990, 1453390, 2827522]
3000B827522R8538k333806l838770k947770L59862M082386N192504K495985j769778
2991D166673m211487l762411j843173J91286J983398K990496K670564K061660
2983D247006K801871L926192K194572l030899p609869p323970k976599J255742
2975f515954K945891K582613J088918r54679k276128j839460o77745n56037j089555
2966g292136n10194J007936J481533P02853Q98222L078938N190459M896877K174954
2957A1629442j648316n235823o732429m496769L9442K565520J073536j096687
2949c902084J00285L377817L942612O11802k518781k107335M7884M37872q38319
2940h48247q83182J064327K478960J537576k80126p62524l09417q86270k559233
$$ y = [2827522, 2926060, 592254, -3246516, -6194286, -5834424, -1752038, 3440466, 5936451, 4166673, -44814, -3807225, -5650398, -5459112, -3475714, -485218, 2185346, 4247006, 7048877, 10975069, 13169641, 10138742, 2528873, -4795097, -7771696, -6515954, -3570063, -987450, 101468, -853211, -3129339, -4968799, -5646544, -6202581, -7292136, -7802330, -6794394, -5312861, -4610008, -3711786, -632848, 4557611, 9454488, 11629442, 9981126, 4745303, -1987126, -6483895, -6444453, -3878933, -2805397, -3902084, -3801799, -423982, 3518630, 4130432, 1611651, -495684, -447800, -9928, -848247, -1731429, -667102, 1811858, 3349434, 3069308, 2306784, 1997367, 1111097, -1448136]
2931a448136l093691j062464K196114M152579L589847J254687j062793j879960
2923B646183j279117q23882j392577j625540n4763J860361J376016q51547r80390
2914a125256K023253M023004J634766k460107l310381o20759J743571J762214
2906C670305R28975N21837l5012q91480j065368n18656l44241n79575k11323N96359
2896B071821O95612K29676J55985j37148j768619l318623k391631j28275j00726
2887d691928k264341k472305P29917L385279K350516L035j58667J055669Q65288
2878a197537o77110j685622j855832j582479P4971L099120M275269J101204l507221
2869a955237m314097p85456K582348K552992M34962q75580j81034J881249L562959
$$ y = [-1448136, -4541827, -5604291, -3408177, 744402, 4334249, 5588936, 4526143, 2646183, 1367066, 543184, -849393, -2474933, -2529696, -669335, 706681, -144866, -1125256, 897997, 4921001, 6555767, 4095660, 785279, 164520, 1908091, 3670305, 4599280, 5121117, 5086105, 4194625, 3129257, 2610601, 2266360, 1686785, 1475462, 2071821, 2767433, 2997109, 3153094, 3015946, 1247327, -2071296, -4462927, -4591202, -4691928, -6956269, -9428574, -8698657, -5313378, -2962862, -2959827, -3118494, -2062825, -1197537, -1874647, -3560269, -5416101, -6998580, -6923609, -3824489, 450780, 1551984, -1955237, -6269334, -7054790, -4472442, -1919450, -1484488, -2360068, -2541102, -659853, 2903106]
2860B903106K790492o51550l841892l634173o05603J800816J622726j08023j601665
2851a325766j847060l73172K217999L707691K423014k05929j245660j32702J107601
2842D326016J201224R22103J026997J012755K94130r10587k026090k382979j479601
2833A983968m3265J64079j075698j468960M17792K507403K294882Q78237R18462
2824F576900K002687J534785o74245k375347k925494l657833m425328l540306
2816g484181j311989R687J55765J120402L097195L789554K463783J130305Q73653
2807C844174N05030k85344l7816J194119J281187j01676o52859K57700K54306
2798F258821j560798k654941j516133l34052r92508j823339p95420J042207J551524
$$ y = [2903106, 5693598, 5042048, 1200156, -2434017, -3039620, -1238804, 383922, 275899, -1325766, -3172826, -3545998, -1327999, 2379692, 4802706, 4596777, 3351117, 3218415, 4326016, 5527240, 6449343, 7476340, 8489095, 8783225, 7872638, 5846548, 3463569, 1983968, 1940703, 2104782, 1029084, -439876, -22084, 2485319, 4780201, 5658438, 6576900, 8579587, 10114372, 9440127, 7064780, 4139286, 481453, -3943875, -7484181, -8796170, -8786483, -8630718, -7510316, -4413121, -623567, 1840216, 2970521, 3844174, 4349204, 4063860, 4026044, 5220163, 6501350, 6399674, 5746815, 6004515, 6258821, 4698023, 2043082, 526949, 192897, -799611, -2622950, -3418370, -2376163, -824639]
2789h24639L28652j986874m293456m079280R5153M341779K983303k166494k635221
2780h237077L735287Q172007M305758j528090p77480L253055J617062m600320
2772E940202o088274r37385K919188J404002l83613J095910J849223p98384k311463
2763B689406N93442L015094j80983n248624n244883o81600K296756J579748L54063
2754h27581K83070l18105j724374j588784P81971L007972L328721K516916J438109
2745F897915l96903k878703m206387k958946M4092K670238L405375K143878r8561
2736D621998k004229k846664k562650j205864P62978J864160R30871p63898p27606
2727a930904R66528J605828M12387J40316K315266M031927K364125o83893j215991
$$ y = [-824639, -495987, -2482861, -6776317, -10855597, -10760444, -6418665, -3435362, -5601856, -8237077, -4501790, 3670217, 7975975, 6447885, 5670405, 8923460, 10540522, 5940202, -148072, -1085457, 1833731, 3237733, 2854120, 3950030, 5799253, 5000869, 2689406, 3282848, 6297942, 6116959, 868335, -4376548, -5058148, -2761392, -1181644, -827581, -544511, -862616, -2586990, -4175774, -3393803, -385831, 2942890, 5459806, 6897915, 6501012, 3622309, -584078, -3543024, -3498932, -828694, 2576681, 4720559, 4621998, 2617769, -228895, -2791545, -3997409, -3234431, -1370271, -439400, -1203298, -1930904, -964376, 641452, 1053839, 1194155, 3509421, 7541348, 9905473, 9221580, 8005589]
2718H005589M99135R42685r02780k737712l228597l102646k240351J71738K370745
2709b22194J229469k343031l490955n02412K360730J502792n13582M13792L022928
2700A457537K862039l71392k339534p10886J810951J946834O4738j456095j634075
2691A630117r82894J20343J424043K089745J510673M79442M29060J575081K495665
2682A0771275J612079j106372l755155l954988j372253J250534O76861k802718
2674A319263n147946l275769J126882L879838L500647K158576J770804J598303
2666F930598N04816o05477k98585Q88237J398778J173962J104201N66049j924523
2657I738056n368939o249166l102330Q75205J517632j358352m423687n175231
$$ y = [8005589, 8504724, 9447409, 8544629, 5806917, 2578320, -524326, -2764677, -2592939, -222194, 1007275, -1335756, -4826711, -5329123, -2968393, -1465601, -1979183, -1565391, 1457537, 4319576, 3948184, 1608650, 897764, 2708715, 4655549, 4720287, 3264192, 1630117, 647223, 767566, 2191609, 4281354, 5792027, 6271469, 6700529, 8275610, 10771275, 12383354, 11276982, 7521827, 3566839, 2194586, 3445120, 4121981, 1319263, -3828683, -7104452, -5977570, -2097732, 1402915, 3561491, 5332295, 6930598, 7435414, 6829937, 6531352, 7419589, 8818367, 9992329, 11096530, 11662579, 9738056, 4369117, -1880049, -4982379, -4107174, -2589542, -3947894, -8371581, -13546812]
2649a3546812l826305j561490P97341K282004K028894P86139O72809K540800M606607
2640e220013M503917J918260j424712l579245l585379j773454K78101Q23980o9299
2631h127844k53325J745646M291286M394108J751169o11554k64224J532505J852521
2622F310288K51125q63243K6740J225325K81955k360168l791736k477636j6367
2613a413717J386596J640794J846311J927155J002601m48068q82742l01145m62209
2604D295576j780141k101689n7055K156388J523521j363298l140539k474364j316044
2595d257645j153426q72127N08208J556929Q69858j40528O74330K557306K925958
2586B668863J461404K89655N6235j162379m015483n718444l791612q1733J484270
$$ y = [-13546812, -17373117, -18934607, -18137266, -15855262, -13826368, -13040229, -12367420, -9826620, -5220013, -716096, 1202164, -222548, -3801793, -7387172, -9160626, -8882525, -8058545, -8127844, -8381169, -6635523, -2344237, 2049871, 3801040, 3189486, 2925262, 4457767, 6310288, 6561413, 5698170, 5724910, 6950235, 7232190, 4872022, 1080286, -1397350, -1413717, -27121, 1613673, 3459984, 5387139, 6389740, 5941672, 5058930, 4757785, 4295576, 2515435, 413746, 356691, 2513079, 4036600, 2673302, -467237, -2941601, -4257645, -5411071, -6283198, -5774990, -4218061, -3348203, -3488731, -2814401, -257095, 2668863, 4130267, 4419922, 4476157, 3313778, -701705, -6420149, -10211761, -10293494, -8809224]
2577h809224K15292r23794n2378J212524R92049M01599J567059L739186L911376
2568B253689J242415j446747j449784L67984J329336Q32378N04894J079117J308135
2559F021417K05610j536203k872101l437040k766109m77682J974849K047615p1309
2550i10953r25545R32752J961462r14903m525026l711582L36895J666155q88139
2541f978884k056577O50091K628277L20744k297676l47623L536435L515370R1653
2532i38190j297314M99306J381396n0342l18748K015225L356406J202711j852882
2523C997568k854897k721229k873098j863464J077053K758093N12457k657551
2515d625068j884405K181303M182109J678275k051521l114396j521050L30346
$$ y = [-8809224, -8593932, -9517726, -9570104, -8357580, -7365531, -6963932, -5396873, -1657687, 2253689, 3496104, 2049357, 599573, 967557, 2296893, 3129271, 3634165, 4713282, 6021417, 6227027, 4690824, 1818723, -1618317, -4384426, -4862108, -2887259, -839644, -910953, -1836498, -903746, 1057716, 142813, -4382213, -8093795, -7756900, -6090745, -6978884, -9035461, -8385370, -5757093, -5436349, -7734025, -8081648, -4545213, -1029843, -938190, -2235504, -1736198, -354802, -405144, -723892, 1291333, 4647739, 5850450, 3997568, 1142671, -1578558, -4451656, -6315120, -5238067, -2479974, -1967517, -4625068, -6509473, -4328170, -146061, 1532214, -519307, -3633703, -5154753, -4824407]
2507d824407J145296J371673J714707K074241J631319n6013j883440j999218l84683
2498a210525O47612l38097j622862r39435R70130J642820Q55539O89104J801836
2489B496122K225713N09397j954419k775938j523148Q6756L44524o62853j259898
2480b513744j94893J573771J856719K64889j040114m78744N70818O1992j388257
2471a287563j551242j40353R61003O83412j75209p83863j110043q56702M32131
2462c828429J940696K074656P05022p07611j371361j767559j848666p14481J312469
2453d205264K264442J162096n11525r86511n10650m23274j027831j508819j306552
2444g053888o81955k23764k11322k24675N08751J887136K488646J258882p92084
$$ y = [-4824407, -3679111, -2307438, -592731, 1481510, 3112829, 3056816, 1173376, -825842, -1210525, -562913, -901010, -2523872, -3463307, -2493177, -850357, 5182, 694286, 2496122, 4721835, 5231232, 3276813, 500875, -1022273, -935517, -590993, -1253846, -2513744, -2708637, -1134866, 721853, 986742, -53372, -532116, 38702, 100694, -1287563, -2838805, -2979158, -2018155, -1334743, -1509952, -2293815, -3403858, -4260560, -3828429, -1887733, 186923, 891945, 184334, -1187027, -2954586, -4803252, -5517733, -4205264, -1940822, -778726, -1290251, -2276762, -2787412, -3210686, -4238517, -5747336, -7053888, -7735843, -7959607, -8170929, -8395604, -7886853, -5999717, -3511071, -2252189, -3044273]
2435c044273j702645r44594M96426J770028K357662J396442j112151k927057j777568
2426e487730J265093L078586K932512K778389L131183K144812m63390k163538
2418G215917j731811j190790j761061j350691J300551L218815J397210k096434
2410E001706l057371j408360m82629j196027j261407k3770J94790j520420k575597
2401f329085p95306K201908L354482K025145j48063j876761l001964l377075k479409
2392a0426128k36336K359401L637646K531728n0295j507900j71172K450068L166329
2383A753341J072029j156494o24458J960899K994530N21859k961360l220945M44094
2374G83495M027725L652672K50287k197596k051175j158738r40301m51987Q37453
$$ y = [-3044273, -4746918, -5691512, -5195086, -3425058, -1067396, 329046, -783105, -3710162, -5487730, -4222637, -1144051, 1788461, 4566850, 7698033, 9842845, 9379455, 7215917, 5484106, 4293316, 2532255, 1181564, 2482115, 5700930, 7098140, 5001706, 1944335, 535975, 53346, -1142681, -2404088, -2427858, -2233068, -3753488, -6329085, -7124391, -4922483, -1568001, 457144, 309081, -1567680, -4569644, -7946719, -10426128, -10662464, -8303063, -4665417, -2133689, -2183984, -3691884, -3863056, -1412988, 1753341, 2825370, 1668876, 1044418, 3005317, 5999847, 6521706, 3560346, 339401, 783495, 4811220, 8463892, 8714179, 6516583, 4465408, 3306670, 2366369, 1914382, 2751835]
2365B751835J406983M92133j60591N22748N17310j837375m117884k882248R39951
2356b367138L111110J744892j210794l409717l839086j837034K005197M244806
2348a557764J754566l217446m975126j993441J349034J714611J128353K179375
2340c617838L043385Q22729l011617m437018k547792J14265J835813K929837L200923
2331a667313J639815j004094k200845r88543Q77132J893816K745800M025129M013310
2322I334207Q91190l707919n675068l272026P65402K784394K332374J256535J8618
2313D727707k450961n296870n236083j085588L521397M216740J171758k014434
2305b446334l288378l203331k064577N59327L521151M463102K978339Q11281j168270
$$ y = [2751835, 4158818, 4650951, 4490360, 5013108, 5530418, 3693043, -424841, -3307089, -2367138, 743972, 2488864, 1278070, -2131647, -5970733, -7807767, -5802570, -1557764, 196802, -3020644, -7995770, -9989211, -8640177, -6925566, -5797213, -3617838, -574453, 248276, -2763341, -7200359, -9748151, -9633886, -7798073, -4868236, -1667313, -27498, -1031592, -3232437, -4220980, -3343848, -1450032, 1295768, 5320897, 9334207, 10225397, 6517478, 842410, -2429616, -1664214, 1120180, 3452554, 4709089, 4727707, 2276746, -3020124, -8256207, -9341795, -5820398, -1603658, -431900, -2446334, -5734712, -8938043, -11002620, -10443293, -6922142, -2459040, 519299, 1330580, 162310]
2296A62310l226692m017313j415683L026841M522091J726810q48022M61015L025513
2287C416870K450312n63029j888586m94921P74546n8559k071200l565821l462385
2278e462773j389596J141921J025313k203298m143096j061680L992341M956343
2270c144525J521604r36983J2355R14337p13292k093735m50205K003123J875403
2261a011918N0239m14496O06117J016843N78971O28099Q74157K9310j036238k86803
2251A034281J452057R57360k292593m716673l635609r01456L65083L78682J438477
2242e920391L479928L969742K108370J79717j95213n17710k266610l454634j303488
$$ y = [162310, -3064382, -7081695, -8497378, -5470537, -948446, 778364, -69658, 391357, 3416870, 5867182, 5304153, 3415567, 2920646, 3695192, 3636633, 1565433, -2000388, -5462773, -6852369, -5710448, -4685135, -6888433, -11031529, -12093209, -8100868, -3144525, -1622921, -2559904, -2547549, -1633212, -2346504, -4440239, -4890444, -2887321, -1011918, -961679, -1376175, -770058, 246785, 825756, 1453855, 2328012, 2357322, 1321084, 1034281, 2486338, 3443698, 1151105, -3565568, -7201177, -8102633, -7737550, -7358868, -5920391, -2440463, 1529279, 3637649, 3817366, 3622153, 3104443, 837833, -2616801, -3920289]
$$ [...]
##END NTUPLES=NMR SPECTRUM
##END=
