##TITLE=31Pdec_DE-92K2_d6
 DMSO-d6, 64 sc
 6.5.2025
##JCAMPDX= 6.0         $$ Bruker NMR JCAMP-DX V2.0
##DATA TYPE= NMR SPECTRUM
##DATA CLASS= NTUPLES
##ORIGIN= UXNMR, Bruker Analytische Messtechnik GmbH
##OWNER= root
$$ XWIN-NMR		Version 3.5
$$ Tue May  6 13:52:18 2025 Russian Standard Time (UT+4h)  she@DPX200
##.OBSERVE FREQUENCY= 81.013821
##.OBSERVE NUCLEUS= ^31P
##.ACQUISITION MODE= SIMULTANEOUS
##.ACQUISITION SCHEME= undefined
##.AVERAGES= 64
##.DIGITISER RES= 17
##SPECTROMETER/DATA SYSTEM= spect
##.PULSE SEQUENCE= zgpg30
##.SOLVENT NAME= D2O
##.SHIFT REFERENCE= (INTERNAL, D2O, 0, 198.062)
##AUDIT TRAIL= $$ (NUMBER, WHEN, WHO, WHERE, WHAT)
$$ ##TITLE= Audit trail, XWIN-NMR		Version 3.5
$$ ##JCAMPDX= 5.01
$$ ##ORIGIN= Bruker BioSpin GmbH
$$ ##OWNER= she
$$ F:/spectra/data/she/nmr/P31/2/pdata/1/auditp.txt
$$ ##AUDIT TRAIL=  $$ (NUMBER, WHEN, WHO, WHERE, WHAT)
(   1,<2025-05-06 13:50:59.96 +0400>,<she>,<DPX200>,
      <created by zg, POWCHK disabled, PULCHK disabled
       configuration hash MD5:
       00 E9 B6 7A A2 85 ED C7 34 08 36 98 17 FE 4E 26
       data hash MD5: 32K
       5B 22 C3 D9 FD F5 C1 05 1C 81 DD 8E 7F 21 E4 C0>)
(   2,<2025-05-06 13:51:02.26 +0400>,<she>,<DPX200>,
      <Start of raw data processing
       efp BC_mod = 2 LB = 1.5 FT_mod = 6 PKNL = 1 PHC0 = 1793.278 PHC1 = -1061.907 SI = 64K 
       data hash MD5: 64K
       5D 23 1F 18 DB 8B ED 96 EE 7F 2E 92 C9 58 EC 88>)
(   3,<2025-05-06 13:51:35.56 +0400>,<she>,<DPX200>,
      <pk PHC0 = -273.3582 PHC1 = 812.6008 
       data hash MD5: 64K
       9F 6C AA EC D5 2F 02 6D 1F 87 E1 78 71 E0 06 3B>)
(   4,<2025-05-06 13:51:40.42 +0400>,<she>,<DPX200>,
      <abs ABSG = 5 
       data hash MD5: 64K
       B4 B6 58 74 0D 6B 03 25 76 F3 D8 A6 C4 8C 61 4E>)
$$ ##END=
$$ 
$$ hash MD5
$$ 92 5A 28 5C AC 9C 04 B8 E5 BC CA 11 DE 28 4D 59
##$RELAX= 
##$RELAX= 
##$RELAX= 
##$RELAX= 
##$RELAX= 
##$RELAX= 
##$RELAX= 
##$RELAX= 
$$ Bruker specific parameters
$$ --------------------------
##$DU= <F:/spectra>
##$EXPNO= 2
##$NAME= <P31>
##$PROCNO= 1
##$TYPE= <nmr>
##$USER= <she>
##$AMP= (0..31)
100 100 100 100 100 100 100 100 100 100 100 100 100 100 100 100 100 100 
100 100 100 100 100 100 100 100 100 100 100 100 100 100 
##$AQSEQ= 0
##$AQ_mod= 1
##$AUNM= <au_zg>
##$AUTOPOS= <>
##$BF1= 81.014009
##$BF2= 200.13
##$BF3= 200.13
##$BF4= 200.13
##$BF5= 200.13
##$BF6= 200.13
##$BF7= 200.13
##$BF8= 200.13
##$BYTORDA= 1
##$CFDGTYP= 0
##$CFRGTYP= 5
##$CHEMSTR= <none>
##$CNST= (0..31)
1 1 145 1 1 1 1 1 1 1 1 1 1 1 1 1 1 1 1 1 1 1 1 1 1 1 1 1 1 1 1 1 
##$CPDPRG= <waltz16>
##$CPDPRG1= <>
##$CPDPRG2= <waltz16>
##$CPDPRG3= <>
##$CPDPRG4= <mlev>
##$CPDPRG5= <mlev>
##$CPDPRG6= <mlev>
##$CPDPRG7= <mlev>
##$CPDPRG8= <mlev>
##$CPDPRGB= <>
##$CPDPRGT= <>
##$D= (0..31)
0 1 0 0 0 0 0 0 0 0.06 0 0.03 2e-05 3e-06 0 0 0.0002 0 0 0 0 0 0 0 0 0 
0 0 0 0 0 0 
##$DATE= 1746525059
##$DBL= (0..7)
120 120 120 11 120 120 24 19 
##$DBP= (0..7)
150 150 150 150 150 150 150 150 
##$DBP07= 0
##$DBPNAM0= <>
##$DBPNAM1= <>
$$ [...]
##$SUBNAM3= <"">
##$SUBNAM4= <"">
##$SUBNAM5= <"">
##$SUBNAM6= <"">
##$SUBNAM7= <"">
##$SUBNAM8= <"">
##$SUBNAM9= <"">
##$SW= 400.765351723535
##$SWIBOX= (0..15)
0 1 3 0 0 0 0 0 0 0 0 0 0 0 0 0 
##$SW_h= 32467.5324675325
##$TD= 32768
##$TD0= 1
##$TE= 0
##$TE2= 300
##$TE3= 300
##$TEG= 300
##$TL= (0..7)
0 120 53 12 22 120 120 120 
##$TP= (0..7)
150 150 150 150 150 150 150 150 
##$TP07= 0
##$TPNAME0= <>
##$TPNAME1= <>
##$TPNAME2= <>
##$TPNAME3= <>
##$TPNAME4= <>
##$TPNAME5= <>
##$TPNAME6= <>
##$TPNAME7= <>
##$TPOAL= (0..7)
0.5 0.5 0.5 0.5 0.5 0.5 0.5 0.5 
##$TPOFFS= (0..7)
0 0 0 0 0 0 0 0 
##$TUNHIN= 0
##$TUNHOUT= 0
##$TUNXOUT= 0
##$USERA1= <user>
##$USERA2= <user>
##$USERA3= <user>
##$USERA4= <user>
##$USERA5= <user>
##$V9= 5
##$VALIST= <valist>
##$VCLIST= <CCCCCCCCCCCCCCC>
##$VD= 0
##$VDLIST= <DDDDDDDDDDDDDDD>
##$VPLIST= <PPPPPPPPPPPPPPP>
##$VTLIST= <TTTTTTTTTTTTTTT>
##$WBST= 1024
##$WBSW= 4
##$XGAIN= (0..3)
0 0 0 0 
##$XL= 0
##$YL= 0
##$YMAX_a= 10213
##$YMIN_a= -10610
##$ZGOPTNS= <>
##$ZL1= 120
##$ZL2= 120
##$ZL3= 120
##$ZL4= 120
##$ABSF1= 198.0616
##$ABSF2= -202.7028
##$ABSG= 5
##$ABSL= 3
##$ALPHA= 0
##$AQORDER= 0
##$ASSFAC= 0
##$ASSFACI= 0
##$ASSFACX= 0
##$ASSWID= 0
##$AUNMP= <proc_1d>
##$AZFE= 0.1
##$AZFW= 0.5
##$BCFW= 0
##$BC_mod= 2
##$BYTORDP= 0
##$COROFFS= 0
##$CY= -3
##$DATMOD= 1
##$DC= 0
##$DFILT= <>
##$DTYPP= 0
##$F1P= 0
##$F2P= 0
##$FCOR= 1
##$FTSIZE= 65536
##$FT_mod= 6
##$GAMMA= 0
##$GB= 0
##$INTBC= 1
##$INTSCL= 9.790993e-09
##$ISEN= 30
##$LB= 1.5
##$LEV0= 0
##$LPBIN= 0
##$MAXI= 10000
##$MC2= 0
##$MEAN= 0
##$ME_mod= 0
##$MI= 50
##$NCOEF= 0
##$NC_proc= -8
##$NLEV= 6
##$NOISF1= 182.463
##$NOISF2= 159.3651
##$NSP= 0
##$NTH_PI= 0
##$NZP= 0
##$OFFSET= 198.0616
##$PC= 4
##$PHC0= 1519.92
##$PHC1= -249.3062
##$PH_mod= 1
##$PKNL= yes
##$PPARMOD= 0
##$PSCAL= 0
##$PSIGN= 0
##$REVERSE= no
##$SF= 81.0140089999434
##$SI= 65536
##$SIGF1= 159.3651
##$SIGF2= -187.1042
##$SINO= 113.3802
##$SIOLD= 16384
##$SREGLST= <1H.CDCl3>
##$SSB= 0
##$STSI= 65536
##$STSR= 0
##$SW_p= 32467.5324675325
##$SYMM= 0
##$S_DEV= 0
##$TDeff= 32768
##$TDoff= 0
##$TI= <>
##$TILT= no
##$TM1= 0
##$TM2= 0
##$TOPLEV= 0
##$USERP1= <user>
##$USERP2= <user>
##$USERP3= <user>
##$USERP4= <user>
##$USERP5= <user>
##$WDW= 1
##$XDIM= 65536
##$YMAX_p= 536946253
##$YMIN_p= -270955167
$$ End of Bruker specific parameters
$$ ---------------------------------
##NTUPLES= NMR SPECTRUM
##VAR_NAME=  FREQUENCY,     SPECTRUM/REAL,   SPECTRUM/IMAG
##SYMBOL=    X,             R,               I
##VAR_TYPE=  INDEPENDENT,   DEPENDENT,       DEPENDENT
##VAR_FORM=  AFFN,          ASDF,            ASDF
##VAR_DIM=   65536,         65536,           65536
##UNITS=     HZ,            ARBITRARY UNITS, ARBITRARY UNITS
##FACTOR=    0.49542278885378, 1,            1
##FIRST=     16045.7642231865, 0,            0
##LAST=      -16421.768244346, 0,            0
##MIN=       -16421.768244346, -270955167,   0
##MAX=       16045.7642231865, 536946253,    0
$$ Real data points
##PAGE= N=1
##DATA TABLE= (X++(R..R)), XYDATA
$$ [...]
43409e15730M19098O3472O67266J807903K395891R04788k119008l583869j910984
$$ -515730 -96632 -33160 634106 2442009 4837900 5742688 3623680 39811 -1871173
43400a871173K91884N6073j310186o03436J657178J889530o89077k865986k586920
$$ -1871173 -1579289 -1523216 -2833402 -3436838 -1779660 109870 -579207 -3445193 -6032113
43391f032113j533639j404515j094877O33252K542568K964178K119783O97951
$$ -6032113 -7565752 -8970267 -10065144 -9431892 -6889324 -3925146 -1805363 -1107412
43383a107412j408690l143578j955951J997897M138495J410705k350075j248113
$$ -1107412 -2516102 -5659680 -7615631 -5617734 -1479239 -68534 -2418609 -3666722
43375c666722L872646O229174K570884k805390m511381k453702j6634P71296M8584
$$ -3666722 205924 6435098 9005982 6200592 1689211 -764491 -781125 -9829 38755
43366C8755j377486k141382q13588J844477K848450R38238j226022p21742J467163
$$ 38755 -1338731 -3480113 -4293701 -2449224 399226 1337464 111442 -610300 856863
43357H56863K176410P03195o63415j85607J247386J462338p48245m271811n940049
$$ 856863 3033273 3736468 3073053 2887446 4134832 5597170 4848925 577114 -5362935
43348e362935l440796J159820K707999o84697m626570m005717L45910L432630
$$ -5362935 -8803731 -7643911 -4935912 -5620609 -10247179 -14252896 -13906986 -10474356
43340a0474356L071109J666370J644081K503196K594173J136716j665321m273819
$$ -10474356 -7403247 -5736877 -4092796 -1589600 1004573 2141289 475968 -3797851
43332c797851m046542m41461K680161J218993l080532m442841j033108K940117
$$ -3797851 -7844393 -8285854 -5605693 -4386700 -7467232 -11910073 -12943181 -10003064
43324a0003064L759820K575854J797267J246412J88277k70020O27282J424683
$$ -10003064 -6243244 -3667390 -1870123 -623711 -435434 -705454 -78172 1346511
43316A346511R95762L73675K33136n21829j837896j566983M32837J022295p91673
$$ 1346511 2342273 2715948 2949084 2427255 589359 -977624 -544787 477508 -314165
43307c14165j343380J355584L202496N42970l020805k162466J207271J254871
$$ -314165 -1657545 -301961 2900535 3443505 422700 -1739766 -532495 722376
43299G22376j803872k444391L77127J686685p93640l401546l350316k419277k054940
$$ 722376 -1081496 -3525887 -3148760 -1462075 -2255715 -5657261 -9007577 -11426854 -13481794
43290a3481794p31579J683484K500515J369204J421642L004566K125090j968679
$$ -13481794 -14213373 -12529889 -10029374 -8660170 -7238528 -4233962 -2108872 -4077551
43282d077551l816000l65954L252683J579383k744707m090219k768275k301370
$$ -4077551 -7893551 -8259505 -5006822 -3427439 -6172146 -10262365 -13030640 -15332010
43274a5332010j587255K625439P632704P074492J064808l148776j545687J924465
$$ -15332010 -16919265 -14293826 -6661122 413370 1478178 -1670598 -3216285 -1291820
43266a291820K486641P51829n37525j196538k077672k337505j135897K95171O54224
$$ -1291820 1194821 1946650 1409125 212587 -1865085 -4202590 -5338487 -5043316 -4389092
43257d389092P99198J974262L267588K629067l85619l968132n562030l763745
$$ -4389092 -3589894 -1615632 1651956 4281023 3895404 -72728 -5634758 -9398503
43249i398503K81891L361387L266356J265407K43354Q79135J446771R94659N39022
$$ -9398503 -9116612 -5755225 -2488869 -1223462 -980108 -100973 1345798 2340457 2879479
43240B879479J013916J967963K490039J909539j61929k901422m074592k698601
$$ 2879479 3893395 5861358 8351397 10260936 10099007 7197585 3122993 424392
43232D24392r66839j143854j743563l5581K624537K175868j450146l540854j587864
$$ 424392 -542447 -1686301 -3429864 -3465445 -840908 1334960 -115186 -3656040 -5243904
43223e243904J221237J408506K85811R56509L118143L798365J599364k033179
$$ -5243904 -4022667 -2614161 -2328350 -1371841 1746302 5544667 7144031 5110852
43215E110852m550281l942043k29430L553597L713439L12301k698004k571079
$$ 5110852 560571 -3381472 -3610902 -57305 3656134 3968435 1270431 -1300648
43207a300648o20484Q53775J543881J673761O13697j216420j892548j229379j435206
$$ -1300648 -1921132 -1067357 476524 2150285 2763982 1547562 -344986 -1574365 -3009571
43198c009571k674752j674198K567566N575807L669518l9106m51123J642782J748326
$$ -3009571 -5684323 -7358521 -4790955 784852 4454370 4415264 3964141 5606923 7355249
43189G355249m25110j121969L98462R86501q2842K02245K364022K383514j732665
$$ 7355249 6930139 5808170 6206632 7193133 7110291 7312536 9676558 12060072 10327407
43180A0327407n839003n228442j120511J565343P21416j561801k671554j932883
$$ 10327407 4488404 -740038 -1860549 -295206 426210 -1135591 -3807145 -5740028
43172e740028j11885J509173J785579O89422n57462r40588p35202p19428j018081
$$ -5740028 -5851913 -4342740 -2557161 -1867739 -2425201 -3365789 -4100991 -4820419 -5838500
43163e838500j202522j000797o02440n42676j087473j436629l29897J912591L169010
$$ -5838500 -7041022 -8041819 -8644259 -9186935 -10274408 -11711037 -12040934 -10128343 -6959333
43154f959333K423940J344787J290883O47538k164792m716106l365108P32479
$$ -6959333 -4535393 -3190606 -1899723 -1252185 -3416977 -8133083 -11498191 -10765712
43146a0765712K570161M00432k198542k111424m71072O72769J494774K254114
$$ -10765712 -8195551 -7795119 -9993661 -12105085 -12576157 -11903388 -10408614 -8154500
43138h154500J676040j39618n11302J470588K529600J89489k753503k316596N68087
$$ -8154500 -6478460 -6618078 -7129380 -5658792 -3129192 -2939703 -5693206 -8009802 -7441715
43129g441715J995327J213142N44158M97142m98596j970895j549913M91265J141939
$$ -7441715 -5446388 -4233246 -3689088 -3191946 -3690542 -5661437 -7211350 -6720085 -5578146
43120e578146q5766l0187K453363L788306J203604k429760k661330L609J398567
$$ -5578146 -5663912 -5694099 -3240736 547570 1751174 -678586 -3339916 -3336307 -1937740
43111a937740J87272r25358k72121M24366j99197n31831P53819J535458o39440
$$ -1937740 -1750468 -2675826 -2947947 -2523581 -2722778 -3254609 -2500790 -965332 -1604772
43102a604772l867770l860350k43889K655510J992518m3704l88521M69471P66410
$$ -1604772 -5472542 -9332892 -9576781 -6921271 -4928753 -4972457 -5360978 -4891507 -4125097
43093d125097J270564L200541M401250J964145k313892l702364j629487k29120
$$ -4125097 -2854533 346008 4747258 6711403 4397511 695147 -934340 -1163460
43085a163460j247504j582354M49724J725491J93553q48527J377740L296683M97638
$$ -1163460 -2410964 -3993318 -3543594 -1818103 -1624550 -2473077 -1095337 2201346 2698984
43076B698984m048483l666966J636472M970132K708777j237347k319784r11963
$$ 2698984 -1349499 -5016465 -3379993 1590139 4298916 3061569 741785 -170178
43068a70178Q73282K810307M324075K984068j476206m976648m218981j287236
$$ -170178 703104 3513411 7837486 10821554 9345348 4368700 149719 -1137517
43060a137517R348k32950M01993J643076J259302l78381n91923R59706J620139
$$ -1137517 -1128169 -1361119 -959126 683950 1943252 1564871 972948 1932654 3552793
43051C552793R3427j761085k223634j922698j635636m02230K514433N452088N799935
$$ 3552793 3646220 1885135 -338499 -2261197 -3896833 -4299063 -1784630 3667458 9467393
43042I467393K865611j595081m928055n213418k577547M17741Q77366j140990
$$ 9467393 12333004 10737923 5809868 596450 -1981097 -1563356 -685990 -1826980
43034a826980k574624j334644J095419K181197J884322J799485J933172Q82986
$$ -1826980 -4401604 -5736248 -4640829 -2459632 -575310 1224175 3157347 4040333
43026D040333j107955j985406j277059j106141k626357l733371k201127P14706
$$ 4040333 2932378 946972 -330087 -1436228 -4062585 -7795956 -9997083 -9282377
43018i282377K191292K086874K449626L387952K680559p8732k173377j989911
$$ -9282377 -7091085 -5004211 -2554585 833367 3513926 3435194 1261817 -728094
43010g28094j663207l252110m648990k473330K262690M977653L925545K244688
$$ -728094 -2391301 -5643411 -10292401 -12765731 -10503041 -5525388 -1599843 644845
43002F44845K549842K733714l31164m921164n698529q20909N036792O139028K416784
$$ 644845 3194687 5928401 5597237 676073 -5022456 -5843365 -806573 5332455 7749239
42993G749239j256247j733787r37630j757309l092763j599007K558543M943399
$$ 7749239 6492992 4759205 3821575 2064266 -1028497 -2627504 -68961 4874438
42985D874438K692555j507781l075252j313025O67956O44965n63344j328620j374215
$$ 4874438 7566993 6059212 2983960 1670935 2338891 2983856 2420512 1091892 -282323
42976b82323j352364j744467k467562k639483j080892J792721L300714J490272
$$ -282323 -1634687 -3379154 -5846716 -8486199 -9567091 -7774370 -4473656 -2983384
42968b983384j734423k672323q35947O22107j59754j157124l3593K136258K767653
$$ -2983384 -4717807 -7390130 -8226077 -7603970 -7763724 -8920848 -8954441 -6818183 -4050530
42959d050530J803071J475116K569870L089126J126168k249173l992804k751274
$$ -4050530 -2247459 -772343 1797527 4886653 6012821 3763648 -229156 -2980430
42951b980430n64858j34578j007680l55146K100578K643286q58672m377234k451517
$$ -2980430 -3545288 -3679866 -4687546 -5042692 -2942114 -298828 -1157500 -5534734 -7986251
42942g986251L689430P127564M469487m32912l003692l532047l954065l386335
$$ -7986251 -4296821 2830743 7300230 6867318 3863626 331579 -3622486 -7008821
42934g008821n59625K337661K373365O20072L34235J554415J268889j442077l815483
$$ -7008821 -7568446 -5230785 -2857420 -2237348 -1903113 -348698 920191 -521886 -4337369
42925d337369l261528l65686K279802K612859O45396j294544o57978J901354K841033
$$ -4337369 -7598897 -7964583 -5684781 -3071922 -2426526 -3721070 -4379048 -2477694 363339
42916C63339R18425m23941J588021L977088K146211k845247n711820m593070k455956
$$ 363339 1281764 857823 2445844 6422932 8569143 5723896 12076 -4580994 -7036950
42907g036950j245167K21007J951166J510111j306365k955898j405430Q80403
$$ -7036950 -8282117 -8061110 -6109944 -4599833 -5906198 -8862096 -10267526 -9387123
42899i387123J337172J114120K084090L288906L065043K028285J335832L49443
$$ -9387123 -8049951 -6935831 -4851741 -1562835 1502208 3530493 4866325 5215768
42891E215768j514828k872135k686082k286392k757429k648254p76979J039821
$$ 5215768 3700940 828805 -1857277 -4143669 -6901098 -9549352 -10326331 -9286510
42883i286510Q03635l39844m06394O7699j3537N65030K673014L688696J270014
$$ -9286510 -8482875 -8822719 -9229113 -9161414 -9174951 -8609921 -5936907 -2248211 -978197
42874i78197j725004r82088K017643K003176j346886k661934L31510L204575K140489
$$ -978197 -2703201 -3685289 -1667646 335530 -1011356 -3673290 -3341780 -137205 2003284
42865B003284m70793r18430j55208r24178k362048j960261o10270j030731k381266
$$ 2003284 1532491 614061 458853 -465325 -2827373 -4787634 -5397904 -6428635 -8809901
42856h809901j134720K714287M715019K391757j030493j366553P32339J353096
$$ -8809901 -9944621 -7230334 -2515315 -123558 -1154051 -2520604 -1788265 -435169
42848d35169q12722l013701k619974l30201J439560J535097L22717j610505l369700
$$ -435169 -1247891 -4261592 -6881566 -7211767 -5772207 -4237110 -3914393 -5524898 -8894598
42839h894598l179921J9633M286761N893713L576158M1182j633813j506387j361304
$$ -8894598 -12074519 -12054886 -7768125 -1874412 1701746 1742928 109115 -1397272 -2758576
42830b758576j401741n05283J035264J447733K52548r24664q42256l42433p87536
$$ -2758576 -4160317 -4665600 -3630336 -2182603 -1930055 -2854719 -3696975 -4039408 -4826944
42821d826944j926684k196636o59907J855524L386268K626790K95220j615582
$$ -4826944 -6753628 -8950264 -9610171 -7754647 -4368379 -1741589 -1446369 -3061951
42813c061951k087593j786258j332771l79264Q11227P94137m64716m50455K045435
$$ -3061951 -5149544 -6935802 -8268573 -8647837 -7836610 -7042473 -7507189 -7957644 -5912209
42804e912209L861208J620337k475317l248296m26820R04986j559545l744831
$$ -5912209 -2051001 -430664 -2905981 -6154277 -6581097 -5676111 -7235656 -10980487
42796a0980487j831916J919863L161910J810887P38441O37517R6427p86728o28014
$$ -10980487 -12812403 -10892540 -7730630 -5919743 -5181302 -4543785 -4447358 -5234086 -5862100
42787e862100K14348J51773n41064j16863J381035J961249Q01632q12893j668382
$$ -5862100 -5647752 -5495979 -6037043 -6153906 -4772871 -2811622 -2009990 -2822883 -4491265
42778d491265j643346o82757J145929K616252K330705P05791p61209j778273k787974
$$ -4491265 -6134611 -6817368 -5671439 -3055187 -724482 -18691 -779900 -2558173 -5346147
42769e346147k812386m70036K853313L696170J106267j860859k171494l17613
$$ -5346147 -8158533 -8628569 -5775256 -2079086 -972819 -2833678 -5005172 -5322785
42761e322785J181154R70198n04865k058149k449840j187970O26296J318656Q65505
$$ -5322785 -4141631 -3171433 -3676298 -5734447 -8184287 -9372257 -8745961 -7427305 -6561800
42752f561800Q02854J690409K325761J940118J393189J426600J385994N76264
$$ -6561800 -5758946 -4068537 -1742776 197342 1590531 3017131 4403125 4979389
42744D979389n75020j515464k277994k503574j432821K77505N51725j147172k637749
$$ 4979389 4404369 2888905 610911 -1892663 -3325484 -3047979 -2496254 -3643426 -6281175
42735f281175k165821r70952j000648j641671q51033J451688L197694K884731
$$ -6281175 -8446996 -9417948 -10418596 -12060267 -12911300 -11459612 -8261918 -5377187
42727e377187Q73578j500404k730454j788680N67603J912611J063585n5276Q09248
$$ -5377187 -4503609 -6004013 -8734467 -10523147 -9955544 -8042933 -6979348 -7034624 -6225376
42718f225376K640802K631158N77881r16539o64550n39012k067069l726951l108038
$$ -6225376 -3584574 -953416 -375535 -1292074 -1956624 -2495636 -4562705 -8289656 -11397694
42709a1397694l32959K051622J894567n93507l046398k865604R4678K687209J714423
$$ -11397694 -11730653 -9679031 -7784464 -8377971 -11424369 -14289973 -14195295 -11508086 -9793663
42700i793663j809068l523849j499029J138481R21106p72792L0225L631075N937482
$$ -9793663 -11602731 -15126580 -16625609 -15487128 -14566022 -15338814 -15308589 -11677514 -5740032
42691e740032M229269O63139j179061q47537k67006j45548M30632J497696J730638
$$ -5740032 -1510763 -847624 -2026685 -2874222 -3141228 -3286776 -2856144 -1358448 372190
42682C72190P04946k60492j37676L99021K68585o00160j841098l295804m196237
$$ 372190 1077136 816644 678968 1077989 1346574 746414 -1094684 -4390488 -8586725
42673h586725l131108j38305K415686K596191J389267O60702m7274k079163l936500
$$ -8586725 -11717833 -11856138 -9440452 -6844261 -5454994 -4794292 -4841566 -6920729 -10857229
42664a0857229k452794J986809M821372L217782k80836j714536p29860M63756
$$ -10857229 -13310023 -11323214 -6501842 -3284060 -3564896 -5279432 -6009292 -5545536
42656e545536Q81508R55433O69175J54190P92922L045797M365520K195807j810479
$$ -5545536 -4664028 -3708595 -3039420 -2885230 -2092308 953489 5319009 7514816 5704337
42647E704337l634169k394830p99723l79952J13055J138735R33465r80407k090843
$$ 5704337 2070168 -324662 -1124385 -1504337 -1391282 -252547 680918 -299489 -2390332
42638b390332o46257J474038J741740O68800K39506M06317l42168j980577k875047
$$ -2390332 -3036589 -1562551 179189 847989 1087495 1493812 1151644 -828933 -3703980
42629c703980k248011q75382L45757J053183J014276L49827j78532r3934J19725
$$ -3703980 -5951991 -6827373 -6481616 -5428433 -4414157 -4064330 -4242862 -4336796 -4217071
42620d217071R2242M05811J319436J705235O13965r82318j438671o80343J32831
$$ -4217071 -4124829 -3719018 -2399582 -694347 -80382 -1062700 -2501371 -3181714 -3048883
42611c048883L63232J2133q82500j508418k50768K700036M130268J746271j841067
$$ -3048883 -2685651 -2673518 -3556018 -5064436 -5315204 -2615168 1515100 3261371 1420304
42602A420304k245186K61474J157654j334314l653211k545156L46778J639992
$$ 1420304 -824882 -563408 594246 -740068 -4393279 -6938435 -6591657 -4951665
42594d951665R82628J62091j89680l14155L77438J966688K499671O35480j427020
$$ -4951665 -3969037 -3806946 -3996626 -4310781 -3933343 -1966655 533016 1168496 -258524
42585b58524p21803J696947K099543j23299j588803l63762J145448J56600k376135
$$ -258524 -980327 716620 2816163 2692864 1104061 740299 1885747 2042347 -333788
42576c33788l477702k068232N88863K886307L729505K636328M82479q75986r52122
$$ -333788 -3811490 -5879722 -5290859 -2404552 1324953 3961281 4443760 3567774 2615652
42567B615652j373432k990064l803329j771930J517536K461362K72314k179466
$$ 2615652 1242220 -1747844 -5551173 -7323103 -5805567 -3344205 -3071891 -5251357
42559e251357k408093j003337J51529M15113L56085O23336J593120L059160L826689
$$ -5251357 -7659450 -8662787 -8511258 -8096145 -7740060 -7116724 -5523604 -2464444 1362245
42550A362245K764539O25819m65282K35964J257168J331889J014158R34627R9658
$$ 1362245 4126784 4752603 4287321 4523285 5780453 7112342 8126500 9061127 9160785
42541I160785k492027n579304o655164m821409j401167J835200L874564M303194
$$ 9160785 6668758 1089454 -5565710 -10387119 -11788286 -9953086 -6078522 -1775328
42533a775328L239740J505546J27740l21898L14345J811634L141572K991795J429881
$$ -1775328 1464412 2969958 3097698 2775800 3090145 4901779 8043351 11035146 12465027
42524A2465027Q3637p6863R1462j30379J78830J560206K282754P09762j678678
$$ 12465027 12548664 12471801 12563263 12432884 12611714 14171920 16454674 17164436 15485758
42515A5485758k238651j274905j271204k436080k266490J36638K454386K705663
$$ 15485758 13247107 11972202 10700998 8264918 5998428 6135066 8589452 11295115
42507A1295115J623547M52325r27476k394479k710240j807180j562952k653949
$$ 11295115 12918662 13370987 12443511 10049032 7338792 5531612 3968660 1314711
42499A314711l057900j558674j90877p79285j491292N8400K257260J774278p65501
$$ 1314711 -1743189 -3301863 -3492740 -4272025 -5763317 -5704917 -3447657 -1673379 -2438880
42490b438880j414639Q87493K611821J092373j534890j553899J324097M039388
$$ -2438880 -3853519 -2966026 -354205 738168 -796722 -2350621 -1026524 3012864
42482C012864M142965K135774K31142k01070K48731K50946l69575p24983p00419
$$ 3012864 7155829 9291603 9522745 9321675 9570406 9821352 9451777 8726794 8026375
42473H026375j162762j870094j161626J097604K466726J679582J106363K776335
$$ 8026375 6863613 4993519 3831893 4929497 7396223 9075805 10182168 12958503
42465A2958503M226295K056621k074161l534910j909059j062227k070982j630815
$$ 12958503 17184798 19241419 17167258 13632348 11723289 10661062 8590080 6959265
42457F959265J249401K537108k31373l536174l493734j735363j710121k687359
$$ 6959265 8208666 10745774 10514401 6978227 3484493 1749130 39009 -2648350
42449b648350j962377j81887M74810J272177M637434Q087416O307962l03756m624558
$$ -2648350 -4610727 -4792614 -4317804 -3045627 1591807 9679223 15987185 15683429 11058871
42440A1058871k112177L195899M439186N00587l936548m887468k904648j074504
$$ 11058871 8946694 12142593 16581779 17082366 13145818 8258350 5353702 4279198
42432D279198j076312j562914j72168K920978M478848K385343q69907j188881
$$ 4279198 3202886 1639972 1467804 4388782 8867630 11252973 10383066 9194185
42424I194185J364497K744776R43030j330081q96711J758609L987358M283467
$$ 9194185 10558682 13303458 14246488 12916407 12019696 13778305 17765663 22049130
42416B2049130K664985j71737k612365k891021j455372p81225j687761j986825
$$ 22049130 24714115 24542378 21930013 19038992 17583620 16802395 15114634 13127809
42408A3127809j51929K110512K765800K436852K266340J377604o84335j525817
$$ 13127809 12975880 15086392 17852192 20289044 22555384 23932988 23248653 21722836
42400B1722836L69469J644199j558902o527793o696493j440668K554348J199807
$$ 21722836 22092305 23736504 22177602 15649809 8953316 7512648 10066996 11266803
42392A1266803j343724m4697K923140K320568j262279k472536N0877J753411l35388
$$ 11266803 9923079 9878382 12801522 15122090 13859811 11387275 11438152 13191563 12856175
42383A2856175l169691k779315N1587J936114J940567J412531O72038p46256j556325
$$ 12856175 9686484 6907169 6958756 8894870 10835437 12247968 12920006 12173750 10617425
42374A0617425L4235K587599K401261r35485l183754j386856J695130J733179
$$ 10617425 10651660 13239259 15640520 14705035 11521281 10134425 11829555 13562734
42366A3562734p52153j596978M20384K052541R13039j257107j932313j389770
$$ 13562734 12810581 11213603 11633987 13686528 14599567 13342460 11410147 10020377
42358A0020377j044283o28853O09857J658820J173812k0128k40343K05317r8472
$$ 10020377 8976094 8347241 8957098 10615918 11789730 11769602 11529259 11734576 11636104
42349A1636104p74312l34724P05789L43176j205435j276417J056163L276293L000748
$$ 11636104 10861792 10527068 11232857 11576033 10370598 9094181 10150344 13426637 16427385
42340A6427385R08591j112231k500414l225038k527741l18381J674772J846975
$$ 16427385 17335976 16223745 13723331 10498293 7970552 7652171 9326943 11173918
42332A1173918O05844r01114k289637k814114r15773K914484M799488J898094
$$ 11173918 11779762 10878648 8589011 5774897 4859124 7773608 12573096 14471190
42324A4471190l158667n301495l533850j151632j60576O32958J717673J205615
$$ 14471190 11312523 6011028 2477178 1325546 1164970 1797928 3515601 4721216
42316D721216j311007k649081k99858L430812M177199J139105k392979l497605
$$ 4721216 3410209 761128 461270 3892082 8069281 9208386 6815407 3317802
42308C317802k580986j906069k577214l385543k316604P66691L320603K960854
$$ 3317802 736816 -1169253 -3746467 -7132010 -9448614 -8681923 -5361320 -2400466
42300b400466P61459m0166J265443J804383k88673k625254j829631J669004M339414
$$ -2400466 -1639007 -1679173 -413730 1390653 1101980 -1523274 -3352905 -1683901 2655513
42291B655513M007261J554335j083823k628788k602128j498620n88497l63628
$$ 2655513 6662774 8217109 7133286 4504498 1902370 403750 -184747 -548375
42283e48375J04683J114503J031457j099697l089480k376483k13057Q4400j436745
$$ -548375 -443692 670811 1702268 602571 -2486909 -4863392 -5076449 -4992049 -6428794
42274f428794j316675J578012M012594L431393J638808J291815J590409L31805
$$ -6428794 -7745469 -6167457 -2154863 1276530 2915338 4207153 5797562 6129367
42266F129367j744773j950451j11904J055641J08759j150634n52363J443185K614039
$$ 6129367 4384594 2434143 2322239 3377880 3486639 2336005 1783642 3226827 5840866
42257E840866J769040k23847j695923j825058j131434o16142n59255l96521K41000
$$ 5840866 7609906 7386059 5690136 3865078 2733644 2117502 1558247 1161726 1402726
42248A402726Q86439Q90136K47618n32932r82761q82772m22106k88198r07180
$$ 1402726 2289165 3179301 3426919 2893987 1911226 1028454 606348 318150 -589030
42239e89030j427724m25998J941754L551120K850072Q67219k98726k40069l14704
$$ -589030 -2016754 -2442752 -500998 3050122 5900194 6767413 6468687 6228618 5913914
42230E913914j400554k793870l336115k726953j540069m34659N11612J704721
$$ 5913914 4513360 1719490 -1616625 -4343578 -5883647 -6318306 -5806694 -4101973
42222d101973K986124K965271N57730k610410l026206L47019M017611M063501
$$ -4101973 -1115849 1849422 2407152 -203258 -3229464 -2882445 1135166 5198667
42214E198667J216834m15488P91539K114828R55417j469631k463054j911825j741590
$$ 5198667 6415501 6000013 6791552 8906380 9861797 8392166 5929112 4017287 2275697
42205B275697k266022j657686O78502K459401J525876r30913j848359l25451J690662
$$ 2275697 9675 -1648011 -969509 1489892 3015768 2084855 236496 -88955 1601707
42196A601707K639144L100526L576487K749775j52376k864812k593417l35241
$$ 1601707 4240851 7341377 10917864 13667639 13515263 10650451 8057034 7721793
42188G721793J67225k124837m048812l000363m17231R77060R94796J086938J568776
$$ 7721793 7889018 5764181 1715369 -1284994 -1702225 -725165 269631 1356569 2925345
42179B925345J920764K310096K588603J196381k427569n487629m711253j006876
$$ 2925345 4846109 7156205 9744808 10941189 8513620 3025991 -1685262 -2692138
42171b692138J515580R30228p97484j431379r38685N6266J442098K260794P23432
$$ -2692138 -1176558 -246330 -1043814 -2475193 -3413878 -3357612 -1915514 345280 1068712
42162A068712k927521n470686m173269O2442M110966N860782N044818K342253
$$ 1068712 -1858809 -7329495 -11502764 -11440322 -7329356 -1468574 3576244 5918497
42154E918497r20187l165589l945393m240315m576235l899945j390548J664287
$$ 5918497 4998310 1832721 -2112672 -6352987 -10929222 -14829167 -16219715 -14555428
42146a4555428L200135K955205K395726K437763K499122J778106M75978m64258
$$ -14555428 -11355293 -8400088 -6004362 -3566599 -1067477 710629 1186607 722349
42138G22349l36150O47694J400249R43108l65232j008297k08968P54065n6234
$$ 722349 386199 1033893 2434142 3377250 3012018 2003721 1794753 2548818 2492584
42129B492584k464804l677019j370410K926980M810456K156098j799459k293718
$$ 2492584 27780 -3649239 -5019649 -2092669 2717787 4873885 3074426 780708
42121G80708O46392K419747Q15805o16111J650636M952456L872011j606703n653839
$$ 780708 1427100 3846847 4662652 4046541 5697177 10649633 14521644 12914941 7261102
42112G261102m398781m20269J520033J87335k044639k594705q71939J482179J994413
$$ 7261102 2862321 2442052 3962085 4149420 2104781 -489924 -1361863 120316 2114729
42103B114729K49489j056784J92653J913594R48139j292661p31385K156285K492588
$$ 2114729 2364218 1307434 1500087 3413681 4361820 3069159 2337774 4494059 6986647
42094F986647o36150j950455J266174L972195J087773m477177o601387m886155
$$ 6986647 6350497 4400042 5666216 9638411 10726184 6249007 -352380 -5238535
42086e238535l256571k683410j292617L68610L53353L49145L450451P360931O203990
$$ -5238535 -8495106 -11178516 -12471133 -12102523 -11749170 -11400025 -7949574 -588643 5615347
42077E615347j84489m766884k795138K339275M805181L355603K91766k607992
$$ 5615347 5430858 663974 -2131164 208111 5013292 8368895 8660661 6052669
42069F052669m356348l979438k041970p33279o87718q4447J693839K371447N65375
$$ 6052669 1696321 -2283117 -4325087 -5058366 -5746084 -5830531 -4136692 -1765245 -1199870
42060a199870j504151j267886N45288J671492J701591J613273J619013J372994
$$ -1199870 -2704021 -3971907 -3426619 -1755127 -53536 1559737 3178750 4551744
42052D551744R30871J62879j231222k266571j432595K31878k68858k859950l371252
$$ 4551744 5482615 5645494 4414272 2147701 715106 946984 678126 -2181824 -5553076
42043e553076J87610L733221K764408r00292j992513M92616K608431J576025j216305
$$ -5553076 -5365466 -1632245 1132163 231871 -1760642 -1268026 1340405 2916430 1700125
42034A700125l089054k806044o07871J812030J823725r90145k938174n37589L947366
$$ 1700125 -1388929 -4194973 -4802844 -2990814 -1167089 -2157234 -5095408 -5632997 -1685631
42025a685631M941893J417814j788381j394874k66283k320065o091331o683331
$$ -1685631 3256262 4674076 2885695 1490821 1224538 -1095527 -7186858 -13870189
42017a3870189k632046K266998L848738K110061L53768J060744L378410M470569
$$ -13870189 -16502235 -14235237 -10386499 -8276438 -7922670 -6861926 -3483516 987053
42009I87053K888589J40378j258100o89910K43995j49180k017693m093640m648266
$$ 987053 3875642 4016020 2757920 2068010 2312005 2162825 145132 -3948508 -8596774
42000h596774k772411L82716K197380J487477J24950L82706J490283Q87584j512220
$$ -8596774 -11369185 -10986469 -8789089 -7301612 -7176662 -6793956 -5303673 -4416089 -5928309
41991e928309k873519j645771K99089Q40301O89292J553661K881433K666446P76053
$$ -5928309 -8801828 -10447599 -10148510 -9308209 -8618917 -7065256 -4183823 -1517377 -741324
41982g41324o70859k91772R27558J454300J267467J199862J142511J81613j643956
$$ -741324 -1412183 -1703955 -776397 677903 1945370 3145232 4287743 4469356 2825400
41973B825400k979437k997560k536649k488759k009605R2707K713626L350022
$$ 2825400 -154037 -3151597 -5688246 -8177005 -10186610 -10093903 -7380277 -4030255
41965d030255J853687R02391J809568K423260R86572m54619O12158K461276J689298
$$ -4030255 -2176568 -1274177 535391 2958651 3945223 3490604 4102762 6564038 8253336
41956H253336n51556L76189M706708O272236Q73693p020664r483144m911303R98614
$$ 8253336 7701780 8077969 12784677 19056913 19930606 12909942 3426798 -1484505 -485891
41947d85891L013044J524713j30204l63722p9505n30509j770387k631764j816274
$$ -485891 2527153 4051866 3921662 3557940 3478435 2947926 1177539 -1454225 -3270499
41938c270499M19120J806086M14598k489423l354613p07891K656336K925682q7630
$$ -3270499 -2851379 -1045293 -630695 -3120118 -6474731 -7182622 -4526286 -1600604 -1688234
41929a688234k864143k535502m5651J473302N81017j099692j191401N84641K274303
$$ -1688234 -4552377 -7087879 -7133530 -5660228 -5079211 -6178903 -7370304 -6785663 -4511360
41920d511360K092956M15751q55373o46490J16988Q302o71375r2435K410924M802843
$$ -4511360 -2418404 -2002653 -2858026 -3504516 -3387528 -3379226 -4050601 -4143036 -1732112 3070731
41910C070731M439461J234097k297321l849975l019856n04351K611837M484973
$$ 3070731 7510192 8744289 6446968 2596993 -422863 -927214 1684623 6169596
41902F169596L410739J36096k373920k706901k827051m508858n863930m064846
$$ 6169596 9580335 9716431 7342511 4635610 1808559 -2700299 -8564229 -12629075
41894a2629075j95135J973584J635303J744014L618284M462564J998972j581952
$$ -12629075 -12824210 -10850626 -9215323 -7471309 -3853025 609539 2608511 1026559
41886A026559k860235k063904j768954k304451j723725K64065J545525J084741
$$ 1026559 -1833676 -3897580 -5666534 -7970985 -9694710 -9430645 -7885120 -6800379
41878f800379M58785J100791K141371K044371P84654n96017j270921o35029J519270
$$ -6800379 -6341594 -5240803 -3099432 -1055061 -270407 -866424 -2137345 -2772374 -1253104
41869a253104L789619L611662M27457k744507k677687j00591J415987K55070j712984
$$ -1253104 2536515 6148177 6575634 3831127 1153440 1052849 2468836 2723906 1010922
41860A010922k405373k063492j826659j744659j303739m27062R94560K986645
$$ 1010922 -1394451 -3457943 -5284602 -7029261 -8333000 -8760062 -7765502 -4778857
41852d778857M009731J761706k903415n178222k048236L065520M700675K845171
$$ -4778857 -769126 992580 -1910835 -7089057 -9137293 -6071773 -1371098 1474073
41844A474073J878570K918150K485104m74389j830668Q17219L283088Q52994m329209
$$ 1474073 3352643 6270793 8755897 8281508 6450840 7268059 10551147 11404141 7074932
41835G074932o509180m552077k157074j335827n96120P98114J424408J027558
$$ 7074932 565752 -3986325 -6143399 -7479226 -8075346 -7277232 -5852824 -4825266
41827d825266J257604K306170K299599Q59277o4893J74933k06358j736131k170021
$$ -4825266 -3567662 -1261492 1038107 1897384 1832491 2007424 1801066 64935 -2105086
41818b105086l47678J440764J023450k45409L7677J411753J519380k79823k355399
$$ -2105086 -2452764 -1012000 11450 -233959 -196282 1215471 2734851 2455028 99629
41809I9629l095327k206633l71108J276009J862394J548647R66740N4865j253156
$$ 99629 -2995698 -5202331 -5573439 -4297430 -2435036 -886389 80351 135216 -1117940
41800a117940j645418Q5355K367710K364058L03153p80007n0220Q28j576582k228259
$$ -1117940 -2763358 -2678003 -310293 2053765 2356918 1576911 1526691 1527519 -49063 -2277322
41790b277322o63482M61402p03566j597198J98855K233063J083941j747996k232844
$$ -2277322 -2940804 -2479402 -3182968 -4780166 -4581311 -2348248 -1264307 -3012303 -5245147
41781e245147o9025J797639K289418K480427K085546J13833j882295j571650j24197
$$ -5245147 -5314172 -3516533 -1227115 1253312 3338858 3452691 1570396 -1254 -125451
41772a25451l62773j406911o1426K744197K349956j979076n019175l000610J426106
$$ -125451 -488224 -1895135 -1956561 787636 3137592 1158516 -3860659 -6861269 -5435163
41763e435163L780320L381513K000661L36841j383967j802524j1803K775070M630419
$$ -5435163 -1654843 1726670 3727331 4064172 2680205 877681 865878 3640948 8271367
41754H271367M437566J592003l198159o366026m318337R60171K970669p09124
$$ 8271367 12708933 14300936 11102777 4736751 418414 1378585 4349254 3640130
41746C640130m796782l924197n9277J344045n17648j880309o62109J707713L659859
$$ 3640130 -1156652 -5080849 -5140126 -3796081 -4313729 -6194038 -6856147 -5148434 -1488575
41737a488575M731165L955374O48278l153971m091474j630131J474209K806958
$$ -1488575 3242590 7197964 7846242 4692271 600797 -1029334 444875 3251833
41729C251833K253545O09343j449464k948543l120494k441636j800163j107455
$$ 3251833 5505378 6114721 4665257 1716714 -1403780 -3845416 -5645579 -6753034
41721f753034j23327L16887l02002o29115O09158K207270K334305J604009J611240
$$ -6753034 -6876361 -6559474 -6861476 -7490591 -6881433 -4674163 -2339858 -735849 875391
41712H75391J639401J10172j659644j024038J081250J027424j454566k546183
$$ 875391 2514792 2624964 965320 -58718 1022532 2049956 595390 -1950793
41704a950793o60572R84455q8401j775641j618298q88029j232134q38496K018863
$$ -1950793 -2611365 -1626910 -1715311 -3490952 -5109250 -5997279 -7229413 -8067909 -6049046
41695f049046M488533K882215r62196j993769L01274J512690k83683j783348l70358
$$ -6049046 -1560513 1321702 359506 -1634263 -1332989 179701 -103982 -1887330 -2257688
41686b257688J747338J535634l40109j578198j921956k001084r58959J622847
$$ -2257688 -510350 1025284 685175 -893023 -2814979 -4816063 -5775022 -4152175
41678d152175L307825J745392j139463j393088J128624K759800J828132O38949
$$ -4152175 -844350 901042 -238421 -1631509 -502885 2256915 4085047 4723996
41670D723996P96375L79666k120811m219741k805988R27550L126903K672152J698473
$$ 4723996 5520371 5900037 3779226 -440515 -3246503 -2318953 807950 3480102 5178575
41661E178575J261852o8952k738629m389831l044179r7636J445336M80354j649705
$$ 5178575 6440427 6371475 3632846 -756985 -3801164 -3898800 -2453464 -1973110 -3622815
41652c622815k981118k222789O31680L769880M602770K575747J20578l34046O77977
$$ -3622815 -6603933 -8826722 -8195042 -4425162 177608 2753355 2873933 2539887 3217864
41643C217864J053147L74051k10774o74141k192151m363312m787524k426870N36499
$$ 3217864 4271011 4645062 4434288 3760147 1567996 -2795316 -7582840 -10009710 -9473211
41634i473211J562333R58749O37308R28906P12845N4540L23182J493935J632746
$$ -9473211 -7910878 -6952129 -6314821 -5385915 -4673070 -4618530 -4295348 -2801413 -1168667
41625a168667o223j398473q22001J83961p44832k402306j083296L640048P217933
$$ -1168667 -1174890 -2573363 -3395364 -3211403 -3956235 -6358541 -7441837 -3801789 3416144
41616C416144N817065J446357r89955l24185J32666j829330m066993l495836n17914
$$ 3416144 9233209 10679566 9689611 9365426 9498092 7668762 3601769 105933 -411981
41607d11981J763358J637202L18809l32059j68140m08573j638835k755437k062829
$$ -411981 1351377 2988579 3307388 2975329 2807189 2398616 759781 -1995656 -4058485
41598d058485O40574L454876M281102L065635J477245N21520m97332k322291m015315
$$ -4058485 -3417911 36965 4318067 7383702 8860947 9382467 8885135 6562844 2547529
41589B547529l730351r51506K641591M613053L895823J482152q97156k507905
$$ 2547529 -1182822 -2134328 507263 5120316 9016139 10498291 9601135 7093230
41581G093230l654648m305621l812658k331985j162258p32930L65783K845542
$$ 7093230 3438582 -867039 -4679697 -7011682 -8173940 -8906870 -8541087 -5695545
41573e695545M495243K680966j619408m640595m444828k432895m56439R79169
$$ -5695545 -1200302 1480664 -138744 -4779339 -9224167 -11657062 -12113501 -11134332
41565a1134332J512512P47775j29638P24554K539930K431468J24337r66096J125152
$$ -11134332 -9621820 -8874045 -9003683 -8279129 -5739199 -3307731 -3183394 -4149490 -3024338
41556c024338L858912M271114K990246J716677j67883l197678m734755k265680
$$ -3024338 834574 5105688 8095934 9812611 9644728 6447050 1712295 -553385
41548e53385J951938L447745J556667p50561j836822k285622j813905L37432K233185
$$ -553385 1398553 4846298 6402965 5652404 3815582 1529960 -283945 53487 2286672
41539B286672Q78290k629704l762746j094026J868372K388713J956069K428801
$$ 2286672 3164962 535258 -3227488 -4321514 -2453142 -64429 1891640 4320441
41531D320441K643264J214983m96971q44128p67393j655343k420037j267411J175218
$$ 4320441 6963705 8178688 7681717 6837589 6070196 4414853 1994816 727405 1902623
41522A902623K777668K737048J677939K04749j033199j195484o53737j019796
$$ 1902623 4680291 7417339 9095278 9300027 8266828 7071344 6417607 5397811
41514E397811k357383k269742M14718L026032K480558k96193j987636j671372
$$ 5397811 3040428 770686 1185404 4211436 6691994 6395801 4408165 2736793
41506B736793j177109j441155j414287n49290J30574j67947r72042j595426j805504
$$ 2736793 1559684 118529 -1295758 -1845048 -1714474 -1882421 -2854463 -4449889 -6255393
41497f255393j397983l64920O52400J173212J645103K244475J840998j48951j818419
$$ -6255393 -7653376 -8018296 -7365896 -6192684 -4547581 -2303106 -462108 -611059 -2429478
41488b429478r73846J213471J349782j294854l616924l010278m95426J471839
$$ -2429478 -3403324 -2189853 -840071 -2134925 -5751849 -8762127 -9257553 -7785714
41480g785714K151812K082365J336102M9276n17628O21421K294824K397847P65357
$$ -7785714 -5633902 -3551537 -2215435 -2166159 -2683787 -2062366 232458 2630305 3395662
41471C395662p16995q47979l99031l06011j34664O21897R03848n95098k849193
$$ 3395662 2678667 1830688 1431657 1125646 990982 1612879 2516727 1921629 -927564
41462i27564l106338n62218K215533K625465J390315R08665J336657P23845j189328
$$ -927564 -4033902 -4596120 -2380587 244878 1635193 2543858 3880515 4604360 3415032
41453C415032k077382p73224N81343k22717k008636k167708p66522k00196j237855
$$ 3415032 1337650 564426 1145769 923052 -1085584 -3253292 -4019814 -4220010 -5457865
41444e457865j924621p78031J010903J507661P49184L65019J166295K150746J878827
$$ -5457865 -7382486 -8160517 -7149614 -5641953 -4892769 -4527750 -3361455 -1210709 668118
41435F68118K80484j191178j225979k24703K66940l78234j205926j318778j042944
$$ 668118 948602 -242576 -1468555 -1693258 -1426318 -1804552 -3010478 -4329256 -5372200
41426e372200p00342N42810L078747M908648L371993j047043m552493m404738
$$ -5372200 -6072542 -5529732 -2450985 2457663 5829656 4782613 230120 -4174618
41418d174618j890363J07022R93900K099061L286490K502309o81846l291592k455980
$$ -4174618 -6064981 -5957959 -4964059 -2864998 421492 2923801 2241955 -1049637 -3505617
41409c505617O26625K397246J917971J483727K153232J823273p85203l089221
$$ -3505617 -2878992 -481746 1436225 2919952 5073184 6896457 6111254 3022033
41401C022033k151975Q37802K575936K554035K573006K549472Q49954j573333
$$ 3022033 870058 1707860 4283796 6837831 9410837 11960309 12810263 11236930
41393A1236930j717020L46151J152776l67371j187013J90981R91699n61134j784511
$$ 11236930 9519910 9866061 11018837 10651466 9464453 9655434 10647133 10085999 8301488
41384H301488n97584L19836j398537k585353L54031M293327L482005j122549l105640
$$ 8301488 7703904 8023740 6625203 4039850 4393881 8687208 12169213 11046664 7941024
41375G941024n31760J828810P29313j276706j408037r30343j363574j165968P08398
$$ 7941024 7409264 9238074 9967387 8690681 7282644 6352301 4988727 3822759 4531157
41366D531157J750439k37775l042982l074411m79980J681400J838740Q55580k52305
$$ 4531157 6281596 6043821 3000839 -73572 -553552 1127848 2966588 3822168 3569863
41357C569863j118162j175176L8021J881773K995291K435536K17212k393077l185362
$$ 3569863 2451701 1276525 1314546 3196319 6191610 8627146 8844358 6451281 3265919
41348C265919j140603J710760K426426J134054N08099J187660Q36392j409130
$$ 3265919 2125316 3836076 6262502 7396556 7904655 9092315 9928707 8519577
41340H519577k952132j908903j75213p7092o91464j57595O60439j48579j829097
$$ 8519577 5567445 3658542 3483329 3406237 2714773 2557178 3217617 3069038 1239941
41331A239941j958605k48658J254114J206167J62088o87490l91281J270740K842684
$$ 1239941 -718664 -967322 286792 1492959 1655047 967557 576276 1847016 4689700
41322D689700K116145n70204j811036J90444K522673J716828r66834j672210P9595
$$ 4689700 6805845 6235641 4424605 4615049 7137722 8854550 7887716 6215506 6295101
41313F295101J289351O57121l9275J20153l62194k051554k891419j439657O24436
$$ 6295101 7584452 8241573 8202298 8322451 7960257 5908703 3017284 1577627 2202063
41304B202063R77364o5502m49730N23740J589225J584828R48555J022973K363067
$$ 2202063 3179427 3113925 2664195 3187935 4777160 6361988 7310543 8333516 10696583
41295A0696583L992779M426237L238882J184933r44357k507608k253418O94454
$$ 10696583 14689362 19115599 22354481 23539414 22595057 20087449 17834031 18528485
41287A8528485M452640N136874J504323k957089m338435k977711j732086j376298
$$ 18528485 22981125 28117999 29622322 26665233 22326798 19349087 17617001 16240703
41279A6240703o17322M25528L8617j887945l262281k729394j112723K25831O53561
$$ 16240703 15623381 16048909 16087526 14199581 10937300 8207906 7095183 7321014 7974575
41270G974575J4565j141004j418592l93224J64575j130424k534015j625028N18668
$$ 7974575 7989140 6848136 5429544 5036320 5200895 4070471 1536456 -88572 430096
41261D30096Q61132n39226q14657M76766O28732r42520j024710K025583N118215
$$ 430096 1291228 752002 -62655 414111 1042843 100323 -924387 1101196 6219411
41252F219411N087519L260010K540143K735154K156003J825627M188425Q263218
$$ 6219411 11306930 14566940 17107083 19842237 21998240 23823867 28012292 36275510
41244C6275510R611156N732658q48476n707431p154270o824182o582081o105715
$$ 36275510 45886666 51619324 50770848 45063417 37909147 31084965 24502884 18397169
41236A8397169l920411j88834K762573L115974J511245n62646k731319m442801
$$ 18397169 14476758 14287924 17050497 20166471 21677716 21115070 18383751 13940950
41228A3940950l618204L94722L794141K179131k829943n048674k318733Q34258
$$ 13940950 10322746 10717468 14511609 16690740 13860797 8812123 6493390 7327648
41220G327648M81992j455942j789233j524161l000382m843326m030518r46527
$$ 7327648 7809640 6353698 4564465 3040304 39922 -4803404 -8833922 -9780449
41212i780449J533329K499369K974379K790132J097760r77914j565833j107875
$$ -9780449 -8247120 -5747751 -2773372 16760 1114520 136606 -1429227 -2537102
41204b537102j100029q87674Q89631K787430K419960J104028K297386N429808
$$ -2537102 -3637131 -4524805 -3635174 -847744 1572216 2676244 4973630 10403438
41196A0403438N801085J543584l408965m822920l164224j396809q11921r26607
$$ 10403438 16204523 17748107 14339142 9516222 6351998 4955189 4143268 3216661
41188C216661j084119m82398J249791K300909M7026m458510o264334k839407K065900
$$ 3216661 2132542 1650144 2899935 5200844 5247870 789360 -5474974 -8314381 -6248481
41179f248481L428794J471618P8862N03973M09758j296057k272003l38209L052034
$$ -6248481 -2819687 -1348069 -1269207 -765234 -355476 -1651533 -3923536 -4261745 -1209711
41170a209711M300428J768502k291202l742016p80317L588427M237830j47577
$$ -1209711 3090717 4859219 2568017 -1173999 -1954316 1634111 5871941 5724364
41162E724364m983988m916790K8084N106216O756570N588937L740194J819152
$$ 5724364 740376 -4176414 -4148330 957886 7714456 13303393 17043587 18862739
41154A8862739n53017k878802l863482k824039l35010K216837L632234M050746
$$ 18862739 18309722 15430920 11567438 8743399 8408389 10625226 14257460 18308206
41146A8308206N040274P722315J0958646J2547234J2150903J1473594J1204626
$$ 18308206 23348480 31070795 42029441 54576675 66727578 78201172 89405798
41139H9405798R694947N798264J298748j382175k801342n526711r892842j3091666
$$ 89405798 99100745 104899009 106197757 104815582 102014240 96487529 86594687 73503021
41131G3503021j2933075j0423891p729433n486487l502880k439787k804983l279419
$$ 73503021 60569946 50146055 42416622 36930135 33427255 30987468 28182485 24903066
41123B4903066k228849m86888m91109k590963m255757l377532n15937K645328
$$ 24903066 22674217 22187329 21696220 19105257 14849500 11471968 10956031 13601359
41115A3601359N066322N720823L402298j152429m600568m437063j968431p467
$$ 13601359 18667681 24388504 27790802 26638373 22037805 17600742 15632311 15624844
41107A5624844J093601K670784M067262L049649O3445j268092P85882L267914
$$ 15624844 16718445 19389229 23456491 26506140 26569585 25301493 26087375 29355289
41099B9355289K851796P99880Q43873L287524M434866K141702r51701j171735
$$ 29355289 32207085 33006965 33850838 37138362 41573228 43714930 42763229 41591494
41091D1591494J255100L206883L518626M069717N790368O456823M309609J794915
$$ 41591494 42846594 46053477 49572103 53641820 59432188 65889011 70198620 71993535
41083G1993535K745814O677824R299196Q938855Q688920J0591734J1611623Q800384
$$ 71993535 74739349 81417173 90716369 99655224 108344144 118935878 130547501 139347885
41075A39347885N427289O954465J2137400J3806234R344341M956768O710386J1625709
$$ 139347885 144775174 151729639 163867039 177673273 187017614 191974382 198684768 210310477
41067B10310477J1894896N449641k291235o349023p384183q247275r033754p761594
$$ 210310477 222205373 227655014 225363779 219014756 211630573 203383298 194349544 186587950
41059A86587950m181902p90082k98601l068483o953760r343469r531901r096247
$$ 186587950 182406048 181615966 181317365 178248882 171295122 161951653 152419752 143323505
41051A43323505r747086j1261005j2170072j1926146j1196977j0256064q566906
$$ 143323505 133576419 122315414 110145342 98219196 87022219 76766155 68199249
41044F8199249o262653m581256m015345l190199p95426K006826K480242l11742
$$ 68199249 61936596 57355340 53339995 50149796 49354370 51361196 53841438 53529696
41036E3529696m042809n461472l696057q74786K83832q07099k248000j879289
$$ 53529696 49486887 44025415 40329358 39454572 39738404 38931305 36683305 34804016
41028C4804016K67381K026793J785066O72037J333761M502725P672012P749394
$$ 34804016 35071397 37098190 38883256 39555293 40889054 45391779 53063791 60813185
41020F0813185M466658M33860j814004j954772j239623p46995n82995j72868R34992
$$ 60813185 65279843 65713703 63899699 61944927 60705304 59958309 59375314 59202446 60137438
41011F0137438K211757K306799P77299o84395L0375K631010M848329N653404N994187
$$ 60137438 62349195 64655994 65433293 64748898 64779273 67410283 72258612 77912016 83906203
41002H3906203N972496M170722J402118K143621R021471J7781860K1686202K0144506
$$ 83906203 89878699 94049421 95451539 97595160 106616631 124398491 146084693 166229199
40994A66229199J8767346K0515600K1178511J5596627N045161m299632q269005
$$ 166229199 184996545 205512145 226690656 242287283 247332444 243032812 234763807
40987B34763807p626553n510014m395868n009190o293367o496527n279419m307417
$$ 234763807 227137254 221627240 217231372 212222182 205928815 199432288 194152869 189845452
40979A89845452n000791o462621o554268m471134j557501J04110p2670K80678
$$ 189845452 184844661 178382040 171827772 167356638 165799137 165903247 165830577 166111255
40971A66111255M876338J4017868K2658525K6458022K8927276L7101402M8571398
$$ 166111255 170987593 185005461 207663986 234122008 263049284 300150686 348722084
40964C48722084M9025078K7797311p660477l8187628n1632280n0289222m2376758
$$ 348722084 397747162 425544473 417883996 379696368 328064088 277774866 235398108
40957B35398108l3412671k6226122k2347223k0282490j6632468j1268746p923418
$$ 235398108 201985437 175759315 153412092 133129602 116497134 105228388 97304970
40950I7304970q083633q451146o616754m936450n692748o464899m423691j935358
$$ 97304970 89221337 80770191 74153437 69216987 63524239 57059340 52635649 50700291
40942E0700291k902121n603988m662458L82463L718849J409359l482695n662623
$$ 50700291 47798170 42194182 37531724 37914187 41633036 43042395 39559700 33897077
40934C3897077m019077j032299J466755L056711K849779L9806l742216n151978
$$ 33897077 29878000 28845701 30312456 33369167 36218946 36258752 32516536 27364558
40926B7364558l078600k38220L36452p81117p11822J012921J427347j256283m237810
$$ 27364558 24285958 24047738 24384190 23603073 22891251 23904172 25331519 24075236 19837426
40917A9837426l649316k29336J588867J47665j223784M45557L368134M133384
$$ 19837426 16188110 15958774 17547641 17695306 16471522 16917079 20285213 24418597
40909B4418597K761739J718857J514758N86656j089666j543399j71920J258812
$$ 24418597 27180336 28899193 30413951 31000607 29910941 28367542 28195622 29454434
40901B9454434J572922J618065J892085J239842n96562j260080J244690N123405
$$ 29454434 31027356 32645421 34537506 35777348 35180786 33920706 35165396 40288801
40893D0288801O629041M872750K669021K447314L388204L596603L474527N103677
$$ 40288801 46917842 51790592 54459613 56906927 60295131 63891734 67366261 72469938
40885G2469938Q932459J3203900J6992843K1700654K8409486L5946465M3798928
$$ 72469938 81402397 94606297 111599140 133299794 161709280 197655745 241454673
40878B41454673N4594843O8909337P7666650O5883071K8437679k0515537n8252110
$$ 241454673 296049516 364958853 442625503 508508574 536946253 516430716 458178606
40871D58178606p2837486o9102822n7926276m5449620l3247777k2856027j5830136
$$ 458178606 385341120 316238298 258312022 212862402 179614625 156758598 140928462
40864A40928462j1637131q759406o984352o734023p356676p878654q393611r159557
$$ 140928462 129291331 120531925 113547573 106813550 99456874 91578220 83184609 74025052
40856G4025052r431568q649031p535440o500463m405079q06874K021032J748505
$$ 74025052 64593484 55944453 48409013 41908550 37503471 36696597 38717629 40466134
40848D0466134l58491j119125j54900j5398j650456k809139j741850J43759O37043
$$ 40466134 40107643 38988518 38833618 38818220 37167764 34358625 32616775 32760534 33397577
40839C3397577l15608j463324k445978l549664m343737m020318k531506n09446
$$ 33397577 33081969 31618645 29172667 25623003 21279266 17258948 14727442 14217996
40831A4217996J261585J747882K23080k224129l036540j289545O74285J94631
$$ 14217996 15479581 17227463 17450543 15226414 12189874 10900329 11574614 11769245
40823A1769245k037979k983473j357129J098091K304910K046503J179830J91092
$$ 11769245 9731266 6747793 5390664 6488755 8793665 10840168 12019998 12211090
40815A2211090p42442j148479m14428J621881M142171N192580K921328j982454
$$ 12211090 11468648 10320169 9905741 11527622 15669793 20862373 23783701 21801247
40807B1801247n852850n649342k617409n92036r18129j303988M7646J813330K197967
$$ 21801247 15948397 10299055 7681646 7089610 6171481 4867493 4915139 6728469 8926436
40798H926436J776490J782452J456784m77410k850984l126337j053283J004328
$$ 8926436 10702926 12485378 13942162 13464752 10613768 7487431 6434148 7438476
40790G438476J364360O72200J61357K00955R40646K589967M363296M640547L027897
$$ 7438476 8802836 9475036 9636393 9837348 10777994 13367961 17731257 22371804 25399701
40781B5399701J139109N50287R23093R53720M39460M69707J686022K879883J744851
$$ 25399701 26538810 27089097 28012190 28965910 29405370 29875077 31561099 34440982 36185833
40772C6185833k402097o693820o924558k624719J623055J665701r97360k090556
$$ 36185833 33783736 27089916 20165358 17540639 19163694 20829395 19832035 17741479
40764A7741479j176654j390587l009968k366454J351882L189935m27000n560627
$$ 17741479 16564825 15174238 12164270 9797816 11149698 14339633 13912633 8352006
40756H352006o005308j925706J364425J444511O50588O32151P0945j622871k677879
$$ 8352006 2346698 420992 1785417 3229928 3880516 4512667 4583612 2960741 282862
40747B82862k213198j586983j318227M1848K617886L894409K321615m00580k105884
$$ 282862 -1930336 -3517319 -4835546 -4793698 -2175812 1718597 4040212 3639632 1533748
40738A533748k667874k424917r73448Q92127J048093k99706r2796K141428K080713
$$ 1533748 -1134126 -3559043 -4532491 -3640364 -2592271 -2891977 -2984773 -843345 1237368
40729A237368k602604o780361m256626K693137O062312L578053J185441L175375
$$ 1237368 -1365236 -8145597 -12402223 -9709086 -3646774 -68721 1116720 4292095
40721D292095N872975M049425j024417l922501k692310k56203L80301r98062l029427
$$ 4292095 10165070 14214495 13190078 9267577 6575267 6319064 6699365 5701303 2671876
40712B671876m117960k937675P7810K011118M23434l012416l979241r05949L104170
$$ 2671876 -1446084 -4383759 -4305949 -2294831 -1871397 -4883813 -8863054 -9769003 -6664833
40703f664833M412541L144879K173489K995732M128405L381652O44368j979719
$$ -6664833 -2252292 892587 3066076 6061808 10190213 13571865 14216233 12236514
40695A2236514k553157j509037j073484k292340l379252k074171P94738J878831
$$ 12236514 9683357 8174320 7100836 4808496 1429244 -644927 149811 2028642
40687B028642j18969k362243j786626N28340J214264m7908j00110K417286M507390
$$ 2028642 1909673 -452570 -2239196 -1710856 -496592 -544500 -644610 1772676 6280066
40678F280066L252182L38827l98378J572187L302320K859668J162545m83039j918893
$$ 6280066 9532248 9871075 9472697 11044884 14347204 17206872 18369417 17886378 15967485
40669A5967485k926466k993905k712695l019602k801742j46276L518414M066340
$$ 15967485 13041019 10047114 7334419 4314817 1513075 1366799 4885213 8951553
40661H951553P93932j871816j007990L55292j185077l056164q56022L618012M294359
$$ 8951553 9745485 7873669 6865679 7220971 6035894 2979730 2123708 5741720 10036079
40652A0036079k6035m148589m435255k817928j651852J04317L094665M476188
$$ 10036079 10010044 5861455 1426200 -1391728 -3043580 -2939263 155402 4631590
40644D631590J988521k035888l896365l277434j946677j72439K362663M042173
$$ 4631590 6620111 4584223 687858 -2589576 -4536253 -4708692 -2346029 1696144
40636A696144L111477P99937l49338l02361r00113k291213k851056k133588j205741
$$ 1696144 4807621 5607558 5258220 4955859 4055746 1764533 -1086523 -3220111 -4425852
40627d425852l07214J299369L146502L462686J501098j595524m096507m562728
$$ -4425852 -4733066 -3433697 -287195 3175491 4676589 3081065 -1015442 -5578170
40619e578170k295647J303912K816647N41050k569369k199471J597187M638642
$$ -5578170 -7873817 -6569905 -3753258 -3212208 -5781577 -7981048 -6383861 -1745219
40611a745219M358352K433437J380317J319481J045095J67170p86891r45274N77794
$$ -1745219 2613133 5046570 6426887 7746368 8791463 8958633 8171742 7226468 7804262
40602G804262L420782N171577L786446O92510q02424j63744n8713j869723l676952
$$ 7804262 11225044 16396621 20183067 20875577 20073153 19909409 19850696 17980973 14304021
40593A4304021l524258j956299k43831J297131K024167O73345k132190l548468
$$ 14304021 10779763 8823464 8579633 9876764 11900931 12574276 10442086 6893618
40585F893618k347299p41413o74452q04543O52644K482557K598807J735280K027217
$$ 6893618 4546319 3804906 3130454 2325911 2978555 5461112 8059919 9795199 11822416
40576A1822416L122271K647809m358k864024m100662l604186k194748r18970o87392
$$ 11822416 14944687 17592496 17588138 14724114 10623452 7019266 4824518 3905548 3218156
40567C218156j200318q92841Q15761K245956J744458l1561j525393k386638k528825
$$ 3218156 2017838 1124997 1940758 4186714 5931172 5899611 4374218 1987580 -541245
40558e41245j028408J853814L541175K673472J765669L182818M517407K052330
$$ -541245 -1569653 284161 3825336 6498808 8264477 11447295 15964702 18017032
40550A8017032k700912m695877k872068r09064m78539P47024L249079L437323
$$ 18017032 15316120 10620243 7748175 6839111 6360572 7107596 10356675 13793998
40542A3793998j81859l387034k148997J583998L474676K953225K088958J074805
$$ 13793998 13612139 10225105 8076108 9660106 13134782 16088007 18176965 19251770
40534A9251770j030977k966763k796611j598734j821883k857675k051025M03125
$$ 19251770 18220793 15254030 12457419 10858685 9036802 6179127 4128102 4531227
40526D531227J462339K12528q82599l39122J90969p02444j628385p84710J390875
$$ 4531227 5993566 6206094 5323495 4984373 5175342 4472898 2844513 2059803 3450678
40517C450678L473372M996071N660461M412993J074710k357377l661447k792449
$$ 3450678 6924050 11920121 17580582 21993575 23068285 20710908 17049461 14257012
40509A4257012j140473N27494J981172K388330J059539j002850j839484q68050
$$ 14257012 13116539 13644033 15625205 18013535 19073074 18070224 16230740 15362690
40501A5362690N69587R60465P8513j128003j297266L75198K993608M166847K520606
$$ 15362690 15932277 16892742 16971255 15843252 14545986 14921184 17914792 22081639 24602245
40492B4602245k64878j283033j21950Q81021K28558r04067j183435j336716k254560
$$ 24602245 24337367 23054334 22932384 23813405 24041963 23137896 21954461 20617745 18363185
40483A8363185k663512r84088J621425K644675K072609K040595K822236K353892
$$ 18363185 15699673 14715585 16337010 18981685 21054294 23094889 25917125 28271017
40475B8271017L21406p16294J72366R537l262144o458876n213651o36758J917824
$$ 28271017 28592423 27876129 28048495 28058032 24795888 18337012 13123361 12486603 14404427
40466A4404427L2974l447570n082077m273798j777460J704256M490073M588489
$$ 14404427 14437401 10989831 5907754 1633956 -143504 1560752 6050825 10639314
40458A0639314K609984J338134J400276L56999k546897m014287j376763L062965
$$ 10639314 13249298 14587432 15987708 16344707 13797810 9783523 8406760 11469725
40450A1469725N068075L788686J429946m75766j561391r83082J450776L353617
$$ 11469725 16537800 20326486 21756432 21280666 19719275 18736193 20186969 23540586
40442B3540586K068888j384436l342423k307737k98023M91233j5394r05913j528514
$$ 23540586 25609474 24225038 20882615 18574878 18276855 18768088 18752694 17846781 16318267
40433A6318267j350311l77887J81889p04666k075383k248707j509804j479062
$$ 16318267 14967956 14590069 14771958 14067292 11991909 9743202 8233398 6754336
40425F754336k139216j813020o0570J718730K654031L037479K534109M45764j781398
$$ 6754336 4615120 2802100 2741530 4460260 7114291 10151770 12685879 13131643 11350245
40416A1350245j186727K418576N289084M356639R61687j567082k241783k501613
$$ 11350245 10163518 12582094 17871178 22227817 23189504 21622422 19380639 16879026
40408A6879026l215842l467603k018661R99843L735931L989872J686582m95275
$$ 16879026 13663184 10195581 8176920 9176763 12912694 16902566 18589148 18093873
40400A8093873l99449M22634p89981k854523j652251K961643N339528J531618
$$ 18093873 17694424 18117058 17327077 14472554 12820303 15781946 21121474 22653092
40392B2653092m728972o832315l743686k129J203006R78781J141085J457929J245959
$$ 22653092 17924120 11091805 7348119 7345990 8548996 9527777 10668862 12126791 13372750
40383A3372750Q96154O48842k16451j894602l123140k615315m82811K258533M591901
$$ 13372750 14268904 14917746 14701295 12806693 9683553 7068238 6585427 8843960 13435861
40374A3435861N407137L610112n76224m712262n625338k517758J616661K690883
$$ 13435861 18842998 22453110 21876886 17164624 11539286 9021528 10638189 13329072
40366A3329072J97354j879995r3851L614020M384917J236592j755871j569297
$$ 13329072 13526426 11646431 11552580 15166600 19551517 20788109 19032238 17462941
40358A7462941n2617j3982q10660n06566K62435j88300j212062j336956j463576
$$ 17462941 17410324 17396342 16585682 16079116 16341551 16153251 14941189 13604233 12140657
40349A2140657k935089l857771j494345K517636L821268K063078J302778L115050
$$ 12140657 9205568 5347797 3853452 6371088 10192356 12255434 13558212 16673262
40341A6673262M071353J707475j471522k410969k049003k403937k411317k78923
$$ 16673262 20744615 22452090 20980568 18569599 16520596 14116659 11705342 11426419
40333A1426419K417426K822255J459857J154150K288689K731150J982785J795796
$$ 11426419 13843845 16666100 18125957 19280107 21568796 24299946 26282731 28078527
40325B8078527K497514K148195J96145j121295m39368K96035j018402l047304
$$ 28078527 30576041 32724236 32920381 31799086 31359718 31655753 30637351 27590047
40317B7590047k910218n16473J399303J210184J21849l15836m04945j058985j902507
$$ 27590047 24679829 24163356 25562659 26772843 26894692 26578856 26173911 25114926 23212419
40308B3212419k033753j776928k070940k486181j540200Q28416K653903K387128
$$ 23212419 21178666 19401738 17330798 14844617 13304417 14132833 16786736 19173864
40300A9173864O73798r20075j617981j086829J029312L825890M762253K460895
$$ 19173864 19847662 18927587 17309606 16222777 17252089 21077979 25840232 28301127
40292B8301127r99159k525885k017253j740432k270999j785195L15816J778641
$$ 28301127 27301968 24776083 22758830 21018398 18747399 16962204 17278020 19056661
40284A9056661O85862j651959k398094o44268J896265K899936J567740n65151
$$ 19056661 19742523 18090564 15692470 15048202 16944467 19844403 21412143 20846992
40276B0846992q73657J407881L786897L383832O87584j437692j958936k281255
$$ 20846992 19973335 21381216 25168113 28551945 29239529 27801837 25842901 23561646
40268B3561646k810095k142871l55734K16457j176503k178035j303491l70898
$$ 23561646 20751551 18608680 18252946 18469403 17292900 15114865 13811374 13440476
40260A3440476r50412j503188n68822K73306k95323o5925K779877N027888K440638
$$ 13440476 12490064 10986876 10418054 10691360 10396037 10330112 13109989 18137877 20578515
40251B0578515l070435n259858k136530J979649L311198L050163L766125N203791
$$ 20578515 17508080 12248222 10111692 12091341 15402539 18452702 22218827 27422618
40243B7422618N456817L732491N37485k959604n059587m930684m055531m235673
$$ 27422618 32879435 36611926 37149411 34189807 29130220 24199536 20144005 15908332
40235A5908332m544233k967463n23373j54258j600727j501450Q43546K190169
$$ 15908332 11364099 8396636 7873263 7719005 6118278 4616828 5460374 7650543
40227G650543J017300j2741Q90739J590576N11531j54261J114604J617703q65080
$$ 7650543 8667843 8655102 9545841 11136417 11647948 11493687 12608291 14225994 13360914
40218A3360914l487568k809398o72738p85066k097876r37731K170428L457973
$$ 13360914 9873346 7063948 6391210 5606144 3508268 2570537 4740965 8198938
40210H198938K592353K709056M186691M142382K439686K436389M625621N098477
$$ 8198938 10791291 13500347 17687038 21829420 24269106 26705495 31331116 36429593
40202C6429593K182736o90089j207371k084449n351184p501547m948364p09044
$$ 36429593 38612329 37922240 36714869 34630420 29279236 21777689 16829325 16120281
40194A6120281l53081l463824m565975j724072J031508L91332j693522j862400
$$ 16120281 15767200 12303376 7737401 6013329 7044837 7436169 5742647 3880247
40186C880247l51455K21929q54840j682904p65490R55291J377665j29290j901581
$$ 3880247 3528792 3750721 2895881 1212977 447487 1402778 2780443 2651153 749572
40177G49572j948674l47152J087526J302918Q43080N2214j573521l277927k519759
$$ 749572 -1199102 -1546254 -458728 844190 1687270 1739484 165963 -3111964 -5631723
40168e631723J353056M640691L386629r22408k915624n62930K428799K357662
$$ -5631723 -4278667 362024 3748653 2826245 -89379 -652309 1776490 4134152
40160D134152N61902O15090K657080L428708J370896j029625q33012J104198J100728
$$ 4134152 4696054 5311144 7968224 11396932 12767828 11738203 10905191 12009389 13110117
40151A3110117k378587o250735o308019k437842J263849J701414K01591k79885
$$ 13110117 10731530 4480795 -1827224 -4265066 -3001217 -1299803 -1098212 -1378097
40143a378097N58296R83568Q07176J411412K436840J562698j506383l543621j996855
$$ -1378097 -819801 163767 970943 2382355 4819195 6381893 4875510 1331889 -664966
40134f64966J260522K372936M31193k068913k929297k315739j224051J80538J948445
$$ -664966 595556 2968492 3399685 1330772 -1598525 -3914264 -5138315 -4957777 -3009332
40125c009332L175486K523627j3816k323343j820815J594838M708188M174171
$$ -3009332 166154 2689781 2675965 352622 -1468193 126645 4834833 9009004
40117I009004M41349k790950l114008j730681p42153k01683O75058J152740O5478
$$ 9009004 9450353 6659403 3545395 1814714 1072561 870878 1545936 2698676 2764154
40108B764154j654676j797668N6850K190212L253089L272537K336931L66886j610715
$$ 2764154 1109478 -688190 -631340 1558872 4811961 8084498 10421429 10788315 9177600
40099I177600k060541j329294j397165k501300k240218N50778L127886K296709
$$ 9177600 7117059 5787765 4390600 1889300 -350918 199860 3327746 5624455
40091E624455p83634j926503L49063L117605L549613K523658K231784K204420
$$ 5624455 4840821 2914318 3263381 6380986 9930599 12454257 14686041 16890461
40083A6890461K64354l276870n192989l782488j401354r85270j755747o66764
$$ 16890461 17154815 13877945 8684956 4902468 3501114 2515844 760097 93333
40075I3333K754529N647527N883756M285437K221873k87411k748310l131690q68331
$$ 93333 2847862 8495389 14379145 18664582 20886455 20599044 17850734 14719044 13850713
40066A3850713J173598L77740j573569j357555N78945Q78087j024200k006249
$$ 13850713 15024311 15402051 13828482 12470927 13049872 13927959 12903759 10897510
40058A0897510m61334J396565J457986M27090p74380k798569n157592n146439
$$ 10897510 10436176 11832741 13290727 13717817 12943437 10144868 4987276 -159163
40050a59163k026123P88776O00935n12876R4573N08272k016201m618435k083517
$$ -159163 -2185286 -1396510 -795575 -1308451 -1213878 -705606 -2721807 -7340242 -9423759
40041i423759M179583O620970K036942m050365n594411l504623j826170r31933
$$ -9423759 -5244176 1376794 3413736 -636629 -6231040 -9735663 -11561833 -12493766
40033a2493766J126947L505204L595141J735778O10733O36700r6707j497270j051557
$$ -12493766 -11366819 -7861615 -4266474 -2530696 -1919963 -1283263 -1379970 -2877240 -3928797
40024c928797J587086L156701J425895j452896k014548O8992K359221K974286
$$ -3928797 -2341711 814990 2240885 787989 -1226559 -1157567 1201654 4175940
40016D175940J838005k65472k188474k665093j558137m31042o43759j361841p98475
$$ 4175940 6013945 5748473 3559999 894906 -663231 -1094273 -1738032 -3099873 -3898348
40007c898348R03919J592963J07300j994632k354134o11957J434886K037654J189930
$$ -3898348 -2994429 -1401466 -1294166 -3288798 -5642932 -6254889 -4820003 -2782349 -1592419
39998a592419J87490j4362L04800L89054L15043R24586K268356K870142J355024
$$ -1592419 -1404929 -1419291 -1114491 -725437 -410394 514192 2782548 5652690 7007714
39989G007714j503160l304050k676951o60458P34145O21710l56563j050079p88778
$$ 7007714 5504554 2200504 -476447 -1136905 -402760 218950 -137613 -1187692 -1976470
39980a976470J89312R60198Q98590N23820Q21784J711245K035935J250054M3327
$$ -1976470 -1787158 -826960 71630 595450 1417234 3128479 5164414 6414468 6457795
39971F457795j065530k396527l611334l142398o17140J516584R18986r69709p57091
$$ 6457795 5392265 2995738 -615596 -3757994 -4375134 -2858550 -1939564 -2909273 -3666364
39962c666364J686310K785134O53521j990543j888220K05254J282389O65146J44439
$$ -3666364 -1980054 805080 1458601 -531942 -2420162 -2214908 -932519 -267373 -122934
39953a22934M39187L19193p22327j395209q58844r6778j13214k76242M08177J475804
$$ -122934 316253 635446 -86881 -1482090 -2340934 -2437712 -2550926 -2827168 -2418991 -943187
39943i43187J702750R41670M1512o64862j484935k000634j030026J324494K743609
$$ -943187 759563 1701233 1742745 1077883 -407052 -2407686 -3437712 -2113218 630391
39934F30391J224410j865997k944326p45729J964114K176155N28236l05871J72074
$$ 630391 1854801 -11196 -2955522 -3701251 -1737137 439018 967254 661383 833457
39925H33457J63158q83842j464078j017358q16325r28711P12203M397302O509464
$$ 833457 996615 112773 -1351305 -2368663 -3184988 -4113699 -3401496 995806 7505270
39916G505270L963890j094933l896194l052611j094327j334N92878J028121N91746
$$ 7505270 11469160 10374227 6478033 3425422 2331095 2329761 2922639 3950760 4542506
39907D542506o82404j668036k050927k444844k427828q19315J736581K914422
$$ 4542506 3860102 2192066 141139 -2303705 -4731533 -5550848 -3814267 -899845
39899h99845K075248J186525J650470K501347K593086K206887J406495p63079
$$ -899845 1175403 2361928 4012398 6513745 9106831 11313718 12720213 11957134
39891A1957134l921275n430630l700914o37323J034606J220514J295004J128130
$$ 11957134 8035859 2605229 -1095685 -1733008 -698402 522112 1817116 2945246
39883B945246k73211k143742k512173j155887L5925k71825j412640k072086j812730
$$ 2945246 2672035 528293 -1983880 -3139767 -3103842 -3375667 -4788307 -6860393 -8673123
39874h673123j027694k85173O5007J25209L03399P57623J298347J849718K341440
$$ -8673123 -9700817 -9985990 -9920983 -9795774 -9492375 -8734752 -7436405 -5586687 -3245247
39865c245247K184373Q90984o98536j068820j21970P31323P33697M18697n4584
$$ -3245247 -1060874 -169890 -868426 -1937246 -2059216 -1327893 -594196 -175499 -230083
39856b30083j122913j966044q98458J507956K302241M41065j490331j460228r72232
$$ -230083 -1352996 -3319040 -4217498 -2709542 -407301 33764 -1456567 -2916795 -3889027
39847c889027j645255j845791J13854K013532Q81503j620237j188963K484824
$$ -3889027 -5534282 -7380073 -7266219 -5252687 -4371184 -5991421 -7180384 -4695560
39839d695560N056281L519224m41800l289250l134470m78496K127005J636863
$$ -4695560 360721 3879945 3438145 148895 -2985575 -3464071 -1337066 299797
39831B99797j843104l954619j481462K517794K699718o47369k327737l68295J854991
$$ 299797 -1543307 -5497926 -6979388 -4461594 -1761876 -2409245 -4736982 -5105277 -3250286
39822c250286K093039K254861L300044K482048j426712m670791l750131n77957
$$ -3250286 -1157247 1097614 4397658 6879706 5452994 782203 -2967928 -3545885
39814c545885J030536Q85203Q67213P00665p08078j832427n62771J668707J692849
$$ -3545885 -2515349 -1630146 -762933 -62268 -770346 -2602773 -3165544 -1496837 196012
39805A96012l40887j390995m77295L91328J91571L41272J610887K545817J985381
$$ 196012 -144875 -1535870 -2013165 -1621837 -1430266 -1088994 521893 3067710 5053091
39796E053091Q64551M00728K58606l48458j043806r42070j83908J92095k70663
$$ 5053091 5917642 6318370 6576976 6228518 5184712 4242642 4058734 4250829 3980166
39787C980166p78224l79393N07162L31126j409641l025654k748402j295353p11757
$$ 3980166 3201942 2822549 3329711 3660837 2251196 -774458 -3522860 -4818213 -5529970
39778e529970j185506j171809m25747j96318k02756J385404M071036M571731J889717
$$ -5529970 -6715476 -7887285 -8313032 -8509350 -8712106 -7326702 -3255666 1316065 3205782
39769C205782n29445M9722J634917J467958P41062J647510K529836N17727k822236
$$ 3205782 2676337 2726059 4360976 5828934 6569996 8217506 10747342 11265069 8442833
39760H442833l264836m44543J966855K129203J564530R36856r60635l328069l033432
$$ 8442833 5177997 4733454 6700309 8829512 10394042 11330898 10370263 7042194 4008762
39751D008762L60291L122008K575733L64426j137395k198639l442577l442063
$$ 4008762 4369053 7491061 10066794 10431220 9293825 7095186 3652609 210546
39743B10546j289860R22946R44656j92590o8681J432964K769878L552007M093303
$$ 210546 -1079314 -156368 788288 595698 527017 1959981 4729859 8281866 12375169
39734A2375169L394494M83103k823507l407946j242933L00798p80540k313510
$$ 12375169 15769663 16252766 13429259 10021313 8778380 9079178 8298638 5985128
39726E985128j251739J797090L240650J250871j898022k733230o82037J649330
$$ 5985128 4733389 6530479 9771129 11022000 9123978 6390748 5708711 7358041
39718G358041J687673o73981l571959m901401l555792k68086K485372K689958
$$ 7358041 9045714 8371733 4799774 -101627 -3657419 -3925505 -1440133 1249825
39710A249825J178103L54956M39605p14676l340410m246809j527744J901077K250243
$$ 1249825 2427928 2782884 3222489 2507813 -832597 -5079406 -6607150 -4706073 -2455830
39701b455830K36040o22299O34442K168004L079182L672886K992354r93l349689
$$ -2455830 -2219790 -2842089 -2207647 -39643 3039539 6712425 9704779 9703786 6354097
39692F354097m053792k673683k127203k509021j541777K24456k03835k421011
$$ 6354097 2300305 -373378 -2500581 -5009602 -6551379 -6326923 -6530758 -8951769
39684h951769k594581j49890J181757M07352J217928M481538N201858Q33642l308535
$$ -8951769 -11546350 -11696240 -10514483 -10107131 -8889203 -4407665 794193 1627835 -1680700
39675a680700k031089J410437R05071k605757l412030n73245J556457J063739
$$ -1680700 -3711789 -2301352 -1396281 -4002038 -7414068 -7987313 -6430856 -5367117
39667e367117M42857J071808J304548N13965L17604J082145J124392l3613r74173
$$ -5367117 -4924260 -3852452 -2547904 -2033939 -1716335 -634190 490202 456589 -517584
39658e17584j190744j470692j547631n01404P03174K56496j142563j124447M42340
$$ -517584 -1708328 -3179020 -4726651 -5228055 -4524881 -4268385 -5410948 -6535395 -6093055
39649f093055J506417J394653J143825Q22419j49505o60660N73114J906592R92353
$$ -6093055 -4586638 -3191985 -2048160 -1225741 -1375246 -2035906 -1462792 443800 1436153
39640A436153p90585m43640J060855L87311j579752p33236K415558K475318j696085
$$ 1436153 645568 201928 1262783 1650094 70342 -662894 1752664 4227982 2531897
39631B531897m232484j516631J982332J198674j540632j059234K196358L739411
$$ 2531897 -1700587 -3217218 -1234886 -36212 -1576844 -2636078 -439720 3299691
39623C299691K501538J343527J393808O70334j763902l914217l603806j005499
$$ 3299691 5801229 7144756 8538564 9208898 7444996 3530779 -73027 -1078526
39615a078526J623446J661762j515836n013864m817012o65911L417194M360195
$$ -1078526 544920 2206682 690846 -4323018 -9140030 -9805941 -6388747 -2028552
39607b028552L248414K182405J062767o44851j949690k269094k516112k421226
$$ -2028552 1219862 3402267 4465034 3820183 1870493 -398601 -2914713 -5335939
39599e335939j29708L516419M387033J502036m45064J372214K713323m25951m059028
$$ -5335939 -5465647 -1949228 2437805 3939841 3494777 4866991 7580314 7154363 3095335
39590C095335k361591K137735K292971j960291l946289j573346J07043j539268
$$ 3095335 733744 2871479 5164450 3204159 -742130 -2315476 -2208433 -3747701
39582c747701k723304r80531M28849r11076j962085R176K449348K288549J035100
$$ -3747701 -6471005 -7451536 -7022687 -7933763 -9895848 -9886672 -7437324 -5148775 -4113675
39573d113675J076384J143860k68259q40163J483527L530953J146315l753629
$$ -4113675 -3037291 -1893431 -2161690 -3001853 -1518326 2012627 3158942 -594687
39565e94687n379280k132476K005672L432021K218269j09641k256682k590916
$$ -594687 -5973967 -8106443 -6100771 -2668750 -450481 -560122 -2816804 -5407720
39557e407720k52603K822961L662471K148088P59657O33423M97183m88771j481237
$$ -5407720 -5660323 -2837362 825109 2973197 3732854 4366277 4863460 4374689 2893452
39548B893452j820578j754254j007055J032403L321782L697926J978035L19965
$$ 2893452 1072874 -681380 -1688435 -656032 2665750 6363676 8341711 8661676
39540H661676j54684p83538k455311l659981l055708j994316k334353l049850
$$ 8661676 8506992 7723454 5268143 1608162 -1447546 -3441862 -5776215 -8826065
39532h826065j526992K101867M344157K763017p13420k167952n03447J569832
$$ -8826065 -10353057 -8251190 -3907033 -1144016 -1857436 -4025388 -4528835 -2959003
39524b959003J283460p95155j809994k35697K574792M168044L298200M93876k582104
$$ -2959003 -1675543 -2470698 -4280692 -4516389 -1941597 2226447 5524647 6018523 3436419
39515C436419m018455k918552m51199R89986K80456j219770j347831M64095K809783
$$ 3436419 -582036 -3500588 -3951787 -2961801 -2681345 -3901115 -5248946 -4784851 -1975068
39506a975068L735656K212011j095715m020689m487805k426419L92559K590327
$$ -1975068 1760588 3972599 2876884 -1143805 -5631610 -8058029 -7665470 -5075143
39498e075143M294342N640214N479958K752161j550008m896379n445148l189538
$$ -5075143 -780801 4859413 10339371 13091532 11541524 6645145 1199997 -1989541
39490a989541M23335L225891L449299J307342q08195p04658J145592K296999J376200
$$ -1989541 -1566206 1659685 5108984 6416326 5608131 4903473 6049065 8346064 9722264
39481I722264l74814q26173K70559Q29747q93272l534241l807852j027687J292368
$$ 9722264 9347450 8521277 8791836 9621583 8728311 5194070 1386218 358531 1650899
39472A650899J73834k074766r81353K957324M399189J089251k677864k569059
$$ 1650899 1824733 -250033 -1231386 1725938 6125127 7214378 4536514 1967455
39464A967455j78245O18017j79995j54582N41843J71733l64399R77525K684980
$$ 1967455 1789210 2407227 2227232 2072650 2614493 2786226 2421827 3399352 6084332
39455F084332J405611j859759k290626J290041M207352K769656q17418k512897
$$ 6084332 7489943 5630184 3339558 4629599 8836951 11606607 10789189 8276292
39447H276292j980975j554600k175267k785357k171543J86611L615375N729172
$$ 8276292 6295317 4740717 2565450 -219907 -2391450 -2204839 1410536 7139708
39439G139708M420750J082741o14866J01326J76141j933709l530111k262993l119
$$ 7139708 11560458 12643199 12028333 12129659 12305800 10372091 6841980 4578987 4575868
39430D575868N80970K79863J009825J772100L94765k586199m951384n873256n031552
$$ 4575868 5156838 5436701 6446526 8218626 8613391 6027192 1075808 -4797448 -9829000
39421i829000j088302N196678Q687925N471047p84329l126866j003852l4081k336957
$$ -9829000 -10917302 -5720624 2967301 8438348 7654019 4527153 3523301 3489220 1152263
39412A152263l487222o62640K309450J317455j494434j659607O38919J828049
$$ 1152263 -2334959 -2997599 -688149 629306 -865128 -2524735 -1885816 -57767
39404e7767P92779p03419j890913l333899m281899l328452j335591m31605l00925
$$ -57767 735012 31593 -1859320 -5193219 -9475118 -12803570 -14139161 -14570766 -14871691
39395a4871691J278817M077891M953740K609525k01314o73106L30176L62169p32764
$$ -14871691 -13592874 -9514983 -4561243 -1951718 -2153032 -2826138 -2495962 -2133793 -2866557
39386b866557j155749j80693J194400K022311K095260J233164m93485j950307
$$ -2866557 -4022306 -4202999 -3008599 -986288 1108972 2342136 1848651 -101656
39378a01656j832296m66976N25250M14546j02609o00365j515943k544300k155647
$$ -101656 -1933952 -2400928 -1875678 -1461132 -1563741 -2164106 -3680049 -6224349 -8379996
39369h379996J73616K607347L198036K427449J999069K014449J162046q14969
$$ -8379996 -8206380 -5599033 -2400997 26452 2025521 4039970 5202016 4387047
39361D387047k701293l597920l374043j716200J143103K973953J466058k037288
$$ 4387047 1685754 -1912166 -5286209 -7002409 -5859306 -2885353 -1419295 -3456583
39353c456583l485822j616701M35213L36434O3898J802551L448908J920857j093575
$$ -3456583 -6942405 -8559106 -8123893 -7787459 -7723561 -5921010 -2472102 -551245 -1644820
39344a644820j080311K298483M465913K640022n67772j532359m11229K79988m04687
$$ -1644820 -2725131 -426648 4039265 6679287 6111515 4579156 4167927 4447915 4043228
39335D043228j339218j409129n11288P28386J275862M93245q27245j124671q1373
$$ 4043228 2704010 1294881 783593 1511979 2787841 3281086 2453841 1329170 1247797
39326A247797J055930J280769O69525o13646k506016l954703l371305p58129K040490
$$ 1247797 2303727 3584496 4254021 3640375 1134359 -2820344 -6191649 -6949778 -4909288
39317d909288L536863L607533K395783K50471j199137m25301J156058N26812k070113
$$ -4909288 -1372425 2235108 4630891 4881362 3682225 3256924 4412982 4939794 2869681
39308B869681k835126k43414K373098K195132J249555K145443K722896n04088
$$ 2869681 34555 -208859 2164239 4359371 5608926 7754369 10477265 9973177
39300I973177n477406o296594j635517L128122L219010K18598j190280M60611
$$ 9973177 4495771 -1800823 -3436340 -308218 2910792 3129390 1939110 2399721
39292B399721K529303K375095M88915n03225P20615K251880J216410k105723m176243
$$ 2399721 4929024 7304119 7793034 7289809 8010424 10262304 11478714 9372991 5196748
39283E196748l037513j044301r57683j645034o16907J062529L64149k100981k438341
$$ 5196748 2159235 1114934 157251 -1487783 -2104690 -1042161 -678012 -2778993 -5217334
39274e217334L17554K518760J499586q90681j910135j703154j474284q36274O49621
$$ -5217334 -4899780 -2381020 -881434 -1772115 -3682250 -5385404 -6859688 -7695962 -7046341
39265g046341J595908Q65969k11424J37980J401413J993442J707407J077673j49856
$$ -7046341 -5450433 -4584464 -4795888 -4657908 -3256495 -1263053 444354 1522027 1372171
39256A372171j855013k307852l64194K265496L207274K835766L078174L677378
$$ 1372171 -482842 -2790694 -3154888 -889392 2317882 5153648 8231822 11909200
39248A1909200K446910q50093l451021k976887j00297K567522K864026K68628
$$ 11909200 14356110 13506017 10054996 7078109 6977812 9545334 12409360 12677988
39240A2677988l783679o540447o142115l381342l66532K057869M095170M854468
$$ 12677988 8894309 2353862 -3788253 -7169595 -7536127 -5478258 -1383088 3471380
39232C471380K844954j023197l256794j782828J477072L244280K721763J411196
$$ 3471380 6316334 5293137 2036343 253515 1730587 4974867 7696630 9107826
39224I107826K76960j027166k470358k990990j945704m9258J651804K861574L458831
$$ 9107826 9384786 8357620 5887262 2896272 950568 901310 2553114 5414688 8873519
39215H873519K649040j23534l518470m826062k888601K08189J320363j85590k065423
$$ 8873519 11522559 11399025 7880555 3054493 165892 374081 1694444 1508854 -556569
39206e56569k288155j202230k04345M07358J102231J488726O09306j144057j855311
$$ -556569 -2844724 -4046954 -4251299 -3843941 -2741710 -1252984 -643678 -1787735 -3643046
39197c643046m75986J589316K263451J585870J376142K039216J353484k279782
$$ -3643046 -4119032 -2529716 -266265 1319605 2695747 4734963 6088447 3808665
39189C808665o453179o766265k306684K993670N223856M570086L159770J201713
$$ 3808665 -2644514 -9410779 -11717463 -8723793 -3499937 1070149 4229919 5431632
39181E431632k011248m811919m430954j355105Q95617P92193M87740J615537K509778
$$ 5431632 3420384 -1391535 -5822489 -7177594 -6281977 -5489784 -5002044 -3386507 -876729
39172h76729J253911j063811k132083j598378p10930l16434n97350j240334q91115
$$ -876729 377182 -686629 -2818712 -4417090 -5128020 -5444454 -6041804 -7282138 -8173253
39163h173253J488937L850608K587825j648164l205598Q51713N775904N601552
$$ -8173253 -6684316 -2833708 -245883 -1894047 -5099645 -4247932 1527972 7129524
39155G129524J533755p75477o854K55348j406286k417140j688541j466168k458837
$$ 7129524 8663279 7887802 7880948 8136296 6730010 4312870 2624329 1158161 -1300676
39146a300676j919421J498378M901454N219118K912052k9459k628111l858209
$$ -1300676 -3220097 -1721719 3179735 8398853 11310905 11281446 8653335 4795126
39138D795126k345090Q74566K249495M05146j802906j814586r78220j415464k239844
$$ 4795126 2450036 3324602 5574097 5979243 4176337 2361751 1383531 -31933 -2271777
39129b271777j651569k89129M20592J124072K798219L951635K547132o19242l071528
$$ -2271777 -3923346 -4212475 -3791883 -2667811 130408 4082043 6629175 6009933 2938405
39120B938405l903115l590202k181296j57353N85550o43176j282711J024455M389490
$$ 2938405 -964710 -4554912 -6736208 -6893561 -6308011 -6951187 -8233898 -7209443 -2819953
39111b819953N130448K956086N27959r37450k168406k836679j729099L58369J219364
$$ -2819953 2310495 5266581 5794540 4857090 2688684 -147995 -1877094 -1518725 -299361
39102b99361O38415K75368N38328N86393Q86875K377385L490473J725580j851015
$$ -299361 339054 614422 1152750 1739143 2626018 5003403 8493876 10219456 8368441
39093H368441l440789k042233l38290K51076J249030L014747L197301Q76188j447544
$$ 8368441 4927652 2885419 2547129 2798205 4047235 7061982 10259283 11135471 9687927
39084I687927j697348p57052K55074J738520L116894K280435o83496k821754l041775
$$ 9687927 7990579 7233527 7488601 9227121 12344015 14624450 13940954 11119200 8077425
39075H077425l423583m067372j790060L087830M325867j113119o631476m891952
$$ 8077425 4653842 586470 -1203590 1884240 6210107 5096988 -1534488 -6426440
39067f426440R39527K177977j928135l988093p58965K891143L299332L149655
$$ -6426440 -5486913 -3308936 -5237071 -9225164 -9984129 -7092986 -3793654 -643999
39059f43999M560586M299234K06921l368859j800150K182898K452129j445230
$$ -643999 3916587 8215821 8422742 5053883 3253733 5436631 7888760 6443530
39051F443530m277197k892665N51342K770896K981518K075584J020723N38913
$$ 6443530 2166333 -726332 -174990 2595906 5577424 7653008 8673731 9212644
39043I212644N16797k50902k273137l960584l674793k252239j422605o75523J621252
$$ 9212644 9729441 9478539 7205402 3244818 -429975 -2682214 -4104819 -4780342 -3159090
39034c159090M479083M795556K045623m84018l57361O53733k49049k293942k311078
$$ -3159090 1319993 6115549 8161172 7677154 7319793 7973526 7724477 5430535 3119457
39025C119457K59367K248748J226102j060259j277440O74479J664542J40106j495124
$$ 3119457 3378824 5627572 6853674 5793415 4515975 5190454 6854996 6995102 5499978
39016E499978o92298J039455L55185k425165l360246q87919J551337O22072j990059
$$ 5499978 4807680 5847135 6202320 3777155 416909 -471010 1080327 1702399 -287660
39007b87660k453863n89149N13794k82026p82730N70670K456418L210808L024683
$$ -287660 -2741523 -3330672 -2816878 -3098904 -3881634 -3310964 -854546 2356262 5380945
38998E380945K399910O19967k545935n112696m737491j743420J075533J471946
$$ 5380945 7780855 8400822 5854887 742191 -3995300 -5738720 -4663187 -3191241
38990c191241k36141j882651j574588O64624K962649L479007K250369P86488R0335
$$ -3191241 -3427382 -5310033 -6884621 -6219997 -3257348 221659 2472028 3258516 3348851
38981C348851p8557j62575k55670p00518j846939k782741j765232J200695L453865
$$ 3348851 3270294 3107719 2852049 2151531 304592 -2478149 -4243381 -3042686 411179
38972D11179K567835n84570k796135k121869M53616K650637L261828K761277K030628
$$ 411179 2979014 2394444 -401691 -2523560 -2069944 580693 3842521 6603798 8634426
38963H634426Q84403j589191m900909o403415m166798j07476J818702O14006r18866
$$ 8634426 9518829 7929638 3028729 -3374686 -7541484 -7648960 -5830258 -5216252 -6135118
38954f135118q09038m87052j244819j155245J644289M820635M596089J462101
$$ -6135118 -6944156 -7431208 -8676027 -9831272 -8186983 -3366348 1229741 2691842
38946B691842o26098l78734n44875k617892m102049k747044j85142J082007J665864
$$ 2691842 2065744 1687010 1142135 -1475757 -5577806 -8324850 -8509992 -7427985 -5762121
38937e762121L210827M224642J770568l081492n207224j915268L295300N232138
$$ -5762121 -2551294 1673348 3443916 362424 -4844800 -6760068 -3464768 1767370
38929A767370L268035Q37620o216n17892j695435j955486o1195J927785J272386
$$ 1767370 5035405 5873025 5866809 5348917 3653482 1697996 1636801 3564586 4836972
38920D836972j095328j806153k34231P73378k65313j305349p51170k36339j233144
$$ 4836972 3741644 1935491 1701260 2474638 2209325 903976 152806 -83533 -1316677
38911a316677k015267j058789o84710l291962o055174m281025Q97400L484240
$$ -1316677 -3331944 -4390733 -5075443 -8367405 -14422579 -18703604 -17806204 -14321964
38903a4321964J522028l31360J444263M057866L673239J425683N52799Q75478
$$ -14321964 -12799936 -13131296 -11687033 -7629167 -3955928 -2530245 -1977446 -1101968
38895a101968K01722j070865q72727M17042O60865L7233P98999L115052M392682
$$ -1101968 -900246 -1971111 -2843838 -2426796 -1765931 -1728698 -929699 2185353 6578035
38886F578035L070458M46340j663044k803759k994857j974258K6456K078727L370454
$$ 6578035 9648493 10094833 8431789 5628030 2633173 658915 685371 2764098 6134552
38877F134552L318601J481354j288980k540143j033058R05795J60585k592845
$$ 6134552 9453153 10934507 9645527 7105384 6072326 6978121 7138706 4545861
38869D545861l702532j736486R58037K129913K148643J852607O41499j826451
$$ 4545861 843329 -893157 64880 2194793 4343436 6196043 6837542 5011091
38861E011091m103154m633280l538170j709947L55406J932608J971086P23660
$$ 5011091 907937 -3725343 -7263513 -8973460 -8618054 -6685446 -4714360 -3990700
38853c990700l5185N83577J486434J766932K069210K615348K021697j12085j418785
$$ -3990700 -4025885 -3442308 -1955874 -188942 1880268 4495616 6517313 6405228 4986443
38844D986443N1159K411226K470199N92877j65474O19250n9633l242563n309738
$$ 4986443 5037602 7448828 9919027 10511904 10346430 10965680 10906047 7663484 2353746
38835B353746l051528R89822J581772j643337l272476L72975N802147O722111
$$ 2353746 -697782 292040 1873812 230475 -3042001 -2669026 3133121 9855232
38827I855232K082576l193744m980127m162109l308387k389368k10517K083746
$$ 9855232 11937808 8744064 3763937 -398172 -3706559 -6095927 -6306444 -4222698
38819d222698K186810N06113k48811O71052J146459Q1643o69505M55277K018564
$$ -4222698 -2035888 -1529775 -1778586 -1107534 38925 120568 -548937 -93660 1924904
38810A924904J949552P75503L89110Q26457N08830q51567j702861j129955k12183
$$ 1924904 3874456 4649959 5039069 5865526 6374356 5522789 3819928 2689973 2477790
38801B477790l60474j374807j838501r38523O74549J725626J610803O96543l67656
$$ 2477790 2117316 742509 -1095992 -2034515 -1359966 365660 1976463 2673006 2305350
38792B305350j094338r81526J87740J468874J255680m76049j533344m35622J101755
$$ 2305350 1211012 229486 417226 1886100 3141780 2665731 1132387 696765 1798520
38783A798520M98867j654662k246775j19607K514825L380950K579247J232694
$$ 1798520 2297387 642725 -1604050 -1723657 791168 4172118 6751365 7984059
38775G984059j57853j340965k134881l019632m080611l518704J34553M334621
$$ 7984059 7826206 6485241 4350360 1330728 -2749883 -6268587 -6134034 -1799413
38767a799413M599898J074295r15102J370273L738985J422476l634966n634613
$$ -1799413 2800485 3874780 2959678 4329951 8068936 9491412 5856446 221833
38759B21833k788339J496035L773303L301866P17461k528007l912376k054568
$$ 221833 -2566506 -1070471 2702832 6004698 6722159 4194152 281776 -1772792
38751a772792J035936K193940R46587q69639k070013k365752j171531J061216
$$ -1772792 -736856 1457084 2403671 1534032 -535981 -2901733 -4073264 -3012048
38743c012048J804644k24024k220635j118874J350311J360002o71087j041335
$$ -3012048 -1207404 -1431428 -3652063 -4770937 -3420626 -2060624 -2731711 -3773046
38735c773046P58315J523810K10211o90406j52199j13927j091808j104761j26394
$$ -3773046 -3014731 -1490921 -1280710 -1971116 -2123315 -2237242 -3329050 -4433811 -4560205
38726d560205o74250k420151j391367L161312O206981M318129Q83935L16438J460869
$$ -4560205 -5234455 -7654606 -9045973 -5884661 322320 4640449 5524384 5840822 7301691
38717G301691J080238j9442O30132J703075L86345j936600j706815L76484K59533
$$ 7301691 8381929 8362487 8992619 10695694 11082039 9145439 7438624 7815108 8074641
38708H074641k626587m521569l518790j813103r67935N92495L742241N961750
$$ 8074641 5448054 926485 -2592305 -4405408 -5373343 -4780848 -1038607 4923143
38700D923143M599888M27561l633276n377591l962917J7293L897318M514602J817612
$$ 4923143 9523031 9950592 6317316 939725 -3023192 -3005899 891419 5406021 7223633
38691G223633q47398j166607n79170j194653k196927j608121j12411k78967k346918
$$ 7223633 6376235 5209628 4630458 3435805 1238878 -369243 -481654 -760621 -3107539
38682c107539l465693j750072R88731J771891L28610j067489r00658J24680Q40927
$$ -3107539 -6573232 -8323304 -7334573 -5562682 -5234072 -6301561 -7202219 -7077539 -6236612
38673f236612J162498J332432J084152N12174N30668J239229J048687q98684k539192
$$ -6236612 -5074114 -3741682 -2657530 -2145356 -1614688 -375459 673228 -225456 -2764648
38664b764648j360170J616759K963130J786845O53711J178393J746400P16798
$$ -2764648 -4124818 -2508059 455071 2241916 2895627 4074020 5820420 6537218
38656F537218r95771k132432l239415m621788m504128j614305K161673L977687
$$ 6537218 5541447 3409015 169600 -4452188 -8956316 -10570621 -8408948 -4431261
38648d431261L434944J892204J22879j253029r02935J158904K364709J067381
$$ -4431261 -996317 895887 1018766 -234263 -1137198 21706 2386415 3453796
38640C453796n23912K21671J843860J292137o00703m34959J688300K031210n42937
$$ 3453796 2929884 3151555 4995415 6287552 5686849 5251890 6940190 8971400 8428463
38631H428463k617369j685213L07499N76646o09524j590935k092695k234662j094014
$$ 8428463 5811094 4125881 4433380 5010026 4400502 2809567 716872 -1517790 -2611804
38622b611804J445295L181287K290780L48679L51593K329810L150988R08860k269496
$$ -2611804 -1166509 2014778 4305558 4654237 5005830 7335640 10486628 11395488 9125992
38613I125992k842105m76053J420381K19490k305269k634102r29966q11769l261395
$$ 9125992 6283887 5807834 7228215 7447705 5142436 2508334 1578368 766599 -2494796
38604b494796m436179j683042J750901J562832q22944q91760J356795J766579
$$ -2494796 -6930975 -8614017 -6863116 -5300284 -6123228 -7014988 -5658193 -3891614
38596c891614n62752j774085O6376J963464J407062K61445Q95022K214988K211271
$$ -3891614 -4454366 -6228451 -6162075 -4198611 -2791549 -2530104 -1635082 579906 2791177
38587B791177J404099J107824P09584q11954k529460k821163j523924M75048K145464
$$ 2791177 4195276 5303100 6012684 5200730 2671270 -149893 -1673817 -1198769 946695
38578I46695K097447k86092k878825k695707l63984M92904j020665j892492p82831
$$ 946695 3044142 2758050 -120775 -2816482 -3180466 -2687562 -3708227 -5600719 -6383550
38569f383550j54615r85091m03184K509199L665310P00362k025837r4282L500307
$$ -6383550 -6538165 -7523256 -7926440 -5417241 -1751931 -1051569 -3077406 -3171688 328619
38560C28619L290486K97637m25645J189119O19187k843405m796969l027430j93731
$$ 328619 3619105 3916742 3491097 4680216 5299403 2455998 -2340971 -5368401 -5562132
38551e562132J410323K455030L117443K025370k26548j004961j47361k80759j725021
$$ -5562132 -4151809 -1696779 1420664 3446034 3219486 2214525 2067164 1786405 61384
38542F1384j562723R45339K500200J084802r37615j003165Q8153P61317J307657
$$ 61384 -1501339 -556000 1944200 3029002 2091387 1088222 1176375 1937692 3245349
38533C245349J898231J248429o91415j795198j342782j281649k068781r87361
$$ 3245349 5143580 6392009 5700594 3905396 2562614 1280965 -787816 -1775177
38525a775177K812297N240911K685387k298736m319653k137382J029770K451174
$$ -1775177 1037120 6278031 8963418 6664682 2345029 207647 1237417 3688591
38517C688591J849003j56133k266069k128042J145541M602316M350669N58847
$$ 3688591 5537594 5381461 3115392 987350 2132891 6735207 11085876 11644723
38509A1644723k816179l065571j306928r5815m66213j670323k448396k101724
$$ 11644723 8828544 5762973 4456045 4360230 3894017 2223694 -224702 -2326426
38501b326426r11105L92031J504113K306629K109967N49799j020080j048134n72310
$$ -2326426 -3237531 -2845500 -1341387 965242 3075209 3625008 2604928 1556794 984484
38492I84484j795182l695154k580952J890241N087451L857219R12695K8086M13929
$$ 984484 -810698 -4505852 -7086804 -5196563 -109112 3748107 4660802 4688888 5102817
38483E102817n55044k149479k097715j207374j679859k604528j710297j62417
$$ 5102817 4547773 2398294 300579 -906795 -2586654 -5191182 -6901479 -7063896
38475g063896p62976k351204j172889K414403L853364J524758j089423j515558
$$ -7063896 -7826872 -10178076 -11350965 -8936562 -5083198 -3558440 -4647863 -6163421
38467f163421j622212k900869k985690J47086L904599M275345J247614j643098
$$ -6163421 -7785633 -10686502 -13672192 -13525106 -9620507 -5345162 -4097548 -5740646
38459e740646j788089M66846L075867M041621K881548J224262Q83366J219512
$$ -5740646 -7528735 -7061889 -3986022 55599 2937147 4161409 5044775 6264287
38451F264287K28542j776712k212325m24276J068573M91668q93910j568884j855914
$$ 6264287 6492829 4716117 2503792 2079516 3148089 3639757 2745847 1176963 -678951
38442f78951j877264o02415J268022P95685k411992m180128j648961J767232J184711
$$ -678951 -2556215 -3158630 -1890608 -1094923 -3506915 -7687043 -9336004 -7568772 -6384061
38433f384061k215962k955089M77872L643778K748187n49748k119821n92186J806717
$$ -6384061 -8600023 -11555112 -11077240 -7433462 -4685275 -5235023 -7354844 -7947030 -6140313
38424f140313K353047P94087n03083N47208K779576L004229N12178j772477j636464
$$ -6140313 -3787266 -2993179 -3496262 -2949054 -169478 2834751 3346929 1574452 -62012
38415f2012m73425j02904L81995J874991K216885l77680l115888k172619J163234
$$ -62012 -535437 -638341 -256346 1618645 3835530 3457850 341962 -1830657 -667423
38406f67423K452796R66884l85007j037099k886576m462677j458250N298234Q590451
$$ -667423 1785373 2752257 2367250 1330151 -1556425 -6019102 -7477352 -2179118 6411333
38397F411333M544668j623007l246029j080943k65894k025666l181097j711558
$$ 6411333 10956001 9332994 6086965 5006022 4740128 2714462 -466635 -2178193
38389b178193J438414M599448O015831L954738o13407l367418j929159L72478
$$ -2178193 -739779 3859669 9875500 13830238 13216831 9849413 7920254 8292732
38381H292732m23033k638875k280478k63739o45327k946593k578570R95760K840012
$$ 8292732 7869699 5230824 2950346 2686607 2041280 -905313 -3483883 -2488123 351889
38372C51889N64448k156776k260741j918369l341073l970526j067544K722139
$$ 351889 916337 -1240439 -3501180 -5419549 -8760622 -12731148 -13798692 -11076553
38364a1076553L106776R08504M09989K465610L752345K385197L14699j96959N47431
$$ -11076553 -7969777 -7061273 -6651284 -4185674 -433329 1951868 2266567 2069608 2617039
38355B617039R28190P2066j623003k609237j255757J778431L237849J233553j660047
$$ 2617039 3545229 3617295 1994292 -614945 -1870702 -92271 3145578 4379131 2719084
38346B719084j735980M62889J189151n74269j771888l62392J619286J452604n02373
$$ 2719084 983104 1445993 2635144 2060875 288987 -73405 1545881 2998485 2496112
38337B496112k153292k730330k610874j552010R23741L947194N517959M246483
$$ 2496112 342820 -2387510 -4998384 -6550394 -5626653 -1679459 3838500 8084983
38329H084983N23548l460885m849391k566438R31022J726562j044693m051149
$$ 8084983 8608531 5147646 298255 -2268183 -1337161 389401 -655292 -4706441
38321d706441l861597p61154K528979M442727N263023N203809L760892J039038
$$ -4706441 -8568038 -9329192 -6800213 -2357486 2905537 8109346 11870238 12909276
$$ [...]
##END NTUPLES=NMR SPECTRUM
##END=
