##TITLE=31Pdec_DE-92K2_TFA
 CDCl3, 64 sc
 5.5.2025
##JCAMPDX= 6.0         $$ Bruker NMR JCAMP-DX V2.0
##DATA TYPE= NMR SPECTRUM
##DATA CLASS= NTUPLES
##ORIGIN= UXNMR, Bruker Analytische Messtechnik GmbH
##OWNER= root
$$ XWIN-NMR		Version 3.5
$$ Mon May  5 15:56:55 2025 Russian Standard Time (UT+4h)  she@DPX200
##.OBSERVE FREQUENCY= 81.013821
##.OBSERVE NUCLEUS= ^31P
##.ACQUISITION MODE= SIMULTANEOUS
##.ACQUISITION SCHEME= undefined
##.AVERAGES= 64
##.DIGITISER RES= 17
##SPECTROMETER/DATA SYSTEM= spect
##.PULSE SEQUENCE= zgpg30
##.SOLVENT NAME= D2O
##.SHIFT REFERENCE= (INTERNAL, D2O, 0, 198.062)
##AUDIT TRAIL= $$ (NUMBER, WHEN, WHO, WHERE, WHAT)
$$ ##TITLE= Audit trail, XWIN-NMR		Version 3.5
$$ ##JCAMPDX= 5.01
$$ ##ORIGIN= Bruker BioSpin GmbH
$$ ##OWNER= she
$$ F:/spectra/data/she/nmr/P31/2/pdata/1/auditp.txt
$$ ##AUDIT TRAIL=  $$ (NUMBER, WHEN, WHO, WHERE, WHAT)
(   1,<2025-05-05 15:55:59.23 +0400>,<she>,<DPX200>,
      <created by zg, POWCHK disabled, PULCHK disabled
       configuration hash MD5:
       00 E9 B6 7A A2 85 ED C7 34 08 36 98 17 FE 4E 26
       data hash MD5: 32K
       80 0E 0A C9 AD 36 60 9A 2B 8F 4F 78 37 C2 AA E5>)
(   2,<2025-05-05 15:56:01.73 +0400>,<she>,<DPX200>,
      <Start of raw data processing
       efp BC_mod = 2 LB = 1.5 FT_mod = 6 PKNL = 1 PHC0 = 1775.46 PHC1 = -1061.907 SI = 64K 
       data hash MD5: 64K
       1C C5 75 FC 55 4C 1A 57 4E EB B8 9E 86 C1 43 65>)
(   3,<2025-05-05 15:56:19.35 +0400>,<she>,<DPX200>,
      <pk PHC0 = 17.81801 PHC1 = 0 
       data hash MD5: 64K
       3F ED 0F 57 8F BF 58 6A 00 33 81 19 7A 72 83 F9>)
(   4,<2025-05-05 15:56:22.85 +0400>,<she>,<DPX200>,
      <abs ABSG = 5 
       data hash MD5: 64K
       39 0F 71 52 43 54 D0 D1 C8 CE 08 BC CF 02 06 19>)
$$ ##END=
$$ 
$$ hash MD5
$$ FC 88 0D C3 B2 6B 19 4D DD 17 CA 01 28 47 AB 8E
##$RELAX= 
##$RELAX= 
##$RELAX= 
##$RELAX= 
##$RELAX= 
##$RELAX= 
##$RELAX= 
##$RELAX= 
$$ Bruker specific parameters
$$ --------------------------
##$DU= <F:/spectra>
##$EXPNO= 2
##$NAME= <P31>
##$PROCNO= 1
##$TYPE= <nmr>
##$USER= <she>
##$AMP= (0..31)
100 100 100 100 100 100 100 100 100 100 100 100 100 100 100 100 100 100 
100 100 100 100 100 100 100 100 100 100 100 100 100 100 
##$AQSEQ= 0
##$AQ_mod= 1
##$AUNM= <au_zg>
##$AUTOPOS= <>
##$BF1= 81.014009
##$BF2= 200.13
##$BF3= 200.13
##$BF4= 200.13
##$BF5= 200.13
##$BF6= 200.13
##$BF7= 200.13
##$BF8= 200.13
##$BYTORDA= 1
##$CFDGTYP= 0
##$CFRGTYP= 5
##$CHEMSTR= <none>
##$CNST= (0..31)
1 1 145 1 1 1 1 1 1 1 1 1 1 1 1 1 1 1 1 1 1 1 1 1 1 1 1 1 1 1 1 1 
##$CPDPRG= <waltz16>
##$CPDPRG1= <>
##$CPDPRG2= <waltz16>
##$CPDPRG3= <>
##$CPDPRG4= <mlev>
##$CPDPRG5= <mlev>
##$CPDPRG6= <mlev>
##$CPDPRG7= <mlev>
##$CPDPRG8= <mlev>
##$CPDPRGB= <>
##$CPDPRGT= <>
##$D= (0..31)
0 1 0 0 0 0 0 0 0 0.06 0 0.03 2e-05 3e-06 0 0 0.0002 0 0 0 0 0 0 0 0 0 
0 0 0 0 0 0 
##$DATE= 1746446158
##$DBL= (0..7)
120 120 120 11 120 120 24 19 
##$DBP= (0..7)
150 150 150 150 150 150 150 150 
##$DBP07= 0
##$DBPNAM0= <>
##$DBPNAM1= <>
##$DBPNAM2= <>
$$ [...]
##$SUBNAM3= <"">
##$SUBNAM4= <"">
##$SUBNAM5= <"">
##$SUBNAM6= <"">
##$SUBNAM7= <"">
##$SUBNAM8= <"">
##$SUBNAM9= <"">
##$SW= 400.765351723535
##$SWIBOX= (0..15)
0 1 3 0 0 0 0 0 0 0 0 0 0 0 0 0 
##$SW_h= 32467.5324675325
##$TD= 32768
##$TD0= 1
##$TE= 0
##$TE2= 300
##$TE3= 300
##$TEG= 300
##$TL= (0..7)
0 120 53 12 22 120 120 120 
##$TP= (0..7)
150 150 150 150 150 150 150 150 
##$TP07= 0
##$TPNAME0= <>
##$TPNAME1= <>
##$TPNAME2= <>
##$TPNAME3= <>
##$TPNAME4= <>
##$TPNAME5= <>
##$TPNAME6= <>
##$TPNAME7= <>
##$TPOAL= (0..7)
0.5 0.5 0.5 0.5 0.5 0.5 0.5 0.5 
##$TPOFFS= (0..7)
0 0 0 0 0 0 0 0 
##$TUNHIN= 0
##$TUNHOUT= 0
##$TUNXOUT= 0
##$USERA1= <user>
##$USERA2= <user>
##$USERA3= <user>
##$USERA4= <user>
##$USERA5= <user>
##$V9= 5
##$VALIST= <valist>
##$VCLIST= <CCCCCCCCCCCCCCC>
##$VD= 0
##$VDLIST= <DDDDDDDDDDDDDDD>
##$VPLIST= <PPPPPPPPPPPPPPP>
##$VTLIST= <TTTTTTTTTTTTTTT>
##$WBST= 1024
##$WBSW= 4
##$XGAIN= (0..3)
0 0 0 0 
##$XL= 0
##$YL= 0
##$YMAX_a= 9680
##$YMIN_a= -14769
##$ZGOPTNS= <>
##$ZL1= 120
##$ZL2= 120
##$ZL3= 120
##$ZL4= 120
##$ABSF1= 198.0616
##$ABSF2= -202.7028
##$ABSG= 5
##$ABSL= 3
##$ALPHA= 0
##$AQORDER= 0
##$ASSFAC= 0
##$ASSFACI= 0
##$ASSFACX= 0
##$ASSWID= 0
##$AUNMP= <proc_1d>
##$AZFE= 0.1
##$AZFW= 0.5
##$BCFW= 0
##$BC_mod= 2
##$BYTORDP= 0
##$COROFFS= 0
##$CY= -3
##$DATMOD= 1
##$DC= 0
##$DFILT= <>
##$DTYPP= 0
##$F1P= 0
##$F2P= 0
##$FCOR= 1
##$FTSIZE= 65536
##$FT_mod= 6
##$GAMMA= 0
##$GB= 0
##$INTBC= 1
##$INTSCL= 9.790993e-09
##$ISEN= 30
##$LB= 1.5
##$LEV0= 0
##$LPBIN= 0
##$MAXI= 10000
##$MC2= 0
##$MEAN= 0
##$ME_mod= 0
##$MI= 50
##$NCOEF= 0
##$NC_proc= -8
##$NLEV= 6
##$NOISF1= 182.463
##$NOISF2= 159.3651
##$NSP= 0
##$NTH_PI= 0
##$NZP= 0
##$OFFSET= 198.0616
##$PC= 4
##$PHC0= 1793.278
##$PHC1= -1061.907
##$PH_mod= 1
##$PKNL= yes
##$PPARMOD= 0
##$PSCAL= 0
##$PSIGN= 0
##$REVERSE= no
##$SF= 81.0140089999434
##$SI= 65536
##$SIGF1= 159.3651
##$SIGF2= -187.1042
##$SINO= 113.3802
##$SIOLD= 16384
##$SREGLST= <1H.CDCl3>
##$SSB= 0
##$STSI= 65536
##$STSR= 0
##$SW_p= 32467.5324675325
##$SYMM= 0
##$S_DEV= 0
##$TDeff= 32768
##$TDoff= 0
##$TI= <>
##$TILT= no
##$TM1= 0
##$TM2= 0
##$TOPLEV= 0
##$USERP1= <user>
##$USERP2= <user>
##$USERP3= <user>
##$USERP4= <user>
##$USERP5= <user>
##$WDW= 1
##$XDIM= 65536
##$YMAX_p= 307633894
##$YMIN_p= -60814042
$$ End of Bruker specific parameters
$$ ---------------------------------
##NTUPLES= NMR SPECTRUM
##VAR_NAME=  FREQUENCY,     SPECTRUM/REAL,   SPECTRUM/IMAG
##SYMBOL=    X,             R,               I
##VAR_TYPE=  INDEPENDENT,   DEPENDENT,       DEPENDENT
##VAR_FORM=  AFFN,          ASDF,            ASDF
##VAR_DIM=   65536,         65536,           65536
##UNITS=     HZ,            ARBITRARY UNITS, ARBITRARY UNITS
##FACTOR=    0.49542278885378, 1,            1
##FIRST=     16045.7642231865, 0,            0
##LAST=      -16421.768244346, 0,            0
##MIN=       -16421.768244346, -60814042,    0
##MAX=       16045.7642231865, 307633894,    0
$$ Real data points
##PAGE= N=1
##DATA TABLE= (X++(R..R)), XYDATA
$$ [...]
7488A783044J62518o2800K92253l03228j729838k667985k400418j240282K14244
7479e952492J339403J514566Q65121N91069J549085K804761K667496R80818p35049
7470E624778j335246j072505n74740r8192J0445n34973r61479k0668J784140K073028
7460D894588k03974k806974l006803j314071n00901j472073k329295j679752o15644
7451i034899m37714k90457J279164L507351M025902K004101q81395k672143k948662
7442e448752k130568k96505K429706N009135N877636M189329N70953l020793m350023
7433B830118k712830O3428J295008L77504r56672j517082k137036l355191l470174
7424i582927r15334K578311L655619J835163o6467j55787K74306n78949k217879
$$ y = [1783044, 1945562, 1882762, 2175015, 1871787, 141949, -2526036, -4926454, -6166736, -5952492, -4613089, -3098523, -2233402, -1642333, -93248, 2711513, 5379009, 6359827, 5624778, 4289532, 3217027, 2642287, 2544095, 2554540, 2019567, 1058088, 1037420, 2821560, 4894588, 4690614, 1883640, -1123163, -2437234, -2938135, -4410208, -6739503, -8419255, -9034899, -9472613, -9763070, -8483906, -4976555, -950653, 1053448, 172053, -2500090, -5448752, -7579320, -7875825, -5446119, -436984, 5440652, 9629981, 10200934, 7180141, 2830118, 117288, 180716, 1475724, 1853228, 896556, -620526, -2757562, -6112753, -9582927, -10498261, -7919950, -4264331, -2429168, -2495635, -2651422, -2377116, -2956065, -5173944]
7415e173944k931046k143339m39940J577281L292651L855782K998946J441569
7407B477960r2084j379540j862548p17764J435586K337448P98026j487487k026321
7398e16724n23869J271380J801703P22442j403126l308088l606175k077052J57422
7389g482087K009883K946803K232684l33107k636681j869673J187246K562645
7381a382287J190564R12286L857153N813230K378473l522963n583185l417040
7373B46231k004952k905614k437126R82583L855444L507983J565687l05858k869882
7364c65504n282387m002764R95986L898213J000279l293383k974162Q63993K966868
7355f192861K381834K094878K364768Q17217j559504q59089K722292M118489J204454
$$ y = [-5173944, -8104990, -10248329, -10688269, -9110988, -5818337, -1962555, 1036391, 2477960, 2385876, 1006336, -856212, -1573976, -138390, 2199058, 2997084, 1509597, -516724, -1040593, 230787, 2032490, 2754932, 1351806, -1956282, -5562457, -7639509, -7482087, -5472204, -2525401, -292717, -625824, -3262505, -5132178, -3944932, -1382287, -191723, 720563, 4577716, 10390946, 12769419, 9246456, 3663271, 246231, -1758721, -4664335, -7101461, -6118878, -2263434, 1244549, 2810236, 2504378, -365504, -5647891, -9650655, -8654669, -4756456, -3756177, -7049560, -10023722, -9159729, -6192861, -3811027, -1716149, 648619, 1465836, -93668, -952757, 1769535, 5888024, 7092478]
7346G092478j812329j174215P98571Q7546k595136l670907k720166k464274l521783
7337i980215l125997K19396L814117M213395J915859N30343J754045L302433K560489
7328E203865M92973k496J251863J386309q27632k738119j826120L47389N78152
7319C866184j189442k276238j578383n30601K2585J000713K619488L291360K044532
7310G270198J90607m99856K9693N87006K71927j022479k621845l187486j837322
7301h19557N93661K389102K985276K922381K028306m40342l582163m860406l307806
7292b091548j152648j095393l012964m342722l043637M08204L391012L443341
7284g496355J029376l88820J525570M322877L531628r70279m289342l091796J75204
$$ y = [7092478, 5280149, 4105934, 4904505, 4992051, 2396915, -1273992, -3994158, -6458432, -9980215, -13106212, -12886816, -9072699, -4859304, -2943445, -2413102, -659057, 2643376, 5203865, 5696838, 5694342, 6946205, 8332514, 7504882, 4766763, 2940643, 3288032, 3866184, 2676742, 400504, -1177879, -1708480, -1685895, -685182, 1934306, 5225666, 7270198, 7460805, 6960949, 6990642, 7577648, 7849575, 6827096, 4205251, 1017765, -819557, -225896, 2163206, 5148482, 8070863, 10099169, 9658827, 6076664, 1216258, -2091548, -3244196, -4339589, -7352553, -11695275, -14738912, -14330708, -10939696, -7496355, -6466979, -6855799, -5330229, -1007352, 2524276, 1553997, -2735345, -5827141, -5651937]
7275e651937J420971N39245K37194J170162J401960k7301j774984k380611j697284
7266f762585j66513J608383K644731K459015J974857K149416K161741O99383j339834
7257E428594j568884K89423J614840M51075j815574k411166p24845J178797J118687
7248C560947q73093k682534k373547l50921J098445P01880k01010J88484J357853
7239D26504J449175L47099l01708r7022n50084k051713k466866k60547K688313
7230h16849L334888J539982p7522O1613P60807K96556j186496k196881j824482
7221a08384m33047J020822J728967J332859N463j660775k973675l426329k811072
7212g325171j295398M96483J593047J172970o65580k547402k718712q20660J488470
$$ y = [-5651937, -4230966, -3691721, -3454527, -2284365, -882405, -909706, -2684690, -5065301, -6762585, -6929098, -5320715, -2675984, -216969, 1757888, 3907304, 6069045, 6768428, 5428594, 3859710, 4149133, 5763973, 6215048, 4399474, 1988308, 1263463, 2442260, 3560947, 2687854, 5320, -2368227, -2719148, -1620703, -918823, -1119833, -931349, 426504, 1875679, 2222778, 1921070, 1824048, 1273964, -777749, -3244615, -3505162, -816849, 2518039, 4058021, 3980499, 4042112, 4802919, 5099475, 3912979, 1716098, -108384, -541431, 479391, 2208358, 3541217, 3546680, 1885905, -1087770, -4514099, -7325171, -8620569, -8124086, -6531039, -5358069, -6023649, -8571051, -11289763, -12110423, -10621953]
7203a0621953K295254J588868Q33706O07846L6144j085753j212544P04235L062219
7194c791978L364201J560467o9045j53343M48768P18429R51232J409347J191229
7185E629307l00724j933648k205256j207904k4760J006815K022514K332408J129861
7176F448613p54255j551790j119343j126004k279269k996317j708734P56944K193927
7167b136228J686054L20145l82650o7781K67037n08594k017634k323335l75442
7158e538428J961982J914372k88002j599458o85607K41845o50083j663309n78022
7149f884710J364754J500587K99950M28904J932702K055637N0025j475843r39896
7140a667890q7261l72608k91130J368076K418696N53778k187033j804886J586493
$$ y = [-10621953, -8326699, -6737831, -5904125, -5296279, -5260135, -6345888, -7558432, -6854197, -3791978, -427777, 1132690, 1063645, 910302, 1359070, 2077499, 3028731, 4438078, 5629307, 5328583, 3394935, 1189679, -18225, -42985, 963830, 2986344, 5318752, 6448613, 5694358, 4142568, 3023225, 1897221, -382048, -3378365, -5087099, -4330155, -2136228, -450174, -130029, -512679, -580460, -313423, -822017, -2839651, -5162986, -5538428, -3576446, -1662074, -1950076, -3549534, -4235141, -3993296, -4643379, -6306688, -6884710, -5519956, -4019369, -3719419, -3290515, -1357813, 697824, 747849, -727994, -1667890, -1755151, -2127759, -2418889, -1050813, 1367883, 1921661, -265372, -2070258, -483765]
7131d83765L593736J682241j607154k567366r65678P11321Q35912l04936j877205
7122i82894l034093k596026r9931K661944K859050J43692k397945j982678K86647
7113e142234J270493M75731M36383K213658L356256J859808l47836m21048P44987
7104D446198J51820k014531k547771p26657K91989j277450k895227k056429m52916
7095g080974r67149k824099k900390m85058K241062L662369L985352L544360K277151
7086A452624O78046o33010j861442k941746k547409k55125J587654Q55047o47112
7077d312473K46386K608417K501278n77303k675981j665529j54503m02439o14363
7068e046510R19453J853169k24168k767082j763031J519986K084428j025926l234072
$$ y = [-483765, 3109971, 4792212, 3185058, 617692, -347986, 363335, 1199247, 894311, -982894, -4016987, -6613013, -6712944, -4051000, -1191950, -1048258, -3446203, -5428881, -5142234, -3871741, -3396010, -2959627, -745969, 2610287, 4470095, 4122259, 3701211, 4446198, 4598018, 2583487, 35716, -690941, -398952, -1676402, -4571629, -6628058, -7080974, -8048123, -10872222, -13772612, -14257670, -12016608, -8354239, -4368887, -824527, 1452624, 2130670, 1497660, -363782, -3305528, -5852937, -6108062, -4520408, -3665361, -4312473, -4066087, -1457670, 1043608, 466305, -2209676, -3875205, -4029708, -4432147, -5046510, -4127057, -2273888, -2498056, -5265138, -7028169, -5508183, -3423755, -4449681, -7683753]
7059g683753j402088J944530L092335K384156K417821L288011K608580m69883
7051F179709l656260m141133j552328J859283L306169J851558p92185k035455
7043A019358j160274K26823N45533l0889o02160q79375n27681J271598L836850
7034C699783L937819m66265n858536n949399J41887N680174M539126r10833l365316
7025A448440m14620L241058L200146O75553j050837j747062k960769m080350l112761
7016d801202m28914J370490J201597N32809N12351M44394l14425j052280j191657
7007c726837j354213j897796j832879m14100J249034J443592R7103j291350j547426
6998i274872p40983N08151J778041K827227L317908K797539J112217r67691j896446
$$ y = [-7683753, -9085841, -7141311, -4048976, -1664820, 753001, 4041012, 6649592, 6179709, 2523449, -1617684, -3170012, -1310729, 1995440, 3846998, 3054813, 1019358, -140916, 85907, 631440, 600551, -1609, -880984, -1408665, -137067, 3699783, 7637602, 7171337, 1312801, -4636598, -4494711, 1185463, 5724589, 4813756, 1448440, 1033820, 4274878, 7475024, 8150577, 7099740, 5352678, 2391909, -1688441, -4801202, -5230116, -3859626, -2658029, -2125220, -1612869, -1168475, -1482900, -2535180, -3726837, -5081050, -6978846, -8811725, -9225825, -7976791, -6533199, -6436096, -7727446, -9274872, -10015855, -9507704, -7729663, -4902436, -1584528, 1213011, 2325228, 1357537, -538909]
6989e38909q54528R91463J585008M05195j103587j636427j437653j203125p75419
6980d567982J89757J108467J065195J16658q32746j173853r24323k14252Q02544
6971d430535J603352J542119O40353k00533k0129J131014K001226J267989r62753
6962B572103l098316l795044l268134k341123r11025J458257L783215M069448
6954a530619J820350j042824k212797j074063J347959L308112L025064J1918l558559
6945I4541m253121j229446K376479L010084P27085j503736j724829p94233n51191
6936c848367j468301k398232k028533l28488J414006K109533K119213K329070
6928b100099K328789Q46960j859021l592330k882730p95466O70133P72315j51171
$$ y = [-538909, -1393437, -401974, 1183034, 1588229, 484642, -1151785, -2589438, -3792563, -4567982, -4378225, -3269758, -2204563, -2087905, -2920651, -4094504, -5018827, -5233079, -4430535, -2827183, -1285064, -644711, -845244, -865373, 265641, 2266867, 3534856, 2572103, -526213, -4321257, -7589391, -9930514, -10841539, -9383282, -5600067, -1530619, 289731, -753093, -2965890, -4039953, -2691994, 616118, 3641182, 3653100, 94541, -4158580, -5388026, -3011547, -1463, 725622, -778114, -2502943, -3297176, -3848367, -5316668, -7714900, -9743433, -10071921, -8657915, -6548382, -4429169, -2100099, 228690, 1075650, -783371, -4375701, -7258431, -8053897, -7383764, -6611449, -6762620]
6919f762620j678615k991416k725954m78909K210680L358051K409087J43674k174952
6910h690974l031580j581306Q31654J741444J037043J263226L198943L851729
6902a379821J238171j409812K28969M807463O649440L335558j777118m650765
6894G042085m643324l096378j333318r31131k697809m193260j532569M641171
6886f744533Q167307M872435j496902l961773j227688J569529M06574k908339
6878a323390m329952k992600j117398j07609Q65006K478977L575011K932428J427568
6869A408041P70876P33588l03904k058834k127562p871J240859o75025l480245
6860d500077l566630j403628m25050j417868j724441j44260R99719j79324j998915
$$ y = [-6762620, -8441235, -11432651, -14158605, -14637514, -12426834, -9068783, -6659696, -6516022, -8690974, -11722554, -13303860, -12472206, -10730762, -9693719, -8430493, -5231550, -1379821, -141650, -1551462, -1322493, 3484970, 10134410, 13469968, 11692850, 7042085, 2398761, -697617, -2030935, -2962066, -5659875, -9853135, -11385704, -6744533, 1422774, 6295209, 4798307, 836534, -391154, 1178375, 1584949, -1323390, -5653342, -8645942, -9763340, -9870949, -9005943, -6526966, -2951955, -19527, 1408041, 2178917, 2912505, 2608601, 549767, -1577795, -1585666, -344807, -1019832, -4500077, -8066707, -9470335, -9895385, -11313253, -13037694, -13181954, -12182235, -12361559, -14360474]
6851a4360474j632063J250165M555480O073048M904728J972105l81545n80480
6843A800964L24894M18279j1768O09785J715233J140572r14861j889289j278694
6834A915115j365167k547733j924021J620097M670297M170030J814080P56584
6826I109282Q03674l0481j576476k302295k214285k153933j924963j551290k300569
6817d141336l961874l621610j17958K924089J996731r27141j864979j039649r34406
6808a1688133n79932K404979N552029L868367j630932m194464j222478K278706
6800e211858K098928P32442J705951L200893J687369j705102k983136j272035
6792a746548R23109J919436J873506P75501j322466k758425j831966L92969J288854
$$ y = [-14360474, -15992537, -14742372, -10186892, -4113844, 790884, 2762989, 2381444, 1800964, 2125858, 2544137, 2532369, 3142154, 4857387, 5997959, 5083098, 3193809, 1915115, 549948, -1997785, -3921806, -2301709, 2368588, 6538618, 8352698, 9109282, 9912956, 9882475, 8305999, 6003704, 3789419, 1635486, -289477, -1840767, -4141336, -8103210, -11724820, -11842778, -8918689, -6921958, -7849099, -9714078, -10753727, -11688133, -12268065, -9863086, -4311057, -442690, -2073622, -6268086, -7490564, -5211858, -3112930, -2380488, -674537, 2526356, 4213725, 2508623, -474513, -1746548, -823439, 1095997, 2969503, 3745004, 2422538, -335887, -2167853, -1774884, -486030]
6783d86030M18644j84339N53086J237707M34335j106413j526064k77767J288574
6774C51733J495729Q7196j657388k408096j994034r39333N06885K112632L065122
6765F20446K781279J909475J315886N74159j044446k615732k555282j320024r14035
6756a248274j634654j702005n63041k0454j032036j710121j25197K511085L154635
6747b370062O64144k812269l795316p35528L942222N629264K753258p72679n44240
6738A958794K103000K351413l68362j683913J23279J193298j058319l294178k027300
6729g02288L73208K5838j604408n56416K207340K051332j435565l348724q46588
6720c836271L012630M047274J908899j050026k789330k111398J110184M624303
$$ y = [-486030, -67386, -251725, 301361, 1539068, 1973403, 866990, -659074, -936841, 351733, 1847462, 1934658, 277270, -2130826, -4124860, -5064193, -4557308, -2444676, 620446, 3401725, 5311200, 6627086, 7201245, 6156799, 3541067, 985785, -334239, -1248274, -2882928, -4584933, -5147974, -5168428, -6200464, -7910585, -8035782, -5524697, -2370062, -1705918, -4518187, -8313503, -9049031, -5106809, 522455, 3275713, 2503034, 1958794, 4061794, 6413207, 6044845, 4360932, 4484211, 5677509, 4619190, 1325012, -702288, -329080, -303242, -1907650, -2464066, -256726, 1794606, 359041, -2989683, -3836271, -823641, 3223633, 5132532, 4082506, 1293176, -818222, 291962, 4916265]
6712D916265M817253P42917m113280n384099k383080J594124K890628R86283j291848
6703B775163j141229O26786N65128k284234m284828k075044K302037L969479J807078
6694B260336p68138j223609o75077p20549p07983M25736J865223K081767R61777
6685C499483m10012j213614j400333j371201j470212j405291n40671P02520P72329
6676b837002o20510j404762j28968J432288R76652m07920m2774J605272J575512
6667A47788m67422j562011m00206O96284j09026j322010r55754M31807J144547
6658b396003O80434o20494k294629l147246j986496K17276J107120N25050P33086
6649g181902K300640K827237J049497r21029j228780j069265j664504j441918
$$ y = [4916265, 9733518, 10476435, 6363155, 979056, -1404024, 190100, 3080728, 4067011, 2775163, 1633934, 2260720, 2825848, 541614, -3743214, -5818258, -3516221, 453258, 2260336, 1492198, 268589, -406488, -1127037, -1835020, -1409284, 455939, 2537706, 3499483, 3089471, 1875857, 475524, -895677, -2365889, -3771180, -4311851, -3609331, -2837002, -3457512, -4862274, -4991242, -3558954, -2582302, -2990222, -3032996, -1427724, 147788, -319634, -1881645, -2281851, -1585567, -1694593, -3016603, -3972357, -3540550, -2396003, -1715569, -2336063, -4630692, -7777938, -9764434, -9547158, -8440038, -7914988, -7181902, -4881262, -2054025, -1004528, -1925557, -3154337, -4223602, -5888106, -7330024]
6641g330024R33631L200162K414962m60362j983283j049850N03707J146458Q90664
6632a733935O4847p57697k89394J814295L511462K664842O2012j851322k381761
6623A103349k499977k128470j39548K998906M882728L956765J194719j231257
6615H137215j966273j300889p58863j419814k228467j150513J437684K466871
6607C216951N31906j703129j470959o8636k69107j435702p93105J413713J866059
6598A287991o89722l656304m468518l301244j217968J489654L912568M004543
6590b639000J244855j752850k025518J01786J482576M0560k671972l178747l29034
6581i727344K796584K394889q76525k421217j80948K163228O41013k864801l394651
$$ y = [-7330024, -6396393, -3196231, -781269, -1241631, -3224914, -4274764, -3771057, -2624599, -1733935, -1669088, -2426785, -2716179, -901884, 2609578, 5274420, 5336432, 3485110, 1103349, -1396628, -3525098, -3664646, -665740, 4216988, 8173753, 9368472, 8137215, 6170942, 4870053, 4111190, 2691376, 462909, -687604, 750080, 3216951, 3748857, 2045728, 574769, 506133, 237026, -1198676, -1991781, -578068, 1287991, 598269, -3058035, -7526553, -10827797, -12045765, -10556111, -6643543, -2639000, -1394145, -3146995, -5172513, -5070727, -3588151, -3547591, -6219563, -9398310, -9727344, -6930760, -4535871, -5412396, -7833613, -8014561, -5851333, -5210320, -8075121, -11469772]
6572a1469772l41257K005115J140847m48452K61710K501441L489505K293252K81482
6563b86129q48095l22496J372764K663866K211864L70069j340210j893356j103829
6554H24448P36363K250954J328452j931525l962916j992206J685143K753102J040375
6545B732190j14558J70182m53639k316991k630361p36451K79075q90411j122789
6536e083753J657833M393574L538049N29046q64742j30300M70580l0208r34261
6527C545818j968956k888293k489461o03511O00906j85690q85202M90417J994377
6518b389595Q52304j447099j245156J238239K224283L88640j573600j650595r10427
6509d513006m39781N38058K192245K764118J341869l80835o67578j27975o7844
$$ y = [-11469772, -11811029, -9805914, -8665067, -9113519, -8851809, -6350368, -2860863, -567611, -286129, -1134224, -1456720, -83956, 2579910, 4791774, 5161843, 3821633, 1928277, 824448, 1560811, 3811765, 5140217, 3208692, -754224, -2746430, -1061287, 1691815, 2732190, 2617632, 2787814, 2334175, 17184, -2613177, -3349628, -3070553, -3960964, -5083753, -3425920, 967654, 4505703, 5034749, 4170007, 4039707, 4510287, 4480079, 3545818, 1576862, -1311431, -3800892, -4404403, -3803497, -3989187, -4874389, -4383972, -2389595, -1537291, -2984390, -4229546, -2991307, -767024, -378384, -1951984, -3602579, -4513006, -4952787, -4414729, -2222484, 541634, 1883503, 1502668, 835090, 707115, 639271]
6500F39271j41376P07440K100937K591874J646160J26327j022944j877997l202618
6491A567074n028517n738554l487701Q92805L672395K397000o10447r15809K251793
6482d999961N097070M296393P71420k256326l032046j910704K50451K662522M073924
6473D952743L150913r4025l644353m810655k731908M66270J751316O61336l15450
6464f13813O31390K050639J558435n50305j976515j917692j599424j474398l06542
6455d198225K271067M219186L349204J52963k587419k663725n61507J036721N370
6446A023635k659609l649475j326915K055667L200201J745911j69944j261906
6438a042435j788751j596939k15148J073629J17215k386416k733263P64487M753819
$$ y = [639271, 497895, 1205335, 3306272, 5898146, 7544306, 7670633, 6647689, 4769692, 1567074, -3461443, -9199997, -12687698, -11794893, -8122498, -5725498, -6335945, -7251754, -4999961, 97109, 4393502, 5164922, 2908596, -123450, -2034154, -1783703, 878819, 4952743, 8103656, 8009631, 4365278, -445377, -3177285, -2711015, -959699, -298363, -613813, 17577, 2068216, 3626651, 3076346, 1099831, -817861, -2417285, -3891683, -4198225, -1927158, 2292028, 5641232, 5794195, 3206776, 543051, -18456, 1018265, 1023635, -1635974, -5285449, -6612364, -4556697, -1356496, 389415, 219471, -1042435, -2831186, -4428125, -4643273, -3569644, -3452429, -5838845, -8572108, -7807621, -3053802]
6429c053802M758750P47893l133987l640571j465511N62492Q04807o0354l90151
6420d870434N81283K205972L316112L185687J689620o49074k447528k339234p72473
6411a00069J66284l66072o91378L69641R19620j138140l931238l545572K20598
6402h096326L316800K995876P77959q82363j771070k430218k312071j190980j88993
6393i781386K86880J554250L948073N268680L928997J665484Q16086O35889r95291
6384G327662l409830l645409q13457K513336L512473J907529o51520k507839k965546
6375A267399k368267j540300q09631J11124J067515J238057N32510P1702M22826
6366g065N67187k87837j102656n75631P38271J319407P77345l02110j572631k540655
$$ y = [-3053802, 1704948, 2452841, -681146, -4321717, -5787228, -5224736, -4419929, -4480283, -4870434, -4289151, -2083179, 1232933, 4418620, 6108240, 5459166, 3011638, 672404, -100069, 66215, -299857, -991235, -621594, 298026, -840114, -4771352, -8316924, -8096326, -4779526, -1783650, -1005691, -1888054, -3659124, -6089342, -8401413, -9592393, -9781386, -9494506, -7940256, -3992183, 1276497, 5205494, 6870978, 7687064, 8322953, 7327662, 3917832, 272423, -541034, 1972302, 5484775, 7392304, 6740784, 4232945, 1267399, -1100868, -2641168, -3450799, -3339675, -2272160, -1034103, -501593, -429891, -7065, 560122, 272285, -830371, -1406002, -667731, 651676, 1429021, 1126911, -445720, -2986375]
6356b986375k130645l62716O99414k93744j375974J33532L266640M499369K881070
6347D330571R90088N04789N4737j421637k238584q89825R19077O53439j152219
6338A750436j987158j437555j357321k137625j730337P73786L197690L546592
6330F18508L041177L479843L323501j9707m554179m767081L04306M357050K258688
6321H042106k396831k756939Q11559J794989j569518l382887N6640L929539K504055
6312G032713j940831l226012j012862k97403k567507l643927r26194K454033K644033
6303a483957M56933o13394O56777K471744K869496J616418j60095j295266j750036
6294B768620k431379l466093l495475j796619k4576q615p31609J03569K027366
$$ y = [-2986375, -5117020, -5479736, -4780322, -5074066, -6450040, -6316508, -3049868, 1449501, 4330571, 5320659, 5825448, 5880185, 4458548, 2219964, 1330139, 2249216, 2902655, 1750436, -236722, -1674277, -3031598, -5169223, -6899560, -6125774, -2928084, 618508, 3659685, 7139528, 10463029, 10443322, 5889143, 1122062, 1426368, 5783418, 8042106, 5645275, 2888336, 3699895, 5494884, 3925366, 542479, 599119, 4528658, 7032713, 5091882, 1865870, 853008, 555605, -2011902, -5655829, -6582023, -4127990, -1483957, -1027024, -1640418, -983641, 1488103, 4357599, 5974017, 5813922, 4518656, 2768620, 337241, -3128852, -6624327, -8420946, -8445522, -8454137, -9185746, -9082177, -7054811]
6285g054811K127647m11007k816776k542252l03868J611094K166778J721665Q69882
6276d631648N9673o02171j455061k290928j772512N95875K688299K241639M71778
6267d695056L02399J411820P42240j770428k285034O17486K915159J163508j992362
6258c590268j832308J448016L562985K393812k47626k243677l118367k685750
6250f313183r38884N17273l02021k564231l002317k46896L164255M042267K331294
6241c312443N91287O37095J731152J876928K53204j919854k944343k630098k052700
6232g769772j675574r90842l3794M56382Q41604K512358M943976N024108J270350
6223D578796l051964l550238l76502K308768J920234j86246j789092k463932k510250
$$ y = [-7054811, -4927164, -5338171, -8154947, -10697199, -11001067, -9389973, -7223195, -5501530, -4631648, -4571975, -5174146, -6629207, -8920135, -10692647, -10096772, -7408473, -5166834, -4695056, -4392657, -2980837, -2238597, -4009025, -6294059, -5676573, -2761414, -1597906, -3590268, -5422576, -3974560, -411575, 1982237, 1734611, -509066, -3627433, -6313183, -7252067, -6734794, -7036815, -9601046, -12603363, -12850259, -9686004, -5643737, -3312443, -2721156, -2084061, -352909, 1524019, 1777223, -142631, -3086974, -5717072, -7769772, -9445346, -10436188, -10469982, -10013600, -9171996, -6659638, -1715662, 3308446, 4578796, 1526832, -2023406, -2399908, -91140, 1829094, 1642848, -146244, -2610176, -5120426]
6214e120426j572782L36216J836068J494133l91055j987852j645748O18239K883630
6205c549577K834369K15135k523042k849054j052875M13055O6005j275129j998742
6196i719855j333083M30113K279359L109904K841194K621469L132392L325662
6188F687155J922793n51230k564807l658823m112985l279456l99183L085009M204558
6179A333031J912660j645992l539415k511458O21932L435940L197498l06635l564220
6170a066659l150540l53768P03183p29415j242371P54353K249916O71032j859241
6161d023510k032153l16788O89554O55523Q80990R44128l56521j699983o42867
6152e901627J975081K721817R90069Q2506J806652L416193J972523r69785j797863
$$ y = [-5120426, -6693208, -6356992, -4520924, -3026791, -3417846, -5405698, -7051446, -6433207, -3549577, -715208, -500073, -3023115, -5872169, -6925044, -6511989, -6445984, -7721113, -9719855, -11052938, -10622825, -8343466, -5233562, -2392368, 229101, 3361493, 6687155, 8609948, 8058718, 5493911, 1835088, -2277897, -5557353, -5956536, -2871527, 1333031, 3245691, 1599699, -1939716, -4451174, -3829242, -393302, 2804196, 2497561, -1066659, -4217199, -4570967, -3867784, -4597199, -5839570, -5085217, -2835301, -2164269, -4023510, -6055663, -6372451, -5682897, -5027374, -4146384, -3202256, -3558777, -5258760, -5901627, -3926546, -1204729, -214660, -132154, 1674498, 5090691, 7063214, 6093429, 4295566]
6143D295566l04983L58964j224015k662468j633526M23455M17913j608440k242586
6134d180120K53500K872477J798498j825369k968047K71016L806744L310358J29721
6125C468778j251940J63748J337512O01200j92995M19505R11162k79253j889029
6116C288688k093266j614758k123088k896975j782006J070393L038460K808966
6108c03586K049041K518401L341529K488674r5900k346339k784107k095890j710292
6099A061531j788253j478116p21471n83698j443977j998385j070513L86638N35688
6090g100556n03101q05434L13902J384025J463203J617870K514761K641781R20118
6081B446569o42712M11993K751551K733820p9193k113000j175286M06131l37907
$$ y = [4295566, 3990583, 4349547, 3125532, 463064, -1170462, -747007, -329094, -1937534, -4180120, -3926620, -1054143, 744355, -1081014, -4049061, -3778045, 28699, 3339057, 3468778, 2216838, 2380586, 3718098, 4319298, 4126303, 4545808, 5456970, 5177717, 3288688, 1195422, -419336, -2542424, -5439399, -7221405, -6151012, -3112552, -303586, 1745455, 4263856, 7605385, 10094059, 9998159, 7651820, 4867713, 2771823, 1061531, -726722, -2204838, -2926309, -3510007, -4953984, -6952369, -8022882, -7636244, -7100556, -7603657, -8409091, -8095189, -6711164, -5247961, -3630091, -1115330, 1526451, 2446569, 1803857, 2215850, 4967401, 7701221, 7622028, 5509028, 4333742, 4739873, 4401966]
6072D401966k476020k847645p89272J288739J507920N35800j05179m2916J63646
6063A637039J71646J08156R4797n635k95438l93006L30596J631911J961566J54479
6053E396111k624145l948891l257838k340154k303279j935183j11384J982391
6045i142372K607607K032377J627979J639423J658716K102035L102276K994541
6037H622582L78917k979510l899466k096895k30261M3756p12371k196656m661218
6028g731122o263560l844699K081271O371625N474859J936364K96004R58163J134750
6019D13655r101o97399k28918M4165m99959p83470l34009k58894j143255j753302
6009e250487p66917J339078K853156K596384Q39383r53797j338232m78951j96440
$$ y = [4401966, 1925946, -921699, -1710971, -422232, 1085688, 1621488, 1516309, 1473393, 1637039, 1808685, 1916841, 2011638, 2006003, 1710565, 1317559, 1648155, 3280066, 5241632, 5396111, 2771966, -1176925, -4434763, -6774917, -9078196, -11013379, -11124763, -9142372, -6534765, -4502388, -2874409, -1234986, 423730, 2525765, 5628041, 8622582, 9001499, 6021989, 2122523, 25628, -204633, -160877, -873248, -3069904, -7731122, -13994682, -17839381, -15758110, -9386485, -3911626, -1975262, -1679258, -721095, 413655, 404554, -292845, -521763, -477598, -977557, -1761027, -2095036, -2353930, -3497185, -5250487, -6017404, -4678326, -1825170, 771214, 1610597, 656800, -681432, -1160383, -1356823]
6000a356823j549692k862244j537147K208961M880587L528322q29092m187039
5992a704167l618345j00414K633775K143843j7443l95324J690184L150056J522921
5983E305086j469123k459156j108487O7255k43017q43284o92611l41677k18167
5974b003181K74340J097574R79653m39318j555108j157035l54252o32188j219615
5965e009130l19974J666420K316820Q31569m68929N78607K604373K466219p0968
5956D595007j680917k52880J827578J124267j661394k861411j648569j144826
5948a703145k997724m455061k905458k72159J46261r72200l35837K411442M091470
5939f992411K763331Q6689j307269m89243J726519L374956K345941j076091l342425
$$ y = [-1356823, -2906515, -5768759, -7305906, -5096945, -216358, 3311964, 2482872, -1704167, -5322512, -5422926, -2789151, -645308, -662751, -1058075, 632109, 3782165, 5305086, 3835963, 1376807, 268320, 335575, 92558, -750726, -1443337, -1785014, -2003181, -1728841, -631267, 348386, -90932, -1646040, -2803075, -3157327, -3789515, -5009130, -5329104, -3662684, -1345864, -514295, -983224, -404617, 2199756, 4665975, 4595007, 2914090, 2661210, 4488788, 5613055, 3951661, 1090250, -558319, -1703145, -4700869, -9155930, -12061388, -12333547, -12187286, -13159486, -13495323, -11083881, -6992411, -4229080, -4142391, -5449660, -5938903, -4212384, -837428, 1508513, 432422, -2910003]
5930b910003j734231J536670K255368L55228n36827O83322J093911r59500l185459
5921c401521l236455j690905J77246K179204L441909K376823j13596r70960j887
5912a240142n53439l300522l919902N6610M424886M288422J200584q8833R98262
5903A865926J541419Q93751Q77864J636313J764313J487223J672171R86049j812195
5894A0912834m156602k819149L62747P44876j909254l486715k330386p12246M07997
5885b985898K427381M279689K483845k321493m499455j560382J887760J346974
5877A058421j079055j073005J024426K013118J543713J579176J994027Q81823
5869G942644j604887l175245k844975j880109j553282j854218k039053j155378
$$ y = [-2910003, -4644234, -3107564, -852196, -496968, -1033795, -350473, 743438, -216062, -3401521, -6637976, -8328881, -8151635, -5972431, -2530522, -153699, -267295, -1238255, -1240142, -1793581, -5094103, -9014005, -8957395, -4532509, -244087, 956497, 867664, 1865926, 3407345, 4301096, 5178960, 6815273, 8579586, 10066809, 11738980, 12725029, 10912834, 6756232, 3937083, 4299830, 5044706, 3135452, -351263, -2681649, -3393895, -2985898, -558517, 3721172, 6205017, 3883524, -615931, -2176313, -288553, 1058421, -20634, -1093639, -69213, 1943905, 3487618, 5066794, 7060821, 7942644, 6337757, 3162512, 317537, -1562572, -3115854, -4970072, -7009125, -8164503]
5861h164503J161353L431547L283669P60572j107042l63214J251083J375135N66921
5852B195521O21868J254535R04309n16080j877411k646898k635410j399639L58265
5843c740940N71507j125518k124415p10845J102441J076291N33542J533368K715141
5834a69428J687767n37860j515953j751060k679486k354673J363934M814039K286682
5825A143962m340146o623580j531505M282064M642047J885028R73739J342395
5817A774004k21035k753099k848576p01197P43042R92993J694279K392348J169786
5808B242545j200997j990664j071801q35292j714879j611042Q2547J525923J853949
5799b719711K031640J819483m34387l978005n220517k734685L84543J015117J29309
$$ y = [-8164503, -7003150, -3571603, -287934, 472638, -634404, -997618, 253465, 1628600, 2195521, 2817389, 4071924, 4976233, 4460153, 2582742, -64156, -2699566, -4099205, -3740940, -3169433, -4294951, -6419366, -7130211, -6027770, -4951479, -4417937, -2884569, -169428, 1518339, 980479, -535474, -2286534, -4966020, -7320693, -5956759, -1142720, 1143962, -3196184, -9819764, -11351269, -7069205, -2427158, -542130, 431609, 1774004, 1552969, -1200130, -4048706, -4749903, -4006861, -3013868, -1319589, 1072759, 2242545, 1041548, -949116, -2020917, -2856209, -4571088, -6182130, -6099583, -4573660, -2719711, -688071, 1131412, 697025, -3280980, -8501497, -11236182, -10851639, -9836522, -9707213]
5790i707213L39090J723059K515191K192304J509767P12176k11414n48105o277
5781a481422J85875q97087k020766j582952j71081O49845R82262J705301J960316
5772f69709M07180j497273p66781K187168L189225J86209l365309l089162M55462
5763b962990L035068K554258Q76086K14189L44126M9893o29953q79147p98995
5754A802535j259576k207719k220833l62451J924924J793020j543164m974295
5746g047559m428834K29671M529340M292680J64943l649792m175398j909858R21905
5737a1072902K604243K501415J049695l16323l13480O85915J124284L82441n80343
5728c935055q84438p95138o78423j45364R86486J915446J926088J401812R40281
$$ y = [-9707213, -9368123, -7645064, -5129873, -2937569, -1427802, -715626, -927040, -1475145, -1481422, -1295547, -2192634, -4213400, -5796352, -5967433, -5317588, -4335326, -2630025, -669709, -262529, -1759802, -2526583, -339415, 2849810, 3036019, -329290, -3418452, -2962990, 72078, 2626336, 3502422, 3716611, 4060737, 4110630, 3480677, 2601530, 1802535, 542959, -1664760, -3885593, -4248044, -2323120, -530100, -2073264, -7047559, -11476393, -11246722, -6717382, -2424702, -2259759, -5909551, -10084949, -11994807, -11072902, -8468659, -5967244, -4917549, -5233872, -5547352, -4861437, -3737153, -3354712, -3935055, -4819493, -5614631, -6293054, -6438418, -5451932, -3536486, -1610398, -208586, 731695]
5719G31695L19257p08123j396286q92179M41597J553905J910221J270788p15824
5710B515051l305247m062265j506486K126792L013069O55177j574752j199767
5702c338428M11865Q21574p574o22350o73721n95026Q6568J897822L452626K525865
5692C959221p78112l646859l770618j706971L29302R70807M87610j34944k52748
5683d543312P8757M35470N58072M06935r7301p59691o66163Q25034K479469K127826
5673H45096j19154j424096k81951R50170k94144k396539j839999J198824L094409
5664b67384K365007J300426J486559J466137J87717p58905l68621n44714k706269
5655B159953m753394m195436k006935m38856Q15127K893210M182818K522439k45229
$$ y = [731695, 1050952, 342829, -1053457, -1945636, -1504039, 49866, 1960087, 3230875, 2515051, -790196, -4852461, -6358947, -4232155, -1219086, -563909, -2138661, -3338428, -2926563, -2104989, -2112563, -2734913, -3408634, -4003660, -3917092, -2019270, 1433356, 3959221, 3181109, -465750, -4236368, -5943339, -5614037, -4643230, -4155620, -4290564, -4543312, -4464555, -4029085, -3471013, -3064078, -3161379, -3921070, -4587233, -3762199, -1282730, 845096, 725942, -698154, -980105, -29935, -324079, -2720618, -4560617, -3361793, -267384, 2097623, 3398049, 4884608, 6350745, 6538462, 5779557, 5410936, 4866222, 2159953, -2593441, -6788877, -8795812, -9234668, -8419541, -5526331, -1343513, 1178926, 933697]
5646I33697l19629J870991K039742r99077l269813j955351L58136J25935j768202
5637b983571k035412j68661J457477J487550Q49360N09986J72677n22447q58495
5628b091536K81223K756979M413380K822686j374391m014279k231129J200413
5620A763346J214738k291336m318047k386070M8028l37305j545124l90360J773124
5611f469006J676352j4022p8097J510443J861567N26007K1239R11050O86694j594202
5601i61975l333883k369379J10651J854984K155307J203055n90951j767757r01405
5592d601353P56094N51475r87822m01874K607646L475273k60535m209323l219534
5583f289953Q09203J959570p01377k455222q71754R78548M65985l15740J091488
$$ y = [933697, 614068, 2485059, 4524801, 3525724, 255911, -1699440, -1341304, -1215369, -2983571, -5018983, -5187644, -3730167, -2242617, -1393257, -883271, -710594, -1233041, -2091536, -1810313, 946666, 5360046, 8182732, 6808341, 2794062, 562933, 1763346, 2978084, 686748, -3631299, -6017369, -5969341, -6306646, -7851770, -8242130, -6469006, -4792654, -4806676, -4884773, -3374330, -1512763, -986756, -965517, -54467, 632227, -961975, -4295858, -6665237, -6554586, -4699602, -2544295, -1341240, -1932191, -3699948, -4601353, -3845259, -3293784, -4281606, -4683480, -2075834, 1399439, 1138904, -3070419, -6289953, -5480750, -3521180, -4222557, -6677779, -7549533, -6570985, -6105000, -6420740, -5329252]
5574e329252K639482J095570j952605j796897K022573M231429J168296l585193
5566a506597l751712J078490M834706L033332j730647l954281k432944n31477
5558d961130m90441r03462k75170J19475j217239k774905j914810R32866K471957
5549i012859R83966j559058k430714j401364Q0624J535641L452650N152897M766361
5540A568144K050305l58470M4284K180577K623747P1662l132900m209740k937360
5531b099751p79165J196040K262208J475508j005710k965571k321420K14229K139383
5522a884249K200737R51063q27442k325438k108364L42467K850396K706679M91166
5513B397015p12221J21015R18396L40600l35387o8402R6956n42624o54173O06718
$$ y = [-5329252, -2689770, -1594200, -3546805, -5343702, -3321129, 910300, 2078596, -1506597, -5258309, -4179819, 654887, 3688219, 1957572, -1996709, -4429653, -4961130, -5451571, -6355033, -6630203, -6510728, -7727967, -10502872, -12417682, -11484816, -9012859, -8028893, -9587951, -12018665, -13420029, -13339405, -11803764, -8351114, -3198217, 1568144, 3618449, 3259979, 3304263, 5484840, 8108587, 8180249, 5047349, 837609, -2099751, -2878916, -1682876, 579332, 2054840, 1049130, -1916441, -4237861, -4023632, -1884249, 316488, 1267551, 440109, -1885329, -3993693, -3651226, -800830, 1905849, 2397015, 1684794, 1805809, 2724205, 3064805, 2729418, 2661016, 2757972, 2215348, 1561175, 2167893]
5503B167893J524285K32983k426303m188698m089765k511037j38335J658904J160004
5494f610069j291528k799120j513614R14995K165333K587947L551751M302898
5486A308593L213073R09657n88063r79270j316407j346445l2004J704754J610192
5477D484080m52959k206348k363287k027272k250477k323522j279015M41735J514704
5468f462361R45994j327029l960143m534402j783851K479601M927206M207270
5460e507715J820390j74843r89317q22062j61408M62338R11678J550064K363897
5451e46978K622611K098222J623152J570292J101451L3936k54453O04714M18264
5442I271211k223395m773559l821799j48880K391151K165795P95767l68816j398824
$$ y = [2167893, 3692178, 3925161, 1498858, -2689840, -6779605, -9290642, -9428977, -7770073, -6610069, -7901597, -10700717, -12214331, -11299336, -9134003, -6546056, -2994305, 1308593, 4521666, 5431323, 4843260, 3863990, 2547583, 1201138, 1169134, 2873888, 4484080, 4031121, 1824773, -538514, -2565786, -4816263, -7139785, -8418800, -7977065, -6462361, -5516367, -6843396, -10803539, -15337941, -17121792, -14642191, -9714985, -5507715, -3687325, -3862168, -4851485, -5673547, -5834955, -5372617, -4460939, -2910875, -546978, 2075633, 4173855, 5797007, 7367299, 8468750, 8502686, 8248233, 8852947, 9271211, 7047816, 2274257, -1547542, -1696422, 694729, 2860524, 3656291, 3287475, 1888651]
5433A888651j828196j077735p02407k570305m731180l124688J903108M936424
5425e306328K849555r48465j708232M90661K266166K035966Q72128o7984n80018
5416i6551q25746j234780k108608k603043j531398L62764R46734Q2973M3562J683928
5406e280165K909127K240279J136040J053121Q73720o54680k337180k659517k331695
5397e050950k413364k012636l17467J111494Q02244K85896J568964L247053K421623
5388c57143n13908k321947j696263m65285q5143J15724P76037J169384Q47114
5379b531430O45713J157963J623614J175358K32372o4831O33411J351175P86459
5370E009804j038523k400706j877221m12988m4507p19876l70804J533069K859675
$$ y = [1888651, 60455, -1017280, -1719687, -4289992, -9021172, -12145860, -10242752, -5306328, -2456773, -3405238, -5113470, -4622809, -2356643, -320677, 551451, 483467, -96551, -922297, -2157077, -4265685, -6868728, -8400126, -8037362, -7090628, -7007655, -6964093, -5280165, -2371038, -130759, 1005281, 2058402, 2932122, 2277442, -59738, -2719255, -5050950, -7464314, -9476950, -9794417, -8682923, -7880679, -7594783, -6025819, -2778766, -357143, -871051, -3192998, -4889261, -5354546, -5439689, -5323965, -4547928, -3378544, -2531430, -1885717, -727754, 895860, 2071218, 2303590, 2238759, 2872170, 4223345, 5009804, 3971281, 1570575, -306646, -719634, -764141, -1484017, -1854821, -321752, 2537923]
5361B537923K142248O39848k02827q97410j855800j712310J15089J478468N94058
5352B839287r92091j136499p02616j485663k537909j930952m67560l1952J83810
5343f262145J816869L107363J169396k304165k696538J35579J425465o11180j903034
5334f122390K76282K366843L92541l177690k931787J410695M878717M296344J514558
5325B904113m55077j180480j717648k187579j986528j271781q32940o96407J24041
5316g300286K038359L584327K735121k41409k337199j219949J659897K722436
5308A641297O44742k328801l381129k058753n7695P89757R7509p48101k223K031348
5298c372049K758346O19753k273395k592588j96816J977336K015542P97985j23982
$$ y = [2537923, 4680171, 5320019, 5117192, 4219782, 2363982, 651672, 766761, 2245229, 2839287, 1847196, 710697, 8081, -1477582, -4015491, -5946443, -6414003, -6445955, -6262145, -4445276, -1337913, -168517, -2472682, -5169220, -5033641, -3608176, -4219356, -6122390, -5846108, -3479265, -3086724, -6264414, -9196201, -7785506, -2906789, 1389555, 2904113, 2449036, 1268556, -449092, -2636671, -4623199, -5894980, -6727920, -7424327, -7300286, -5261927, -1677600, 1057521, 816112, -1521087, -2741036, -1081139, 1641297, 2286039, -42762, -3423891, -5482644, -5540339, -4750582, -4653073, -5401174, -5403397, -3372049, -613703, 6050, -2267345, -4859933, -5056749, -3079413, -1063871, -265886, -389868]
5289c89868q3081J247406L471915M381829J920145k270786m013641k101319J77440
5280B340040J11723q50816l56776R06601J036601M27758N76472R33557r8055j942264
5270C084841k417289j092991L61391Q85726P81808L8415j574880k647678j061685
5261c642342K403305L863191J228381k593394l325023q95619Q36667n42567l203535
5252e870936m019722k301218M48739K874773M266996L830777J518324p67351q75263
5243h94881N58184Q14663q03963j922315j049479K4997l76342n22718J738064
5234b433790M471029L786368j28477k845322j967407r2849k82622j609656j303674
5225b406400P31903J946856Q33626j293865k065399n43304J974807L178496K006062
$$ y = [-389868, -472949, 774457, 4246372, 8628201, 10548346, 8277560, 4263919, 2162600, 2340040, 2451763, 1600947, 1244171, 2150772, 3187373, 3615131, 4191603, 5125160, 5027105, 3084841, 667552, -425439, -64048, 821678, 1603486, 1641901, 67021, -2580657, -3642342, -1239037, 2624154, 3852535, 1259141, -2065882, -2961501, -2124834, -2667401, -5870936, -9890658, -12191876, -11743137, -8868364, -4601368, -770591, 747733, -19618, -894881, -336697, 477966, -325997, -2248312, -3297791, -3272794, -3649136, -4171854, -2433790, 2037239, 5823607, 5695130, 2849808, 882401, 789552, 506930, -1102726, -2406400, -1674497, 272359, 1105985, -187880, -2253279, -2796583, -821776, 2356720, 4362782]
5216D362782k48114j539965j494504j299276j511999j361196k72967J263407K522869
5207D21037L025697K245527K66297j358055j103999J20920m0070j855123l077823
5198a355592k461183j330650q11139L8908J856629K968429J789946l71856j113159
5189g89667m95571o07112k012115k732520j097087J810604L265689J991373l59937
5180a026343j051783L98698J436226j96270l076608l654280r86594K003150K445693
5171c708111Q42674m99650p82221j013468j817238k346273j421346Q76819L000711
5162f868103L450086K396242J097183k99908k733931n303013m797084l38080L722446
5153i674162K906625q54207j795668J314917L923341K963120O04635m85970j029301
$$ y = [4362782, 4114668, 2574703, 1080199, -219077, -1731076, -3092272, -3365239, -2101832, 421037, 3446734, 5692261, 5958558, 4600503, 3496504, 3617424, 3577354, 1722231, -1355592, -3816775, -5147425, -5958564, -5919656, -4063027, -1094598, 695348, 323492, -789667, -1285238, -1892350, -3904465, -6636985, -7734072, -5923468, -2657779, -666406, -1026343, -2078126, -1679428, -243202, -439472, -3516080, -7170360, -8156954, -6153804, -3708111, -2865437, -3365087, -4147308, -5160776, -6978014, -9324287, -10745633, -9868814, -6868103, -3418017, -1021775, 75408, -224500, -2958431, -8261444, -13058528, -13396608, -9674162, -6767537, -7621744, -9417412, -8102495, -4179154, -1216034, -611399, -1097369, -2126670]
5144b126670k056932j912048P70402L933047M655402K758107p9274k546000l458446
5135f2412j959223L56963L74376j801911k320519K60628K144873L96125k081685
5126d692785j408073R73332J363949L02255R14665K735213K473270O6427j024122
5117A704131N24534K325882K640744K393485K286043J329306r13735l253376m609349
5108D427665m761508l462820r82274Q24600L82045r54961m87957J812904L150339
5099e1967J641332j637080m005049l178287J012169N402769N728992J892389j325576
5090E479692j063611o49033l468490o136589l395036K587969M643617J570713
5082d30768m79071J642035L486080J252319j843730j490543M25346o26746m143790
$$ y = [-2126670, -4183602, -6095650, -5325248, -1392201, 3263201, 6021308, 5942034, 3396034, -62412, -2021635, -1664672, -1290296, -3092207, -5412726, -5152098, -3007225, -2611100, -4692785, -6100858, -5127526, -3763577, -3461322, -2546657, 188556, 2661826, 2728253, 1704131, 2228665, 4554547, 7195291, 9588776, 11874819, 13204125, 12290390, 9037014, 4427665, -333843, -3796663, -4778937, -3954337, -3572292, -4527253, -5015210, -3202306, -51967, 1589365, -47715, -4052764, -7231051, -6218882, -816113, 4912879, 6805268, 5479692, 4416081, 3767048, 298558, -5838031, -9233067, -6645098, -2001481, -430768, -909839, 732196, 4218276, 5470595, 3626865, 2136322, 2561668, 1934922, -2208868]
5073b208868n444815k799411N41115J291410l159n91550Q73470L108138L936906
5064a296764K808425J253971O69778N87679P4782l96623j98945m55488k290417
5055G56398m058122l126627O0906K580733L274432L306519K863162R41883j422630
5046E176654j618028Q3851L22833j877959l184704j300459J209260Q60841j667041
5037a994752k991316j715178O23182K019917J660612J02362r89779k41364J601446
5028a924870K339268J104175q57592k112503k035867k25838K770606M389202K462266
5019E908847j254758k881405j838692j205874k334632k864296j165466R08338
5011f727938J346394Q44403O16857L08000j89661K98141J664162J724117j68303
$$ y = [-2208868, -7653683, -10453094, -9911979, -8620569, -8623728, -9215278, -8341808, -5233670, -1296764, 1511661, 2765632, 3435410, 4023089, 4097871, 3701248, 3502303, 3046815, 756398, -3301724, -6428351, -6367445, -3786712, -512280, 2794239, 5657401, 6599284, 5176654, 3558626, 3642477, 3965310, 2087351, -1097353, -2397812, -1188552, -327711, -1994752, -4986068, -6701246, -6078064, -4058147, -2397535, -2295173, -3284952, -3526316, -1924870, 414398, 1518573, 660981, -1451522, -3487389, -3713227, -942621, 3446581, 5908847, 4654089, 1772684, -66008, -1271882, -3606514, -6470810, -7636276, -6727938, -5381544, -4537141, -3920284, -3612284, -3801945, -3503804, -1839642, -115525, -283828]
5002b83828j475068m16744J157291J028011J40572L87803J105894N27575q55223
4993A316283j009703M48507J830672J609951k19987k455970l629597l281890k365305
4984g757039j516283K32311L233199M984013L118487k52465r70868Q09902J054722
4975B935979j218096k320804l01542J890580J517670q9217r50520j577371k333535
4966b446856j601020Q24869K091291O27672j152623q47944M97369J141467J422634
4957E56859J599090M09972j962755k969226j817443q66059r91954J69070L062153
4948b810293L927323P12709l003237l251722r13691J275573K830936L550448J787865
4939D105911j886667l467674j356228P58026J07636o66576J160515L320473K803027
$$ y = [-283828, -1758896, -2175640, -1018349, 9662, 150234, 538037, 1643931, 2171506, 1316283, 306580, 755087, 2585759, 4195710, 3975723, 1519753, -2109844, -5391734, -7757039, -9273322, -9041011, -5807812, -823799, 2294688, 2042223, 1071355, 1881257, 2935979, 1717883, -602921, -904463, 986117, 2503787, 2414570, 1464050, -113321, -2446856, -4047876, -3223007, -1131716, -504044, -1656667, -2504611, -2007242, -865775, 556859, 2155949, 2565921, 603166, -2366060, -4183503, -5049562, -6041516, -5872446, -2810293, 1117030, 1829739, -1173498, -4425220, -5338911, -4063338, -1232402, 2318046, 4105911, 2219244, -1248430, -2604658, -1846632, -1738996, -2405572, -1245057, 2075416, 4878443]
4930D878443P39022p95665k268839l376073j473373K741391L721954k65680l039709
4921H61471j68181L583985K422877j128190j830285p45605j193623j112408K497621
4912C187662O015043M116125j367870m695608m670843l411653j019681K168663
4904C21838K867191N25392P1038L099659L641116p09102k462906K688347O463292
4895A6505865J838439m055284k785945L37159k190811m505661P28737N817028
4887A1689527J490180l968224O88194O970544J732661o074075o37825R284305
4879B1175287N566245k454573O263114K0155498J3116978L944959L8553271R9649877
4871B05970656R9750515J912723j08250923j25099260n7618613q85584o28296
$$ y = [4878443, 5617465, 4821800, 2552961, -823112, -2296485, 444906, 4166860, 3901180, 861471, 693290, 4277275, 6700152, 5571962, 3741677, 2996072, 1802449, 690041, 3187662, 9202705, 13318830, 11950960, 7255352, 2584509, -827144, -1846825, 321838, 3189029, 3714421, 3785459, 6885118, 10526234, 9817132, 7354226, 10042573, 16505865, 18344304, 14289020, 11503075, 11840234, 9649423, 5143762, 5872499, 11689527, 13179707, 9211483, 9899677, 16870221, 18602882, 12528807, 11890982, 21175287, 26741532, 24286959, 30550073, 50705571, 63822549, 67767508, 106320779, 205970656, 305721171, 307633894, 199382971, 74283711, 16665098, 15779514, 15151218]
4864A5151218j5628739o695119Q218231L200776q724692o036802L107444J453445
4856e954238n815960n100678L70578Q11978p62933K087559M339205K73642l191944
4847a2942791J246860O930545M887481n51678r23189J213973p53622l899613j934083
4838f726117K055111J159736k725844k848618O45270K704175K692925K943541
4830i9821K347277n95357k696757j320801L6942j808938l203651o66077J503238
4821f503945j411171n197698l421519J410309K423677O7155j4075K274215K130358
4812h242694n09001p08094K598189M851115L039932j065529m387842m700518q90374
4803a0014816M623990O190670K058489k025982j134221J115562p93391m234627
$$ y = [15151218, -477521, -7172640, 1045591, 4246367, -4478325, -10515127, -7407683, -5954238, -11770198, -16870876, -16500298, -15688320, -16451253, -14363694, -10024489, -9750847, -12942791, -11695931, -4765386, 122095, -429583, -1352772, -138799, -892421, -4792034, -6726117, -4671006, -3511270, -6237114, -9085732, -8440462, -5736287, -3043362, -99821, 2247456, 1652099, -1044658, -2365459, -2328517, -4137455, -7341106, -8007183, -6503945, -7915116, -13112814, -16534333, -15124024, -12700347, -12633192, -12647267, -10373052, -8242694, -8751695, -9459789, -6861600, -2010485, 1029447, -36082, -4423924, -9124442, -10014816, -5390826, 799844, 2858333, 832351, -301870, 813692, 20301, -4214326]
4795d214326k779960K570994M974783K824934Q63712R68894J04791k225711k384443
4786G03668J69315J049374j634498l961871k525510Q60278K790551K430899M78983
4777C61189k172841l438212j346248K489992M019880K138539l45630j517030k413746
4768b224107l571364l315592q97492J745312K765625K549823K095501J375884
4760E23590J05673j520757l111143l791332k338941P49328K615622J635745O0875
4751e071340M31481J285413j11049k565201k672649m58620J095528J227388J548338
4742e290711J814713M48649j175799j83769K137151J650471j291364j811287J037203
4733b664743K141259r21970l218061m43293L661303K890480k097060n296202m040975
$$ y = [-4214326, -6994286, -4423292, 551491, 3376425, 4240137, 5209031, 5313822, 3088111, 703668, 872983, 1922357, 287859, -3674012, -6199522, -5339244, -2548693, -117794, 361189, -1811652, -5249864, -6596112, -4106120, -86240, 2052299, 1706669, 189639, -2224107, -5795471, -9111063, -10008555, -8263243, -5497618, -2947795, -852294, 523590, 629263, -891494, -4002637, -7793969, -10132910, -9383582, -6767960, -5132215, -5071340, -4639859, -3354446, -3465495, -6030696, -8703345, -9161965, -8066437, -6839049, -5290711, -3475998, -3027349, -4203148, -4386917, -2249766, -599295, -1890659, -3701946, -2664743, -523484, -1445454, -4663515, -5106808, -1445505, 1444975, -652085, -5948287, -9989262]
4724i989262j235222J51023M85465J231325K467075L285563K944484J470633J5477
4715H26561j01412M85006n87337l837533o225282m785415o70832K391860K679163
4706i825221J482616K93910p86964j837187k148430j044949J222802L607481M736955
4697d298987L500954M6090l682289n052426k935162J062077L709145L025608L13745
4688d311245j237433l27194J029950O03728q24031r05620O45671K018749K319359
4679i88066K221567J792109L04651j439372j305378P71964K092738J139092j59223
4670D430082K66617J287811P54042p62263j102841m29253j062931l371380m506213
4661d496329k351150J112709K074925k06970k464880j592915J593025L734783
$$ y = [-9989262, -11224484, -11073461, -10587996, -9356671, -6889596, -3604033, -659549, 811084, 826561, 725149, 1210155, 622818, -3214715, -9439997, -14225412, -14896244, -12504384, -9825221, -8342605, -8048695, -8835659, -10672846, -12821276, -13866225, -12643423, -9035942, -4298987, -798033, -751943, -4434232, -9486658, -12421820, -11359743, -7650598, -4624990, -4311245, -5548678, -5875872, -4845922, -4242194, -5066225, -5971845, -5326174, -3307425, -988066, 1233501, 3025610, 3330261, 1890889, 585511, 1357475, 3450213, 4589305, 4430082, 4696699, 5984510, 6738552, 5976289, 4873448, 4444195, 3381264, 9884, -4496329, -6847479, -5734770, -3659845, -3866815, -6331695, -7924610, -6331585, -2596802]
4653b596802L239767J646660P32220J21481j214422k579329k416615q72662K86352
4644c653350K28025k5368N28410J354330J291108K56300m96398K24943J887019
4635A595019K259366p1370l322452m106889j750844P79103J018692l7652l62501
4626c999528J03973P32394J959949L240332J863184k713030n726411k777490L010690
4617d305937M617592J094434j720884o17561R08691m04007k302413j610961N64154
4608c776892J595376J499635J034619q31107l989646n028356j985762J541705
4600i940428J327353q93853n31549K017921K080685j308953l629203j958531R66108
4591a1870450J674779J050807J816670L616869L694089J343107r56337r11449
$$ y = [-2596802, 642965, 2289625, 3021845, 3143326, 1928904, -650425, -3067040, -3939702, -3653350, -3425325, -3450693, -2922283, -1567953, -276845, -20545, -516943, -292000, 1595019, 3854385, 3783015, 460563, -3646326, -5397170, -4618067, -3599375, -3637027, -3999528, -3895555, -3163161, -1203212, 2037120, 3900304, 1187274, -4539137, -7316627, -4305937, 311655, 1406089, -314795, -932356, -23665, -427672, -2730085, -4341046, -3776892, -2181516, -681881, 352738, -478369, -4468015, -9496371, -11482133, -9940428, -8613075, -9506928, -10038477, -8020556, -5939871, -7248824, -10878027, -12836558, -11870450, -10195671, -9144864, -7328194, -3711325, -17236, 1325871, 369534, -541915]
4583e41915P62909J465714j03976k560815l650020k888296j712971j228854j016564
4574a1474788n68782n34186j408359j963052m98153K567415M586453L450678O11
4565e842163k508642j565944J617566K924117K64680l050328k051527L016439
4557g195802O541879M981071J169586n08151k1656l5837j091483j913575k536497
4548f10465l367888k658541R42712M278363K783936k273455m405167q30025L668445
4539b472085L790908N87243j623264j849328k094504k465264r37509K247031L697569
4530a119203J475768j922804k721034n21924J800210K167109J475401J353241
4522A986764J268756n72427l860811n668795m110218r67428P55482P33908R17903
$$ y = [-541915, 220994, 1686708, 1582732, -978083, -4628103, -7516399, -9229370, -10458224, -11474788, -12043570, -12577756, -13986115, -15949167, -16447320, -13879905, -9293452, -5842774, -5842163, -8350805, -9916749, -8299183, -5375066, -5110386, -8160714, -10212241, -7195802, -653923, 4327148, 5496734, 4988583, 4966927, 4931090, 3839607, 1926032, -610465, -3978353, -6636894, -5694182, -1415819, 1368117, -905338, -5310505, -6140530, -2472085, 1318823, 1906066, 282802, -1566526, -3661030, -6126294, -7063803, -4816772, -1119203, 356565, -1566239, -4287273, -4809197, -3008987, -841878, 633523, 1986764, 3255520, 2683093, -1177718, -6846513, -10956731, -11924159, -11168677, -10434769, -9516866]
4513i516866K008354K638889K007638J064110O37543M05590L10487R66875J850784
4504B373404J217459r46952k004221m43684J324417K99483k374813k823362m9757
4495c428026K721245K634150O73143l45554O50574K546447L786827L436360J498601
4486A4173767p96827j787919j286659q98229j663478k419955j715841m42253q10157
4477B352449k941865m267276k759505N86067L156924L522495K041962l67876k845195
4468a521820m262120l530557p98867K042863K676063N93251k000382k138336N65010
4459h374895L100399K513051k84951j579854K78720K844964L098869J305169k0328
4450B881144J94474O37586r1343j710701k764219k047410K34863K170513J670986
$$ y = [-9516866, -7508512, -4869623, -2861985, -1797875, -1160332, -754742, -444255, 522620, 2373404, 3590863, 2643911, 639690, 196006, 1520423, 1819906, -554907, -3378269, -3428026, -706781, 1927369, 2600512, 2254958, 2905532, 5451979, 9238806, 12675166, 14173767, 13376940, 11589021, 10302362, 9404133, 7740655, 5320700, 3604859, 3162606, 2352449, -589416, -4856692, -7616197, -7030130, -3873206, -350711, 1691251, 1323375, -1521820, -5783940, -9314497, -10113364, -8070501, -5394438, -4801187, -6801569, -8939905, -8374895, -5274496, -2761445, -3046396, -4626250, -4347530, -1502566, 1596303, 2901472, 2881144, 3075618, 3713204, 3621861, 1911160, -853059, -2900469, -2665606, -495093, 1175893]
4441A175893j006168l142690k743760o93791J143304K281334K593488J012218
4433F19828k176132l473822j47718M767808N372836Q92430l189914k818742k42908
4424c96334N00459o67231j276665o84412N3266R06952K450770L649036K736070
4415G271911M4764k037683j934539m14435O08370J5428j441915j692332K68370
4406F87939K545702K323190k81406k319368k251690j600968j649926j367507o8277
4397c982311O62092l12007j470906j244690n08629l66851J03767J534178K218412
4388c366945J078378J49641J105584J882382K68853j643746p22756J605622J587953
4379A944966n98785j610642q40834n88381r78714J23901K152858J894673r13442
$$ y = [1175893, 169725, -2972965, -5716725, -6410516, -5267212, -2985878, -392390, 619828, -1556304, -5030126, -5177844, -410036, 4962800, 5855230, 2665316, -153426, -396334, 104125, -563106, -1839771, -2524183, -2470917, -1563965, 886805, 4535841, 7271911, 7316675, 5278992, 3344453, 2930018, 3538388, 3553816, 2111901, 419569, 687939, 3233641, 5556831, 5275425, 2956057, 704367, -896601, -2546527, -3914034, -3982311, -3320219, -3632226, -5103132, -6347822, -6856451, -7223302, -7119535, -5585357, -3366945, -2288567, -2138926, -1033342, 849040, 1117893, -525853, -1248609, 357013, 1944966, 1346181, -264461, -1105295, -1693676, -2672390, -2548489, -395631, 1499042, 585600]
4370E85600k786289k105450j039255r80949n61437O96664J143185O11036Q94879
4361c542016J466585n63836m672908o056554k680999J563064L147655L477859
4353g861150M334133L787489M55036k640660k664008j485821j473903q81897J811847
4344f618934L075889l12403m387538l039354K298008M818725K890989J322727
4336D8109K246641J990581j448607m260086k914109N77111K489448K544917K265266
4327C539271J388789r07623l320125l727481k041334J6699R85034N36803m60537
4318c990504k29846K014469M248408L754252J161623k39432M46957N43664j355859
4309F353732k826486j783643p0057k84937j555509j417228l9259N14460L0804
$$ y = [585600, -2200689, -4306139, -5345394, -6326343, -6887780, -6191116, -5047931, -4436895, -3542016, -2075431, -2639267, -7312175, -13368729, -16049728, -14486664, -11339009, -7861150, -3527017, 260472, 715508, -1925152, -4589160, -6074981, -7548884, -8430781, -6618934, -3543045, -3855448, -8242986, -11282340, -8984332, -4165607, -1274618, 48109, 2294750, 4285331, 2836724, -1423362, -4337471, -3760360, -1270912, 1274005, 3539271, 4928060, 4020437, 700312, -3027169, -5068503, -5051804, -4066770, -3529967, -3990504, -4220350, -2205881, 2042527, 5796779, 6958402, 6718970, 7165927, 7709591, 6353732, 3527246, 1743603, 1673546, 1388609, -166900, -1584128, -1623387, -1108927, -1078123]
4300a078123J40964J169880J701462J115162K61756l62195j075182j564068q67959
4291e58303Q28699J883468J130457q80813k759255l505096k840315j128319R69336
4282f860141L141119N262330O234350M254291n24294m763645n258119k852189
4274a366298j069449j276958j571244n45847M63870j09109j475005j886738j108200
4265i944978k0490J028126K003185K303853J618087Q98331R99273J027198l10265
4256c97680k178653k260616P3520K835886L844295K722543M44850j578468j806476
4247A699201K76788K780309K914466O81965o88520Q47254L046852K420398r84245
4238A2994468l979935m658706m102699l766944l358976j992641Q6075J789475
$$ y = [-1078123, -937159, 232721, 1934183, 3049345, 3311101, 2948906, 1873724, 309656, -558303, 270396, 2153864, 3284321, 2403508, -355747, -3860843, -6701158, -7829477, -6860141, -3719022, 1543308, 7777658, 12031949, 11507655, 6744010, 1485891, -1366298, -2435747, -3712705, -5283949, -5829796, -5365926, -5475035, -6950040, -8836778, -9944978, -9965468, -8937342, -6934157, -4630304, -3012217, -2113886, -1114613, -87415, -397680, -2576333, -4836949, -4763429, -1927543, 1916752, 4639295, 5084145, 3505677, 1699201, 1975989, 4756298, 7670764, 8352729, 7664209, 8511463, 11558315, 13978713, 12994468, 9014533, 4355827, 253128, -3513816, -6872792, -8865433, -8779358, -6989883]
4230f989883K345834J647951J61973j128454j305462l99903O59845J046264O68421
4221c293414K695l07339J3986L42008l34431j896469k815009k016074k00114J352698
4211i151463K172397K019736N25246j299314j068819J488982K975812R15226j928914
4202c351111j311943J855095K925622Q96295n04455N30562J173482o25247k676882
4193a088582k773159k282233k861268l143257j583810M66707J337512J785120
4185a0142970K471950J762949r65600k851825j713908J55129j52317j340915p71024
4176a3548531O39889O41301K63175J574529L010245J846917n04876q22439p2792
4167f972582j552953m191048l657925J67381K721773K022127P74282O03306k46442
$$ y = [-6989883, -4644049, -2996098, -2834125, -3962579, -5268041, -5667944, -5008099, -3961835, -3293414, -3290719, -3598058, -3584072, -3242064, -3576495, -5472964, -8287973, -10304047, -10504161, -9151463, -6979066, -4959330, -4434084, -5733398, -6802217, -5313235, -2337423, -1422197, -3351111, -4663054, -2807959, 117663, 1013958, 509503, 1040065, 2213547, 1588300, -1088582, -3861741, -6143974, -9005242, -12148499, -13732309, -13265602, -11928090, -10142970, -7671020, -5908071, -6873671, -9725496, -11439404, -11284275, -11436592, -12777507, -13548531, -12908642, -12267341, -12004166, -10429637, -7419392, -5572475, -6077351, -6899790, -6972582, -8525535, -12716583, -16374508, -16207127, -13485354, -11463227, -10688945, -10085639, -10332081]
4158a0332081k266648k946118j260691N77972J154231J419806J389246l32007
4150a2596290l020011m301119m440362n421717o253827n065334m686388p820981
4142e3606029p208013P747264L1361833M1351547K5952565R81478j0262688n620482
4134C0697475n98190k902486n350942k523232K41748k212290o080516n826831
4126E444736k506629j29599O57587J173990J279634O50732J81321m2690j045678
4117E663404k039961q41958J769902K124753o94342l242112k948950j009232R67659
4108b50837K883139L657976J578260j405261p93182L082277M169254n3464l952304
4099H915858k287784J684981J724287j803009l578166j950859j08176N9245n0671
$$ y = [-10332081, -12598729, -15544847, -16805538, -16227566, -15073335, -13653529, -12264283, -12596290, -15616301, -19917420, -24357782, -29779499, -36033326, -41098660, -45785048, -53606029, -60814042, -53066778, -21704945, 19646602, 45599167, 46580645, 36317957, 30697475, 30099285, 27196799, 21845857, 19322625, 19564373, 17352083, 11271567, 5444736, 2938107, 2808508, 3466095, 4640085, 5919719, 6570451, 6751772, 6709082, 5663404, 3623443, 2781485, 4551387, 6676140, 5981798, 2739686, -209264, -1218496, -250837, 2632302, 6290278, 7868538, 6463277, 5670095, 8752372, 12921626, 12868162, 8915858, 6628074, 8313055, 10037342, 8234333, 4656167, 2705308, 2597132, 2656377, 2605706]
4090B605706M40539N88523K94829O34923J341582J053558Q0052M728N86487P117
4080G638044j603581j828676J10598J586247j9750l662329n599038l476460J059734
4071e795211L793041K231405j618090l675569k738016j116508k88651J054996
4063h152603L379036M106444J687403r85767o53358J056200L88921k127723k474250
4054c775697L17139K829901K653991J068780k19358j145873j156511J164887M715787
4045F453046N499186J778236l008539m656994l390504k463916l288743m231306
4037g309534l336980m90614K570980L420671J066503k305577l038717l50130K549396
4028g224002K749526J302868J002764K105384K469270J114526n60036r80946j25915
$$ y = [2605706, 3046245, 3634768, 3929597, 4564520, 5906102, 6959660, 7039712, 7044440, 7630927, 7638044, 6034463, 4205787, 4316385, 5902632, 5882882, 2220553, -3378485, -6854945, -5795211, -2002170, 229235, -1388855, -5064424, -7802440, -8918948, -9207599, -8152603, -4773567, -667123, 1020280, 34513, -618845, 437355, 826276, -1301447, -3775697, -3458558, -628657, 2025334, 3094114, 2874756, 1728883, 572372, 1737259, 6453046, 11952232, 13730468, 10721929, 6064935, 2674431, 210515, -3078228, -7309534, -10646514, -11137128, -8566148, -5145477, -4078974, -6384551, -9423268, -9773398, -7224002, -4474476, -3171608, -2168844, -63460, 2405810, 3520336, 2960300, 1979354, 1853439]
4019A853439J026366J500513P43284q83069j953259j198195J001967K868431K883637
4010G843114Q78879k057158m202796m243696k414325l32372P33295R27381P95274
4001b072404J71589j070337k048891j854811r05325r7978P84062K288307L348333
3992a457455K145679q03904k453825j077127J410292K348534J964759K048964
3984D125917K219993N39351k205462k353814R41215L095975K44720m260326l783373
3975a435804J937325N965321L923120l32040j386735j90432r96999l565690l916894
3966A172j539387j34226r19218o27772K254607M146052J975130j744715k773498
3957F38145j235898l32686r64022j283839n73825j44602n57037p44262j94238
$$ y = [1853439, 2879805, 4380318, 5123602, 4240533, 2287274, 1089079, 2091046, 4959477, 7843114, 8721993, 6664835, 2462039, -1781657, -4195982, -4528354, -3795059, -2867678, -2072404, -1900815, -2971152, -5020043, -6874854, -7780179, -7878157, -7094095, -4805788, -1457455, 688224, -115680, -2569505, -3646632, -2236340, 112194, 2076953, 4125917, 6345910, 6885261, 4679799, 2325985, 3267200, 6363175, 6607895, 2347569, -1435804, 501521, 6466842, 10389962, 10057922, 8671187, 8480755, 7483756, 3918066, 1172, -1538215, -1672441, -2591659, -3219431, -964824, 3181228, 5156358, 3411643, 638145, -597753, -930439, -1894461, -3178300, -3752125, -3896727, -4453764, -5198026, -5392264]
3948e392264J08558n66315j357384o85346J968995M894992M804411Q9283o126446
3939b261516q226265m509496P67471L125274K960696K724738K028031p12170l807424
3930g910661l898520j167785J182066K165700L499322M974617L962430L81665
3922C188834k139757j553907r1398o9153n86850k88018l8293o69889j052818n73036
3912c874285o67320j804780j998356n92230j59617j797840k090554J457555N187541
3903f339886M212105K02068j019793J674735L711966K336642j28438j140311j240913
3894B268175j241035l18850J382485J772719J31948j572868k059228k405707l060981
3885e103342k432325j11469J692637J839733K175647L604263L627042O99224k090628
$$ y = [-5392264, -5283706, -5850021, -7207405, -7892751, -5923756, -1028764, 3775647, 3864930, -2261516, -10487781, -14997277, -14229806, -11104532, -8143836, -5419098, -3391067, -4103237, -7910661, -11809181, -12976966, -11794900, -9629200, -6129878, -1155261, 2807169, 3188834, 1049077, -504830, -596228, -665381, -1252231, -1540249, -1578542, -2248431, -3301249, -3874285, -4541605, -6346385, -8344741, -8936971, -9096588, -10894428, -12984982, -11527427, -6339886, -2127781, -1925713, -2945506, -1270771, 2441195, 4777837, 4649399, 3509088, 2268175, 1027140, 708290, 2090775, 3863494, 3995442, 2422574, 363346, -2042361, -5103342, -7535667, -7647136, -5954499, -4114766, -1939119, 1665144, 5292186, 5991410, 3900782]
3876C900782j320098J262044J520960n98187j608145l34120J070950J472069J846113
3867G212368J923440l6419l263339m183030j600481J143589R45455j028630j967365
3858h54412j402843l88234R70664K648346L177540J591286m51402r48361p43027
3849C599557j789065l251928k449717N63149K436241J070490j848639l621662
3841e291574l537818k204456j33301J693843J846342O51808O74426L118298N229112
3832B046680L573755j045179m451696m453181k729803j268802K39807K295722
3824e792697L307066J521921j979521m224107l795702j780877L48545K149792
3816a0245580L443524L647436K504340O80643q20595j409185j018474q4412N01982
$$ y = [3900782, 2580684, 3842728, 5363688, 4765501, 3157356, 2823236, 3894186, 5366255, 7212368, 9135808, 9099389, 5836050, 1653020, 52539, 1196128, 2141583, 1112953, -854412, -2257255, -2645489, -1674825, 973521, 4151061, 5742347, 5290945, 4342584, 3599557, 1810492, -1441436, -3891153, -3328004, -891763, 178727, -1669912, -5291574, -8829392, -11033848, -11167149, -9473306, -7626964, -6975156, -6300730, -3182432, 2046680, 5620435, 4575256, 123560, -4329621, -7059424, -8328226, -8088419, -5792697, -2485631, -963710, -2943231, -7167338, -10963040, -12743917, -12395372, -10245580, -6802056, -3154620, -650280, 30363, -790232, -2199417, -3217891, -3302303, -2800321]
3807b800321P1819r73193j416214m19334J791684M122180N008319L226258o33695
3798G977503l815130l799248j100916J428209J932612Q38142q95698k719425l423166
3789c577117j617860J565996K585158M2811k881363k684439l35635Q45864M56298
3780e600287P18657J826462J486711o87300k051658j148045K84594P96711J514180
3771b859975L193148M015604K572840M26102p10992j753262l409861l238526O71379
3762a093543N017112M709126J12277l493892l432631k193372k142425k261011
3754d778359j484156j038229j356501l54938K672527M614992K888159l64532j386461
3745e87498Q111J287762J306814N36993j054093l170875l724429j459677J272771
$$ y = [-2800321, -2728502, -3701695, -5117909, -5537243, -3745559, 376621, 5384940, 8611198, 7977503, 4162373, 363125, -737791, 690418, 2623030, 3461172, 2565474, -153951, -3577117, -5194977, -3628981, -1043823, -1001012, -3882375, -6566814, -6902449, -6056585, -5600287, -4881630, -3055168, -1568457, -2255757, -4307415, -5455460, -5170866, -4374155, -2859975, 333173, 4348777, 6921617, 7347719, 6636727, 4883465, 1473604, -1764922, -1093543, 3923569, 8632695, 8744972, 5251080, 1818449, -374923, -2517348, -4778359, -6262515, -7300744, -8657245, -9012183, -6339656, -1724664, 1163495, 798963, -587498, -579387, 708375, 2015189, 2552182, 1498089, -1672786, -5397215, -6856892, -5584121]
3736e584121J673117R62831J892182L193842J313829k824381m072789q19524K516519
3727a748495K290853K42325q37001j536319k954853l300955r85603J816461K279476
3718d734111J241897J058511J427040Q69163K33530R05320J368206l65893k431028
3709d27365j601255J030163J591252K5113L7384K290319K992021N40020j531274
3700D946378n05839J127652K79513j508483j087128P84183Q67150j185353k536326
3691A181747j604977J84028R23023K02269j339531k630132k452346n95473J434493
3682d696899J951646R58831l51567j158576j130117m2814J479620J860772N69875
3673e59229p10852l11255J007054J399623P70086M74132Q73999J048639O26848
$$ y = [-5584121, -3911004, -2948173, -1055991, 2137851, 3451680, 627299, -3445490, -4265014, -1748495, 542358, 784683, -52318, -1588637, -4543490, -7844445, -8830048, -7013587, -4734111, -3492214, -2433703, -1006663, -137500, 96030, 1001350, 2369556, 2003663, -427365, -2028620, -998457, 592795, 617908, 655292, 2945611, 5937632, 6477652, 4946378, 4440539, 5568191, 5847704, 4339221, 3252093, 4036276, 4903426, 3718073, 1181747, -423230, -239202, 683821, 886090, -453441, -3083573, -5535919, -6131392, -4696899, -2745253, -1786422, -2137989, -3296565, -4426682, -4469496, -2989876, -1129104, -559229, -1270081, -1581336, -574282, 825341, 1595427, 2069559, 2943558, 3992197, 4619045]
3664D619045K47411L05729N55780P52162O08658l86339j979553k659706j464320
3655E98867L99993J109153O38981J52436j54610p78819j187594m09193J012336
3646A381550J568927J054492N20095L20943J5936k27152o1569k57069j397861
3637B918292j934306k18221J976897J257676j893403l027409j73658L115210K991474
3628E012552N03424q80003m14664J68017K88461P14131R59896m53973l064419
3619B833422m263184k687987j06692R19666K13182o1629J666986M092429M165580
3610F771773P80196l241503l894834o08917L149553M022541K047067n78583k265191
3601F182102k593105j659435k74395K22843l64731m76510R67288K658574K632343
$$ y = [4619045, 4866456, 5172185, 5727965, 6480127, 7088785, 6702446, 4722893, 2063187, 598867, 998860, 2108013, 2746994, 2899430, 2744820, 1966001, 778407, 369214, 1381550, 2950477, 4004969, 4525064, 4846007, 4861943, 4634791, 4573222, 4316153, 2918292, 983986, 765765, 2742662, 4000338, 2106935, -920474, -1094132, 2021078, 5012552, 5515976, 4635973, 4221309, 4389326, 4677787, 5391918, 6351814, 5897841, 2833422, -1429762, -4117749, -4224441, -3304775, -3091593, -3153222, -1486236, 2606193, 6771773, 7551969, 4310466, 415632, -193285, 2956268, 6978809, 9025876, 8447293, 6182102, 3588997, 1929562, 1655167, 1878010, 1513279, 1036769, 2004057, 4662631, 7294974]
3592G294974J133896J43018L63347K81646j487720m004662m792102k641387P01597
3583c007393K128369P57846q41796n4443K020436K131443k50741k226196j892674
3574a235149o04906Q9622P45766J686440J413289l79850j050316Q68064K399185
3565C932145N14901k432142j937705J407817K628277m2967k959455l012626j445657
3556c347412m69423N4471P63348Q76123J30012j1641J016762J428907R8656j254203
3546g14400q73489J28339j74641j363087j823301j596778j817730k401969k410136
3537a3047192j854934j232298n6340K241777M553502M984365L126036J42151k693138
3528c836071m212999l131855N48890M429046N677776L851445O22098k470247m577679
$$ y = [7294974, 8428870, 8571888, 8935235, 9216881, 7729161, 3724499, -1067603, -3708990, -3007393, -879024, -121178, -962974, -1017417, 1003019, 3134462, 2883721, 657525, -1235149, -1840055, -1750433, -1004667, 681773, 2095062, 1715212, 664896, 1532960, 3932145, 4447046, 2014904, 77199, 1485016, 4113293, 4070326, 1110871, -1901755, -3347412, -3816835, -3762364, -2999016, -2122893, -1992881, -2004522, -987760, 441147, 539803, -714400, -1587889, -1459550, -1634191, -2997278, -4820579, -6417357, -8235087, -10637056, -13047192, -14902126, -16134424, -16190764, -13948987, -9395485, -4411120, -1285084, -1142933, -3836071, -8049070, -11180925, -10632035, -6202989, -525213, 3326232, 3948330, 1478083, -3099596]
3519c099596m897207l414660j665949q70630O9161K679145N663994O021504L267452
3510C753214Q6255j397363j551415j109107J77761J749647J622026p74550k958459
3501d01991k354323L93338K610723K974880K145121R40628m32102j714546k453195
3492A708533k367025j211027J066162L366224L705557J518708j255384k549424
3484C982324k566344k438515j824220R972J664543R54158j327026j872559K56752
3475c160915K005696R63831q68319j61166K608010L745761J419026k233228m078652
3466B40044l209870r54905Q03655R70657L5356k97655Q13956J949346J373289
3457A723873j48141m60826L16948l6280j511752r54239K684138N238088K722248
$$ y = [-3099596, -7996803, -11411463, -13077412, -13948042, -13878881, -11199736, -5535742, 485762, 3753214, 3839469, 2442106, 890691, -218416, -40655, 1708992, 3331018, 2556468, -401991, -2756314, -2362976, 247747, 3222627, 5367748, 6308376, 5876274, 4161728, 1708533, -658492, -1869519, -803357, 2562867, 6268424, 7787132, 6531748, 3982324, 1415980, -1022535, -2846755, -2836783, -1172240, -218082, -1545108, -3417667, -3160915, -1155219, -191388, -1059707, -1220873, 1387137, 5132898, 6551924, 4318696, 240044, -2969826, -3924731, -3121076, -2150419, -2115063, -2412718, -1598762, 350584, 1723873, 1575732, 1114906, 1431854, 1395574, -116178, -1070417, 1613721, 6851809, 9574057]
3448I574057k227439l417337J18761K811117P08919l281770m348971k472124j090368
3439c625155j396523j505084k86635J264256K271100K748349K108950l07461k836080
3430a564283k526370L43887J529362j569736n760540n948296j772483K287636
3422a4980823K849669J097680J53280J186500K907164L449024J997026m99580
3414a840060j844722p81236J184235J365067n03830j827260q85841P65072Q55164
3405c513411k07330l21212R09781J852312J641531J318067J817469K369000J595619
3396G461826o65922l116753m059041k726169j91163J324097R03797K20068J088784
3387B39524K323656J113143k390503m352590k239128J598225L075686J576235
$$ y = [9574057, 7346618, 3929281, 4048042, 6859159, 7568078, 4286308, -62663, -2534787, -3625155, -5021678, -6526762, -6813397, -5549141, -3278041, -529692, 1579258, 1271797, -1564283, -4090653, -3746766, -2217404, -3787140, -9547680, -15495976, -17268459, -14980823, -12131154, -11033474, -10880194, -9693694, -6786530, -3337506, -1340480, -1840060, -3684782, -4466018, -3281783, -1916716, -2420546, -4247806, -5133647, -4368575, -3513411, -3720741, -4041953, -3132172, -1279860, 361671, 1679738, 3497207, 5866207, 7461826, 6795904, 3679151, -379890, -3106059, -3297222, -1973125, -1069328, -849260, 239524, 2563180, 3676323, 1285820, -3066770, -5305898, -3707673, -631987, 944248]
3379I44248r9307l4732Q82386J239840J154490J314211J365618L72690j511251
3370E628193k645963j518322J305623L294713K543008o0227k064042k485573k245060
3361A752350j822433o13063Q87253P13460j376601k625742j161831Q99405O75452
3352b671750j038618j549586r09528j119092j658676k9637L227751M324200J939219
3343E14283p79131j297634r61719j293658q42789J464168L083238J452663j519800
3334a80379k169004n28133N75824N50035J212680K525345K173252k08936j946495
3325B004189j439584m06335p46389j646832j336153J76481J632873K373490K312889
3316B924629J259034m45658j508182j094347j2611M52046K64200K85032P20600
$$ y = [944248, 844941, 810209, 1692595, 2932435, 4086925, 5401136, 6766754, 7139444, 5628193, 2982230, 1463908, 2769531, 6064244, 8607252, 8547025, 6482983, 3997410, 1752350, -70083, -683146, 204107, 917567, -459034, -3084776, -4246607, -3347202, -2671750, -3710368, -5259954, -6169482, -7288574, -8947250, -8976887, -5749136, -1424936, 514283, -264848, -1562482, -2524201, -3817859, -4660648, -3196480, -113242, 1339421, -180379, -2349383, -2877516, -2301692, -1751657, -538977, 1986368, 4159620, 3950684, 2004189, 564605, 158270, -588119, -2234951, -3571104, -3394623, -1761750, 611740, 2924629, 4183663, 3738005, 2229823, 1135476, 1122865, 1574911, 1839111, 2124143, 2844743]
3307B844743R03433M40951k09371m21284k67243n39384j854473l682114m552726
3298g337468l598935j613638p6341N38965P95361R95821Q70670M93494M45343
3289h486728Q59636J213357J336803J764841K664644L105735J935426q69284l877258
3280c52828n058410l319731J72112K515651J841260n42248j664192m10419J563901
3271e254904K371205J971781J388688J161265J244703J414317J057205n43479
3263D810781k946070m345254l518117j495727m83204j348971k784582k831065
3255a4942209q63861J843684L385551L152598K327248K183673K447228K155473
3247A689385J543186J585816J856988P48712j695921l131881k250769j067088
$$ y = [2844743, 3748176, 4189127, 3979756, 3558472, 3291229, 2751845, 897372, -2784742, -7337468, -10936403, -12550041, -12626382, -12087417, -11292056, -10296235, -9425565, -8932071, -8486728, -7627092, -6413735, -5076932, -3312091, -647447, 2458288, 4393714, 3524430, -352828, -5411238, -8730969, -8558857, -6043206, -4201946, -4744194, -6408386, -6818805, -5254904, -2883699, -911918, 476770, 1638035, 2882738, 4297055, 5354260, 4810781, 1864711, -2480543, -5998660, -7494387, -7977591, -9326562, -12111144, -14942209, -15806070, -13962386, -10576835, -7424237, -5096989, -2913316, -466088, 1689385, 3232571, 4818387, 6675375, 7424087, 5728166, 2596285, 345516, -721572]
3239g21572k082875m242556l871540L98097N358866O483715K658389k725118n066811
3230c811405k896913R17405K456590J073908l80922L25848J969761K017199K45787
3221A917258j323108j318209k06912J020570J788817J689779P33890j35061j7943
3212D149081N37405L84355k16380o8553N73113J21550j412675j797179p062J676599
3202C940254P39255j779617k616541p06912J684618K085003M06989j632538k303319
3193a82808r70348J364243K548445J421432o35052j518994j423379k160659l553625
3184e110745l067978K4468K638058J860822j018126k662521k217372j102230K89258
3175a0366366K379797L618768J722388j930476k890835J43100L165600K753336
$$ y = [-721572, -2804447, -7047003, -10918543, -10520446, -5161580, 1322135, 3980524, 1255406, -3811405, -6708318, -5790913, -3334323, -2260415, -2641337, -2315489, -345728, 1671471, 1917258, 594150, -724059, -930971, 89599, 1878416, 3568195, 4302085, 4167024, 4149081, 4686486, 5070841, 4854461, 4785908, 5359021, 5480571, 4067896, 2270717, 2263655, 3940254, 4679509, 2899892, 283351, -423561, 1261057, 3346060, 3753049, 2120511, -182808, -1153156, 211087, 2759532, 4180964, 3545912, 2026918, 603539, -1557120, -5110745, -8178723, -8154255, -5516197, -3655375, -4673501, -7336022, -9553394, -10655624, -10366366, -7986569, -4367801, -2645413, -4575889, -7466724, -7323624, -4158024, -1404688]
3167a404688Q07348P98481K207229K165882N52642m32591n51194j408115k568134
3158A66860j785663O88363J858928P88933L021R09852J428611M0319j152102k6878
3148B920244J615141Q15337j748132k967651k088964j039462n65615O95281L008162
3139F44341M243977K795147j45165k237399k557681j635422j15811J486265K256467
3130D734719J206487j577236m444378n304384l576411q14678J081972J920263
3122f773646K577599K833534J656089k23467l48840J775835L231224J636952j337071
3113E028209k562131j903468j480953j754366j378530l23883j143l33608K77193
3104d432680J771566K158955R98746K09488M97169J4857j916205k682520k63946
$$ y = [-1404688, -597340, 201141, 2408370, 4574252, 5126894, 4694303, 4143109, 2734994, 166860, -1618803, -930440, 928488, 1717421, 1720442, 2630294, 4058905, 4099224, 2947122, 2920244, 4535385, 5350722, 3602590, 634939, -1454025, -2493487, -3059102, -2363821, 644341, 4888318, 7683465, 7538300, 5300901, 2743220, 1107798, 991987, 2478252, 4734719, 5941206, 4363970, -80408, -5384792, -8961203, -9775881, -8693909, -6773646, -4196047, -1362513, 293576, 70109, -278731, 1497104, 4728328, 6365280, 5028209, 2466078, 562610, -918343, -2672709, -4051239, -4375122, -4376265, -4709873, -4432680, -2661114, -502159, 496587, 706075, 1203244, 1218101, -698104, -3380624, -3644570]
3095c644570L023633L367217O34141j855653j877452k72261J138415J448385N90912
3086B552767q60519j774870j627557j310360j606267j608157l60206O99447n82783
3077f478505l043646k757236J336352N003245L995467q4258j906823M36132L410208
3068h9064L428753J295458k18784p68669j793871k876835j963541Q31797K724683
3059E69927K371409J609459J689564P66532k346818m587495k550187J581589K397481
3050A501461p79768k849486o67831K627749K996280J192692J22211k51969j594966
3041B296373k971595k062548L16994P63771j635335l936103l439536o45057K230289
3032i082747L488180K520635K76236p32024R75828L238880K612790o37384k690018
$$ y = [-3644570, -620937, 2746280, 3380421, 1524768, -352684, -624945, 513470, 1961855, 2552767, 1692248, -82622, -1710179, -3020539, -4626806, -6234963, -6595169, -5895722, -6478505, -9522151, -12279387, -10943035, -5939790, -1944323, -2028581, -3935404, -3499272, -89064, 3339689, 4635147, 4416363, 3647694, 1853823, -1023012, -2986553, -2154756, 569927, 2941336, 4550795, 6240359, 7006891, 4660073, 72578, -2477609, -896020, 1501461, 721693, -2127793, -2795624, -167875, 2828405, 4021097, 4143308, 3891339, 2296373, -675222, -2737770, -2420776, -1657005, -3292340, -7228443, -10667979, -11313036, -9082747, -5594567, -3073932, -2797696, -3529720, -2553892, 684988, 3297778, 2660394, -29624]
3023b9624j719094j73853m18782j259258p58170K35105o456o55219K77468K297242
3013b210641K994208J712947J67670l90419l84208l00051O0612M67392J78375
3004B295885o77442j114711q89595o25373k87214P05722J597607O34591j842752
2995b03282k748342l49400K588263J996565j915614m679738l265776M37908K628109
2986e511307K170902P15349m19952j386345k194198k073076r78423j03582k9458
2977i810090K54750J406964K169431J303403n0900K7033J054055J000410j082
2968b646026K81511J989402K231975k37235k362298j080211K131438L715590L020591
2959G044737J695476j12916l029084m939052k785158J868260L521185K48075l514737
$$ y = [-29624, -1748718, -1922571, -2341353, -3600611, -4358781, -4123676, -4130132, -4785351, -4507883, -2210641, 783567, 2496514, 2664184, 2273765, 1889557, 1589506, 1650118, 2117510, 2295885, 1618443, 503732, -385863, -1011236, -1298450, -592728, 1004879, 1639470, -203282, -2951624, -3301024, -712761, 1283804, -631810, -5311548, -8577324, -8139416, -5511307, -3340405, -2625056, -3045008, -4431353, -6625551, -8698627, -9677050, -9780632, -9810090, -9555340, -8148376, -5978945, -4675542, -4726442, -4699409, -3645354, -2644944, -2646026, -2364515, -375113, 1856862, 1619627, -742671, -1822882, 308556, 4024146, 7044737, 8740213, 8627297, 5598213, 659161, -2125997, -257737, 3263448, 3511523, -3214]
2950c214l512543j124449K85861Q08729K152642L168321J572777j340519k007259
2941C46m1301J568925J547829J614613K219977J098124k360482m769546l131389
2932b252904Q38759L119084K393584N00454p24455q45951j2320J150318J285745
2923E452314l08503k308023k727191j307690N93954J870660K114839R58955j333775
2914C005540l055068k617416p79726M01906O69314J552676L087948K956686J2883
2905E234743l341489m003177k058713l8456P75418J277187K126396K466799J487386
2896C926094k07940j402835j489200n91388N09781M18684j511034l421244k300042
2887f069124J819111M748603L089372j092519k999303j609308k72973q19870q60326
$$ y = [-3214, -3515757, -4640206, -4354345, -3545616, -1392974, 1775347, 3348124, 2007605, 346, -40955, 1527970, 3075799, 4690412, 6910389, 8008513, 5648031, 878485, -2252904, -1414145, 1704939, 4098523, 4598977, 3874522, 3028571, 3016251, 4166569, 5452314, 5143811, 2835788, 108597, -1199093, -605139, 1265521, 3380360, 4339315, 3005540, -49528, -2666944, -3446670, -3044764, -2375450, -822774, 2265174, 5221860, 5234743, 1893254, -2109923, -4168636, -4207092, -3431674, -2154487, -28091, 2438708, 3926094, 3718154, 2315319, 826119, 234731, 744512, 1163196, -347838, -3769082, -6069124, -4250013, 498590, 3587962, 2495443, -503860, -2113168, -2386141, -3206011, -4066337]
2878d066337J453183L453107J855713j603128k254288O07131K753445J318633
2870C517459j443765k079688p91306k31622j215764k000600j204247M68883J463699
2861c516951J147294J59978l94376l1632O27816O18084j34434p47200m89248N83331
2851b177338J884414K475993J421546r18342k392119j401575N88734Q24750o13459
2842c07396r17390R10843K477771K000544R94331J205994J542999M13823j116802
2833G204717j175913k43563K44530O77903J675097J489278j347176m112421k830721
2824A581731J406881L403094J320771j168553j051245O3341j69283j004127j129482
2815C253128j602677l283851m024235j706983J780784K885649J465643L98152
$$ y = [-4066337, -2613154, 839953, 2695666, 1092538, -1161750, -554619, 2198826, 3517459, 2073694, -5994, -797300, -1028922, -2244686, -4245286, -5449533, -4980650, -3516951, -2369657, -2209679, -2604055, -2635687, -2007871, -1389787, -1524221, -2271421, -2760669, -2177338, -292924, 2183069, 3604615, 2686273, 294154, -1107421, -518687, 306063, -307396, -1224786, -313943, 2163828, 4164372, 5158703, 6364697, 7907696, 8321519, 7204717, 6028804, 5785241, 6029771, 6707674, 8382771, 9872049, 8524873, 4412452, 1581731, 2988612, 6391706, 7712477, 6543924, 5492679, 5556020, 5386737, 4382610, 3253128, 1650451, -1633400, -5657635, -7364618, -5583834, -2698185, -1232542, -834390]
2807h34390Q59314J107043n3450j366301j332413k94568N45877Q82494J255736
2798G69342J911336K242408J312064q71053k562939j635706J709860M470878L979344
2789A1325534Q70189j895458k288631o83928J123162J362688n62404l325932m600461
2780A324759l572343j841393j020310n40094Q59575K520453K626147J120413m6014
2771A431193L18240J247066J348093O09908q6939l39770m91529r83449j804822
2762A247991k417219k241381j395694p00812o92154r68672q02442m041J043285
2753f931139J755115J692203J210172J644118L694814N664553M968714J755224
2745A5453774r58383j502298j590357k752608l255485j036922K226778L061129
$$ y = [-834390, 24924, 1131967, 1078517, -287784, -1620197, -1914765, -1368888, -486394, 769342, 2680678, 4923086, 6235150, 5364097, 2801158, 1165452, 2875312, 7346190, 11325534, 12195723, 10300265, 8011634, 7327706, 8450868, 9813556, 9251152, 5925220, 1324759, -2247584, -4088977, -5109287, -5649381, -4789806, -2269353, 356794, 1477207, 1431193, 1749433, 2996499, 4344592, 4954500, 4867561, 4527791, 4036262, 3052813, 1247991, -1169228, -3410609, -4806303, -5507115, -6199269, -7167941, -7970383, -7974424, -6931139, -5176024, -3483821, -2273649, -629531, 3065283, 8729836, 13698550, 15453774, 14495391, 12993093, 11402736, 8650128, 5394643, 4357721, 6584499, 9645628]
2737I645628J120501q85713j592122k175705l189155l235709j483945Q38052K181856
2728A223688K132853Q48524j145504k522173k430456k106010l078378m100507
2720a1177963k627376P28496K555304J949529J782748L422992M058660J563350
2712B255740j521962k043369j350928k472818m231027k670888K297986N982295
2704c754971N144357J684053q68998j584137j484767j080302l23622M28587R30822
2695i08978J576650K329528K102646L41076j572845j728080j04519J464378J559011
2686E058867M90011o22410j202823j321118j028460j96436J026808K034256K266564
2677F505259J746884R52599L58005L08040R54809J776746J533826l42949k420136
$$ y = [9645628, 10766129, 9880416, 8288294, 6112589, 2923434, -312275, -1796220, -958168, 1223688, 3356541, 4205065, 3059561, 537388, -1893068, -3999078, -7077456, -11177963, -13805339, -13076843, -10521539, -8572010, -6789262, -3366270, 692390, 2255740, 733778, -1309591, -2660519, -5133337, -9364364, -12035252, -9737266, -3754971, 1389386, 3073439, 2204441, 620304, -864463, -1944765, -2268387, -1839800, -908978, 667672, 2997200, 5099846, 5440922, 3868077, 2139997, 2035478, 3499856, 5058867, 5548878, 4926468, 3723645, 2402527, 1374067, 1177631, 2204439, 4238695, 6505259, 8252143, 9204742, 9562747, 9870787, 10825596, 12602342, 14136168, 13793219, 11373083]
2668A1373083k569404r09038l3808j520707l621534l767940k120926p35137r8096
2659d003507R96516K307182J764850q60133k567773j217916J070044J002992q83965
2650b391710j242788P22283K137518J084207p11502r85286l5518R90335K435559
2641B003098M372535M577809J412473k515885l053956m34357J072787l49928j733175
2632E351401o34097R59224L18647j486136j740582o44313n03290j677130k419786
2623b476062k007577j212759k00643J356478K506179K063047J077952J402364
2615B508979K006517K818m272014o585927m407271k39665K146293K194655J499551
2606e146064O67939m44108j036096k66837J076193J679445J683596J963095K259607
$$ y = [11373083, 8803679, 7894641, 7860833, 6340126, 2718592, -1049348, -3170274, -3905411, -4003507, -3006991, -699809, 1065041, 204908, -2362865, -3580781, -2510737, -1507745, -2391710, -3634498, -2912215, -774697, 309510, -401992, -1387278, -1422796, -432461, 2003098, 6375633, 10953442, 12365915, 9850030, 6796074, 6361717, 7434504, 7084576, 5351401, 4717304, 5676528, 5995175, 4509039, 2768457, 2124144, 1620854, -56276, -2476062, -4483639, -5696398, -5897041, -4540563, -2034384, 28663, 1106615, 2508979, 4515496, 4518314, 246300, -6339627, -10746898, -10986563, -8840270, -6645615, -5146064, -4478125, -4922233, -5958329, -6225166, -5148973, -3469528, -1785932, 177163, 2436770]
2597B436770J693456N47577k2937K52250N51270K73910l82419q56619n67762O24532
2587D550028J737649J299638o26670k058058j639372n46242p13639k095915l003543
2578c096124k479476j025523N33977J636742J749736P39604n76985j081313m94923
2569d094285O00578J551148J974989J723545R44643n5330j020443j404058l54467
2560a33680J858830L072580J749205k27506J10235J803514Q04491l310657n518098
2551B08914k574928J668520J761778j450248k797751p53536J411435J723981J869588
2542A067753K920004L055162J062336j216762j693119q43676j79394J05288N54165
2533D831757J096415J393883J287395L12351j780964l653554l302199r14446R61555
$$ y = [2436770, 4130226, 4677803, 4654866, 4907116, 5458386, 5732296, 5349877, 4493258, 3925496, 4550028, 6287677, 7587315, 6960645, 4902587, 3263215, 2716973, 2003334, -92581, -3096124, -5575600, -6601123, -6067146, -4430404, -2680668, -1941064, -2518049, -3599362, -4094285, -3493707, -1942559, 32430, 1755975, 2700618, 2645288, 1624845, 220787, -133680, 1725150, 4797730, 6546935, 6319429, 6429664, 8233178, 9037669, 5727012, 208914, -2366014, -697494, 1064284, -385964, -3183715, -3937251, -2525816, -801835, 1067753, 3987757, 7042919, 8105255, 6888493, 5195374, 4351698, 4172304, 4277592, 4831757, 5928172, 7322055, 8609450, 8921801, 7140837, 3487283, 185084, -729362, 232193]
2524B32193O96406p08625j677655j838205j087797R08159L200393L646744J931778
2515E303391N99884J458328K719394J718717r33216k269075j312966j46990n72210
2506F565257j683103j483913K77098J796293J394123n53456j989279j384190O59353
2497C598183K182425J944872L55096j276646j760880o33072J411539K781594K385926
2488A0989037O44709j305401k732449k976069j210649J994094L976091K900579
2480A2279942O17975K36281J432196J121614j277605k717820j545667k14333j108110
2471H824473k611009j962409R4544N04016j393700l139140k803518j122415P3111
2462c536047n5317r23539j123489L25985K497576K977367Q11445j752463j835064
$$ y = [232193, 928599, 219974, -1457681, -3295886, -4383683, -3475524, -275131, 3371613, 5303391, 5903275, 7361603, 10080997, 11799714, 10866498, 8597423, 7284457, 7137467, 6565257, 4882154, 3398241, 3675339, 5471632, 6865755, 6312299, 4323020, 2938830, 3598183, 5780608, 7725480, 8080576, 6803930, 5043050, 4409978, 5821517, 8603111, 10989037, 11633746, 10328345, 7595896, 4619827, 3409178, 5403272, 9379363, 12279942, 12897917, 13134198, 14566394, 15688008, 14410403, 11692583, 10146916, 9932583, 8824473, 6213464, 4251055, 4345599, 4849615, 3455915, 316775, -2486743, -3609158, -3536047, -3591364, -4514903, -5638392, -5312407, -2814831, 162536, 973981, -778482, -2613546]
2453b613546L62250J957725J208275o66313j605714j233581o96923r04906j640356
2444e833089k097370j801318r62092j30241K89894J88037k42295m53479M9846
2435a0992107R54206J411339J449201K072978L203748K969543N87989j496191
2427A60706o85189J650427K016248R8744j151351n91201j82529o06934K43924
2418I52845K753566L578327P81828k445008k400523m44319l93525k446597l489932
2409c553338k178893j00828J425257K424429K504050J002184j131390k050480
2401a659009j520440o90356J07806J148940J562359K66503j725219k318692j356897
2392f185005l62604K66464J299409K258405J723697J55085k20710J205225K412560
$$ y = [-2613546, -2251296, -293571, 914704, 248391, -1357323, -2590904, -3287827, -4192733, -5833089, -7930459, -9731777, -10693869, -10824110, -10534216, -10346179, -10588474, -11041953, -10992107, -10037901, -8626562, -7177361, -5104383, -1900635, 1068908, 1656897, 160706, -524483, 1125944, 3142192, 3240936, 2089585, 1498384, 1315855, 708921, 952845, 3706411, 7284738, 8066566, 5621558, 3221035, 2776716, 2383191, -63406, -3553338, -5732231, -5833059, -4407802, -1983373, 520677, 1522861, 391471, -1659009, -3179449, -3869805, -3761999, -2613059, -1050700, -784197, -2509416, -4828108, -6185005, -6547609, -6281145, -4981736, -2723331, -999634, -844549, -1065259, 139966, 2552526]
2383B552526J639557o20114k826109l807708k845126k12240K176251K421450J082465
2374d39048L88090J185644K377796L037792L134821K479067R79438l87032q76697
2365A1879871j608346l569973m881748l061776N59879K142604R01186k79343M5581
2356B127935J49607p46422p96338N33854Q29025q70394j700620L18661K405325
2347B250633J017919k659560m506275l128935p40560N50023O82972M80828N58122
2338e494833R98492R95175k52298j608962p94945J946683L390685K075605Q05422
2329B061024K087629L683194J933461k312636m679897l288436n20518Q84167O31926
2320D79914k10967p45722n55340j21286n53437j611421j251872J070722K422858
$$ y = [2552526, 4192083, 3571969, 745860, -3061848, -5906974, -6119214, -3942963, -1521513, -439048, -50958, 1134686, 3512482, 6550274, 9685095, 12164162, 13143600, 12756568, 11879871, 10271525, 6701552, 1819804, -1241972, -682093, 1460511, 2361697, 2082354, 2127935, 2277542, 1531120, 734782, 1268636, 2097661, 1227267, -473353, -154692, 2250633, 3268552, 608992, -3897283, -7026218, -7766778, -7216755, -6533783, -6052955, -5494833, -4496341, -3501166, -3753464, -5362426, -6157371, -4210688, -820003, 1255602, 2061024, 4148653, 7831847, 9765308, 7452672, 2772775, -515661, -1036179, -152012, 479914, 268947, -476775, -1032115, -1153401, -1706838, -3318259, -4570131, -3499409, -1076551]
2311a076551M28291k332558j559460K056003L497615R01517j810864r64358J840164
2302I79799K717971Q46475j411359k057049j220312l24607o79800k130175k683379
2293e962436p16075K328206L292111J627501J2098j3394j52788j557606j925569
2284c067952P67880L846039K969674j233210l389509p01659L284722L705161O58060
2275F839206j670458p33645J802905K853688J385252j246194l151316l464817
2267B614621k678300j914360j639735j069573O99345L046543M170061L345664
2259F574266J904337J286698J008161k90685k302496l069777j688674L39632J061300
2250D822762M08841j95225M7054M88620K09757o84492j232612q85691k27112j23414
$$ y = [-1076551, -648260, -2980818, -4540278, -2484275, 1013340, 1914857, 103993, -860365, 979799, 3697770, 4544245, 3132886, 1075837, -144475, -469082, -1148882, -3279057, -5962436, -6678511, -4350305, -1058194, 569307, 581405, 568011, 415223, -1142383, -3067952, -2300072, 1545967, 4515641, 3282431, -107078, -808737, 2475985, 6181146, 6839206, 5168748, 4435103, 6238008, 9091696, 10476948, 9230754, 6079438, 2614621, -63679, -1978039, -3617774, -4687347, -3988002, -941459, 3228602, 6574266, 8478603, 9765301, 10773462, 10482777, 8180281, 5110504, 3421830, 3761462, 4822762, 5231603, 5036378, 5083432, 5572052, 5781809, 5097317, 3864705, 2979014, 2751902, 2628488]
$$ [...]
##END NTUPLES=NMR SPECTRUM
##END=
