##TITLE=31Pdec_DE-92K
 CDCl3, 64 sc
 29.4.2025
##JCAMPDX= 6.0         $$ Bruker NMR JCAMP-DX V2.0
##DATA TYPE= NMR SPECTRUM
##DATA CLASS= NTUPLES
##ORIGIN= UXNMR, Bruker Analytische Messtechnik GmbH
##OWNER= root
$$ XWIN-NMR		Version 3.5
$$ Tue Apr 29 13:56:33 2025 Russian Standard Time (UT+4h)  she@DPX200
##.OBSERVE FREQUENCY= 81.013821
##.OBSERVE NUCLEUS= ^31P
##.ACQUISITION MODE= SIMULTANEOUS
##.ACQUISITION SCHEME= undefined
##.AVERAGES= 64
##.DIGITISER RES= 17
##SPECTROMETER/DATA SYSTEM= spect
##.PULSE SEQUENCE= zgpg30
##.SOLVENT NAME= CDCl3
##.SHIFT REFERENCE= (INTERNAL, CDCl3, 0, 198.062)
##AUDIT TRAIL= $$ (NUMBER, WHEN, WHO, WHERE, WHAT)
$$ ##TITLE= Audit trail, XWIN-NMR		Version 3.5
$$ ##JCAMPDX= 5.01
$$ ##ORIGIN= Bruker BioSpin GmbH
$$ ##OWNER= she
$$ F:/spectra/data/she/nmr/P31/2/pdata/1/auditp.txt
$$ ##AUDIT TRAIL=  $$ (NUMBER, WHEN, WHO, WHERE, WHAT)
(   1,<2025-04-29 13:55:09.56 +0400>,<she>,<DPX200>,
      <created by zg, POWCHK disabled, PULCHK disabled
       configuration hash MD5:
       00 E9 B6 7A A2 85 ED C7 34 08 36 98 17 FE 4E 26
       data hash MD5: 32K
       73 75 CC D5 F9 72 CA 8A FC 1A B8 09 23 A4 33 8D>)
(   2,<2025-04-29 13:55:12.00 +0400>,<she>,<DPX200>,
      <Start of raw data processing
       efp BC_mod = 2 LB = 1.5 FT_mod = 6 PKNL = 1 PHC0 = 1744.336 PHC1 = -874.1069 SI = 64K 
       data hash MD5: 64K
       E8 58 4A 08 6D 97 E4 D7 2D FE 81 4F CF 62 CF 01>)
(   3,<2025-04-29 13:55:38.12 +0400>,<she>,<DPX200>,
      <pk PHC0 = 45.62026 PHC1 = -61.79998 
       data hash MD5: 64K
       6B 6E C3 32 A4 0D C9 59 4E D6 ED 0D 4E 15 96 6A>)
(   4,<2025-04-29 13:55:42.17 +0400>,<she>,<DPX200>,
      <abs ABSG = 5 
       data hash MD5: 64K
       C1 3D 69 C7 5F 49 A2 B6 1E 17 B7 51 5D DC 7E 86>)
(   5,<2025-04-29 13:56:05.82 +0400>,<she>,<DPX200>,
      <pk PHC0 = -11.16716 PHC1 = 0 
       data hash MD5: 64K
       53 A1 E0 45 9C 9B 3F 91 60 B5 63 6C DC 8E B7 12>)
$$ ##END=
$$ 
$$ hash MD5
$$ 0D 96 FC DE 6A 35 05 A9 D2 5C 25 AB C3 7F 45 0C
##$RELAX= 
##$RELAX= 
##$RELAX= 
##$RELAX= 
##$RELAX= 
##$RELAX= 
##$RELAX= 
##$RELAX= 
$$ Bruker specific parameters
$$ --------------------------
##$DU= <F:/spectra>
##$EXPNO= 2
##$NAME= <P31>
##$PROCNO= 1
##$TYPE= <nmr>
##$USER= <she>
##$AMP= (0..31)
100 100 100 100 100 100 100 100 100 100 100 100 100 100 100 100 100 100 
100 100 100 100 100 100 100 100 100 100 100 100 100 100 
##$AQSEQ= 0
##$AQ_mod= 1
##$AUNM= <au_zg>
##$AUTOPOS= <>
##$BF1= 81.014009
##$BF2= 200.13
##$BF3= 200.13
##$BF4= 200.13
##$BF5= 200.13
##$BF6= 200.13
##$BF7= 200.13
##$BF8= 200.13
##$BYTORDA= 1
##$CFDGTYP= 0
##$CFRGTYP= 5
##$CHEMSTR= <none>
##$CNST= (0..31)
1 1 145 1 1 1 1 1 1 1 1 1 1 1 1 1 1 1 1 1 1 1 1 1 1 1 1 1 1 1 1 1 
##$CPDPRG= <waltz16>
##$CPDPRG1= <>
##$CPDPRG2= <waltz16>
##$CPDPRG3= <>
##$CPDPRG4= <mlev>
##$CPDPRG5= <mlev>
##$CPDPRG6= <mlev>
##$CPDPRG7= <mlev>
##$CPDPRG8= <mlev>
##$CPDPRGB= <>
##$CPDPRGT= <>
##$D= (0..31)
0 1 0 0 0 0 0 0 0 0.06 0 0.03 2e-05 3e-06 0 0 0.0002 0 0 0 0 0 0 0 0 0 
$$ [...]
##$SUBNAM3= <"">
##$SUBNAM4= <"">
##$SUBNAM5= <"">
##$SUBNAM6= <"">
##$SUBNAM7= <"">
##$SUBNAM8= <"">
##$SUBNAM9= <"">
##$SW= 400.765351723535
##$SWIBOX= (0..15)
0 1 3 0 0 0 0 0 0 0 0 0 0 0 0 0 
##$SW_h= 32467.5324675325
##$TD= 32768
##$TD0= 1
##$TE= 0
##$TE2= 300
##$TE3= 300
##$TEG= 300
##$TL= (0..7)
0 120 53 12 22 120 120 120 
##$TP= (0..7)
150 150 150 150 150 150 150 150 
##$TP07= 0
##$TPNAME0= <>
##$TPNAME1= <>
##$TPNAME2= <>
##$TPNAME3= <>
##$TPNAME4= <>
##$TPNAME5= <>
##$TPNAME6= <>
##$TPNAME7= <>
##$TPOAL= (0..7)
0.5 0.5 0.5 0.5 0.5 0.5 0.5 0.5 
##$TPOFFS= (0..7)
0 0 0 0 0 0 0 0 
##$TUNHIN= 0
##$TUNHOUT= 0
##$TUNXOUT= 0
##$USERA1= <user>
##$USERA2= <user>
##$USERA3= <user>
##$USERA4= <user>
##$USERA5= <user>
##$V9= 5
##$VALIST= <valist>
##$VCLIST= <CCCCCCCCCCCCCCC>
##$VD= 0
##$VDLIST= <DDDDDDDDDDDDDDD>
##$VPLIST= <PPPPPPPPPPPPPPP>
##$VTLIST= <TTTTTTTTTTTTTTT>
##$WBST= 1024
##$WBSW= 4
##$XGAIN= (0..3)
0 0 0 0 
##$XL= 0
##$YL= 0
##$YMAX_a= 8879
##$YMIN_a= -26143
##$ZGOPTNS= <>
##$ZL1= 120
##$ZL2= 120
##$ZL3= 120
##$ZL4= 120
##$ABSF1= 198.0616
##$ABSF2= -202.7028
##$ABSG= 5
##$ABSL= 3
##$ALPHA= 0
##$AQORDER= 0
##$ASSFAC= 0
##$ASSFACI= 0
##$ASSFACX= 0
##$ASSWID= 0
##$AUNMP= <proc_1d>
##$AZFE= 0.1
##$AZFW= 0.5
##$BCFW= 0
##$BC_mod= 2
##$BYTORDP= 0
##$COROFFS= 0
##$CY= -3
##$DATMOD= 1
##$DC= 0
##$DFILT= <>
##$DTYPP= 0
##$F1P= 0
##$F2P= 0
##$FCOR= 1
##$FTSIZE= 65536
##$FT_mod= 6
##$GAMMA= 0
##$GB= 0
##$INTBC= 1
##$INTSCL= 9.790993e-09
##$ISEN= 30
##$LB= 1.5
##$LEV0= 0
##$LPBIN= 0
##$MAXI= 10000
##$MC2= 0
##$MEAN= 0
##$ME_mod= 0
##$MI= 50
##$NCOEF= 0
##$NC_proc= -8
##$NLEV= 6
##$NOISF1= 182.463
##$NOISF2= 159.3651
##$NSP= 0
##$NTH_PI= 0
##$NZP= 0
##$OFFSET= 198.0616
##$PC= 4
##$PHC0= 1778.789
##$PHC1= -935.9069
##$PH_mod= 1
##$PKNL= yes
##$PPARMOD= 0
##$PSCAL= 0
##$PSIGN= 0
##$REVERSE= no
##$SF= 81.0140089999434
##$SI= 65536
##$SIGF1= 159.3651
##$SIGF2= -187.1042
##$SINO= 113.3802
##$SIOLD= 16384
##$SREGLST= <1H.CDCl3>
##$SSB= 0
##$STSI= 65536
##$STSR= 0
##$SW_p= 32467.5324675325
##$SYMM= 0
##$S_DEV= 0
##$TDeff= 32768
##$TDoff= 0
##$TI= <>
##$TILT= no
##$TM1= 0
##$TM2= 0
##$TOPLEV= 0
##$USERP1= <user>
##$USERP2= <user>
##$USERP3= <user>
##$USERP4= <user>
##$USERP5= <user>
##$WDW= 1
##$XDIM= 65536
##$YMAX_p= 321244906
##$YMIN_p= -233769393
$$ End of Bruker specific parameters
$$ ---------------------------------
##NTUPLES= NMR SPECTRUM
##VAR_NAME=  FREQUENCY,     SPECTRUM/REAL,   SPECTRUM/IMAG
##SYMBOL=    X,             R,               I
##VAR_TYPE=  INDEPENDENT,   DEPENDENT,       DEPENDENT
##VAR_FORM=  AFFN,          ASDF,            ASDF
##VAR_DIM=   65536,         65536,           65536
##UNITS=     HZ,            ARBITRARY UNITS, ARBITRARY UNITS
##FACTOR=    0.49542278885378, 1,            1
##FIRST=     16045.7642231865, 0,            0
##LAST=      -16421.768244346, 0,            0
##MIN=       -16421.768244346, -233769393,   0
##MAX=       16045.7642231865, 321244906,    0
$$ Real data points
##PAGE= N=1
##DATA TABLE= (X++(R..R)), XYDATA
$$ [...]
44321e126268m224931m502307m441187j257462L494264N259184L275081J280265
44313f243361J470532K057240J370995M80303N57395Q28493N91257P60279J877749
44304C750882K522112J290128q59617j608763n8010K285609L039819J309732j226264
44295A0445628k012232q42027l71459k338511m581743l856415p30604J032251
44287c255112r8868j500146o56046J383889K337714K191303K212418K077749N58359
44278E251260j632275k245010q60248L91133O4937o59833l88982n5762j195509
44269a330289k775966k105800J132224L946535L835339J716238k0741p54741j280435
44260B362364j429740k66358J633373K211592O81098j325052j956239j280364
$$ y = [-5126268, -9351199, -13853506, -18294693, -19552155, -16057891, -10798707, -7523626, -6243361, -4772829, -2715589, -1344594, -864291, -306896, 521597, 1112854, 1873133, 3750882, 6272994, 7563122, 6703505, 5094742, 5036732, 7322341, 10362160, 11671892, 10445628, 8433396, 7591369, 7219910, 4881399, 299656, -3556759, -4287363, -3255112, -3353980, -4854126, -5510172, -4126283, -1788569, 402734, 2615152, 4692901, 5251260, 3618985, 1373975, 513727, 904860, 969797, 309964, -79018, -134780, -1330289, -4106255, -6212055, -5079831, -1133296, 2702043, 4418281, 4397540, 3642799, 2362364, 932624, 666266, 2299639, 4511231, 5192329, 3867277, 1911038, 630674]
44252F30674o00689o17767r06225n89880P86020K498928K882348J261661n63282
44243D781788k21577J798566K445712L85887j974473j971528m42238j12802j338942
44234C350393j730169P9142K285950K283690K0096j958511j521455O50837J943413
44225E403386Q86517j223969k201610j825992j675086k289547k128689n0147K519618
44216b585519L145244J409097q20028j781221j389823n60003j9896k187l33723
44207b938059m82111k3617N89888K18456j372422k382740n85082L415725N724485
44198B164523L454769j172077l161768j178222J026661M66695r33352k91664J050019
44189A425584j5120k589348k938090q16158O8873j557560k309738P6303K912093
$$ y = [630674, 29985, -587782, -1494007, -2083887, -1297867, 1201061, 4083409, 5345070, 4781788, 4560211, 6358777, 8804489, 9190376, 7215903, 5244375, 4802137, 4689335, 3350393, 1620224, 1699366, 3985316, 6269006, 6289102, 4330591, 2809136, 3459973, 5403386, 6289903, 5065934, 2864324, 1038332, -636754, -2926301, -5054990, -5105137, -2585519, 559725, 1968822, 1148794, -632427, -2022250, -2582253, -2602149, -2604336, -2938059, -3420170, -3443787, -2853899, -2635443, -4007865, -6390605, -6975687, -3559962, 2164523, 5619292, 4447215, 1285447, 107225, 1133886, 1600581, 667229, 375565, 1425584, 1410464, -1178884, -4116974, -4933132, -4864259, -6421819, -8731557, -8655254, -5743161]
44180e743161L040627J717829J894068L166967K854681N85171j363576j599357
44172D553249r41977o05067r91536j887429k361320j139051J560877L429358K684794
44163D301898M00809j084677j078013n07355n4194K24317K18933r1375n76395
44154A753948j640289l606948m956039l369466M98268K904506K169202J073656
44146e173162K056912L173284J819196n32539j208076j363220l412376n229898
44138i869879k422147L952562P298054M047724k109301n758052n486388k658996
44130a3006423J557200N603042O959142M767587J279474j034877k128009k818773
44122A178363k629906r39977J238623K361432K247659J647116Q75162j00602j076096
$$ y = [-5743161, -2702534, -984705, 909363, 4076330, 6931011, 7516182, 6152606, 4553249, 3611272, 3006205, 2014669, 127240, -2234080, -3373131, -1812254, 1617104, 4301898, 4702707, 3618030, 2540017, 2032662, 1978468, 2202785, 2421718, 2330343, 1753948, 113659, -3493289, -8449328, -11818794, -11320526, -8416020, -6246818, -5173162, -3116250, 57034, 1876230, 1343691, 135615, -1227605, -4639981, -9869879, -12292026, -8339464, -1041410, 3006314, 897013, -4861039, -10347427, -13006423, -11449223, -5846181, 1112961, 5880548, 7160022, 6125145, 3997136, 1178363, -1451543, -2391520, -1152897, 1208535, 3456194, 5103310, 5978472, 5877870, 4801774]
44113D801774j885547k480230k387032j154782M36381R62275M54265M15847J336644
44104D99595J829895R16093m33489r78096j071290j713925k688138k755651j309434
44095g704440Q83355K431441K576919J828737J221099R36710L78310k75473R997
44086B286655J012735Q68606r23888k047404p56771J206574J390456L62571j12409
44077C287125n89875k165085l076812j333099P61982l75915l013131k104127K190662
44068f418275M056583J168369j763348p46721J868005K542385K152251K618357
44060E477606K317858p38298m326067m802138k214610P21501K435353K407829
44052A279034R7618k926559k814403J127483L928427J782112j824770j490333
$$ y = [4801774, 2916227, 435997, -1951035, -3105817, -2669436, -1707161, -1252896, -837049, 499595, 2329490, 3245583, 2812094, 1833998, 762708, -951217, -3639355, -6395006, -7704440, -6821085, -4389644, -1812725, 16012, 1237111, 2173821, 2552131, 2276658, 2286655, 3299390, 4167996, 3244108, 1196704, 439933, 1646507, 3036963, 3399534, 3287125, 2697250, 532165, -2544647, -3877746, -3115764, -3491679, -6504810, -8608937, -6418275, -2361692, -1193323, -2956671, -3703392, -1835387, 706998, 2859249, 5477606, 7795464, 7057166, 2731099, -2071039, -4285649, -3564148, -1128795, 1279034, 1376652, -1549907, -4364310, -3236827, 691600, 2473712, 648942, -841391]
44044h41391J561795K010804n13321j277511J191223K803625Q10759k332184l533331
44035a19532l032856k014964j09073K582913M004466K912762R79600L02651N42950
44026F048917J09405j176501k013488j425889K08089J440957R72116p45924j517931
44017A899751q2347J813396J487373r62783k661425j554136J363234L336341K432246
44008G071650p38810l203133k524102j19539J48871k331394l350880n0398M262563
43999h35172M718558J831308j58720P6954N80216J007741K682938M106248J812746
43990A5822817l511886o682431n123400j919897k77014O44997K262817L095235
43982D311238J638811m47009r09501k53799p9405k99389l01431p35221j824325
$$ y = [-841391, 720404, 2731208, 2217887, 940376, 2131599, 4935224, 5745983, 3413799, -119532, -3152388, -5167352, -5276425, -2693512, 1310954, 4223716, 5203316, 5505967, 6048917, 6158322, 4981821, 2968333, 1542444, 1750533, 3191490, 4163606, 3417682, 1899751, 1817404, 3630800, 5118173, 4155390, 1493965, -60171, 1303063, 4639404, 7071650, 6332840, 3129707, 605605, 486066, 634937, -1696457, -5047337, -5097735, -835172, 3883386, 5714694, 5555974, 5632928, 6213144, 7220885, 9903823, 14010071, 15822817, 12310931, 5628500, 505100, -1414797, -1691811, -1046814, 1216003, 4311238, 5950049, 5503040, 4593539, 4339740, 4260335, 3960946, 3659515, 2924294, 1099969]
43973A099969j835271M06288L040008L390154J395131r62561k344009k568631
43965A621078j794449p25735m60078j007253j317097j428867k452148l569986
43957a1134535j969926K495176N525993L852611K8380j279898K35642J231823
43949a014734N08318K44540J703157L223577L215968K482358K374562K368831
43941A5106577Q11639k508417n416982n332274k329981L75372Q9157j763231j617063
43932b585203R43707K747456K302570J856952K579828J661773k580271o124641
43924H02171m271038R26550L251801J301769l69723Q48728J980810L50859j609300
43915C212627m22932K817886M255665K762265M91385j006565k260680l614361
$$ y = [1099969, -735302, -329014, 2710994, 6101148, 7496279, 6533718, 4189709, 1621078, -173371, -899106, -1359184, -2366437, -3683534, -5112401, -7564549, -11134535, -13104461, -10609285, -5083292, -1230681, -1202301, -2482199, -2246557, -1014734, -506416, -261876, 1441281, 4664858, 7880826, 10363184, 12737746, 15106577, 15918216, 13409799, 7992817, 2660543, 330562, 705934, 795091, -968140, -2585203, -1641496, 1105960, 3408530, 5265482, 7845310, 9507083, 6926812, 802171, -3468867, -2542317, 709484, 2011253, 1641530, 2490258, 4471068, 4821927, 3212627, 2789695, 5607581, 9863246, 12625511, 13116896, 12110331, 9849651, 6235290]
43907F235290l992579k647110n82805O76408R79195J385772K350629K778427J252938
43898H436165k012009m943535n500265l482902l63046K191354L344807L221459
43890H92028K546043J882007R65895p19907k531651k743760p12843J836521K635266
43881D049599J504170K86597M72680J666607K218287Q36771k148380m768633n125071
43872a007373l415874j601840q24161j91520J389758L407135M596518M510791
43864F863434L331708J207998j216875k681619k770314k494618k512274k064366
43856b336926p27561L47589L17514R8532L14922l22759k436262l695181j967422
43847a0407554Q06478J232074j88999j28657J745528K309501P02586J16281K362501
$$ y = [6235290, 2242711, -404399, -987204, -310796, 668399, 2054171, 4404800, 7183227, 8436165, 6424156, 1480621, -4019644, -7502546, -7865592, -5674238, -2329431, 892028, 3438071, 5320078, 6285973, 5566066, 3034415, 290655, -422188, 1414333, 4049599, 5553769, 5840366, 6313046, 7979653, 10197940, 11034711, 8886331, 4117698, -1007373, -4423247, -6025087, -6849248, -7040768, -5651010, -2243875, 2352643, 6863434, 10195142, 11403140, 10186265, 7504646, 4734332, 2239714, -272560, -2336926, -3064487, -2716898, -2399384, -2300852, -1985930, -2308689, -4744951, -8440132, -10407554, -9601076, -8369002, -8558001, -8686658, -6941130, -4631629, -3929043, -3812762, -1450261]
43838a450261M517806L317603p8730k289941k418761j951930j646634j110128
43830c110976m45634q6881K92842R22713Q24372o85122k232564k022411n57100
43821g100761K54430K30257R70735K768014L673411K377586K69696n21797M5174
43812B966745L99286j7367j55205M98766O48671r28654l041712l128565o92639
43803c450674J770450J925200L82758p03322o33432k18236K69397J228747K138015
43794B708903J847675N97374j11307Q2217J184o63675o43980L52770M56537j541761
43784C085937l800232l592149q39173K060705L136914K196913Q1323j886961k218206
43775a774929n56829J440244J691497Q6049j600308j956259j207526m44675m39273
$$ y = [-1450261, 3067545, 6385148, 6306418, 4016477, 1597716, -354214, -2000848, -3110976, -3556610, -3643491, -3350649, -2427936, -1603564, -2288686, -4521250, -6543661, -7100761, -6846331, -6616074, -5645339, -2877325, 796086, 3173672, 3443368, 2921571, 2966745, 3366031, 3348664, 3193459, 3692225, 4340896, 3412242, 370530, -2758035, -3450674, -1680224, 244976, 627734, -75588, -709020, -927256, -657859, 570888, 2708903, 4556578, 5153952, 5042645, 5124862, 5126046, 4462371, 3818391, 4171161, 4627698, 3085937, -714295, -4306444, -5145617, -3084912, 52002, 2248915, 2330238, 443277, -1774929, -2331758, -891514, 799983, 886032, -714276, -2670535, -3878061, -4322736, -4762009]
43766d762009j128146j626760r43841Q00970K224267K230836J210943J92220m57532
43757b259052p73946n20912J74016K78078p22989j417743q8709K375789K885082
43748g0386K7042l695927m457138j411785K407289L486436J526201p40894j204104
43739d133266p41923j170899k046987j575171k36460n48625k479771k421744J137742
43730a4217104M049692K133317j957986k137031J928703M320723J978821j107204
43722e008069p61062J318597J612761O98756Q98250J265050j89937j566075K05693
43713a526036K981409J641033l266410n144248j088148L629690L492208J65337
43705H84835j637645j449032j628721j831289n9934K553743L020729J606843J044897
$$ y = [-4762009, -5890155, -7516915, -8460756, -7659786, -5435519, -3204683, -1993740, -1801520, -2259052, -3032998, -3553910, -3379894, -3101816, -3824805, -5242548, -5331257, -2955468, -70386, -43344, -3739271, -8196409, -9608194, -7200905, -3714469, -2188268, -2929162, -4133266, -4875189, -6046088, -8093075, -9668246, -9904706, -10453331, -12933102, -15354846, -14217104, -10167412, -8034095, -9992081, -12129112, -10200409, -5879686, -3900865, -5008069, -5769131, -4450534, -2837773, -2139017, -1240767, 24283, -165654, -1731729, -1526036, 1455373, 3096406, -170004, -5314252, -6402400, -2772710, 719498, 884835, -752810, -2201842, -3830563, -5661852, -5721786, -3168043, -147314, 1459529, 2504426]
43696B504426J340758K05270j597550o61420K575739L177924n71255l855573k591487
43687E26832M84405P07424j257817j518225K70614R95650l42603j545769j252478
43678b931967k74694R50149K780433M102720K852122o45987l463356l716441k297191
43669b644212q69876l57617j324157l349032m007121j229358K985349M037379
43661f758645O12836l533038m510676k406596N14930K938489M250678L629710
43653e262312J434667k19768j50876M3966j447666l535663l516427o47831L128027
43644a0173883N429587N184579K799293k11177k107880k221805j126424M72568
43636a955142K031293K414977N93221k344557l636238k258569k94575J30011m19125
$$ y = [2504426, 3845184, 4050454, 2452904, 1791484, 4367223, 7545147, 6973892, 3118319, 526832, 1011237, 1718661, 460844, -1057381, -786767, 208883, -133720, -1679489, -2931967, -3206661, -2256512, 523921, 4626641, 7478763, 6832776, 3369420, -347021, -2644212, -3514088, -3871705, -5195862, -8544894, -12552015, -13781373, -10796024, -6758645, -6145809, -9678847, -14189523, -16596119, -16081189, -13142700, -8892022, -5262312, -3827645, -4047413, -4198289, -4154323, -5601989, -9137652, -12654079, -13301910, -10173883, -4744296, 440283, 3239576, 3028399, 920519, -1301286, -2427710, -1955142, 76151, 2491128, 3084349, 739792, -2896446, -5155015, -5449590, -5319579, -5738704]
43627e738704l66269R4925k18849r51420m41792J736208L895920M089213K282987
43618D382219O65753J535469M230159M868608Q34027n004180p117255m449770
43610e4970j579193j886604l152430k032590M51845J162792J81659J46781J578988
43601e183722K505410K196135J958567K227245J769807J36028j478717k204473
43593A926280k355594k050329q07401J110557K445655K354745J018136j023189
43585B618860l059338m085653l594323k109626j72247K171665L913018K869793
43577a447851j133105m411797l303285J031065M163465L939706J881378j33705
43569E85871j573743j960032r54674Q4989n78068j956907j285185J632554L847790
$$ y = [-5738704, -6104973, -6010048, -6228897, -7180317, -7622109, -5885901, -1989981, 2099232, 4382219, 5047972, 6583441, 10813600, 15682208, 16516235, 11512055, 4394800, -54970, -1634163, -3520767, -6673197, -8705787, -8253942, -7091150, -6909491, -6762710, -5183722, -2678312, -482177, 1476390, 3703635, 5473442, 5609470, 4130753, 1926280, -429314, -2479643, -3287044, -2176487, 269168, 2623913, 3642049, 2618860, -440478, -4526131, -8120454, -10230080, -10402327, -8230662, -4317644, -1447851, -2580956, -6992753, -10296038, -9264973, -5101508, -1161802, 719576, 585871, -987872, -2947904, -3902578, -3817589, -4395657, -6352564, -7637749, -6005195, -2157405]
43560b157405L591582K308482J516160N15609j348030k630113j829126K07328
43552A74487J510422J374137L51028q65409j456755n35370J698008L610822L723033
43543I584403K102318m6690j485438j687345j280823j424696j976682j307702
43535B477345P69342J495892j016577l941181l111457N64593K088615j93801k445864
43526c313093j573546O35683J397924J073242J000177N78779o30600p56210J287683
43517b99961K879900J247705j795863k233770K1276R81824j375424m074305l263140
43508g911758N39586K869151O83732l642730m596887r3172N502260O412880K405048
43499B168110j752996k992442k604820k087766n30623K220778L558653J881055
$$ y = [-2157405, 1434177, 3742659, 5258819, 5774428, 4426398, 1796285, -32841, 174487, 1684909, 3059046, 3410074, 2544665, 1087910, 552540, 2250548, 5861370, 9584403, 11686721, 11640031, 10154593, 8467248, 7186425, 5761729, 3785047, 2477345, 3246687, 4742579, 3726002, -215179, -3326636, -2762043, -673428, -867229, -3313093, -4886639, -4250956, -2853032, -1779790, -779613, -200834, -831434, -1587644, -299961, 2579939, 3827644, 2031781, -201989, -180713, 801111, -574313, -4648618, -7911758, -7372172, -4503021, -3819289, -7462019, -12058906, -12152078, -6649818, -236938, 2168110, 415114, -2577328, -5182148, -7269914, -7800537, -5579759, -2021106, -140051]
43491a40051m46798n45865R02255J601791J469718J750758K077084J162866p61260
43482G070498k368907k963312k356518p55455J04531j698335m479123l937514
43474a1384135J26696K272254m02591l108446q44519L313889L374823M86987O90378
43465e474664M444072N977945K949877m37565r88267o42980j311354j507178m83874
43456B526012m93222k248427k736942l92598J621842K68642k673027l603809j866188
43447i597717R10363L363813M093763J761671k224490l960084k133026L3676n4421
43438g806452o17708N95924K163673J924305R66101J164014J417243L0102j504104
43429a666902r29767N88636O36425J19612J502081L825223L836512J379868n22136
$$ y = [-140051, -586849, -1132714, -230459, 1371332, 2841050, 4591808, 6668892, 7831758, 7070498, 4701591, 1738279, -618239, -1373694, -1269163, -2967498, -7446621, -11384135, -11257439, -8985185, -9387776, -12496222, -13340741, -10026852, -6652029, -6165042, -5474664, -1030592, 4947353, 7897230, 7459665, 6471398, 5828418, 4517064, 3009886, 2526012, 2032790, -215637, -2952579, -3345177, -1723335, -1454693, -4127720, -7731529, -9597717, -8687354, -5323541, -1229778, 531893, -1692597, -5652681, -7785707, -7752031, -7806452, -8424160, -7828236, -5664563, -3740258, -2774157, -1610143, -192900, -162798, -1666902, -2596669, -2008033, -1371608, -1251996, 250085, 4075308, 7911820, 9291688, 8769552]
43420H769552o77232q18891j679406j851793r91645n51381o72593K70651K230821
43411D028083K900872J642036P85282J537743J604830j080502m692539n878101
43403H47704m066470j249127J166886L013550L757272K654307N36572m98231J95946
43394F358409O97300r51276l767486m591435k022570J467527K341672L01016j721419
43385a888262j725095p72966l51482R0855J367037K365693J967625J522627K569443
43376E145475L318635Q98627l362211m780232j971480J121121J170347j87393
43368A352889r1470P45236J09252j213791p35164J074403J096181j490463l720272
43359b873199k975354j81262K031089K457198J616073M21256l32926j29078P07109
$$ y = [8769552, 8092320, 7273429, 5594023, 3742230, 2750585, 2199204, 1526611, 1797262, 4028083, 6928955, 8570991, 9356273, 10894016, 12498846, 11418344, 6725805, 847704, -3218766, -4467893, -3301007, -287457, 3469815, 6124122, 6660694, 6162463, 6358409, 7055709, 6104433, 2336947, -2254488, -4277058, -2809531, -467859, -166843, -1888262, -3613357, -4386323, -4737805, -4646950, -3279913, -914220, 1053405, 2576032, 5145475, 8464110, 9362737, 6000526, 1220294, -751186, 369935, 1540282, 1352889, 1261419, 2006655, 2115907, 902116, 166952, 1241355, 2337536, 847073, -2873199, -5848553, -6029815, -3998726, -1541528, 74545, 495801, 162875, 33797, 740906]
43350G40906J199012R60049N44044K69337l20612j329668j848728j132373L85261
43341e32772J910994L234761M071066L474019J137926j404213k266186j556382
43333H069213r34763j064914r42424J99354J747894K796716L113781K637110J215866
43324A6837833o59917k013686k743947l634976m547573m095833j948630O8623
43316b738106L17071n79230j169718j120478k88442K219332N787735O865633L018105
43307A2311902k540143m093364j005436J609764M71523j539483n45917K217088
43299F885934K522414n51350l599488l590716j199252O19296n5446k295813l219540
43290d483961j090454K292348L357978J101790j910034l174183k727688j280957
$$ y = [740906, 1939918, 2899967, 3444011, 3713348, 3392736, 2063068, 214340, -918033, -532772, 1378222, 4612983, 8684049, 12158068, 13295994, 11891781, 9625595, 8069213, 7134450, 6069536, 5127112, 5326466, 7074360, 9871076, 12984857, 15621967, 16837833, 16177916, 14164230, 11420283, 7785307, 3237734, -858099, -2806729, -2738106, -2421035, -3000265, -4169983, -5290461, -5578903, -3359571, 2428164, 9293797, 12311902, 9771759, 5678395, 4672959, 6282723, 6754246, 5214763, 4668846, 6885934, 9408348, 8856998, 5257510, 1666794, 467542, 1086838, 1031392, -1264421, -4483961, -5574415, -3282067, 75911, 1177701, -732333, -3906516, -6634204, -7915161]
43282g915161J399434M580047N624592L350763K52849j091768j724335l513973
43274I62448m822667k827644J170940L024259J856359P41731J230030J462210
43266B797666M40810o1983P04468O78966j080244k272926j498051j070000k712982
43257d074276l579843m78508M127870M836246J119637k011413j381167N06246
43249i35208L67167p16332L33661L256013M590323K663020j68043r23098Q0175
43240H547678P7057k051303m121607l572981r05460J073371J063600P37485J893272
43231B741112L622615L639747J602314n68102j563086k194671l457624m525792
43223g03487l903030j796424N4044P01605Q12899J057165J101908P96906R55243
$$ y = [-7915161, -6515727, -1935680, 3688912, 7039675, 7292524, 6200756, 4476421, 962448, -3860219, -6687863, -5516923, -2492664, -636305, 105426, 1335456, 2797666, 3238476, 3176493, 3880961, 4559927, 3479683, 1206757, -291294, -1361294, -4074276, -7654119, -8132627, -4004757, 831489, 1951126, -60287, -1441454, -935208, -568041, -1284373, -950712, 2305301, 6895624, 9558644, 9390601, 8467503, 8547678, 8624735, 6573432, 2451825, -1121156, -2026616, -953245, 110355, 847840, 2741112, 6363727, 10003474, 11605788, 11037686, 9474600, 7279929, 3822305, -703487, -4606517, -6402941, -6348897, -5647292, -4834393, -3777228, -2675320, -1878414, -923171]
43214i23171J811588J864973j03704k593910k905408q45199J103347J352265P28987
43205e10232M5912j294878l144329l526752j546235O25487P47749k12235p2188
43196h887701Q52534O68710o06858j244519p17766K37089J710033L902304N009229
43187I23055L087981k33162j380255k86431n20633l254570m922281k581077J579602
43178g587771L248550J284131j795836k803854j60908M799404P874052N742044
43170A0599812N92175j844932N3262J653829o26629l800512l166952O94996L644679
43161G799728M106242L340197J605221j438253l639339k215630J479464K965349
43153A4002979N52166l092268n206383n332759l479821L19356L906804L975999
$$ y = [-923171, 888417, 2753390, 2649686, 55776, -2849632, -3694831, -2591484, -1239219, -510232, -464320, -1759198, -4903527, -8430279, -9976514, -9351027, -8603278, -8815513, -8887701, -8035167, -7366457, -7973315, -9217834, -9935600, -9698511, -7988478, -4086174, 923055, 4011036, 3777874, 2397619, 2111188, 1590555, -1664015, -6586296, -9167373, -7587771, -4339221, -3055090, -4850926, -7654780, -7815688, -3016284, 4857768, 10599812, 11191987, 9347055, 9400317, 11054146, 10427517, 6627005, 3460053, 4155049, 7799728, 11905970, 15246167, 16851388, 15413135, 11773796, 9558166, 11037630, 14002979, 14555145, 11462877, 6256494, 923735, -2556086, -2236730, 1670074, 5646073]
43145E646073M49998k845151l007113j136453K92060O09591M09271J30984L68116
43136I17376J620073K822671K104489k55690j832119j770310j968257l411540
43128a773307m034090k059882Q38791J956403J392699J170266J755437J773117
43120A019434N75042q79900j538904j281075n69649K6477J97338K23538M47191
43111a780508M11931l55681q31471L31470J886348Q52528k654225m313872j408721
43102g862201K799394L355662K99414k313952k651975k347744j959747L22824
43094a0358325M260887N774080K121536l550752n594460k557025J844371L685904
43086d373784K536102M26096p53260l57406R72504J693728P84909p61621q90372
$$ y = [5646073, 6096071, 3250920, 243807, -892646, -600586, 9005, 418276, 549260, 917376, 2537449, 5360120, 7464609, 7208919, 5376800, 3606490, 1638233, -1773307, -5807397, -7867279, -7028488, -5072085, -3679386, -2509120, -753683, 1019434, 1594476, 714576, -824328, -2105403, -2675052, -2648575, -2451237, -2227699, -1780508, -1368577, -1724258, -2555729, -2224259, -337911, 514617, -2139608, -6453480, -7862201, -5062807, -1707145, -1407731, -3721683, -6373658, -8721402, -10681149, -10358325, -6097438, -323358, 1798178, -1752574, -7347034, -9904059, -8059688, -4373784, -1837682, -1411586, -2164846, -2522252, -1549748, 143980, 928889, 167268, -723104]
43077g23104O38914J646940P17588m49636M15307K326726K274470O0278j090923
43068E816560L05496J220132j269315m906268m967280q69268L253814M259081
43060B842952L051738J667639M88526o47915j314004j757042k937243m095880
43052b701229k811919R57709L487426K078734j037139k099768j087185o25335
43044c838706j252004j181949O5691J231565K192017L918708N474138M459459
43036A1068919J142734j139912r05766o87410k438726l751244j521375K607560
43028D374780L906369J034922k324219k679128q62811K57604J65490P58082K740853
43019G371942M002508K240054j843663m969090m737615j938448P09757J480692
$$ y = [-723104, -84190, 1562750, 2280338, 1830702, 2246009, 4572735, 6847205, 6907483, 5816560, 6122056, 7342188, 6072873, 1166605, -3800675, -4669943, -1416129, 2842952, 5894690, 7562329, 8050855, 7402940, 6088936, 4331894, 1394651, -2701229, -5513148, -4555439, -1068013, 1010721, -26418, -2126186, -3213371, -3838706, -5090710, -6272659, -6206968, -4975403, -2783386, 1135322, 6609460, 11068919, 12211653, 11071741, 10165975, 9478565, 7039839, 3288595, 1767220, 4374780, 8281149, 9316071, 6991852, 4312724, 3449913, 3707517, 3873007, 4631089, 7371942, 11374450, 13614504, 11770841, 6801751, 2064136, 125688, 835445, 2316137]
43011B316137Q68257L11749M05858N22041j88271j735018l233527l758338l094137
43002g585249j651350J3206J316003J682825J084518L65270L68535Q44998R20127
42993b641117M15818k16659r57003j842424j750525M91631L462438L905296J208864
42984B076319j111060j09649K458928K989022J245155j55490l14896p66528j918209
42975D393592k139235r15420N6054j35910j55861Q48240J482271O22862l99859
42966C656734j1307Q08660m3758k542516m531666m460102k727614p25638L91800
42957a0185407M26599M20868J605428L490689M049886K534142P30788L06904M51011
42948C830908j59463n39394J000274L288095L230691M26298j903693j445669J22384
$$ y = [2316137, 3184394, 3496143, 3902001, 4424042, 4235771, 2500753, -732774, -4491112, -7585249, -9236599, -9223393, -7907390, -6224565, -5140047, -4774777, -4406242, -3561244, -2641117, -2225299, -2441958, -3398961, -5241385, -6991910, -6500279, -3037841, 867455, 2076319, 965259, 855610, 3314538, 6303560, 7548715, 7393225, 7078329, 6311801, 4393592, 2254357, 1338937, 1394991, 1259081, 1103220, 1951460, 3433731, 4056593, 3656734, 3645427, 4454087, 4410329, 1867813, -2663853, -7123955, -9851569, -10577207, -10185407, -9758808, -9337940, -7732512, -4241823, -191937, 2342205, 3072993, 3379897, 3830908, 3671445, 3132051, 4132325, 7420420, 10651111, 11077409, 9173716, 7728047, 7850431]
42939G850431j03j674050k533059j599239j34543O85455J025673J204355R61359
42930E786279M90505P70782J890932K151585K24153k389014k718204k92934J795241
42921G709325N67571l179858n866638n068578j498903K326734M241571L620593
42913B851817J698733O77182J457861K356528J218511j309331k172358O1358L111294
42904I951595L771328J561306j411217l195425l368506k390056r84707R596K56362
42895D200276L49395Q40737J097256J63893j314241j348661O55266K509669J746868
42886H900458r47024k229034l64502K363828K650291O09780o24939M51793J726131
42877A2536782Q86706j304728k692602k846148k470552j318493O88496J511378
$$ y = [7850431, 7850328, 6176278, 3643219, 2043980, 1909437, 2594892, 3620565, 4824920, 5786279, 6276784, 7047566, 8938498, 11090083, 11314236, 8925222, 6207018, 5914084, 7709325, 8276896, 5097038, -769600, -5838178, -7337081, -5010347, -768776, 2851817, 4550550, 5227732, 6685593, 9042121, 10260632, 8951301, 6778943, 6840301, 9951595, 13722923, 15284229, 13873012, 10677587, 7309081, 4919025, 3934318, 3943914, 4200276, 4549671, 5390408, 6487664, 6651557, 5337316, 3988655, 4643921, 7153590, 8900458, 7953434, 5724400, 5359898, 7723726, 10374017, 10983797, 10358858, 10810651, 12536782, 13423488, 12118760, 9426158, 6580010, 4109458, 2790965, 3479461, 4990839]
42869D990839n91715l314305k565336J460310M267847L726071K584893K858892
42861A3417496K141678j573883n262237n020818k047278j58472M75319K265105
42853D236910M265241K864812j363783k875988R92079N648051N275996J96780
42845A9240098m449992n209487k911073j90184J164079R51326L38975O52453J621330
42836A1207525J612821J80807r78558o29343j39206j469850l962817m871536k848669
42827a898826M87789K570230K514250J505698J091817J414801J256713j33995
42819H808477j802495k338576j868982j632499j779857j071860R81226L065613
42811B361047L647674K505715L73177j719252k493413j316106M98429Q61988m3365
$$ y = [4990839, 4399124, 1084819, -1480517, -20207, 4247640, 7973711, 10558604, 13417496, 15559174, 13985291, 8723054, 3702236, 1654958, 1496486, 1971805, 4236910, 8502151, 11366963, 10003180, 7127192, 8119271, 13767322, 19043318, 19240098, 14790106, 9580619, 6669546, 6479362, 7643441, 8594767, 8933742, 9586195, 11207525, 12820346, 13001153, 12022595, 11393252, 11254046, 9784196, 5821379, 949843, -1898826, -1411037, 1159193, 3673443, 5179141, 6270958, 7685759, 8942472, 8808477, 7005982, 4667406, 2798424, 1165925, -613932, -1685792, -704566, 2361047, 6008721, 8514436, 8887613, 7168361, 4674948, 3358842, 3857271, 4719259, 4675894]
42802D675894K82530K748073M692752L371498k03831k764668k916978j840845
42794H044425q23069k16861l57571j388000k164747j174240J161999K572358J715045
42785G369339k96714j497641j157093J43441J582233K581383K708458J792805
42777A3226211K61779r27725j132146r75555j835358l636827l880844m94461M499863
42768E104937O301153L059373j687299l530624k299782r47352r49169j109694
42760C941543j44207J694008L269978L290275R56722k564983m200442k374659
42752C868235M74889R65247m83893p02982Q70825J231238j170231l595465k831588
42743a373725M50371K973262K923752J074482r65147k030103j755453j022801
$$ y = [4675894, 4958424, 7706497, 12399249, 15770747, 15566916, 12802248, 9885270, 8044425, 7221356, 7004495, 6646924, 5258924, 3094177, 1919937, 3081936, 5654294, 7369339, 7072625, 5574984, 4417891, 4561332, 6143565, 8724948, 11433406, 13226211, 13487990, 12560265, 11428119, 10452564, 8617206, 4980379, 1099535, 605074, 5104937, 11406090, 14465463, 12778164, 9247540, 6947758, 6000406, 5051237, 3941543, 3797336, 5491344, 8761322, 12051597, 13008319, 10443336, 6242894, 3868235, 4343124, 5308371, 4824478, 4121496, 4992321, 6223559, 5053328, 1457863, -1373725, -923354, 2049908, 4973660, 6048142, 5082995, 3052892, 1297439, 274638]
42735B74638j438038l222782m250918k421792J346064L706904K608832l94064
42727c791156j926297n07831K035772L000165J993027P90887M13705J37487j92175
42718A953584P36669K705418K535661j414974n151592l402815K593700N997351
42710F553002L429258j220756l244303k899616k395242j267109J500181L631702
42702D087117K128609j683770l457215j623963J205461K335703J743783P88896
42694E524621M23122P91952J106188K93123j113261j021137Q18124J446870q96039
42685G373563l130627j492235K313150L243840L28400k546366l057932k856356
42677A75437k876080j209364K453189M695111L369920J060256O30289O99060r62091
$$ y = [274638, -1163400, -4386182, -8637100, -11058892, -9712828, -6005924, -3397092, -3791156, -5717453, -6225284, -4189512, -1189347, 803680, 1594567, 2008272, 2145759, 1953584, 2690253, 5395671, 7931332, 6516358, 1364766, -2038049, 555651, 6553002, 9982260, 8761504, 5517201, 2617585, 222343, -1044766, 455415, 4087117, 6215726, 4531956, 1074741, -549222, 656239, 2991942, 4735725, 5524621, 5947743, 6739695, 7845883, 8139006, 7025745, 6004608, 6822732, 8269602, 7373563, 4242936, 2750701, 5063851, 8307691, 8636091, 6089725, 3031793, 175437, -2700643, -3910007, -1456818, 3238293, 6608213, 7668469, 8298758, 8997818, 8035727]
42668H035727k457281n64183L176367L736107k66376m569918m943778j779921
42660C66744J819951L956982M607895M117792K556847J25897k462603l972582
42652A1116923l352103r82156J266528J923801J320260M74629m13154j297938
42644A0056790j264865J64975J471136P60389j404666k631056j985986q42466
42636D324251m09513k68163K56425Q98807J202101J160141O32008o53995k006959
42627E135103j871367K64121K845546L721165K181615n74342k448465k063261
42619G190115j42448R46225j39740j960667k303720j284620p85240j278390j358795
42610a117280m51647L00163L03954M11755Q00851K40792j411333k201196j039716
$$ y = [8035727, 5578446, 5014263, 8190630, 11926737, 11660361, 7090443, 2146665, 366744, 2186695, 6143677, 10751572, 14869364, 17426211, 17552108, 15089505, 11116923, 7764820, 6782664, 8049192, 9972993, 11293253, 11767882, 11354728, 10056790, 8791925, 8956900, 10428036, 11188425, 9783759, 7152703, 5166717, 4324251, 3914738, 3646575, 3903000, 4801807, 6003908, 7164049, 7796057, 7142062, 5135103, 3263736, 3527857, 6373403, 10094568, 12276183, 11701841, 9253376, 7190115, 7047667, 7993892, 7854152, 5893485, 3589765, 2305145, 1519905, 241515, -1117280, -1568927, -1268764, -964810, -553055, 247796, 488588, -922745, -3123941, -4163657]
42601d163657L82104M01483J42127J261648K627732J952324k59777j202753J13593
42592A254824J762245J938552Q60954n24277j607684j561347K08214K456046K830217
42583G617744R82355p43597o10444J57061m89258k269113l033198j614314J082678
42574A079914L385862M132252K941627L26922k332957l615270l117139j567188
42566A234023k8746Q01060P39488n3314j285617k559268l246717k765974j342231
42557h507296r2611K39060K61048Q92993J776977J859546J320539J444711K365751
42548A560718K525634J122119l06188P4374J703357K306167Q00787j648508l275883
42539D862577l377737k334749q66976M40874J314027J717461J570466P40961n03682
$$ y = [-4163657, -3781553, -3380070, -3237943, -1976295, 651437, 2603761, 2343984, 1141231, 1254824, 3017069, 4955621, 5816575, 5292298, 3684614, 2123267, 2331481, 4787527, 7617744, 8600099, 7856502, 7246058, 7403119, 6913861, 4644748, 1611550, -2764, 1079914, 4465776, 8598028, 11539655, 11866577, 9533620, 5918350, 2801211, 1234023, 1205277, 2006337, 2745825, 2692511, 1406894, -1152374, -4399091, -7165065, -8507296, -8599907, -8360847, -8099799, -7206806, -5429829, -3570283, -2249744, -805033, 1560718, 4086352, 5208471, 4902283, 4976657, 6680014, 8986181, 9786968, 8138460, 4862577, 1484840, -849909, -1716885, -1276011, 38016, 1755477, 3325943, 4066904, 3563222]
42530C563222j360970j146098L0257J318880J664859M63199j712131l094441k277522
42521b550745O4272J850790K094233J616514J107959J10865j252575j308147P57283
42512B490449K770642J952900j157622l236130k471750l35607J090609J508752
42504B612243J504292J113107L73253o1507Q779k54247j155769j438510k03932
42495B497709J146783P65412l83621N49778L701560N161798J817730m047861p200222
42486D009066n805900k895198j425504p24945Q10949K118909J307385m23312q0559
42477c109109K194661K928525P06493j536444j143671L55445K84419p56500n25654
42468f01835N49943J09818j922775l159761k570917j430045l62941J475375L694559
$$ y = [3563222, 2202252, 1056154, 1086411, 2405291, 4070150, 4533349, 2821218, -273223, -2550745, -2486473, -635683, 1458550, 3075064, 4183023, 4293888, 3041313, 1733166, 2490449, 5261091, 7213991, 6056369, 2820239, 348489, 12882, 1103491, 2612243, 4116535, 5229642, 5602895, 5541388, 5550167, 5295920, 4140151, 2701641, 2497709, 3644492, 4409904, 4026283, 4576061, 8277621, 13439419, 15257149, 11209288, 4009066, -1796834, -4692032, -6117536, -6842481, -6031532, -3912623, -2605238, -3028550, -3109109, -914448, 2014077, 2720570, 1184126, 40455, 395900, 680319, -76181, -601835, -51892, 57926, -1864849, -5024610, -7595527, -9025572, -9388513, -7913138, -4218579]
42459d218579M050925J678148j337607k677754k126785m54437J767374L276707
42451d2008K457248p1405j397263l18078Q19459k8955j265809m60893J553254
42442A245550K208352J376439J033407J617497J699291R25517M34189K64750r29314
42433I875678l037318l770904j796040J185094K541408J663988o1226j260378
42425E340302j714933k009545k560508k880172j993881Q8630J908709K253674
42417a567724J637577J198748R49633L52265j91254j0745K84053l16399j195685
42408A140469q09905P63162J780961J330094K18459n47287n87065K75407J526859
42399E091154J514943m45962k066383p83236J901601J973804j067884l347088
$$ y = [-4218579, -167654, 1510494, 172887, -2504867, -4631652, -5086089, -3318715, -42008, 2415240, 2343835, 946572, 628494, 1447953, 1418998, 153189, -307704, 1245550, 3453902, 4830341, 5863748, 7481245, 9180536, 10106053, 10540242, 10804992, 9875678, 6838360, 3067456, 1271416, 2456510, 4997918, 6661906, 6600680, 5340302, 3625369, 1615824, -944684, -3824856, -5818737, -5730107, -3821398, -1567724, 69853, 1268601, 2218234, 2570499, 2379245, 2368500, 2652553, 2336154, 1140469, 330564, 1093726, 2874687, 4204781, 4423240, 3875953, 3288888, 3564295, 5091154, 6606097, 6160135, 4093752, 3310516, 5212117, 7185921, 6118037, 2770949]
42391B770949k600151j186458j410675j658242M3352J850942J046135j120489
42383b264637j293300O89928K005834J510415O93322L69331j60792n55737O68476
42374A662840L010453L639048J294715j743590k802226k094975j608475k109748
42366g51958k574737j870965r9951J472674J674243R79342J324551L463022N199377
42357H815598L849867J03070k491726k034308m04090l49341k053477l392472k522326
42348d79205L54235L001193K866314k12930l208062l079194m18895J694816J998700
42339B516972J898791K170775J693830J78700o81444j26361J18229j176152k526542
42330D066798k374941j723598j908600j770015K46056K678631K717609M71975
$$ y = [2770949, 170798, -1015660, -2426335, -4084577, -4041225, -2190283, -1144148, -2264637, -3557937, -2868009, -862175, 648240, 1341562, 1710893, 1550101, 994364, 1662840, 4673293, 8312341, 9607056, 7863466, 5061240, 2966265, 1357790, -751958, -3326695, -5197660, -5297611, -3824937, -2150694, -1171352, 153199, 3616221, 8815598, 12665465, 12768535, 10276809, 8242501, 7838411, 7489070, 5435593, 2043121, -479205, -124970, 2876223, 5742537, 5529607, 2321545, -757649, -1176544, 518272, 2516972, 4415763, 6586538, 8280368, 8459068, 7777624, 7651263, 7769492, 6593340, 4066798, 1691857, -31741, -1940341, -3710356, -3464300, -785669, 1931940, 2403915]
42322B403915j164351n00012J461870L097215L504573K290335K71179k29791J747327
42313A2882260L363390J393038k458450l274084j25657K405392R86291k105041
42305A3067139l352129l115200l463673l763046k019807J035208K699734K358193
42297C446419J815510K047107K259546J864519R60233q37270l644791n693183
42289B218090m966322k317070m00407L80242J972512M541300N507070L662534
42281A0597949J152493p8128q89021k214846k654616j267453k35226j671683l706676
42272i67207l146895o91087J96231j030732j301207Q25645K863708K485805R26653
42263A60914O88875J976764K983333K305912J9094k419837k848032n53577J998355
$$ y = [2403915, 1239564, 739552, 2201422, 5298637, 8803210, 11093545, 11364724, 11134933, 12882260, 16245650, 17638688, 15180238, 11906154, 11780497, 14185889, 15172180, 13067139, 9715010, 6599810, 3136137, -626909, -2646716, -1611508, 1088226, 3446419, 5261929, 7309036, 9568582, 11433101, 12393334, 11556064, 7911273, 2218090, -2748232, -5065302, -5465709, -5085467, -3112955, 1428345, 6935415, 10597949, 11750442, 11672314, 10783293, 8568447, 5913831, 4646378, 4411152, 2739469, -967207, -4114102, -4805189, -4608958, -5639690, -6940897, -6115252, -3251544, -765739, 160914, 849789, 2826553, 5809886, 8115798, 8134892, 5715055, 2867023, 2313446, 4311801]
42254D311801J667662q83479j945577n73794p6147k034689k815255O11432M652460
42245B914414L584594j737377m771604k527857J037144J689381M36665L96713
42237A022073J740359K444491J814538P36464k06166q81021q97879k89888J74
42228E483145n21428j043219q92776o61196r74608j442206j717283k111969k198567
42219f080107n89359K548145M549193L503802Q69520q50178j303986j211265j7727
42210A418038K659333M716475L777570Q67460j039221j305014j338419q72716
42202H883506J604351M860292N547542L498169K255856L086959K763185n55290
42194C1944570l485897k756611p24035j333519l331851k552553N32481J081517
$$ y = [4311801, 5979463, 5095984, 3150407, 2576613, 2500466, 465777, -2349478, -1738046, 2914414, 6499008, 4761631, -9973, -2537830, -1500686, 188695, 625360, 1022073, 2762432, 5206923, 7021461, 7757925, 7551759, 6670738, 5772859, 5482971, 5483145, 4961717, 3918498, 3025722, 2364526, 1389918, -52288, -1769571, -3881540, -6080107, -6669466, -4121321, 427872, 3931674, 4801194, 3951016, 2647030, 1435765, 1418038, 4077371, 8793846, 12571416, 13438876, 12399655, 11094641, 9756222, 8883506, 10487857, 15348149, 20895691, 24393860, 26649716, 29736675, 32499860, 31944570, 28458673, 25702062, 24978027, 23644508, 20312657, 17760104, 18292585, 19374102]
42186A9374102k135528m287271j772934K282865K648456p43754l343239k400518
42178I622179Q3808O38799j511994l968999l827503n75381L308090M755160L144982
42169A1669141M38698j503042k511499k863167k141028l41583J237517J554120
42161E539157J293227J461832J492640M04531r07426o16974R32078J172572j114599
42152I657038l910154m485205k490832L55409K446165L045028J913354l50983
42144F179820k052017j857640m87804J63338l96026p20644K48293J535580J650884
42135D263784R24648J065371K500888L405987J979842j076216l266373l231883
42127F566048k053861j526603k021783k511892j990016k40742K193864M054158
$$ y = [19374102, 17238574, 12951303, 11178369, 13461234, 16109690, 15365936, 12022697, 9622179, 9705987, 10344786, 8832792, 4863793, 1036290, 460909, 3768999, 8524159, 11669141, 12107839, 10604797, 8093298, 5230131, 3089103, 2747520, 3985037, 5539157, 6832384, 8294216, 9786856, 10191387, 9283961, 8666987, 9599065, 10771637, 9657038, 5746884, 1261679, -1229153, -873744, 1572421, 4617449, 6530803, 6179820, 4127803, 2270163, 1782359, 1945697, 1549671, 829027, 1077320, 2612900, 4263784, 5188432, 6253803, 8754691, 12160678, 14140520, 13064304, 9797931, 6566048, 4512187, 2985584, 963801, -1548091, -3538107, -3778849, -1584985, 2469173]
42119B469173L923986J746123n69693j085972p3960Q01564J027300J291141J298641
42110A0828303j05254k225625k579886q76849j98106k128541l418016p93692K991381
42101A493715K407485k247422m483529q34226M250713N098230K477484J093268
42093I255718K148413K579176O50959j531510j405041Q00046K765480K506291
42085A7769532L8688k297275j848743Q92406K227684L23771j560926L10592M073276
42076A9929005M693062J552047r67818n85991P5985r93402j785840p84873m05094
42067B0727081k492817m153553k236872R41174R99773j473070k233042m54061
42059I624613O86967J24938L21045J908290K024815l10926j702913K77091L006512
$$ y = [2469173, 6393159, 8139282, 7569589, 6483617, 6409657, 7211221, 8238521, 9529662, 10828303, 10723049, 8497424, 5917538, 5040689, 4842583, 2714042, -703974, -1497666, 1493715, 3901200, 1653778, -2829751, -3663977, 586736, 5684966, 8162450, 9255718, 11404131, 13983307, 14634266, 13102756, 11697715, 12497761, 15263241, 17769532, 17808220, 15510945, 13662202, 14554608, 16782292, 17106063, 15545137, 15855729, 19929005, 24622067, 26174114, 25206296, 24620305, 24696290, 23702888, 21917048, 21132175, 20727081, 18234264, 14080711, 11843839, 12785013, 13784786, 12311716, 10078674, 9624613, 10311580, 10436518, 10757563, 12665853, 14690668, 14379742, 12676829, 12953920, 15960432]
42050A5960432K907444N45363j306551j998877k223757j258932J418980L508879
42042A7552981K665296P66532J493645M216831M431488O10668l387451l956138
42034B4393852k242142j191193j146529q53155n45257j130992j617256k36153
42026A5431175K287885L137205J268493j172618j879650j206098j033527j867236
42018A4965629k238395q82970J250764J713748n51585l425266l581109m69196
42010F781620K660580K473805n52082l096342l257082k251519j813367j574987
42002f29374k5850K790948M726002L779303M70893k287349j919156J046946L314179
41993A1266542K371313p64070l079991l194622k086553o64698J222126K872517
$$ y = [15960432, 18867876, 19413239, 18106688, 16107811, 13884054, 12625122, 14044102, 17552981, 20218277, 20984809, 22478454, 26695285, 31126773, 31737441, 28349990, 24393852, 22151710, 20960517, 19813988, 18960833, 18415576, 17284584, 15667328, 15431175, 17719060, 20856265, 22124758, 20952140, 19072490, 17866392, 16832865, 14965629, 12727234, 11844264, 13095028, 14808776, 14257191, 10831925, 7250816, 6781620, 9442200, 11916005, 11363923, 8267581, 5010499, 2758980, 945613, -629374, -655224, 2135724, 6861726, 10641029, 11111922, 8824573, 6905417, 7952363, 11266542, 13637855, 12873785, 9793794, 6599172, 4512619, 3847921, 5070047, 7942564]
41985G942564K226214j056476l782264k822226M47793J850640K38555j105344
41977C939456N68716L660539M732421K935107K09652j625438k143358j430973
41969A0846122K19285J886015K629801K450263J723516K55735j861307l146621
41961A5002809k280574m15711J61882l15231O74333L309415L870127o8526n028390
41952A4910134n328122o04698L581746L023606k17538j570582k37990P28585m31279
41943A3853862j718334n93675K210775L466739J401740k308773m562123m015746
41935G734465j863388j1897P35359P44681O63622R46648J739189K602539K635983
41926A5927201J498212J23806k02853O70183J832975K559279K557787J288656
$$ y = [7942564, 10168778, 9112302, 5330038, 2507812, 2955605, 4806245, 5044800, 3939456, 4508172, 8168711, 12901132, 15836239, 16045891, 14420453, 12277095, 10846122, 11065407, 12951422, 15581223, 18031486, 19755002, 20010737, 18149430, 15002809, 12722235, 12306524, 12468406, 12153175, 12827508, 16136923, 20007050, 19938524, 14910134, 9582012, 8977314, 12559060, 15582666, 15365128, 13794546, 13556556, 14285141, 13853862, 12135528, 11541853, 13752628, 17219367, 18621107, 16312334, 11750211, 7734465, 5871077, 5859180, 6594539, 7339220, 8002842, 8949490, 10688679, 13291218, 15927201, 17425413, 17549219, 17346366, 18016549, 19849524, 22408803, 24966590, 26255246]
41918B6255246j487759m244680m472051j907301M22601j80998k462203k932919
41910H989936o01053J977384K299698O64192j025774j433302j30127K537061M925171
41901A8203186M919279K532709M43413N64233J317601J28170k412827l289469
41893B2406295j637901Q0685L1264l76214Q36614K942680L808739L093997K007965
41884C3194124O97592j726964m611275n539135l468947l67373J278634J265422
41876B0722078R83656J157513J557699K008492K193763J145779j364825l246389
41868B5157766j820165K523840O104988O136977L786948K216015K859822M795259
41860E1761450O660944P646730P241754N722878M796224O210732R471603J2160127
$$ y = [26255246, 24767487, 20522807, 16050756, 14143455, 14566056, 14385058, 11922855, 8989936, 8388883, 10366267, 12665965, 13330157, 12304383, 10871081, 10740954, 13278015, 18203186, 23122465, 25655174, 26098587, 26662820, 27980421, 28108591, 25695764, 22406295, 20768394, 20849079, 20880343, 20504129, 21340743, 24283423, 28092162, 31186159, 33194124, 33891716, 32164752, 27553477, 22014342, 18545395, 18178022, 19456656, 20722078, 21705734, 22863247, 24420946, 26429438, 28623201, 29768980, 28404155, 25157766, 23337601, 25861441, 31966429, 38103406, 41890354, 44106369, 46966191, 51761450, 58422394, 66069124, 73310878, 79033756, 83829980, 90040712, 99512315, 111672442]
41852A11672442J2844824J2554700J2938199J4001589J4298406J2603564Q807337
41845A99721061L715516j541817o268578j0509812j4125742j5875419j4693275
41838A40421934j1941703j0634996j1588035j2035416r563452n966594m956538
41831G3735200o657356o956531k942716K989587N810223L699729p5896j041483
41823F8560757J612964M506641M222453J252202r37333l40189J621745K946948
41815H3446188L976711N955329Q137752Q651086P700356P577284R416559J2069201
41807A46930466J4469165J6934828J9471756K0928619K0939879K0817389K1084750
41800B81576852J9679257J4310153N678644l069113r387522j2770649j4124090
$$ y = [111672442, 124517266, 137071966, 150010165, 164011754, 178310160, 190913724, 199721061, 203436577, 201894760, 195626182, 185116370, 170990628, 155115209, 140421934, 128480231, 117845235, 106257200, 94221784, 84658332, 78691738, 73735200, 67077844, 60121313, 57178597, 60168184, 65978407, 69678136, 69602240, 68560757, 70173721, 74680362, 78902815, 80155017, 79217684, 78877495, 80499240, 83446188, 87422899, 93378228, 101515980, 110167066, 117867422, 125444706, 134861265, 146930466, 161399631, 178334459, 197806215, 218734834, 239674713, 260492102, 281576852, 301256109, 315566262, 321244906, 318175793, 308788271, 296017622, 281893532]
41793B81893532j4978071j6546028j8353485j8485890j6190328j3255173j1642924
41786A72441633j0922421r626730q056529p645195q131067p625953n573604l712601
41778A11147533l683891n126741o504713o634697n174604k692866m79290N24979
41770H1375710N49763J30045q53722k153398k151692K94621L667154N520386N876920
41761I2255787O426084O677736M129025j041882m627651l430928P24635L819482
41753A04932288M418629L692792K606158J590058J825178M235569P494549R018721
41745A39813942P902000N460217L150540J302433l43297k091214m183057o393463
41737A44618101q071229r134479j0176249j0954287j0150426p708233n764266
$$ y = [281893532, 266915461, 250369433, 232015948, 213530058, 197339730, 184084557, 172441633, 161519212, 151892482, 143835953, 136190758, 128059691, 120433738, 114860134, 111147533, 107463642, 102336901, 95832188, 89197491, 84022887, 81330021, 80850731, 81375710, 81925473, 82055518, 81201796, 79048398, 76896706, 77191327, 80858481, 86378867, 92255787, 98681871, 105359607, 109488632, 108446750, 103819099, 100388171, 101112806, 104932288, 109350917, 113043709, 115649867, 117239925, 119065103, 123300672, 130795221, 139813942, 147715942, 153176159, 156326699, 157629132, 157285835, 155194621, 151011564, 144618101, 136546872, 127412393, 117236144, 106281857, 96131431, 88423198, 82658932]
41730H2658932n575631n179229k436779J010046J788875p7632j475423j398312
41722F9314847k119709m470841n694936l837833j159852o46058j463324q17193
41714D9105101J247609K134973J197364P90305K366617M099777L621069J423919
41706F5986734K0308M89792J285559M93080j678173l167170k533171o17582M63829
41697F0743206l47841k127188l133408k334712P5963K812147L915597J961458
41689F1565222k409730o516195p819306o138773l636074k811005m374507o537329
41681B1322303o469715l242437O92851K005537N90417l13816J243682K960057
41673A8788879J618046j915546l521475j456652J404196J777931K55789k84651
$$ y = [82658932, 77083301, 71904072, 69467293, 70477339, 72266214, 72188582, 70713159, 69314847, 67195138, 62724297, 57029361, 53191528, 52031676, 51385618, 49922294, 49105101, 50352710, 52487683, 53685047, 54475352, 56841969, 60941746, 64562815, 65986734, 66007042, 66496834, 67782393, 68275473, 66597300, 63430130, 60896959, 60279377, 60743206, 60395365, 58268177, 55134769, 52800057, 52876020, 55688167, 59603764, 61565222, 59155492, 52639297, 44819991, 38681218, 35045144, 32234139, 27859632, 21322303, 14852588, 11610151, 12303002, 14308539, 14898956, 14585140, 15828822, 18788879, 20406925, 18491379, 14969904, 13513252, 14917448, 16695379, 16951168, 16666517]
41665A6666517Q70696J613206M49321j532584k652079k847564k785345k085698
41657G696470j30198J982861K273709Q65892K33699J618535K923930J707078j034646
41648A8137330k156276q43515N31986K12956n51149J35514J840747K599008J613787
41639B1520388j46981j378595j347193Q3192K249647L794034L787884K578343
41631C1140719J109848n5907o44156m64138O516k91856j507407k370821k098888
41622B4823910j746940k443840l367810l098339k070391j756143k082334j851240
41614F406873j305562j754814k641648j767241R22967K607460J925574J305459
41606E699068K915635M706847L407319q5723j717383k47934J177445R4796j600568
$$ y = [16666517, 17537213, 19150419, 19599740, 18067156, 15415077, 12567513, 9782168, 7696470, 7566272, 9549133, 11822842, 12688734, 12922433, 14540968, 17464898, 19171976, 18137330, 15981054, 15137539, 15669525, 15882481, 15331332, 15466846, 17307593, 19906601, 21520388, 21373407, 19994812, 18647619, 18730811, 20980458, 24774492, 28562376, 31140719, 32250567, 32194660, 31550504, 31086366, 31092882, 30801026, 29293619, 26922798, 24823910, 23076970, 20633130, 17265320, 14166981, 12096590, 10340447, 8258113, 6406873, 5101311, 3346497, 704849, -1062392, -139425, 2468035, 4393609, 5699068, 8614703, 13321550, 16728869, 16643146, 14925763, 14677829, 15855274, 15950070, 14349502]
41597A4349502o78162K714835N389067N232716L207631J513531J232752K006340
41589C4968212K996981L579975L426564K401462O29268j321996k692476l387090
41581D0600900m232548n584787n990072l696109J93906J922781k35120l059249
41573A9919702k340933J185343K740372L78058k269127j519507R70668R63799
41565B0028375k101662m815556m969719l736244k559304j092574P08990J233609
41557B695915k36136j607424o46309J759720K984926K393607J687326J936455
41549A0968080K121608Q46691j659483l552188l029642l22020J878809J104420
41541H356275j415590j762423J156866L306212Q40733m164708o252827l692309
$$ y = [14349502, 13671340, 16386175, 21775242, 27007958, 30215589, 31729120, 32961872, 34968212, 37965193, 41545168, 44971732, 47373194, 48002462, 46680466, 43987990, 40600900, 36368352, 30783565, 24793493, 21097384, 21291290, 23214071, 22978951, 19919702, 17578769, 18764112, 21504484, 21882542, 19613415, 18093908, 19064576, 20028375, 17926713, 13111157, 8141438, 4405194, 1845890, 753316, 1462306, 2695915, 2459779, 852355, 206046, 1965766, 4950692, 7344299, 9031625, 10968080, 13089688, 13936379, 12276896, 8724708, 5695066, 5373046, 7251855, 8356275, 6940685, 5178262, 6335128, 9641340, 10482073, 6317365, 64538, -3627771]
41533c627771J81260K118409J987003P18194j088011j784610N73898M764180O755053
41524A0597605N004629K396264J295059P6127k904800n103882l204517J304251
41516I460736L771226K542229M8326j545694k375145k722640k024180m91959O80200
41507G343099J069606J059048L66163j242863k189321p76440J433174R62193k423867
41498E600792m928301l976893j359486J22801L31231L55981q4643j526604k786763
41489h251885k368222p22778P06861J627134K391541K465683J217958n68962j619850
41480e122520j836863j594744m55991J554124K432289M17234k646931k797425
41472a0050827P02221L766130K408629k250903n338788l895155J27198K592347
$$ y = [-3627771, -3446511, -1328102, 658901, 1377095, 289084, -1495526, -921628, 3842552, 10597605, 15602234, 17998498, 19293557, 19369684, 16464884, 11361002, 8156485, 9460736, 13231962, 15774191, 15822517, 14276823, 11901678, 9179038, 7154858, 6662899, 7343099, 8412705, 9471753, 9837916, 8595053, 6405732, 5629292, 7062466, 8024659, 5600792, 672491, -3304402, -4663888, -4541087, -4209856, -3853875, -3938518, -5465122, -8251885, -10620107, -11342885, -10636024, -9008890, -6617349, -4151666, -2933708, -3502670, -5122520, -6959383, -8554127, -9010118, -7455994, -5023705, -4606471, -7253402, -10050827, -9348606, -5582476, -3173847, -5424750, -10763538, -14658693, -14531495, -11939148]
41464a1939148J980032O81587J519416L944239M835083K788630q4188j247843
41456B477808r63777j074061j853176j949550q61727M12703J085011J281574J022380
41447d22815J17083o90452q8910J737824K855481K174584J017710R74714J193199
41438H868418n58695m224196o441504m183515J252229N228472M974872K480083
41430G396164J171922J055953n07313l574913m448422j161720K691827K367158
41422D990656j517387m028871k639345L97208K252145K670582K123616L1229l368984
41413I10849n638560m686692j451220J434602K504232J839788N0472j621736j419859
41404h078124R51313L207933K885691L46110j830881j834640J35563K799565M550052
$$ y = [-11939148, -9959116, -9277529, -7758113, -3813874, 1021209, 3809839, 3725651, 2477808, 1514031, 439970, -1413206, -3362756, -4224483, -3811780, -2726769, -1445195, -422815, -305732, -996184, -1085094, 652730, 3508211, 5682795, 6700505, 7675219, 8868418, 8309723, 4085527, -2355977, -6539492, -5287263, -58791, 4916081, 7396164, 8568086, 9624039, 9116726, 5541813, 1093391, -68329, 2623498, 4990656, 3473269, -555602, -3194947, -2797739, -545594, 2124988, 4248604, 4279833, 910849, -4727711, -9414403, -10865623, -9431021, -6926789, -5087001, -5036529, -6658265, -8078124, -7126811, -3918878, -1033187, -687077, -2517958, -4352598, -4217035, -1417470, 3132582]
41395C132582L915100Q51031k578012l964128k831714m56155J771437K736694
41387B576835J458185j663068m054703l360882m57214J620197J554923P18934
41379a606793L96333K62954Q8124P60182K512704L771147L020702P04532j690013
41370H219872l283121l618855k176292N59678K539254K207078N70386j44771N77362
41361E450591J347827J224689O59853J01054o95458j451030r40046J186465L104374
41352I988319K624951p746k276749k441496j405035j061625j657265j806836p85675
41343A170843M91323J101136J469652K146486K241903O99002j281870j136099
41335F902376J225481K445789M5025l668194m048713K6968M826317O424039M693572
$$ y = [3132582, 7047682, 7898713, 5320701, 1356573, -1475141, -1931296, -159859, 2576835, 4035020, 2371952, -1682751, -5043633, -5500847, -3880650, -2325727, -1606793, -1210460, -947506, -859382, -99200, 2413504, 6184651, 9205353, 9909885, 8219872, 4936751, 1317896, -858396, -298718, 2240536, 4447614, 5018000, 4873229, 5450591, 6798418, 8023107, 8682960, 8784014, 8088556, 6637526, 5697480, 6883945, 9988319, 12613270, 12605524, 10328775, 7887279, 6482244, 5420619, 3763354, 1956518, 1170843, 1662166, 2763302, 4232954, 6379440, 8621343, 9320345, 8038475, 6902376, 8127857, 10573646, 10618671, 6950477, 2901764, 2928732, 7755049, 14179088, 18872660]
41326A8872660J926461n22059k474433l105301j367022J607313K684008M79385
41318A8101012k397668k381233M22078K369348J116711j453450k106556p22637
41310A2947605j53412j945740m032315l386793J75140L836365M826155K758432
41302A5025437n88883k769987k130579J013796M286997N234405L917851K820816
41294B6809853L610960M845797L987760J172090o54360K60918J796977N19135
41286D2349130l779340p588095p840352n274860k977666k518860k703394j883831
41278G782732k15998R20028R07563L86583K7621k39698n74906o18000j01180M62872
41268H737617M50894K01824N52476J350819J439438M48656l76811J19317J194251
$$ y = [18872660, 20799121, 20277062, 17802629, 14697328, 13330306, 14937619, 17621627, 18101012, 15703344, 13322111, 13744189, 16113537, 17230248, 15776798, 13670242, 12947605, 12794193, 10848453, 6816138, 3429345, 3604485, 7440850, 12267005, 15025437, 14436554, 11666567, 9535988, 10549784, 14836781, 20071186, 23989037, 26809853, 30420813, 35266610, 39254370, 40426460, 39772100, 40033018, 41829995, 42349130, 38569790, 30981695, 23141343, 17866483, 14888817, 12369957, 9666563, 7782732, 7566734, 8486762, 9394325, 9780908, 9808529, 9568831, 8993925, 8375925, 8274745, 8737617, 9188511, 9390335, 9942811, 11293630, 12733068, 13181724, 12804913, 12924230, 14118481]
41259A4118481J106699m39544j693731q03514K163558N135662N707269L324348
41251B8619228K50812l59858J800075L206215O49126m244503o556462m077027
41243A9287606L15492K648810K008824k06019k858210n121045n708253m235183
41235F132022k334044j506942q70205R53828K786691K328434L3372j348340j085911
41226E088905j291210k797711l256588q22426K783610M778500M832970M005265
41218A3321315K034083j591583m980054n277003k684259m25339k84150n65210
41210d52200N73416J940507J207722j345688l051057k477674j003264m42711o71111
41201e722060n11176J71103O62659J108518K294662L654343L379932J335899J2193
$$ y = [14118481, 15225180, 14785636, 13091905, 12288391, 14451949, 19587611, 25294880, 28619228, 28870040, 28510182, 30310257, 33516472, 34165598, 29921095, 23364633, 19287606, 19603098, 22251908, 24260732, 24054713, 21196503, 16075458, 10367205, 6132022, 3797978, 2291036, 1420831, 2374659, 5161350, 7489784, 7523156, 6174816, 5088905, 3797695, 999984, -2256604, -3079030, -295420, 4483080, 9316050, 13321315, 15355398, 13763815, 8783761, 3506758, 822499, 397160, 113010, -452200, 121216, 2061723, 3269445, 1923757, -1127300, -3604974, -4608238, -5050949, -5722060, -6233236, -6062133, -5399474, -4290956, -1996294, 1658049, 5037981, 6373880, 6386073]
41192F386073J016784K286881J203261p41915J94202L565587M158609n50403n957820
41183A1561259o330270k596137k52797r90201j038877J871470M426627K699038
41175I350112j966221m857845l893004j015875J267689J990231Q05520k127126
41167d46519m717118l814485J047034O200731P561048M894386J183116j292126
41159A0616067k559955l203976l073970k129407r32853L59050K139159L816781
41151E030896L675831J387398p65785p25000M74251N34086m24885m11024P17707
41142I493475Q64963o71543j885439j321183k20742n0382n9771Q98284J888768
41133H936430J338887k46556j070264p08784j13984L01320O55511K77517j550199
$$ y = [6386073, 7402857, 9689738, 10892999, 10151084, 10345286, 13910873, 18069482, 17519079, 11561259, 5230989, 2634852, 2382055, 1391854, 352977, 2224447, 6651074, 9350112, 7383891, 2526046, -1366958, -2382833, -1115144, 875087, 1680607, -446519, -5163637, -8978122, -7931088, -1730357, 5830691, 10725077, 11908193, 10616067, 8056112, 4852136, 1778166, -351241, -1284094, -925044, 1214115, 5030896, 8706727, 10094125, 9328340, 8603340, 9077591, 9611677, 9186792, 8775768, 9493475, 10358438, 9686895, 7801456, 6480273, 6259531, 6209149, 6149378, 7047662, 8936430, 10275317, 10028761, 8958497, 8249713, 8135729, 8437049, 9092560, 9370077, 7819878]
41124G819878l756894m316972k938341j236066k22198O42173J676153J977181
41116c55086Q65009p82765j224288O16777M110900O660998N216353l36703n601285
41107I169910n466975P1048N473595N691662J393898k509817k516456J79685J631497
41098A3118047k26559l188242l515400q95181R82003l77310k642692k365287l54998
41089E34381K2901j208558o71574K208873L572210J206169j739615j605902N34829
41080B853714J546565J442423K300610L743287L378444J092310o12833n91499
41072A5153021l32480q74870j150803k45363Q38595P26954n10567j938603k943353
41063H722531l143910k190115l95694J142476J600875J126636L18949l58851n79101
$$ y = [7819878, 4062984, -253988, -3192329, -4428395, -4650593, -4008420, -2332267, -355086, 509923, -272842, -1497130, -880353, 3230547, 9891545, 15107898, 14771195, 9169910, 3702935, 3773983, 9247578, 14939240, 16333138, 13823321, 11306865, 11486550, 13118047, 12891488, 9703246, 6187846, 5292665, 6274668, 5897358, 3254666, 889379, 534381, 557282, -651276, -1322850, 886023, 4458233, 5664402, 3924787, 2318885, 2853714, 4400279, 5842702, 8143312, 11886599, 15265043, 16357353, 15744520, 15153021, 14820541, 13945671, 12794868, 12549505, 13388100, 14115054, 13604487, 11665884, 8722531, 5578621, 3388506, 2992812, 4135288, 5736163, 6862799, 7181748, 6822897, 6243796]
41054F243796l41279l50115j427869l207276m056360k824607l85697J007114P765
41045e334528k277431l257120j596492J229758K599012J724436K02507k67824
41037f977682M04352J383113J969771J519124l68051k794758l875875k915315
41029a1655321j174566K24181J694969L453517M042139K295946m11742j765145
41021c296022j564129j426628k070767k639005k315404j074829P58352K331015
41013a1297417K299788N42968r28211m53043O96353K09151j467245j573112Q86818
41004a1083950L765404M683491L424074J186264q60391j998599k263730k357546
40996e504983k332782j163228J094739K201438R96791J45394K356010N077593
$$ y = [6243796, 5902517, 5552402, 4124533, 917257, -3139103, -5963710, -6349407, -5342293, -5334528, -7611959, -10869079, -12465571, -11235813, -8636801, -6912365, -6709858, -6977682, -6573330, -5190217, -3220446, -1701322, -2069373, -4864131, -8740006, -11655321, -12829887, -12605706, -10910737, -7457220, -3415081, -1119135, -1530877, -3296022, -4860151, -6286779, -8357546, -10996551, -13311955, -14386784, -13628432, -11297417, -8997629, -8454661, -9382872, -9835915, -9139562, -8930411, -10397656, -11970768, -11083950, -7318546, -2635055, 789019, 1975283, 1114892, -883707, -3147437, -5504983, -7837765, -9000993, -7906254, -5704816, -4708025, -4562631, -2206621, 2870972]
40988B870972L276902k602542o188019l889414L60535J282691o82964j525511
40980g097350K0935J780370K116403J516929R57953R25034J477666J786119N37765
40971D021824j961714l401430k449207n93238L73766R48238K232350L302613K381961
40962D855163m06449l200523m385928l208323J28838L608179M341154J945232
40954C677343p35991j719918k382223l986945m536160k079838J217843J967009
40946h578880P43641N10059J228429L96641j643361j463802J906741N095245M986173
40937C180886K075129j537832m526673n876613m831373k335765l77075N96985
40929a3632331J488446J953018Q42559p84156m23108J721183K795565K037932
$$ y = [2870972, 6147874, 3545332, -2642687, -6532101, -6171566, -4888875, -5571839, -7097350, -7076415, -5296045, -3179642, -1662713, -704760, 220274, 1697940, 3484059, 4021824, 2060110, -1341320, -3790527, -4383765, -4009999, -3061761, -829411, 2473202, 4855163, 4448714, 1248191, -3137737, -6346060, -6217222, -2609043, 1732111, 3677343, 2941352, 1221434, -1160789, -5147734, -9683894, -11763732, -10545889, -8578880, -7835239, -7325180, -6096751, -5700110, -7343471, -8807273, -6900532, -1805287, 3180886, 5256015, 3718183, -808490, -6685103, -11516476, -13852241, -14229316, -13632331, -12143885, -10190867, -9348308, -10132464, -10555572, -8834389, -6038824, -4000892]
40921d000892J612794J830429j5063m089749n773993k175124K758043L480614
40913f372941M93749j345969k34963J144419P13446m93587r65924o34470K54746
40904g441494J663347K729786K257468O11320n26920n21393m25060j049188j667568
40895d369702j011456J137099L445489L941048J954945p37824j727763r48899
40887A682937k81008k18243N08039J438421q7946m161349o498133m206917k98300
40878a2122499R32155P6929O9409L33302j184007k224751J068987O289979O520889
40869b39607R07786l278278j459092J775966P08765k647245k793121L05674K209749
40860d509403J439097L92862J37660o07907j660616j105163Q75106J756866P95489
$$ y = [-4000892, -2388098, -557669, -572732, -4662481, -10436474, -12611598, -9853555, -6372941, -5879192, -7225161, -7460124, -6315705, -5602259, -6095846, -7061770, -7696240, -7441494, -5778147, -3048361, -790893, -179573, -706493, -1227886, -1652946, -2702134, -4369702, -5381158, -4244059, -798570, 3142478, 5097423, 4359599, 2631836, 1682937, 1401929, 1183686, 1691725, 3130146, 3042200, -1119149, -7617282, -11824199, -12122499, -11190344, -11113415, -11044006, -10710704, -11894711, -14119462, -13050475, -6760496, -239607, 668179, -2610099, -4069191, -2293225, -1584460, -4231705, -7024826, -6719152, -4509403, -3070306, -2677444, -2539784, -3147691, -4808307, -5913470, -5038364, -3281498, -2486009]
40851b486009K3926N28267Q73438J00291n99184l36734j21024o68763q13371L65987
40841c133176J579318J172725k38446o09469O44375J931046J578409j59398j400303
40832A365081p93257P96441J222876k14750j895726k224721j583568r05055J84565
40823d048114J991090K906486J474994o08131n55785Q80458K65805k766189m340057
40814d799443k181890Q35877J066511q89109k026035j440670k34939J232535L031522
40805e405641L792295K020641j300279l705559m194659l223915r23843K217824
40797a0723136L999067K777269M31449K0110J038569M83238j565973j593323J241843
40788c890887K909147O07373k604697k452075J0526L98289j883781k707230L43764
$$ y = [-2486009, -2462083, -1933816, -1060378, -960087, -1559271, -1896005, -2017029, -2685792, -3499163, -3133176, -1553858, -381133, -619579, -1229048, -584673, 1346373, 2924782, 2765384, 1365081, 571824, 1368265, 2591141, 2376391, 480665, -1744056, -3327624, -4232679, -4048114, -2057024, 849462, 2324456, 1716325, 1160540, 2040998, 2306803, -459386, -4799443, -6981333, -6145456, -5078945, -5968054, -7994089, -9434759, -9669698, -8437163, -5405641, -1613346, 407295, -892984, -4598543, -8793202, -12017117, -12940960, -10723136, -6724069, -3946800, -3515351, -3495241, -2456672, -1973434, -3539407, -5132730, -3890887, -981740, -374367, -2979064, -5431139, -5420613, -5022324, -6906105, -9613335, -9269571]
40779i269571M100038L923050l21124m202942l984914o04809J825755R51773j134884
40770h717628p28731K381250M133649J222985m396604p458471n238752q0336L660010
40761a5222628L824967J599684k51577J42294K199865L408839J970027r83803
40753c312332k554128j571628R5675K50838o71710n58849R83937J851713N37466
40744d949018j457555j660979k37978L35922q06429j496202j6379J930984J666868
40735f690766l25712j150047O7267J088045K75770j029305r20331K23804P81413
40726g679862M82469L84798R16252J271627O06550r25633k239328k173774o06412
40717i963313J256643K074229J510860k65263l064144n337124l968786J809197
$$ y = [-9269571, -5169533, -1246483, -1567607, -5770549, -9755463, -10360272, -8534517, -7582744, -8717628, -9446359, -7065109, -2931460, -1708475, -6105079, -13563550, -18802302, -18882638, -15222628, -11397661, -9797977, -10049554, -9907260, -7707395, -4298556, -2328529, -3312332, -5866460, -7438088, -7342413, -7091575, -7763285, -8322134, -7338197, -5486484, -4949018, -6406573, -8067552, -8305530, -7969608, -8776037, -10272239, -10288618, -8357634, -6690766, -7016478, -8166525, -8099258, -7011213, -6735443, -7764748, -8685079, -8461275, -7679862, -7197393, -6812595, -5896343, -4624716, -4018166, -4943799, -7183127, -9356901, -9963313, -8706670, -6632441, -5121581, -5386844, -8450988, -13788112, -17756898, -15947701]
40709a5947701P294617O858954J568484j929190p88468O91455r56377k458827
40701e667053P9191L651861K592000k316810m884707k554906J072715K486126
40693e541583J992027Q90273n14150j389236q40247m00418k192174m350336k650539
40684a4996383K637997O141570M846432J614982l20056j565869k917189k273681
40676f832197J270509M092904K783663n70575j618058L7591J507395J549542J102473
40667C323247K99655j428579l064235k950946j548560p19996r05239j212850j407308
40658i614811j548180o40043J948945M467288M447999J889370j000221k478190
40650b527843k202827p24899L74645o39117k948614l203374j80532K769300K372281
$$ y = [-15947701, -8653084, -1794130, -225646, -2154836, -2943304, -2251849, -3208226, -5667053, -5587862, -1936001, 655999, -1660811, -6545518, -9100424, -8027709, -5541583, -3549556, -2659283, -3173433, -4562669, -5402916, -5803334, -7995508, -12345844, -14996383, -12358386, -6216816, -1370384, 244598, -75458, -1641327, -4558516, -6832197, -5561688, -1468784, 1314879, 744304, -873754, -836163, 671232, 2220774, 3323247, 3622902, 2194323, -869912, -3820858, -5369418, -6089414, -6994653, -8207503, -9614811, -11162991, -11803034, -9854089, -5386801, -938802, 950568, -49653, -2527843, -4730670, -5455569, -5080924, -5720041, -8668655, -11872029, -12052561, -9283261, -6910980]
40641f910980J97928k69983R00395J264637Q70393J731094L378350L104924M46869
40632D713627k120790k825243j891945K04997K638170L215596R23773j395586
40624C462599o07605J463721N54439l085086n000892l483329j234395P263J328206
40615f595079K563263J684454n93947p92831J337559K031551L18756m5175K228918
40606B137469K768667j003272m741524l873414o35445M35063j50462O43024J956335
40597b463559R89499r84448l92638K170274K662167J93884j938915j698450n24271
40588a986457K0686J59242K19355L1096n485L24319r9843j730280k519394r46851
40578f533612P35842k27958k148565j335438J659002K852113J400646N63359J812876
$$ y = [-6910980, -6713052, -6983035, -6082640, -4818003, -3947610, -2216516, 1161834, 4266758, 4713627, 2592837, -232406, -2124351, -1919354, 718816, 3934412, 4858185, 3462599, 2854994, 4318715, 4873154, 1788068, -3212824, -6696153, -7930548, -7923285, -6595079, -4031816, -2347362, -2941309, -3734140, -2396581, -365030, -46274, -91449, 2137469, 4906136, 3902864, -838660, -4712074, -5347519, -4912456, -5062918, -4419894, -2463559, -1474060, -2458508, -2851146, -680872, 1981295, 2175179, 236264, -1462186, -1986457, -1965771, -1806529, -1587174, -1556078, -1561563, -1237244, -1337087, -3067367, -5586761, -6533612, -5797770, -6025728, -8174293, -9509731, -7850729, -4998616, -3597970, -3034611, -1221735]
40569a221735K612034J072687j200529k185789j958149j095994K34454Q27096
40561b915925o29078k462239j416559K010765L442575J055949j790297k037319
40553d742128j022628p65610o2317K438881M383022K767999j082120l223362k597538
40544c905801j564759j613592j622182m96581Q97638J134094K34476l16560P60346
40535f492921K834978L576815J685974r98713j704265o79899n30208j527975q71637
40526d707851K178413L868500J169496l266548m544293k154755J41277J0967j229243
40517h534037j831113j855688j565142j51642K604389M911034M596700J719545
40509a05954j321883k351875j656545j207090j769612j947675q58924j75865j389930
$$ y = [-1221735, 1390299, 2462986, 1262457, -923332, -2881481, -3977475, -3743021, -2915925, -3545003, -6007242, -7423801, -5413036, -1970461, -914512, -2704809, -4742128, -5764756, -6530366, -6592683, -4153802, 229220, 2997219, 1915099, -1308263, -3905801, -5470560, -7084152, -8706334, -9202915, -8305277, -7171183, -6936707, -7253267, -6492921, -3657943, -81128, 1604846, 606133, -1098132, -1778031, -2308239, -3836214, -4707851, -2529438, 1339062, 2508558, -757990, -5302283, -7457038, -7315761, -7304794, -8534037, -10365150, -12220838, -13785980, -13937622, -11333233, -6422199, -1825499, -105954, -1427837, -3779712, -5436257, -6643347, -8412959, -10360634, -11219558, -11395423, -12785353]
40500a2785353k301026L83800N159787O501273K655358j390085r74819J883575
40492h67490K344859j47739k436040l041200k892957k191276o25088K69000j018335
40483a0606266k415104p03472K800677L369116P2481k486240r48587K181586K726875
40474f008934N95800j010455j65141K066556L301351J967093j258193l641009
40466d152932l240779j426528p41057q33978N39212K726021K430481l76323j282054
40457f357937J602097L796772J099023l520918m259147j244146L07397j412354
40449i989213k711760j265642K13494p85461j951118M9749L953292N591409L726154
40440c169096Q51745j221688l218738n302893n190532j295524L920988O027091
$$ y = [-12785353, -15086379, -14702579, -9542792, -3041519, -386161, -1776246, -2751065, -867490, 1477369, 1329630, -1106410, -4147610, -7040567, -9231843, -9856931, -9587931, -10606266, -13021370, -13724842, -10924165, -7555049, -7482568, -9968808, -10917395, -8735809, -6008934, -5413134, -6423589, -6588730, -4522174, -1220823, 746270, -511923, -4152932, -7393711, -8820239, -9561296, -10395274, -9856062, -7130041, -4699560, -5075883, -6357937, -4755840, -959068, 139955, -3380963, -7640110, -8884256, -8576859, -9989213, -12700973, -13966615, -13753121, -14538582, -16489700, -16439951, -12486659, -6895250, -3169096, -2317351, -3539039, -6757777, -12060670, -17251202, -18546726, -14625738, -8598647]
40432h598647L678102j49553j973360j216369N31945J920161K392999J643142
40424a771580Q0817p68880J23960J506729J065812j559392m210869m721392k881968
40415a3136763M7013K515301L286405K193216O18762J80874Q22287J225491Q68595
40406a378819K40807o20654j812434j961491M83822L968826M701631J850859j000624
40397D471923j133865m28315j544731l280644k962633j241874p21123j229573
40389h070835m66144J360437J617126l5242r70550k15656P1350j133996j605996
40380i449506J89857K145528J726989k66772j389301j040489j73947P43176J407838
40371f106627R21749n72660j037919N23622J854949O48247j504054j370113P18035
$$ y = [-8598647, -4920545, -5070098, -7043458, -8259827, -7727882, -5807721, -3414722, -1771580, -1690763, -2459643, -2335683, -828954, 236858, -1322534, -5533403, -10254795, -13136763, -13089750, -10574449, -7288044, -5094828, -4476066, -4295192, -3472905, -2247414, -1378819, -1138012, -1758666, -3571100, -5532591, -5048769, -1079943, 3621688, 5472547, 4471923, 3338058, 2909743, 1365012, -1915632, -4878265, -6120139, -6841262, -8070835, -8536979, -7176542, -5559416, -5594658, -6565208, -6780864, -6709514, -7843510, -9449506, -9259649, -7114121, -5387132, -5653904, -7043205, -8083694, -8257641, -7514465, -6106627, -5184878, -5757538, -6795457, -6271835, -4416886, -3768639, -5272693, -6642806, -5924771]
40362e924771J395808j84558r67530R64861L201968K656236N4350j454119q03826
40353a061581J11206m10518j776098k406796j840188q64212j78903K53332M25593
40344g748165l85298k562274m553935l762120J51423M005280M488064K052899
40336h314126l7446R9677J480596K476144K412091J033291j360146k940168j855207
40327g005294O93910J367689l93282j177752J014871L173287J851111j128405
40319a603865j390749R34583J291136k077540n189033m000594K95852L579236
40311h160974L834525J787732j337208m193232m881883k773077r1426N90390P695
40302a5217458J082915M274137O489771N276125J940220p21284k086180l301873
$$ y = [-5924771, -4528963, -4713521, -5681051, -4716190, -1514222, 1142014, 1196364, -257755, -1061581, -950375, -1360893, -3136991, -5543787, -7383975, -8248187, -8427090, -8173758, -7748165, -8133463, -10695737, -15249672, -19011792, -18860369, -14855089, -10367025, -8314126, -8351572, -8251895, -6771299, -4295155, -1883064, -849773, -2209919, -5150087, -7005294, -6311384, -4943695, -5336977, -6514729, -5499858, -2326571, -475460, -1603865, -2994614, -2060031, -768895, -2846435, -8035468, -12036062, -11740210, -8160974, -4326449, -2538717, -3875925, -8069157, -12951040, -15724117, -15815543, -15225153, -15217458, -14134543, -9860406, -3370635, 1905490, 3845710, 3124426, 1038246, -2263627]
40294b263627m236300l163791J50667K943205K431978m94404k178120q26944J317973
40285f319363J240670p73870j889972q37650P10440R70057K83058j96651l04746
40276g118027k09232N49527J904997K390339J093172n53330q17814n69142j792344
40267e121854l811178l861288j606863l6812p84986j441899M88433L282820L374331
40258i519296O91198j299373n32133J313381J751047N82869p43606j260675r66784
40249i983372j75543P49322J465444J849942J810377J075313j59939p84158j01992
40240d254606P22461R4532j272109j010271J184800K730209J981080N90327M66333
40231A232756O05040o55161k052385j261457O54040K75399k626548m202875k243403
$$ y = [-2263627, -6499927, -9663718, -9513051, -6569846, -4137868, -4632272, -6810392, -7637336, -6319363, -5078693, -5852563, -7742535, -8580185, -7869745, -6899688, -6616630, -6813281, -7118027, -7327259, -6777732, -4872735, -2482396, -1389224, -1942554, -2760368, -3329510, -5121854, -8933032, -12794320, -14401183, -14437995, -15222981, -16664880, -16176447, -12893627, -9519296, -8828098, -10127471, -10659604, -9346223, -7595176, -7012307, -7755913, -9016588, -9983372, -10158915, -9409593, -7944149, -6094207, -4283830, -3208517, -3368456, -4152614, -4254606, -3532145, -3437613, -4709722, -5719993, -4535193, -1804984, 176096, 766423, 1232756, 1837796, 1182635, -869750, -2131207, -1477167, -1201768, -3828316, -8031191, -10274594]
40222a0274594M54095K74835k221986l713403k564199L80558L775671O116119
40214g772904N548793K132999o91795J52989K769534K545194j184053m234218
40206g33461l853999k213447k079869k445452j057145J292387K160755J528064
40198g402167J261741J412103K80415j956735k743098q62842J781546K937760
40190e291277K535888J606457N34076n47061j149596j275002j542072j650818
40182f779405l38395K031650K689058Q1832l229497l604698j226355O43299P14904
40173i017607Q67750K026763K236918M13470r27609O75311L219463K658916j202858
40164I50517m518164m957977m127288l738222k772605l24765J581367Q68783o81454
$$ y = [-10274594, -9820499, -9545664, -11767650, -15481053, -18045252, -17664694, -13889023, -7772904, -2224111, -91112, -782907, -629918, 2139616, 4684810, 3500757, -733461, -4587460, -6800907, -8880776, -11326228, -12383373, -11090986, -8930231, -7402167, -6140426, -4728323, -4447908, -6404643, -9147741, -10010583, -8229037, -5291277, -2755389, -1148932, -614856, -1161917, -2311513, -3586515, -5128587, -6779405, -7117800, -5086150, -2397092, -2315260, -5544757, -9149455, -10375810, -9732511, -9017607, -8149857, -6123094, -3886176, -3472706, -4400315, -3725004, -505541, 2153375, 950517, -3567647, -8525624, -12652912, -16391134, -19163739, -19488504, -17907137, -17038354, -17719808]
40155a7719808L90220L831483N556265L096700j372861m006029l224632j99964
40147a3648626K634977K976026M58531k243351j930543R50913K720036J677868
40139f404169L24978J064884K453704J968179J84890o50853n21511r40756j464241
40130c984895k76927K059989K674004N30789k151152l072702k105622j12358J980828
40121d458046K490947K2589l868117n464879l485768o99237K21638J39093J071234
40112a4030546K481928K295985M46653r15926n10663M80277J56407j586020k609386
40103a3791291q34027K693115L960270P40690l642071l884788J27029L024858
40095a1606215J603768r39984m56447J938164K361848M17454q79725j15656J215142
$$ y = [-17719808, -17329588, -13498105, -7941840, -4845140, -6218001, -10224030, -13448662, -13648626, -11013649, -8037623, -7579092, -9822443, -11752986, -10802073, -8082037, -6404169, -6079191, -5014307, -2560603, -592424, -407534, -1058387, -1579898, -2520654, -3984895, -4261822, -2201833, 472171, 1002960, -1148192, -4220894, -6326516, -6438874, -4458046, -1967099, -1944510, -5812627, -11277506, -14763274, -15462511, -15240873, -15101780, -14030546, -11548618, -9252633, -8805980, -9721906, -10232569, -9752292, -9595885, -11181905, -13791291, -14625318, -11932203, -7971933, -7231243, -10873314, -14758102, -14631073, -11606215, -10002447, -10942431, -11398878, -9460714, -7098866, -6681412, -7561137, -7676793, -6461651]
40086f461651J820598J775887Q63589j232758l128670k914155j175997k68666
40078a0721823o54533p04668q2405k12106j022332n42183J276333J583189q71399
40069a1951927l108082j966024J380948L255485K247417n0602j864369k596776
40061a4653930k115215p29825L61047J70704o18293m05022J275390L207111L668890
40052i839143J721449j845887m314702l031009J375023M934836M764423K406295
40044c828715J266377J930401K179606R55415l02742n10975p05995j908364l027933
40035c952925k423505n88067K33545j117167l355077m322858l166853p09735J765467
40026a7637175L517012M212710L510203J449511q75237j885020j151464J44083
$$ y = [-6461651, -4641053, -2865166, -2001577, -3234335, -6363005, -9277160, -10453157, -10721823, -11376356, -12081024, -12163429, -12375535, -13397867, -13940050, -12663717, -11080528, -11951927, -15060009, -17026033, -15645085, -12389600, -10142183, -10192785, -12057154, -14653930, -16769145, -17498970, -17137923, -16967219, -17585512, -17990534, -16715144, -13508033, -9839143, -8117694, -9963581, -14278283, -17309292, -15934269, -10999433, -6235010, -3828715, -2562338, -631937, 1547669, 2503084, 2200342, 1689367, 983372, -924992, -3952925, -6376430, -6964497, -6730952, -7848119, -11203196, -15526054, -18692907, -19402642, -17637175, -14120163, -9907453, -6397250, -4947739, -5822976, -7707996, -8859460, -8715377]
40018h715377Q72248J404626K556195L611907K761822k70985l189391l446159
40010d415114j044806J607947K265864P01731j611059k917142k382391o18303
40002h413273Q43234J086169Q08822J174690J811027J134193r68579k234869r57525
39993e716111J379601K123358J280619J063409J837705J221665j996572n472870
39985d279196o242229m123626p93484K505948M545627L560925k44642l247656
39977h318333k437774K20913O02092j356472j965086j1673J501966O03600p02686
39968a1863453l56746M67729J81185k03337N50248J107438J3180j173802k43267
39959a1520825J765719K088707M59086j204124k302146l505953l853036j455924
$$ y = [-8715377, -7843129, -6438503, -3882308, -270401, 2491421, 2220436, -968955, -4415114, -5459920, -3851973, -1586109, -884378, -2495437, -5412579, -7794970, -8413273, -7570039, -6483870, -5675048, -4500358, -2689331, -1555138, -2523717, -4758586, -5716111, -4336510, -2213152, -932533, 130876, 1968581, 3190246, 1193674, -4279196, -10521425, -14645051, -15438535, -12932587, -8386960, -4826035, -5070677, -8318333, -10756107, -10535194, -9933102, -11289574, -13254660, -13266333, -11764367, -11160767, -11863453, -12220199, -11752470, -11571285, -11774622, -11224374, -10116936, -10103756, -11277558, -11520825, -9755106, -7666399, -7207313, -8411437, -10713583, -14219536, -18072572, -19528496]
39951a9528496K717737N121980M452975L191570L221772K852444J28882l251460
39943a092596l968096j787605L95518Q59896Q41955J505575J529742m96350k726608
39934d938569j808282J924781L775748P86985l654002m000041r7581K825142J569578
39925c616241j324272k263007j365527m63720M89480K028394K549548N52339j921441
39916e334447j583792J038369K101293j24317l180927l956515j945802J113838
39908a1872300K872415J837364q99576j985506J67441K759545K481142N46678
39900d092797L93809J639473Q91345j788223k414060Q8196J740978Q2400j931868
39891e390747j228088N62401Q24773N95800J682263K464219P88968j551580j566448
$$ y = [-19528496, -16810759, -11688779, -7235804, -4044234, -822462, 2029982, 2158864, -1092596, -5060692, -6848297, -6452779, -5592883, -4750928, -3245353, -1715611, -2211961, -4938569, -6746851, -4822070, -1046322, -259337, -3913339, -7913380, -8010961, -5185819, -3616241, -4940513, -7203520, -8569047, -9032767, -8543287, -6514893, -3965345, -3413006, -5334447, -6918239, -5879870, -3778577, -3902894, -7083821, -11040336, -12986138, -11872300, -8999885, -7162521, -8062097, -10047603, -9880162, -7120617, -4639475, -4092797, -3698988, -2059515, -1168170, -2956393, -5370453, -5282257, -3541279, -3458879, -5390747, -6618835, -6056434, -5231661, -4635861, -2953598, -489379, 299589, -1251991, -2818439]
39882b818439k21435m95795k019844k213061j429768k069209l275226j712971
39874a6255748K174154L804830J460660j057092n31699J184654J171484J75584
39866g873173L24123R81663K24909j409728j803995p72040L4644K3683O3698M09110
39856i797106L17859m02371j101331j375084j175986k79209J080225J637106O12336
39847a0483561p53895p40694K86284N60077k40581p95696o77004r05191j624653
39838a5374914j419675J52727J341304Q45167l8465L30717Q97817n56014l380237
39829a7201573m050546p64005L864262N839519M359777K063071J287421J514506
39821c087568Q57382q99703j805812l83566K147275L229754K231991R78428P07760
$$ y = [-2818439, -3039874, -3535669, -5555513, -7768574, -9198342, -11267551, -14542777, -16255748, -14081594, -10276764, -8816104, -9873196, -10404895, -9220241, -8048757, -7873173, -7549050, -6567387, -6342478, -7752206, -9556201, -10328241, -10293597, -10269914, -10206216, -9797106, -9479247, -9881618, -10982949, -12358033, -13534019, -13813228, -12733003, -11095897, -10483561, -11237456, -11978150, -11691866, -11131789, -11372370, -12168066, -12845070, -13750261, -15374914, -16794589, -16641862, -15300558, -14455391, -14493856, -14163139, -13265322, -13821336, -17201573, -21252119, -22016124, -18151862, -12312343, -7952566, -5889495, -4602074, -3087568, -2230186, -3129889, -4935701, -5319267, -3171992, 57762, 2289753, 3268181, 3975941]
39812C975941J97143j796633l740524l209059q11944M25866l90961r44091J69017
39803f125245J212769P28226K79937J381063K120075N6374l174710l777685j535380
39794h834576M5080p35324j671605o73670J404900K918134L391775K257010j207089
39785c105365n045827m917351L01245N706619O027815K205841o94670o81087m63675
39776f66455k341808m856098n282573l058698L19324L212535M633733M158294
39768c881746K092865m12042j852216j288498P36172K189166J301047j322960
39760b438212l146324k548616k88922J990409L269373K871526O50590j687299
39752a327475j527617J037936K532902P01896k142291k396298k2243K146831K404123
$$ y = [3975941, 4173084, 2376451, -1364073, -4573132, -5385076, -4959210, -5350171, -6294262, -6125245, -4912476, -4184250, -3904313, -2523250, -403175, -346801, -3521511, -7299196, -8834576, -8789496, -9524820, -11196425, -11870095, -10465195, -7547061, -4155286, -1898276, -3105365, -8151192, -13068543, -12767298, -7060679, -1032864, 1172977, 478307, -202780, -666455, -3008263, -7864361, -13146934, -16205632, -15886308, -12673773, -8040040, -3881746, -1788881, -2200923, -4053139, -5341637, -4605465, -2416299, -1115252, -2438212, -5584536, -8133152, -8422074, -6431665, -3162292, -290766, 359824, -1327475, -2855092, -1817156, 715746, 1417642, -724649, -3120947, -3143190, -996359, 1407764]
39743A407764J103465r30859k454107j750919Q06440J738525r67991l918113k626894
39734g592689J597924L454228J578498j69569M93484J205993o5572j561605j265782
39725b325090j57227K09944J67202r728j394925l712106m349334k256332N8999
39716a3768597O61486J278903L560164N178764L125658j177190l576934k759752
39708g477498j071987o78307j510545k328406j790262N95529L036610K642062
39700h582804k52146j284995J963824N720043N034632Q99559j612352p74071N81259
39691A692949M70751r9683m45431j437945k747167k508147o53655N86412L24234
39682d817682J39203Q05910R30402k32595j482969k049931k349773j675221J401048
$$ y = [1407764, 2511229, 1580370, -873737, -2624656, -1818216, -79691, -1047682, -4965795, -7592689, -5994765, -2540537, -962039, -1131608, -638124, 567869, 502297, -1059308, -2325090, -2482317, -2272373, -2105171, -2114899, -3509824, -7221930, -11571264, -13827596, -13768597, -13107111, -11828208, -8268044, -3089280, 36378, -1140812, -4717746, -7477498, -8549485, -9227792, -10738337, -13066743, -14857005, -14261476, -11224866, -8582804, -8834950, -10119945, -8156121, -2436078, 2598554, 3498113, 1885761, 1111690, 1692949, 2163700, 2064017, 1618586, 180641, -2566526, -5074673, -5728328, -5141916, -4817682, -4678479, -3872569, -2942167, -3174762, -4657731, -6707662, -9057435, -10732656, -9331608]
39673i331608N138157N000664Q5218m347318l620292O8828J414626m31060j909129
39664g931914j040855O98582J879632K710973L010752J886044j4033p57886l32655
39655A08640r32285l093381m112125j865215J813251L410731K011543m34421j994222
39646e087484k084523p69990J231128K153567P96949j343191j437119P41319K098296
39637c701048L20469l041273m886542m385188k714434l76712K687524M932893
39629a1164311M094264P38406j578415p28792J464992K272993J630544J120493
39621b149826J066477N28159q55096k616380m164292m526598k727717J80341J176434
39612a4088498o55185j869496Q02374N104341N888061K417337p97468p61621K95333
$$ y = [-9331608, -4193451, 807213, 892431, -3454887, -7075179, -7006351, -5591725, -6022785, -7931914, -8972769, -8274187, -6394555, -3683582, -672830, 1213214, 1199181, 441295, 108640, -823645, -3917026, -8029151, -9894366, -8081115, -4670384, -2658841, -3093262, -5087484, -7172007, -7941997, -6710869, -4557302, -3760353, -5103544, -6540663, -5799344, -3701048, -3380579, -6421852, -11308394, -15693582, -18408016, -18784728, -16097204, -11164311, -7070047, -6331641, -7910056, -8638848, -7173856, -4900863, -3270319, -2149826, -1083349, -555190, -1410286, -4026666, -8190958, -12717556, -15445273, -15264932, -14088498, -14743683, -16613179, -15810805, -10706464, -4818403, -2401066, -3198534, -3960155, -3664822]
39603c664822n73367k157178j244304K281052N056599M334714P60367k735361
39595B057700l820499k601900r68614j55304M53759J544207K090371R37859q38574
39586a300995j367328j041141j494395k059881n70555K226729K830362M98286
39578b278918j163948K26888K317143K337094J429610J634817J650655o12095
39570E541246l518357l851578j980448p58984k59174J930553N222966N437808
39562G764032R92867m047171n163383k915994j014564p94331k47261K083830M534764
39553A192789M263073P98137l102276m235984k311920n221L76886o41807j172575
39544d838898q53315r25017j843408k328873j161402R92809K140979J205115n64767
$$ y = [-3664822, -4238189, -6395367, -7639671, -5358619, -302020, 4032694, 4793061, 2057700, -1762799, -4364699, -5333313, -5488617, -5034858, -3490651, -1400280, -462421, -1300995, -2668323, -3709464, -5203859, -7263740, -7834295, -5607566, -2777204, -2278918, -3442866, -3215978, -898835, 1438259, 2867869, 4502686, 6153341, 5541246, 2022889, -1828689, -3809137, -4568121, -4827295, -2896742, 2326224, 7764032, 8756899, 4709728, -453655, -3369649, -4384213, -5178544, -5425805, -3341975, 1192789, 5455862, 6253999, 3151723, -1084261, -3396181, -3401402, -3024516, -3666323, -4838898, -5692213, -6617230, -8460638, -10789511, -11950913, -10958104, -8817125, -7612010, -8176777]
39535h176777q25884Q88987K199606J053995q93049l25986K446254L315045M58009
39526A40200k689825k666156j075063j233222k261241q06552K627863L777574
39518d186422J229634j280819l80490K521236L956179K918134Q26345j141813
39510D461984k780062l854135l802367k322986l3186J227719m06804m155747o117165
39501a7782749l444473J676167M490207L568681J598595O57940o3785j437689
39493a0737106k523998k558512k013438o44149K632207O578632P352348L394174
39485A480158j821762m041013l152340j809678j244540r20471o89418o55282o565
39476a2860911J596240K411306Q00349j682822j844568P76720L332447L443826
$$ y = [-8176777, -9002661, -8113674, -5914068, -4860073, -5753122, -6079108, -3632854, -317809, 140200, -2549625, -5215781, -6290844, -7524066, -9785307, -10591859, -7963996, -4186422, -2956788, -4237607, -4618097, -2096861, 1859318, 4777452, 5603797, 4461984, 1681922, -2172213, -5974580, -8297566, -8330752, -7103033, -7509837, -11665584, -17782749, -21227222, -19551055, -15060848, -11492167, -9893572, -9235632, -9299417, -10737106, -13261104, -15819616, -17833054, -18477203, -15844996, -9266364, -1914016, 1480158, -341604, -4382617, -7534957, -9344635, -10589175, -11509646, -12199064, -12854346, -12860911, -11264671, -8853365, -8053016, -9735838, -11580406, -10803686, -7471239, -4027413]
39468d027413J496437j006648l257923m531597l574830j79267L385943M145829
39460g549469J902194k60322J75425J750275J163923j565373k682076k76876K620260
39451d722039K658648J091072P53756N84069k120779n403533m369648O44012L531300
39442g353142J472129j205663o21702Q16941k47673k027754j462785r8831r40389
39433a1668869k530897j488794J299090K227403J085347O39168J339131J228088
39425g870333J97131j80588j43660p10401l89640K299436M299548J560580l548091
39416d486018m364016L21568M613587M465977K355582J468905J028015j66830
39408E236770p04870M4450q0134j829021k381903j97536J844500J089971o88966
$$ y = [-4027413, -2530976, -3537624, -6795547, -11327144, -14901974, -15081241, -11695298, -7549469, -5647275, -5907597, -5732172, -3981897, -2817974, -4383347, -7065423, -7342299, -4722039, -2063391, -972319, -218563, 365506, -1755273, -7158806, -11528454, -10884442, -7353142, -5881013, -7086676, -7708378, -6891437, -7139110, -9166864, -10629649, -10728480, -11668869, -14199766, -15688560, -14389470, -12162067, -11076720, -10437552, -9098421, -7870333, -7673202, -7853790, -7997450, -8707851, -9097491, -6798055, -2498507, -937927, -4486018, -8850034, -8528466, -3914879, 551098, 2906680, 4375585, 5403600, 5236770, 4531900, 4576350, 4496216, 2667195, 285292, 87756, 1932256, 3022227, 2333261]
39399B333261p27084M20115R34244R49312Q77982l08082k335668k513618k88770
39390f58308O74925j700481l813760k125764P09142L75106j602573o47850K645109
39381f144454L214395k17167l274708k648102J43372K389350L418470L289282
39373A70438J820436l3039o31486k07944o89386k730604m989009o073662n211560
39364a8575816j928347K517778M730402L163428J003664J600787K827105N40342
39356d120657l798621m624263j026745J997998J729993J048760J917225J660781
39348e215529j267772l233359j093236K317687K550000O0425j668962j684055
39340i234801j163736J19078K699339M463303K884946p34173k738778k023229
$$ y = [2333261, 1606177, 2026292, 2960536, 3909848, 4787830, 4479748, 2144080, -369538, -658308, 16617, -1683864, -5497624, -7623388, -6914246, -6539140, -8141713, -8789563, -6144454, -2930059, -3147226, -6421934, -9070036, -8926664, -6537314, -3118844, 170438, 1990874, 1957835, 1326349, 1118405, 429019, -2301585, -7290594, -13364256, -18575816, -20504163, -17986385, -13255983, -10092555, -9088891, -7488104, -4660999, -4120657, -7919278, -12543541, -13570286, -11572288, -9842295, -8793535, -6876310, -5215529, -6483301, -9716660, -10809896, -8492209, -5942209, -5881784, -7550746, -9234801, -10398537, -10279459, -7580120, -3116817, -231871, -966044, -3704822, -5728051]
39332e728051m17375Q31117J836758K197548J487779J034307K212249L504557
39324F958889K266164r89605l165247l282429l412263m576073m833828k509171
39316a3543563J071393L269650K947114Q11223j582861k546043j294997J067730
39308i800354K455170J894663J12652j521522j737699P2462K638167L119386M53775
39299b313300k544451k632631p60688m38651k063685k315225M51274L652442M449474
39290d515441L198132J366799j126471m278969n956968m177484k93645K343890
39282a3440157K255086O84335o54731j021316l86002P31797J422668J420591J460429
39273g527300J738164J017575j359295l470778k675940P57470L551162L102231
$$ y = [-5728051, -6145426, -5314309, -3477551, -1280003, 207776, 1242083, 3454332, 6958889, 9225053, 8235448, 5070201, 1787772, -1624491, -6200564, -11034392, -13543563, -12472170, -9202520, -6255406, -5444183, -7027044, -9573087, -10868084, -9800354, -7345184, -5450521, -5337869, -6859391, -8597090, -8524628, -5886461, -2767075, -2313300, -4857751, -7490382, -8251070, -8689721, -10753406, -13068631, -12617357, -8964915, -4515441, -1317309, 49490, -1076981, -5355950, -11312918, -15490402, -15784047, -13440157, -11185071, -10500736, -11155467, -12176783, -12562785, -11830988, -10408320, -8987729, -7527300, -5789136, -4771561, -6130856, -9601634, -12277574, -11520104, -7968942, -4866711]
39265d866711K1731l087389m125874k541462P86652L880454M611911K307826j480218
39256d493080m152957m192415k203255K8457J349688J965809K477884K786351
$$ y = [-4866711, -4844980, -7932369, -12058243, -14599705, -13813053, -9932599, -5320688, -3012862, -4493080, -8646037, -12838452, -15041707, -15013250, -13663562, -11697753, -9219869, -6433518]
$$ [...]
##END NTUPLES=NMR SPECTRUM
##END=
