##TITLE=31Pdec_DE-92
 CDCl3, 64 sc
 28.4.2025
##JCAMPDX= 6.0         $$ Bruker NMR JCAMP-DX V2.0
##DATA TYPE= NMR SPECTRUM
##DATA CLASS= NTUPLES
##ORIGIN= UXNMR, Bruker Analytische Messtechnik GmbH
##OWNER= root
$$ XWIN-NMR		Version 3.5
$$ Mon Apr 28 14:26:47 2025 Russian Standard Time (UT+4h)  she@DPX200
##.OBSERVE FREQUENCY= 81.013821
##.OBSERVE NUCLEUS= ^31P
##.ACQUISITION MODE= SIMULTANEOUS
##.ACQUISITION SCHEME= undefined
##.AVERAGES= 64
##.DIGITISER RES= 17
##SPECTROMETER/DATA SYSTEM= spect
##.PULSE SEQUENCE= zgpg30
##.SOLVENT NAME= CDCl3
##.SHIFT REFERENCE= (INTERNAL, CDCl3, 0, 198.062)
##AUDIT TRAIL= $$ (NUMBER, WHEN, WHO, WHERE, WHAT)
$$ ##TITLE= Audit trail, XWIN-NMR		Version 3.5
$$ ##JCAMPDX= 5.01
$$ ##ORIGIN= Bruker BioSpin GmbH
$$ ##OWNER= she
$$ F:/spectra/data/she/nmr/P31/2/pdata/1/auditp.txt
$$ ##AUDIT TRAIL=  $$ (NUMBER, WHEN, WHO, WHERE, WHAT)
(   1,<2025-04-28 14:21:01.79 +0400>,<she>,<DPX200>,
      <created by zg, POWCHK disabled, PULCHK disabled
       configuration hash MD5:
       00 E9 B6 7A A2 85 ED C7 34 08 36 98 17 FE 4E 26
       data hash MD5: 32K
       B0 9E 48 4F 9F DF 6A 8D C2 53 92 D6 CA D6 CC 95>)
(   2,<2025-04-28 14:25:10.95 +0400>,<she>,<DPX200>,
      <Start of raw data processing
       efp BC_mod = 2 LB = 1.5 FT_mod = 6 PKNL = 1 PHC0 = 1414.484 PHC1 = 82.09354 SI = 64K 
       data hash MD5: 64K
       D5 55 98 E1 78 3C DF C2 B1 F2 8A 58 ED F9 A3 64>)
(   3,<2025-04-28 14:26:00.10 +0400>,<she>,<DPX200>,
      <pk PHC0 = 354.518 PHC1 = -963.0004 
       data hash MD5: 64K
       60 3F 9B 9B DA 1D F3 72 CA 91 BC 56 61 33 3E D9>)
(   4,<2025-04-28 14:26:04.64 +0400>,<she>,<DPX200>,
      <abs ABSG = 5 
       data hash MD5: 64K
       4F 57 2F 1A 7E 52 A2 2D 1D 4A 94 28 B1 81 6D AD>)
$$ ##END=
$$ 
$$ hash MD5
$$ B6 F5 CB 81 67 D7 B5 D3 8C 9B 7F FD 36 E7 99 2C
##$RELAX= 
##$RELAX= 
##$RELAX= 
##$RELAX= 
##$RELAX= 
##$RELAX= 
##$RELAX= 
##$RELAX= 
$$ Bruker specific parameters
$$ --------------------------
##$DU= <F:/spectra>
##$EXPNO= 2
##$NAME= <P31>
##$PROCNO= 1
##$TYPE= <nmr>
##$USER= <she>
##$AMP= (0..31)
100 100 100 100 100 100 100 100 100 100 100 100 100 100 100 100 100 100 
100 100 100 100 100 100 100 100 100 100 100 100 100 100 
##$AQSEQ= 0
##$AQ_mod= 1
##$AUNM= <au_zg>
##$AUTOPOS= <>
##$BF1= 81.014009
##$BF2= 200.13
##$BF3= 200.13
##$BF4= 200.13
##$BF5= 200.13
##$BF6= 200.13
##$BF7= 200.13
##$BF8= 200.13
##$BYTORDA= 1
##$CFDGTYP= 0
##$CFRGTYP= 5
##$CHEMSTR= <none>
##$CNST= (0..31)
1 1 145 1 1 1 1 1 1 1 1 1 1 1 1 1 1 1 1 1 1 1 1 1 1 1 1 1 1 1 1 1 
##$CPDPRG= <waltz16>
##$CPDPRG1= <>
##$CPDPRG2= <waltz16>
##$CPDPRG3= <>
##$CPDPRG4= <mlev>
##$CPDPRG5= <mlev>
##$CPDPRG6= <mlev>
##$CPDPRG7= <mlev>
##$CPDPRG8= <mlev>
##$CPDPRGB= <>
##$CPDPRGT= <>
##$D= (0..31)
0 1 0 0 0 0 0 0 0 0.06 0 0.03 2e-05 3e-06 0 0 0.0002 0 0 0 0 0 0 0 0 0 
0 0 0 0 0 0 
##$DATE= 1745835661
##$DBL= (0..7)
120 120 120 11 120 120 24 19 
##$DBP= (0..7)
150 150 150 150 150 150 150 150 
##$DBP07= 0
##$DBPNAM0= <>
##$DBPNAM1= <>
$$ [...]
##$SUBNAM3= <"">
##$SUBNAM4= <"">
##$SUBNAM5= <"">
##$SUBNAM6= <"">
##$SUBNAM7= <"">
##$SUBNAM8= <"">
##$SUBNAM9= <"">
##$SW= 400.765351723535
##$SWIBOX= (0..15)
0 1 3 0 0 0 0 0 0 0 0 0 0 0 0 0 
##$SW_h= 32467.5324675325
##$TD= 32768
##$TD0= 1
##$TE= 0
##$TE2= 300
##$TE3= 300
##$TEG= 300
##$TL= (0..7)
0 120 53 12 22 120 120 120 
##$TP= (0..7)
150 150 150 150 150 150 150 150 
##$TP07= 0
##$TPNAME0= <>
##$TPNAME1= <>
##$TPNAME2= <>
##$TPNAME3= <>
##$TPNAME4= <>
##$TPNAME5= <>
##$TPNAME6= <>
##$TPNAME7= <>
##$TPOAL= (0..7)
0.5 0.5 0.5 0.5 0.5 0.5 0.5 0.5 
##$TPOFFS= (0..7)
0 0 0 0 0 0 0 0 
##$TUNHIN= 0
##$TUNHOUT= 0
##$TUNXOUT= 0
##$USERA1= <user>
##$USERA2= <user>
##$USERA3= <user>
##$USERA4= <user>
##$USERA5= <user>
##$V9= 5
##$VALIST= <valist>
##$VCLIST= <CCCCCCCCCCCCCCC>
##$VD= 0
##$VDLIST= <DDDDDDDDDDDDDDD>
##$VPLIST= <PPPPPPPPPPPPPPP>
##$VTLIST= <TTTTTTTTTTTTTTT>
##$WBST= 1024
##$WBSW= 4
##$XGAIN= (0..3)
0 0 0 0 
##$XL= 0
##$YL= 0
##$YMAX_a= 4307
##$YMIN_a= -25051
##$ZGOPTNS= <>
##$ZL1= 120
##$ZL2= 120
##$ZL3= 120
##$ZL4= 120
##$ABSF1= 198.0616
##$ABSF2= -202.7028
##$ABSG= 5
##$ABSL= 3
##$ALPHA= 0
##$AQORDER= 0
##$ASSFAC= 0
##$ASSFACI= 0
##$ASSFACX= 0
##$ASSWID= 0
##$AUNMP= <proc_1d>
##$AZFE= 0.1
##$AZFW= 0.5
##$BCFW= 0
##$BC_mod= 2
##$BYTORDP= 0
##$COROFFS= 0
##$CY= -3
##$DATMOD= 1
##$DC= 0
##$DFILT= <>
##$DTYPP= 0
##$F1P= 0
##$F2P= 0
##$FCOR= 1
##$FTSIZE= 65536
##$FT_mod= 6
##$GAMMA= 0
##$GB= 0
##$INTBC= 1
##$INTSCL= 9.790993e-09
##$ISEN= 30
##$LB= 1.5
##$LEV0= 0
##$LPBIN= 0
##$MAXI= 10000
##$MC2= 0
##$MEAN= 0
##$ME_mod= 0
##$MI= 50
##$NCOEF= 0
##$NC_proc= -8
##$NLEV= 6
##$NOISF1= 182.463
##$NOISF2= 159.3651
##$NSP= 0
##$NTH_PI= 0
##$NZP= 0
##$OFFSET= 198.0616
##$PC= 4
##$PHC0= 1769.002
##$PHC1= -880.9069
##$PH_mod= 1
##$PKNL= yes
##$PPARMOD= 0
##$PSCAL= 0
##$PSIGN= 0
##$REVERSE= no
##$SF= 81.0140089999434
##$SI= 65536
##$SIGF1= 159.3651
##$SIGF2= -187.1042
##$SINO= 113.3802
##$SIOLD= 16384
##$SREGLST= <1H.CDCl3>
##$SSB= 0
##$STSI= 65536
##$STSR= 0
##$SW_p= 32467.5324675325
##$SYMM= 0
##$S_DEV= 0
##$TDeff= 32768
##$TDoff= 0
##$TI= <>
##$TILT= no
##$TM1= 0
##$TM2= 0
##$TOPLEV= 0
##$USERP1= <user>
##$USERP2= <user>
##$USERP3= <user>
##$USERP4= <user>
##$USERP5= <user>
##$WDW= 1
##$XDIM= 65536
##$YMAX_p= 105416736
##$YMIN_p= -250142694
$$ End of Bruker specific parameters
$$ ---------------------------------
##NTUPLES= NMR SPECTRUM
##VAR_NAME=  FREQUENCY,     SPECTRUM/REAL,   SPECTRUM/IMAG
##SYMBOL=    X,             R,               I
##VAR_TYPE=  INDEPENDENT,   DEPENDENT,       DEPENDENT
##VAR_FORM=  AFFN,          ASDF,            ASDF
##VAR_DIM=   65536,         65536,           65536
##UNITS=     HZ,            ARBITRARY UNITS, ARBITRARY UNITS
##FACTOR=    0.49542278885378, 1,            1
##FIRST=     16045.7642231865, 0,            0
##LAST=      -16421.768244346, 0,            0
##MIN=       -16421.768244346, -250142694,   0
##MAX=       16045.7642231865, 105416736,    0
$$ Real data points
##PAGE= N=1
##DATA TABLE= (X++(R..R)), XYDATA
$$ [...]
$$ plain form
7498 989140 -918772 826669 3924762 5365392 4895102 4023336 3612198 3647975 4080515
7489 4080515 4615328 4379956 2863887 854546 -311505 -144040 965028 2714226 4997924
7480 4997924 7013624 7152849 4384332 -497570 -5415193 -8703894 -9986181 -9589241 -7799570
7471 -7799570 -5043594 -2314955 -680487 -231257 31755 975599 2159209 2133692 -16099
7462 -16099 -3482212 -6158533 -6323667 -3942084 -452874 2335919 3037635 1205637 -1913980
7453 -1913980 -3513292 -1581452 2562961 5510431 6066347 6605784 8991010 11071918 9557531
7444 9557531 5137085 1749647 973675 300338 -2230856 -4696057 -4479781 -2641090 -2555297
7435 -2555297 -5054934 -7154614 -5666230 -685288 4722235 7535464 7414100 6622137 7103736
$$ packed form
7498I89140j907912J745441L098093J440630m70290q71766m11138L5777M32540
7489D080515N34813k35372j516069k009341j166051J67465J109068J749198K283698
7480D997924K015700J39225k768517m881902m917623l288701j282287L96940J789671
7471g799570K755976K728639J634468M49230K63012R43844J183610k5517k149791
7462a6099l466113k676321j65134K381583L489210K788793P01716j831998l119617
7453a913980j599312J931840M144413K947470N55916N39437K385226K080908j514387
7444I557531m420446l387438p75972o73337k531194k465201K16276J838691Q5793
7435b555297k499637k099680J488384M980942N407523K813229j21364p91963M81599
$$ plain form
7426 7103736 7832663 6156185 1857355 -1826282 -2088323 152378 2097998 2679760 2624117
7417 2624117 2219234 1159817 -118021 -1079974 -2629628 -5851786 -9399910 -10350893 -7890414
7408 -7890414 -4126546 -898117 2093465 5198106 6931213 5685396 2197587 -1007146
7400 -1007146 -2086892 -1106292 464036 811410 -942154 -3888555 -6258853 -7432770 -8256259
7391 -8256259 -9277571 -9934870 -9963165 -10214311 -11113288 -11374508 -9400187 -5335037 -922866
7382 -922866 1966043 2007904 -1189880 -6056496 -9216388 -8305809 -4554711 -1448523 -941070
7373 -941070 -1931744 -2167529 -428637 3089562 7222353 10272079 11013407 9827890 8243197
7364 8243197 6990386 5126060 1541694 -3108232 -6568617 -7055291 -4905609 -2118970
$$ packed form
7426G103736P28927j676478m298830l683637k62041K240701J945620N81762n5643
7417B624117m04883j059417j277838r61953j549654l222158l548124r50983K460479
7408g890414L763868L228429K991582L104641J733107j245817l487809l204733
7400a007146j079746R80600J570328L47374j753564k946401k370298j173917q23489
7391h256259j021312o57299k8295k51146q98977k61220J974321M065150M412171
7382i22866K888909M1861l197784m866616l159892R10579L751098L106188N07453
7373i41070r90674k35785J738892L518199M132791L049726P41328j185517j584693
7364H243197j252811j864326l584366m649926l460385m86674K149682K786639
$$ plain form
7356 -2118970 -351081 471336 1391412 2585603 3054974 2355498 1652115 2100961 2754985
7347 2754985 1433544 -2175180 -5461672 -5624189 -2844038 -72933 106738 -2049761 -3973227
7338 -3973227 -3425048 -713704 1448758 344523 -4254141 -9860596 -13444175 -13666090 -11103707
7329 -11103707 -6959451 -2251423 1898559 4251685 4562426 4323591 5374317 7587799
7321 7587799 8890882 8060674 6464713 5981467 6073536 4656413 1646259 -434643 -19607
7312 -19607 1280512 1302128 453034 213983 -229615 -3052512 -7552433 -9712605 -7166102
7303 -7166102 -2471540 236291 320463 314167 1467804 2106941 582320 -2323835 -4817155
7294 -4817155 -6234870 -6496532 -4772692 -673899 3624897 4551681 1158918 -3397002 -5400680
$$ packed form
7356b118970J767889Q22417R20076J194191M69371o99476p03383M48846O54024
7347B754985j321441l608724l286492j62517K780151K771105J79671k156499j923466
7338c973227N48179K711344K162462j104235m598664n606455l583579k21915K562383
7329a1103707M144256M708028M149982K353126L10741k38835J050726K213482
7321G587799J303083q30208j595961m83246R2069j417123l010154k080902M15036
7312a9607J300119K1616q49094k39051m43598k822897m499921k160172K546503
7303g166102M694562K707831Q4172o296J153637O39137j524621k906155k493320
7294d817155j417715k61662J723840M098793M298796R26784l392763m555920k003678
$$ plain form
7285 -5400680 -4629618 -3672053 -4002418 -4555309 -4220252 -3689356 -3623764 -2489766 1693828
7276 1693828 7790821 11847419 11564427 8743141 6165891 3652526 -742156 -6458716
7268 -6458716 -10078719 -9754820 -7607552 -6361079 -5616461 -3580603 -989705 -354902 -1677262
7259 -1677262 -2046135 -205446 1353768 340990 -1849158 -2831144 -3320047 -5458935 -8161210
7250 -8161210 -7663845 -3030580 1973538 3688646 2919372 2959054 4994754 7314115 8118570
7241 8118570 7321847 5737897 3812108 1482519 -1195079 -3481435 -4206787 -3107753 -1811772
7232 -1811772 -2592671 -5912037 -9954849 -12664892 -13247090 -11667424 -8220058 -4181117 -1430430
7223 -1430430 -462468 140776 1488296 2859216 3215226 2794057 2104732 853448 -716813
$$ packed form
7285e400680P71062R57565l30365n52891L35057N30896O5592J133998M183594
7276A693828O096993M056598k82992k821286k577250k513365m394682n716560
7268f458716l620003L23899K147268J246473P44618K035858K590898O34803j322360
7259a677262l68873J840689J559214j012778k190148r81986m88903k138888k702275
7250h161210M97365M633265N004118J715108p69274L9682K035700K319361Q04455
7241H118570p96723j583950j925789k329589k677598k286356p25352J099034J295981
7232a811772p80899l319366m042812k710043n82198J579666L447366M038941K750687
7223a430430R67962O03244J347520J370920L56010m21169o89325j251284j570261
$$ plain form
7214 -716813 -972578 748101 2253490 1167186 -1625830 -3678495 -5181723 -8376125 -12982041
7205 -12982041 -15568872 -14286065 -11342593 -9538214 -8859889 -8060307 -7274124 -7009778 -6337974
7196 -6337974 -4369347 -2325658 -1949078 -2790907 -3286938 -3704120 -5427613 -7628509 -7545275
7187 -7545275 -4706583 -2231227 -2568250 -4126787 -4072217 -2802942 -3019759 -4931958 -5197522
7178 -5197522 -1400667 4412108 7976240 7451579 4594883 2092114 1079604 1034169 861117
7169 861117 -149646 -1736250 -2860092 -2880401 -2399955 -2530107 -3640467 -5303709 -6878006
7160 -6878006 -7414245 -5835180 -2508045 85059 52007 -917313 531380 4368301 6507079
7151 6507079 4085807 -783826 -3921745 -3895729 -2335555 -979390 -251591 165994 881262
$$ packed form
7214g16813k55765J720679J505389j086304k793016k052665j503228l194402m605916
7205a2982041k586831J282807K943472J804379O78325P99582P86183K64346O71804
7196f337974J968627K043689L76580q41829m96031m17182j723493k200896Q3234
7187g545275K838692K475356l37023j558537N4570J269275k16817j912199k65564
7178e197522L796855N812775L564132n24661k856696k502769j012510m5435j73052
7169H61117j010763j586604j123842k0309M80446j30152j110360j663242j574297
7160f878006n36239J579065L327135K593104l3052r69320J448693L836921K138778
7151F507079k421272m869633l137919K6016J560174J356165P27799M17585P15268
$$ plain form
7142 881262 2216825 3186459 2268074 25324 -908123 283085 985498 -695352 -2657961
7133 -2657961 -2373949 -1348262 -2401058 -4396240 -4132768 -2497142 -3744143 -8356967 -11420837
7124 -11420837 -9457582 -4783513 -1304958 381800 1559654 2186927 1567349 4448
7116 4448 -2110948 -4818168 -6878113 -6221377 -3703040 -3372818 -6726724 -9628459 -7879449
7107 -7879449 -3318378 -926319 -1752845 -2512852 -1227440 474164 673185 -289566 -1150861
7098 -1150861 -1517043 -1751249 -2240823 -2816672 -2338961 202671 3446965 4159767 1279495
7089 1279495 -2304285 -3562882 -2844673 -1683607 296136 3307679 4656592 2112918
7081 2112918 -1518023 -1691524 726663 390705 -4172996 -7923077 -6436230 -1551486 2186297
$$ packed form
7142H81262J335563R69634r18385k242750r33447J191208P02413j680850j962609
7133b657961K84012J025687j052796j995182K63472J635626j247001m612824l063870
7124a1420837J963255M674069L478555J686758J177854O27273o19578j562901
7116D448k115396k707220k059945O56736K518337L30222l353906k901735J749010
7107g879449M561071K392059q26526p60007J285412J701604J99021r62751q61295
7098a150861l66182k34206m89574n75849M77711K541632L244294P12802k880272
7089A279495l583780j258597P18209J161066J979743L011543J348913k543674
7081B112918l630941j73501K418187l35958m563701l750081J486847M884744L737783
$$ plain form
7072 2186297 3195238 2301968 -662577 -6236154 -12382100 -15208159 -13015613 -8157446
7064 -8157446 -4495658 -3663860 -4083400 -3486604 -1921001 -1323351 -2102330 -2046587 118248
7055 118248 2055817 990384 -1983587 -3618988 -3358781 -3065358 -2684209 -299436 3172950
7046 3172950 3524889 -1013680 -6837964 -9413268 -8026369 -4746389 -1337345 1188517
7038 1188517 2274738 2664507 3726098 5132751 5431386 5262838 6823843 9401565 9334908
7029 9334908 5910388 3100529 3133957 2702369 -1047442 -4813073 -3896363 435304 3192364
7020 3192364 2958548 1961881 655632 -2348695 -5717455 -6076202 -3382570 -969032 -39698
7011 -39698 1205160 2530328 835232 -4153500 -8049997 -7992899 -6759174 -8048728 -10980461
$$ packed form
7072B186297J008941q93270k964545n573577o145946k826059K192546M858167
7064h157446L661788Q31798m19540N96796J565603N97650p78979N5743K164835
7055A18248J937569j065433k973971j635401K60207K93423L81149K384773L472386
7046C172950L51939m538569n824284k575304J386899L279980L409044K525862
7038A188517J086221L89769J061591J406653K98635j68548J561005K577722o6657
7029I334908l424520k809859L3428m31588l749811l765631R16710M331667K757060
7020C192364k33816r96667j306249l004327l368760l58747K693632K413538R29334
7011c9698J244858J325168j695096m988732l896497N7098J233725j289554k931733
$$ plain form
7002 -10980461 -12314082 -11597162 -10869401 -10816865 -10128202 -7866148 -4307267 -111310 3652361
6993 3652361 5442673 4770421 3138741 2279577 2220314 2003339 1184971 -382096 -2912624
6984 -2912624 -5619182 -6643246 -5406266 -3641163 -2619482 -958551 2834637 7130775
6976 7130775 9075525 8822698 9075517 10703345 11668127 10649117 8988292 7986531 6559961
6967 6559961 3170446 -1421738 -4897928 -5910950 -4609610 -1586057 2214435 5103856
6959 5103856 5750767 4710840 3731089 3412821 2499126 -355310 -4935743 -9784587 -13382171
6950 -13382171 -14771782 -13897266 -11920309 -10588746 -10586739 -10864305 -10210477 -9106683 -9175470
6941 -9175470 -10860920 -12514695 -12141611 -9647536 -7077182 -6711437 -8804030 -10962312 -10088639
$$ packed form
7002a0980461j333621P16920P27761N2536O88663K262054L558881M195957L763671
6993C652361J790312o72252j631680q59164n9263k16975q18368j567067k530528
6984b912624k706558j024064J236980J765103J021681J660931L793188M296138
6976G130775J944750k52827K52819J627828R64782j019010j660825j001761j426570
6967F559961l389515m592184l476190j013022J301340L023553L800492K889421
6959E103856O46911j039927r79751l18268r13695k854436m580433m848844l597584
6950a3382171j389611Q74516J976957J331563K007k77566O53828J103794o8787
6941i175470j685450j653775L73084K494075K570354L65745k092593k158282Q73673
$$ plain form
6932 -10088639 -5490938 97980 3148027 2768882 952486 -109457 179122 1411630
6924 1411630 2959887 3788211 2958248 1057703 -81412 150637 217039 -1049112 -2305532
6915 -2305532 -1523679 930973 2574315 1674372 -1420620 -5267154 -8316512 -9455257 -8974418
6906 -8974418 -8576390 -9086801 -8869759 -6314754 -3225848 -3159633 -6178574 -7932017 -5139894
6897 -5139894 126575 3285581 2807542 951066 -194759 -1141927 -3140756 -5526383 -6119594
6888 -6119594 -3962686 -730091 1085042 1041986 968195 2163583 3536092 3428721 2272953
6879 2272953 1784248 1983361 1049613 -1548657 -3741261 -3684814 -2401522 -2161059 -3079285
6870 -3079285 -2863378 117985 4557763 7273391 6128209 1835100 -2819348 -5318006
$$ packed form
6932a0088639M597701N588918L050047l79145j816396j061943K88579J232508
6924A411630J548257Q28324q29963j900545j139115K32049O6402j266151j256420
6915b305532P81853K454652J643342q99943l094992l846534l049358j138745M80839
6906h974418L98028n10411K17042K555005L088906O6215l018941j753443K792123
6897e139894N266469L159006m78039j856476j145825r47168j998829k385627n93211
6888f119594K156908L232595J815133m3056p3791J195388J372509j07371j155768
6879B272953m88705J99113r33748k598270k192604N6447J283292K40463r18226
6870c079285K15907K981363M439778K715628j145182m293109m654448k498658
$$ plain form
6862 -5318006 -4976122 -2595703 529310 2932603 3390845 2120641 918958 970444 1212183
6853 1212183 261136 -961182 -723323 -57044 -1896016 -6176903 -8811787 -7001496 -3052597
6844 -3052597 -972303 -1405178 -2303845 -2850220 -3757390 -4593529 -3902649 -1991362 -832394
6835 -832394 -629341 1018851 5283251 9360198 9369747 5112274 264355 -1956012 -1860320
6826 -1860320 -1707243 -2377981 -2847456 -2459840 -2047758 -2164671 -1631920 730788 3792181
6817 3792181 5287563 4862810 3965534 2920202 605489 -2550311 -4096219 -3444772 -3616527
6808 -3616527 -6990547 -11420857 -13100486 -11622143 -9388115 -7342774 -4620013 -1827528
6800 -1827528 -1114023 -2524351 -3320269 -1833016 454188 1510311 1103541 -359696 -2873527
$$ packed form
6862e318006L41884K380419L125013K403293M58242j270204j201683N1486K41739
6853A212183r51047j222318K37859O66279j838972m280887k634884J810291L948899
6844c052597K080294m32875q98667n46375r07170q36139O90880J911287J158968
6835h32394K03053J648192M264400M076947R549m257473m847919k220367R5692
6826a860320J53077o70738m69475L87616M12082j16913N32751K362708L061393
6817C792181J495382m24753q97276j045332k314713l155800j545908O51447j71755
6808c616527l374020m430310j679629J478343K234028K045341K722761K792485
6800a827528P13505j410328p95918J487253K287204J056123m06770j463237k513831
$$ plain form
6791 -2873527 -5290170 -4953450 -807694 4599752 7960341 8826004 8832731 8692062 7987452
6782 7987452 7029566 6680018 6627337 5812493 4524213 4192031 4837042 4499887 1866557
6773 1866557 -1954546 -5073853 -7014413 -8261482 -8663739 -7709212 -5935538 -4536918 -3442267
6764 -3442267 -1261531 2121460 4193283 2575157 -1329395 -3233577 -929829 3141219
6756 3141219 5118702 4117496 2020446 124880 -1746159 -3133773 -2583898 -272962
6748 -272962 1175477 99828 -1492824 -606126 2236165 3353321 666849 -3919768 -7283297
6739 -7283297 -8386176 -7983523 -6668563 -4695251 -2863739 -2034834 -2002945 -2012383 -2177134
6730 -2177134 -3205544 -4802319 -5644476 -5178600 -4221900 -3360914 -1990002 337915 2730570
$$ packed form
6791b873527k416643L36720M145756N407446L360589Q65663O727j40669p04610
6782G987452r57886l49548n2681q14844j288280l32182O45011l37155k633330
6773A866557l821103l119307j940560j247069m02257R54527J773674J398620J094651
6764c442267K180736L382991K071823j618126l904552j904182K303748M071048
6756C141219J977483j001206k097050j895566j871039j387614N49875K310936
6748b72962J448439j075649j592652Q86698K842291J117156k686472m586617l363529
6739g283297j102879M02653J314960J973312J831512Q28905L1889r438j64751
6730b177134j028410j596775q42157M65876R56700Q60986J370912K327917K392655
$$ plain form
6721 2730570 4110065 4627113 4832707 4338115 2752818 1343873 2007985 4620950 6963815
6712 6963815 7488011 6772535 5980653 5280823 4281970 2789962 595178 -2370921 -5213361
6703 -5213361 -6602887 -6601679 -6652672 -7188400 -6766318 -4505580 -1924397 -1085708 -2046172 -3408152
6693 -3408152 -4399203 -5132843 -5729720 -6457384 -7884864 -9682569 -10214271 -8608043 -6228664
6684 -6228664 -4731803 -3820140 -2550676 -1572713 -1895827 -2433326 -1319537 790526 1267280
6675 1267280 -764204 -3647651 -6152045 -8665973 -11049928 -11807567 -10354620 -8208165
6667 -8208165 -7040135 -7094374 -8027590 -9545020 -10627430 -9959610 -7840134 -5973918 -4846628
6658 -4846628 -3295901 -1354208 -1141439 -3544927 -6068921 -5824564 -3276055 -1318644 -1633004
$$ packed form
6721B730570J379495N17048K05594m94592j585297j408945O64112K612965K342865
6712F963815N24196p15476p91882o99830r98853j492008k194784k966099k842440
6703e213361j389526J208n0993n35728M22082K260738K581183Q38689r60464j361980
6693c408152r91051p33640n96877p27664j427480j797705n31702J606228K379379
6684f228664J496861R11663J269464R77963l23114n37499J113789K110063M76754
6675A267280k031484k883447k504394k513928k383955p57639J452947K146455
6667h208165J168030n4239r33216j517430j082410O67820K119476J866216J127290
6658d846628J550727J941693K12769k403488k523994K44357K548509J957411l14360
$$ plain form
6649 -1633004 -3364233 -4561400 -3783329 -1124861 1437038 1627530 -561723 -3038585 -4654164
6640 -4654164 -6175441 -7567558 -6903789 -3773385 -1541363 -3675992 -9093799 -13393041
6632 -13393041 -13705792 -10397231 -5268240 -465536 1814796 1148542 8761 929691 3117111
6623 3117111 4041223 3603633 3957145 5438322 5619915 2949110 -1045089 -3857828 -4414859
6614 -4414859 -2944875 -388542 1549113 1561982 463288 122366 532206 -68714 -1967865
6605 -1967865 -3357250 -3613117 -4503322 -6752756 -7975187 -6162120 -3253421 -2644900 -4325161
6596 -4325161 -5151435 -3520242 -1282237 -799932 -2151815 -3868920 -4852619 -4703484 -3300249
6587 -3300249 -1128555 495212 481604 -766552 -1736061 -1611574 -1331661 -2466520 -5047523
$$ packed form
6649a633004j731229j197167P78071K658468K561899J90492k189253k476862j615579
6640d654164j521277j392117O63769L130404K232022k134629n417807m299242
6632a3393041l12751L308561N128991M802704K280332o66254j139781R20930K187420
6623C117111R24112m37590L53512J481177J81593k670805l994199k812739n57031
6614d414859J469984K556333J937655J2869j098694l40922M09840o00920j899151
6605a967865j389385k55867q90205k249434j222431J813067K908699O08521j680261
6596d325161q26274J631193K238005M82305j351883j717105r83699J49135J403235
6587c300249K171694J623767j3608j248156r69509J24487K79913j134859k581003
$$ plain form
6578 -5047523 -6900878 -5583123 -1102266 3508018 4663846 1606486 -2587468 -3788970
6570 -3788970 -1168840 1541259 160210 -4568796 -7248895 -4299462 1357651 3780469
6562 3780469 1254654 -2121691 -2004238 1252151 3925439 3414558 168772 -3675813 -6080735
6553 -6080735 -5928564 -3448583 -291777 1343551 269112 -2698699 -5410865 -6513954
6545 -6513954 -6933339 -8481700 -10814512 -11110757 -7776079 -3151489 -781168 -842701 -501452
6536 -501452 1484587 3020881 2081990 -345951 -1854415 -1588008 -517032 85262 -553293
6527 -553293 -2497407 -4921971 -6862989 -8406606 -10005536 -10528888 -7841427 -2105120 3234761
6518 3234761 4944922 3192833 336367 -1916386 -3006401 -2865982 -2371136 -3132615 -5198978
$$ packed form
6578e047523j853355J317755M480857M610284J155828l057360m193954j201502
6570c788970K620130K710099j381049m729006k680099K949433N657113K422818
6562C780469k525815l376345J17453L256389K673288n10881l245786l844585k404922
6553f080735J52171K479981L156806J635328j074439k967811k712166j103089
6545f513954m19385j548361k332812k96245L334678M624590K370321o1533L41249
6536e01452J986039J536294r38891k427941j508464K66407J070976O02294o38555
6527e53293j944114k424564j941018j543617j598930n23352K687461N736307N339881
6518C234761J710161j752089k856466k252753j090015J40419M94846p61479k066363
$$ plain form
6509 -5198978 -6166915 -4302510 -1420942 -722290 -2620954 -4694608 -5097787 -4002650 -2117240
6500 -2117240 162333 2253438 3844965 5756341 8728632 11632597 12618033 11772152 10747626
6491 10747626 9981796 8451493 6230682 4904109 4854895 4351319 2263889 -256378 -1913459
6482 -1913459 -3264351 -5159889 -6686117 -6402302 -4763360 -3647177 -3815887 -4206820 -3708221
6473 -3708221 -2573370 -1805894 -1714583 -1432385 90546 2618319 4450651 4091822 1831512
6464 1831512 -821956 -2853502 -4139459 -4646206 -4344771 -3628372 -2715242 -1109434 977377
6455 977377 1406081 -1466306 -5371130 -5851787 -1974690 2327330 3590755 2701277 1885734
6446 1885734 848449 -1305275 -2622521 -477662 3764705 5826403 4227713 1803929
$$ packed form
6509e198978r67937J864405K881568O98652j898664k073654m03179J095137J885410
6500b117240K279573K091105J591527J911376K972291K903965R85436q45881j024526
6491A0747626p65830j530303k220811j326573m9214n03576k087430k520267j657081
6482a913459j350892j895538j526228K83815J638942J116183j68710l90933M98599
6473c708221J134851P67476R1311K82198J522931K527773J832332l58829k260310
6464A831512k653468k031546j285957n06747L01435P16399R13130J605808K086811
6455I77377M28704k872387l904824m80657L877097M302020J263425q89478q15543
6446A885734j037285k153724j317246K144859M242367K061698j598690k423784
$$ plain form
6438 1803929 1085822 1090131 -159929 -2249925 -3142584 -2062006 -337290 -13327 -2157057
6429 -2157057 -5764915 -8140602 -7387810 -4656579 -2670171 -1957735 -275280 3695226 7915347
6420 7915347 9448582 8011125 5724233 4202383 3135787 1234201 -2399114 -7434197
6412 -7434197 -12194492 -14858778 -15203976 -14462544 -13299110 -11291580 -8946612 -8378412 -10498103
6403 -10498103 -12930507 -12589995 -9435248 -5858496 -3195396 -982448 860111 1629922
6395 1629922 1844261 3314338 6414705 9034216 9080079 6593571 2790561 -1266117 -4086978
6386 -4086978 -3675499 233427 4850281 6923520 6229060 5232716 5759025 7300982 8350044
6377 8350044 8036147 6298475 3507856 402384 -2025912 -2850316 -1549910 1380831 3910809
$$ packed form
6438A803929p18107M309j250060k089996q92659J080578J724716L23963k143730
6429b157057l607858k375687P52792K731231J986408P12436J682455L970506M220121
6420G915347J533235j437457k286892j521850j066596j901586l633315n035083
6412g434197m760295k664286l45198P41432J163434K007530K344968N68200k119691
6403a0498103k432404L40512L154747L576752K663100K212948J842559P69811
6395A629922K14339J470077L100367K619511M5863k486508l803010m056678k820861
6386d086978M11479L908926M616854K073239o94460r96344N26309J541957J049062
6377H350044l13897j737672k790619l105472k428296q24404J300406K930741K529978
$$ plain form
6368 3910809 3543762 -80664 -4215470 -5783120 -4856884 -4228834 -5643069 -7781721 -8306844
6359 -8306844 -6701881 -4307192 -2247693 -312598 2055623 4255739 4609789 2296469
6351 2296469 -1088259 -2825062 -2271916 -1757848 -3398823 -5990964 -6602304 -4731330 -2910610
6342 -2910610 -2973908 -3760678 -3518520 -2864859 -3643238 -5704223 -6663542 -4835056 -1027140
6333 -1027140 2752623 5130202 5466732 3438845 -190392 -2893292 -2153000 1361710 3507952
6324 3507952 939913 -4661703 -8188627 -7162931 -4417771 -3735407 -4690703 -4087294 -1487745
6315 -1487745 -248537 -2577425 -6285976 -7948171 -7336176 -6789122 -7395543 -7929491 -7206265
6306 -7206265 -5667668 -4424574 -3951683 -4018875 -4193398 -4379584 -5348768 -8267332 -12812563
$$ packed form
6368C910809l67047l624426m134806j567650R26236O28050j414235k138652n25123
6359h306844J604963K394689K059499J935095K368221K200116L54050k313320
6351B296469l384728j736803N53146N14068j640975k592141o11340J870974J820720
6342b910610o3298p86770K42158O53661p78379k060985r59319J828486L807916
6333a027140L779763K377579L36530k027887l629237k702900P40292L514710K146242
6324C507952k568039n601616l526924J025696K745160O82364r55296O03409K599549
6315a487745J239208k328888l708551j662195O11995N47054o06421n33948P23226
6306g206265J538597J243094M72891o7192j74523j86186r69184k918564m545231
$$ plain form
6297 -12812563 -16203869 -15394698 -10312355 -3921173 980377 3972959 5945579 7188554
6289 7188554 7367258 6540506 5191720 3551658 1742912 549024 1185678 3837686 6854998
6280 6854998 8089880 7105162 5519652 4984233 5518319 6341286 7385261 8657289 8720314
6271 8720314 5910308 1439665 -874066 723990 3243945 2753391 -378155 -2263162
6263 -2263162 -922577 1496297 2140646 926417 -255718 -224293 728854 1855172 2717551
6254 2717551 3254028 3571862 3539828 2684059 959587 -647092 -1039961 -270393 969614
6245 969614 2590206 4497923 5185513 2907124 -1427408 -4417297 -3987054 -1456734 965846
6236 965846 2994041 5283116 7196540 7378969 5820789 3805908 2236509 1218979 791336
$$ packed form
6297a2812563l391306Q09171N082343O391182M901550K992582J972620J242975
6289G188554J78704q26752j348786j640062j808746j193888O36654K652008L017312
6280F854998J234882r84718j585510n35419N34086Q22967J043975J272028O3025
6271H720314k810006m470643k313731J598056K519955m90554l131546j885007
6263b263162J340585K418874O44349j214229j182135L1425R53147J126318Q62379
6254B717551N36477L17834l2034q55769j724472j606679l92869P69568J240007
6245I69614J620592J907717O87590k278389m334532k989889M30243K530320K422580
6236I65846K028195K289075J913424J82429j558180k014881j569399j017530m27643
$$ plain form
6227 791336 813335 546335 -459079 -1400531 -1252466 -307938 558358 1697239 4080043
6218 4080043 6844650 7216502 3741051 -1454452 -4620821 -4257084 -2424751 -2372221 -5232562
6209 -5232562 -9013434 -10565178 -8380850 -3585924 1238699 3661324 2420830 -1730484
6201 -1730484 -5907903 -7127521 -5178264 -2479810 -599611 1583127 5272860 9064400
6193 9064400 10634253 9806676 7877412 5059179 1172127 -1918682 -1658557 1381517 4034723
6184 4034723 5224514 6921683 9601935 10376427 7691503 4690756 4919218 7029378 7127690
6175 7127690 4707753 2513492 1409396 -562109 -3809467 -5703890 -4682784 -2820183
6167 -2820183 -2712717 -4158892 -5545815 -6472264 -7220697 -7363837 -6782634 -6654481 -7568528
$$ packed form
6227G91336K1999k67000j005414r41452J48065R44528Q66296J138881K382804
6218D080043K764607L71852l475451n195503l166369L63737J832333N2530k860341
6209e232562l780872j551744K184328M794926M824623K422625j240494m151314
6201a730484m177419j219618J949257K698454J880199K182738L689733L791540
6193I064400J569853q27577j929264k818233l887052l090809K60125L040074K653206
6184D034723J189791J697169K680252P74492k684924l000747K28462K110160R8312
6175G127690k419937k194261j104096j971505l247358j894423J021106J862601
6167b820183J07466j446175j386923r26449p48433j43140N81203J28153r14047
$$ plain form
6158 -7568528 -7966471 -6436870 -4299295 -3574875 -3431194 -1482116 1810151 3160783 1304020
6149 1304020 -1165803 -1888900 -1956078 -3273981 -5009991 -5118069 -4010538 -4073201 -6026195
6140 -6026195 -8114646 -8942450 -9095986 -9577165 -10244177 -10326709 -9284136 -6858649 -3488684
6131 -3488684 -865032 -642934 -2193864 -3100777 -2393058 -1581331 -1631021 -972553 1622171
6122 1622171 3840934 2275676 -2453599 -5888882 -5522773 -3798263 -4066713 -5757979 -5687066
6113 -5687066 -2886046 324986 1834577 2036292 2112377 1888322 506193 -1952574 -4687897
6104 -4687897 -7226096 -9157434 -9623387 -8471903 -7376345 -8036258 -9299634 -8013731 -3338759
6095 -3338759 1598752 3446493 2435485 1042552 392036 61027 363594 2154128 4525088
$$ packed form
6158g568528l97943J529601K137575P24420J43681J949078L292267J350632j856763
6149A304020k469823p23097o7178j317903j736010j08078J107531o2663j952994
6140f026195k088451q27804j53536m81179o67012q2532J042573K425487L369965
6131c488684K623652K22098j550930r06913P07719Q11727m9690O58468K594724
6122A622171K218763j565258m729275l435283L66109J724510k68450j691266P0913
6113e687066K801020L211032J509591K01715P6085k24055j382129k458767k735323
6104d687897k538199j931338m65953J151484J095558o59913j263376J285903M674972
6095c338759M937511J847741j011008j392933o50516l31009L02567J790534K370960
$$ plain form
6086 4525088 5247969 3859876 1997705 247417 -2646776 -6409458 -7981025 -5720188
6078 -5720188 -2528985 -2152737 -4102872 -5204567 -4878780 -5403883 -7341096 -8267543 -6614697
6069 -6614697 -3739774 -1310353 651278 2107689 2099122 895186 589645 1952234 3008834
6060 3008834 2432468 1788721 2235275 1741332 -1275350 -3995498 -3036557 -607824 -1848017
6051 -1848017 -6398171 -8071216 -4172797 12174 -1227621 -6249954 -9467259 -9186962
6043 -9186962 -7671263 -5706635 -2248245 1195408 833754 -3872903 -8853437 -10804664
6035 -10804664 -10577147 -9927836 -8440582 -5858551 -4395846 -5718775 -7669430 -7023233 -4073498
6026 -4073498 -1542244 -201399 1077684 1663352 -626303 -5278230 -8550163 -8317831 -6537398
$$ packed form
6086D525088P22881j388093j862171j750288k894193l762682j571567K260837
6078e720188L191203L76248j950135j101695L25787n25103j937213r26447J652846
6069f614697K874923K429421J961631J456411q567j203936l05541J362589J056600
6060C008834n76366o43747M46554m93943l016682k720148R58941K428733j240193
6051a848017m550154j673045L898419M184971j239795n022333l217305K80297
6043i186962J515699J964628L458390L443653l61654m706657m980534j951227
6035a0804664K27517O49311J487254K582031J462705j322929j950655O46197K949735
6026d073498K531254J340845J279083N85668k289655m651927l271933K32332J780433
$$ plain form
6017 -6537398 -5547332 -4796535 -3191003 -2075269 -3107964 -4848043 -4420346 -1807823 179819
6008 179819 -102785 -1597103 -2951345 -4149199 -5309362 -5775167 -5055902 -3376472 -1063775
5999 -1063775 1302530 2240237 655517 -2088587 -3376571 -2990764 -3408038 -5757222 -7845487
5990 -7845487 -7535954 -5879861 -5033036 -4920342 -4175152 -2884766 -1913853 -635192 1915352
5981 1915352 4320787 4197008 2201789 1587995 3248281 4148007 1854958 -1939549 -4004405
5972 -4004405 -3557601 -1953234 -294929 614157 -424393 -3328746 -5450481 -4493802 -2078196
5963 -2078196 -1742857 -3582679 -3742402 44548 4964974 6599274 4069260 75093 -2945741
5954 -2945741 -4840793 -6383285 -7503411 -7194946 -4580184 -68251 4376710 6738222
$$ packed form
6017f537398R90066P50797J605532J115734j032695j740079M27697K612523J987642
6008A79819k82604j494318j354242j197854j160163m65805P19265J679430K312697
5999a063775K366305R37707j584720k744104j287984L85807m17274k349184k088265
5990g845487L09533J656093Q46825J12694P45190J290386R70913J278661K550544
5981A915352K405435j23779j995219o13794J660286Q99726k293049l794507k064856
5972d004405M46804J604367J658305R09086j038550k904353k121735R56679K415606
5963b078196L35339j839822j59723L786950M920426J634300k530014l994167l020834
5954b945741j895052j542492j120126L08465K614762M511933M444961K361512
$$ plain form
5946 6738222 7158658 7860605 10147608 12361070 12004519 9308746 7183040 7643969 9651813
5937 9651813 10795330 9951576 7744096 5328685 3478124 2315227 1320679 -55633 -1428895
5928 -1428895 -1639229 -334932 1162434 1236102 -196008 -1958275 -3337223 -4478022 -5081292
5919 -5081292 -3965044 -705304 2974630 4445879 2727213 -832637 -4208744 -6131064
5911 -6131064 -5908550 -3257511 715608 3324134 2630439 -222681 -2431076 -3314502 -5000734
5902 -5000734 -8712821 -12111706 -11808848 -7462173 -1765150 2938938 6289223 8537107
5894 8537107 9507464 9291917 8568935 7830800 7266594 7278307 7759132 7121221 4016655 160582
5884 160582 -955559 999711 1983929 -1136360 -6193002 -8654207 -7283501 -4531980 -2578720
$$ packed form
5946F738222M20436P01947K287003K213462l56551k695773k125706M60929K007844
5937I651813J143517q43754k207480k415411j850561j162897r94548j376312j373262
5928a428895k10334J304297J497366P3668j432110j762267j378948j140799o03270
5919e081292J116248L259740L679934J471249j718666l559850l376107j922320
5911f131064K22514K651039L973119K608526o93695k853120k208395q83426j686232
5902e000734l712087l398885L02858M346675N697023M704088L350285K247884
5894H537107R70357k15547p22982p38135n64206J1713M80825o37911l104566l856073
5884A60582j116141J955270R84218l120289n056642k461205J370706K751521J953260
$$ plain form
5875 -2578720 -1651123 -1623411 -2547565 -3481137 -2957073 -921548 1330381 2930739 3567380
5866 3567380 2564814 87870 -1358421 500230 3776293 4252271 1486935 -419723
5858 -419723 821634 2296973 803689 -2368522 -4424518 -5790813 -8177249 -10108081
5850 -10108081 -8642613 -4590280 -1910903 -2012394 -2366733 -1212806 -108986 -716120 -2052283
5841 -2052283 -2542894 -2604098 -3607209 -5795222 -8359223 -10212224 -9948601 -6719334 -2056953
5832 -2056953 861856 835534 -44228 310546 1150117 716136 -794248 -1887693 -2150419
5823 -2150419 -2101845 -1559982 8927 2038646 3413914 4177576 5303906 6982788 8262073
5814 8262073 8197123 6583618 4073601 2228740 2487463 4167935 4703984 3049015 1380324
$$ packed form
5875b578720R27597K7712r24154r33572N24064K035525K251929J600358O36641
5866C567380j002566k476944j446291J858651L276063M75978k765336j906658
5858d19723J241357J475339j493284l172211k055996j366295k386436j930832
5850a0108081J465468M052333K679377j01491l54339J153927J103820o07134j336163
5841b052283m90611o1204j003111k188013k564001j853001K63623L229267M662381
5832b056953K918809k6322q79762L54774Q39571m33981j510384j093445k62726
5823b150419M8574N41863J568909K029719J375268P63662J126330J678882J279285
5814H262073o4950j613505k510017j844861K58723J680472N36049j654969j668691
$$ plain form
5805 1380324 1725012 2442633 526434 -3661665 -6787310 -7129182 -5835697 -3844576 -834237
5796 -834237 2307202 3273161 1764805 231537 -192427 -1633445 -5517349 -9371995 -10073666
5787 -10073666 -8175258 -6264961 -4644587 -1659478 2552410 5562905 5789594 3984758
5779 3984758 1808496 698044 1574326 3707326 4499936 2533661 187252 835058 4034256
5770 4034256 6287822 6252780 5947535 6557984 6591120 5287929 4475879 5165373 5243579 2940769
5760 2940769 175912 -343765 411854 -750979 -4338041 -7624638 -8650382 -8104388 -7104957
5751 -7104957 -5454424 -2808083 25637 1787292 2053730 1565243 1650119 2920454 4070180
5742 4070180 2937410 -370631 -2781292 -2251174 -1052822 -2626345 -6020371 -6603181 -2547397
$$ packed form
5805A380324L44688P17621j916199m188099l125645l41872J293485J991121L010339
5796h34237L141439R65959j508356j533268m23964j441018l883904l854646p01671
5787a0073666J898408J910297J620374K985109M211888L010495K26689j804836
5779C984758k176262j110452Q76282K133000P92610j966275k346409O47806L199198
5770D034256K253566l5042l05245O10449L3136j303191q12050O89494P8206k302810
5760B940769k764857n19677P55619j162833l587062l286597j025744N45994R99431
5751g104957J650533K646341K833720J761655K66438m88487Q4876J270335J149726
5742D070180j132770l308041k410661N30118J198352j573523l394026n82810M055784
$$ plain form
5733 -2547397 2450154 4097440 2633749 1265373 1345904 1381647 104392 -1518504 -1650193
5724 -1650193 88990 2141081 2693210 1694600 838316 1230249 1791420 965661 -651410
5715 -651410 -1005214 343745 1711492 1968350 1684822 1155991 -461829 -3017903 -4529803
5706 -4529803 -3993864 -3180405 -3876483 -5044884 -4834550 -3950786 -4435717 -5917969 -5787751
5697 -5787751 -3021272 492513 2620834 2958155 1901699 -232222 -2594282 -3972387
5689 -3972387 -4239826 -4356497 -4574097 -4064015 -2728692 -1837455 -2173118 -2861447 -2738455
5680 -2738455 -1707288 -160490 1670222 3133799 3250294 2165521 1249211 950587 -48322
5671 -48322 -2573457 -5371919 -7088906 -8318742 -9935135 -10703995 -8845335 -5263574 -2828770
$$ packed form
5733b547397M997551J647286j463691j368376Q0531L5743j277255j622896j31689
5724a650193J739183K052091N52129r98610q56284L91933N61171q25759j617071
5715f51410l53804J348959J367747K56858k83528n28831j617820k556074j511900
5706d529803N35939Q13459o96078j168401K10334Q83764m84931j482252J30218
5697e787751K766479L513785K128321L37321j056456k133921k362060j378105
5689c972387k67439j16671k17600N10082J335323Q91237l35663o88329J22992
5680b738455J031167J546798J830712J463577J16495j084773r16310k98624r98909
5671d8322k525135k798462j716987j229836j616393p68860J858660L581761K434804
$$ plain form
5662 -2828770 -2611823 -3119653 -3393308 -4444216 -6825950 -8912455 -8934460 -7285045 -5519080
5653 -5519080 -4197677 -2963496 -1778191 -764821 467553 2071502 3089004 2586876
5645 2586876 1270473 724521 1261781 1714517 1311908 639250 535647 837261 388376
5636 388376 -2124480 -7019248 -12612637 -15836563 -14874065 -10957128 -6749841 -3586435 -1455590
5627 -1455590 -736620 -1822316 -3397891 -3624595 -3294184 -5127847 -9103051 -11311073 -9140909
5618 -9140909 -5033095 -2711920 -1838350 519100 4433220 6606067 5160934 1986432
5610 1986432 -174511 -693671 -559488 -733118 -1526512 -2327128 -1944233 -472659 -166762
5601 -166762 -2630880 -5919656 -6851771 -5502391 -4347574 -3434970 -388676 4283445 6298208
$$ packed form
5662b828770K16947n07830k73655j050908k381734k086505k2005J649415J765965
5653e519080J321403J234181J185305J013370J232374J603949J017502n02128
5645B586876j316403n45952N37260M52736m02609o72658j03603L01614m48885
5636C88376k512856m894768n593389l223926R62498L916937M207287L163406K130845
5627a455590P18970j085696j575575k26704L30411j833663l975204k208022K170164
5618i140909M107814K321175Q73570K357450L914120K172847j445133l174502
5610A986432k160943n19160J34183j73630p93394q00616L82895J471574L05897
5601a66762k464118l288776r32115J349380J154817R12604L046294M672121K014763
$$ plain form
5592 6298208 3868232 960418 1621383 4302857 4972783 3233684 1894004 2380914 3957404
5583 3957404 5996944 7793191 7445388 4215063 848407 281441 1205968 507357 -963065
5574 -963065 669665 5848966 10468078 11811214 11577700 11900630 12113553 11058991 9368223
5565 9368223 7705712 5572283 3499864 3605241 6017227 7347928 4964571 712034
5557 712034 -1738331 -1401242 180107 1805977 3146816 3799495 3821018 4069580 4507243
5548 4507243 3682387 1420280 77349 1076004 2114332 379693 -3041654 -4824002 -4308775
5539 -4308775 -3700954 -3970278 -3607569 -1546971 1219356 3253925 3893730 2772364 43971
5530 43971 -2841432 -4347570 -4773906 -5264033 -5264462 -3165876 546734 3145829 3201926 2295303
$$ packed form
5592F298208k429976k907814O60965K681474O69926j739099j339680M86910J576490
5583C957404K039540J796247l47803l230325l366656n66966R24527o98611j470422
5574i63065J632730N179301M619112J343136k33514L22930K12923j054562j690768
5565I368223j662511k133429k072419J05377K411986J330701k383357m252537
5557G12034k450365L37089J581349J625870J340839O52679K1523K48562M37663
5548D507243q24856k262107j342931R98655J038328j734639l421347j782348N15227
5539d308775O07821k69324L62709K060598K766327K034569O39805j121366k728393
5530D3971k885403j506138m26336m90127m29K098586L712610K599095N6097r06623
$$ plain form
5520 2295303 2499457 3812180 4844362 4770998 3911305 3177540 3132439 2987475 1159618
5511 1159618 -2119772 -3924509 -2307792 261728 -93636 -2893651 -3938250 -1754320
5503 -1754320 373611 -159617 -1440218 -485874 2511292 5498284 7390069 7368365 4179144
5494 4179144 -981593 -3333363 259330 6595181 10083918 9855867 9083988 8445322 5130921
5485 5130921 -1236610 -6334265 -6589609 -3512280 -706513 449993 22306 -2670820 -7358457
5476 -7358457 -10768859 -9697280 -5534795 -2811601 -3289623 -4231260 -3051342 -1081315 -1197500
5467 -1197500 -3430132 -4966227 -4012319 -1860865 -769333 -1102661 -1561911 -1610896 -2274436
5458 -2274436 -4160428 -5874153 -5574369 -3621327 -2298843 -2854676 -4212249 -5058498 -5749293
$$ packed form
5520B295303K04154J312723J032182p3364q59693p33765m5101j44964j827857
5511A159618l279390j804737J616717K569520l55364k800015j044599K183930
5503a754320K127931n33228j280601R54344K997166K986992J891785k1704l189221
5494D179144n160737k351770L592693O335851L488737k28051p71879o38666l314401
5485E130921o367531n097655k55344L077329K805767J156506m27687k693126m687637
5476g358457l410402J071579M162485K723194m78022r41637J179918J970027j16185
5467a197500k232632j536095R53908K151454J091532l33328m59250m8985o63540
5458b274436j885992j713725K99784J953042J322484n55833j357573q46249o90795
$$ plain form
5449 -5749293 -7126595 -8616979 -8891480 -7692260 -5657543 -3019580 -82162 1555232
5441 1555232 301083 -2866114 -5169985 -5709464 -6209993 -7426404 -7332764 -4611188 -1746219
5432 -1746219 -2023612 -4745452 -6343888 -5714952 -5339326 -6716454 -7647170 -5461624 -849980
5423 -849980 3213690 5038687 5209072 5019940 5368082 6543081 7875870 8022537 6495079
5414 6495079 4357951 2652618 977572 -1366159 -3677361 -4570976 -3798193 -2192831 -489597
5405 -489597 507844 -598046 -4281743 -8311789 -9392807 -6878886 -3405137 -1632588 -1764911
5396 -1764911 -2416245 -2323812 -793806 1983371 4453296 4948820 4007567 3937884 5384078
5387 5384078 6039693 3901627 148957 -2761250 -4422275 -5984991 -7464422 -7834413 -7266971
$$ packed form
5449e749293j377302j490384k74501J199220K034717K637963K937418J637394
5441A555232j254149l167197k303871n39479n00529j216411R3640K721576K864969
5432a746219k77393k721840j598436O28936L75626j377128r30716K185546M611644
5423h49980M063670J824997J70385j89132L48142J174999J332789J46667j527458
5414F495079k137128j705333j675046k343731k311202q93615P72783J605362J703234
5405d89597R97441j105890l683697m030046j081018K513921L473749J772549j32323
5396a764911o51334R2433J530006K777177K469925M95524r41253o9683J446194
5387E384078O55615k138066l752670k910207j661025j562716j479431l69991N67442
$$ plain form
5378 -7266971 -6913655 -6540489 -4795583 -2192726 -1262602 -2602442 -3179271 -570374 2926179
5369 2926179 3132345 54629 -1989864 -554952 1738003 1668673 416036 1330897 4196803
5360 4196803 5221375 2936709 813283 2394811 6224183 7965539 6181983 3337497
5352 3337497 1472914 -415719 -3987611 -8533158 -11569585 -11464298 -8591088 -4606160
5344 -4606160 -1283196 461353 918077 725920 -163107 -1871166 -3295436 -3015989 -1754969
5335 -1754969 -2123488 -5093588 -8478470 -10143524 -10906195 -12353374 -13406169 -11826418 -8396996
5326 -8396996 -6489586 -7197566 -7847959 -6400793 -4613022 -4922983 -6301712 -5819614 -3218871
5317 -3218871 -1061471 -416678 798500 4128566 7386568 7096292 3234974 -400182 -656885
$$ packed form
5378g266971L53316L73166J744906K602857R30124j339840n76829K608897L496553
5369B926179K06166l077716k044493J434912K292955o9330j252637R14861K865906
5360D196803J024572k284666k123426J581528L829372J741356j783556k844486
5352C337497j864583j888633l571892m545547l036427J05287K873210L984928
5344d606160L322964J744549M56724j92157q89027j708059j424270K79447J261020
5335a754969l68519k970100l384882j665054p62671j447179j052795J579751L429422
5326h396996J907410p07980o50393J447166J787771l09961j378729M82098K600743
5317c218871K157400O44793J215178L330066L258002k90276l861318l635156k56703
$$ plain form
5308 -656885 1614360 3243562 2645257 898772 -607423 -2104626 -4305847 -6222402 -5529672
5299 -5529672 -1505664 3256037 4979544 2488924 -1773145 -4586038 -5153384 -5110892 -5998250
5290 -5998250 -7633424 -8909380 -9210630 -8544801 -6954089 -4610177 -2284328 -974547 -978711
5281 -978711 -1827780 -3107708 -4697900 -6060329 -6065689 -4120758 -1116281 1292570 2218329
5272 2218329 2023974 1584934 1651602 2827273 5403481 8775036 11368498 11730500 9864079
5263 9864079 7282450 5551749 4850298 4163878 2845601 1527723 1126016 1258079 381722
5254 381722 -2266935 -5390531 -6741661 -5359309 -2405893 85607 1018300 880952 900528
5245 900528 1650575 2464845 2230652 620978 -1720476 -4048427 -5915854 -6577380 -4985841
$$ packed form
5308f56885K271245J629202n98305j746485j506195j497203k201221j916555O92730
5299e529672M024008M761701J723507k490620m262069k812893n67346M2492q87358
5290e998250j635174j275956l01250O65829J590712K343912K325849J309781m164
5281i78711q49069j279928j590192j362429n360J944931L004477K408851R25759
5272B218329j94355m39040O6668J175671K576208L371555K593462L62002j866421
5263I864079k581629j730701p01451o86420j318277j317878m01707J32063q76357
5254C81722k648657l123596j351130J382352K953416K491500R32693j37348J9576
5245I00528P50047Q14270k34193j609674k341454k327951j867427o61526J591539
$$ plain form
5236 -4985841 -1354714 1779797 1472814 -2258408 -5988803 -6482476 -3989536 -1140161 704762
5227 704762 2536896 5147992 7105105 6249636 2357831 -2739788 -7133819 -9787151 -9959347
5218 -9959347 -7358757 -3311660 -394243 69328 -662355 -784577 -536459 -1594909 -4336943
5209 -4336943 -7053259 -7986218 -7092926 -5540944 -4373782 -4064653 -4607939 -5471818 -5917610
5200 -5917610 -5872569 -6190880 -7589351 -9454021 -10110772 -8431781 -5094276 -2066935 -653268
5191 -653268 -193503 795751 2263844 2430189 520229 -1346039 -252130 4041812 9022068
5182 9022068 12474328 14146724 14515602 13671561 11907726 9943090 7964713 5761471 4273929
5173 4273929 5291922 8611417 11178423 10624304 8358801 7317574 7606478 6559065 2771814
$$ packed form
5236d985841L631127L134511l06983l731222l730395m93673K492940K849375J844923
5227G04762J832134K611096J957113q55469l891805n097619m394031k653332j72196
5218i959347K600590M047097K917417M63571p31683j22222K48118j058450k742034
5209d336943k716316r32959Q93292J551982J167162L09129n43286q63879m45792
5200e917610M5041l18311j398471j864670o56751J678991L337505L027341J413667
5191f53268M59765R89254J468093J66345j909960j866268J093909M293942M980256
5182I022068L452260J672396L68878q44041j763835j964636j978377k203242j487542
5173D273929J017993L319495K567006n54119k265503j041227K88904j047413l787251
$$ plain form
5164 2771814 -2114821 -5912966 -8205277 -9452177 -9415025 -7711617 -5146978 -3376693 -3373298
5155 -3373298 -4690034 -6037675 -6357054 -5612412 -4693776 -4331314 -4237943 -3727256 -2851857
5146 -2851857 -2105245 -1189564 707356 3133506 4154179 2762808 624501 352960 2497325
5137 2497325 5156672 6193891 4840796 1466603 -2839537 -6174030 -6585639 -3823958
5129 -3823958 203308 3258174 4524423 4177581 2273366 -780433 -3364098 -3977938 -3552529
5120 -3552529 -4831085 -8746229 -12648662 -13152467 -9962470 -5952543 -4126323 -5445746
5112 -5445746 -8935566 -12571709 -14261252 -13175514 -10345874 -7410859 -5122758 -3724044
5104 -3724044 -3885421 -5741405 -7459009 -6673603 -3581878 -990064 -934018 -2803247 -5169214
$$ packed form
5164B771814m886635l798145k292311j246900L7152J703408K564639J770285L395
5155c373298j316736j347641l19379P44642R18636L62462R3371N10687Q75399
5146b851857P46612R15681J896920K426150J020673j391371k138307k71541K144365
5137B497325K659347J037219j353095l374193m306140l334493m11609K761681
5129c823958M027266L054866J266249l46842j904215l053799k583665o13840M25409
5120c552529j278556l915144l902433n03805L189997M009927J826220j319423
5112e445746l489820l636143j689543J085738K829640K935015K288101J398714
5104c724044j61377j855984j717604P85406L091725K591814N6046j869229k365967
$$ plain form
5095 -5169214 -7569361 -9540729 -9698689 -7388509 -4194383 -2317722 -2150984 -2656569 -3301381
5086 -3301381 -4148723 -4652724 -4050549 -2880149 -2658286 -3808902 -5009248 -4926320 -3815697
5077 -3815697 -3099229 -3864240 -5830338 -7262838 -5999720 -1411032 4332703 7595039 6535400
5068 6535400 2980296 652783 1483523 4018426 5606640 5486706 4799747 3950185 1735948
5059 1735948 -2181562 -5739444 -7115147 -7587064 -9401840 -11520027 -10396361 -5267944
5051 -5267944 118098 2033459 696612 -1453644 -3118713 -4204751 -4551276 -4589024 -5860900
5042 -5860900 -8946929 -11828572 -11956085 -9149063 -5230007 -1934926 -476307 -1691377
5034 -1691377 -4760700 -6901616 -6311689 -4625135 -4585944 -5999557 -5992654 -3028253 1031742
$$ packed form
5095e169214k400147j971368j57960K310180L194126J876661J66738n05585o44812
5086c301381q47342n04001O02175J170400K21863j150616j200346Q2928J110623
5077c815697P16468p65011j966098j432500J263118M588688N743735L262336j059639
5068F535400l555104k327513Q30740K534903J588214j19934o86959q49562k214237
5059A735948l917510l557882j375703m71917j814776k118187J123666N128417
5051e267944N386042J915361j336847k150256j665069j086038l46525l7748j271876
5042e860900l086029k881643j27513K807022L919056L295081J458619j215070
5034a691377l069323k140916N89927J686554L9191j413613O903K964401M059995
$$ plain form
5025 1031742 2908123 985011 -3214374 -5982648 -4781214 -1292229 306610 -1116070
5017 -1116070 -2000085 463829 3702890 3245839 -993291 -5079655 -6590534 -6554124 -6444887
5008 -6444887 -6490980 -7061163 -8861644 -11175454 -12026782 -10554805 -7660212 -4342860 -979439
4999 -979439 1948794 3895845 4707560 3982833 1089680 -2836607 -4622646 -2860624 -341731
4990 -341731 -341229 -2259631 -3661186 -4550070 -6057594 -6727890 -4410089 -672992 1116760
4981 1116760 1271910 2664292 4750755 3981430 431527 -1272688 1179160 4662406 5706185
4972 5706185 4403549 2002409 -1006070 -2916435 -1331846 2513986 4077424 1946175
4964 1946175 -219767 -43728 -102248 -2551142 -4540863 -2716808 1020189 2116894 -392116
$$ packed form
5025A031742J876381j923112m199385k768274J201434L488985J598839j422680
5017a116070q84015K463914L239061m57051m239130m086364j510879L6410J09237
5008f444887m6093n70183j800481k313810q51328J471977K894593L317352L363421
4999i79439K928233J947051Q11715p24727k893153l926287j786039J762022K518893
4990c41731N02j918402j401555q88884j507524o70296K317801L737097J789752
4981A116760J55150J392382K086463p69325l549903j704215K451848L483246J043779
4972E706185j302636k401140l008479j910365J584589L845832J563438k131249
4964A946175k165942J76039n8520k448894j989721J824055L736997J096705k509010
$$ plain form
4955 -392116 -3446944 -4260039 -2695939 -673459 -684951 -3447315 -6402602 -6597234 -4990277
4946 -4990277 -4854233 -6191678 -6009158 -4261514 -4277360 -6293415 -6275783 -3002107 -477186
4937 -477186 -848205 -932066 1075519 1643883 -1266886 -3444919 -1495242 762765 -1417736
4928 -1417736 -5755713 -7211292 -6172643 -6349855 -7911919 -8665645 -9163564 -10928627 -12151382
4919 -12151382 -10509058 -7864381 -7274789 -7947006 -7726014 -7441380 -8117414 -7516145 -4533902
4910 -4533902 -3156198 -6535134 -11081217 -12212749 -11748373 -13292248 -14737335 -12562513
4902 -12562513 -9554370 -10621973 -14434142 -16640422 -17676938 -19827781 -20790965 -18435862
4894 -18435862 -17524173 -22632115 -28705442 -28270968 -23738463 -22522820 -24679803 -26186957
$$ packed form
4955c92116l054828q13095J564100K022480j1492k762364k955287j94632J606957
4946d990277J36044j337445J82520J747644j5846k016055J7632L273676K524921
4937d77186l71019q3861K007585N68364k910769k178033J949677K258007k180501
4928a417736m337977j455579J038649j77212j562064p53726m97919j765063j222755
4919a2151382J642324K644677N89592o72217K20992K84634o76034O01269K982243
4910d533902J377704l378936m546083j131532M64376j543875j445087K174822
4902a2562513L008143j067603l812169k206280j036516k150843r63184K355103
4894a8435862R11689n107942o073327M34474M532505J215643k156983j507154
$$ plain form
4886 -26186957 -29191456 -36885365 -43750096 -44159799 -44460787 -51808517 -58951908 -58184291 -61022192
4877 -61022192 -80397578 -102993929 -111332900 -126166141 -181506131 -250142694 -245815132
4870 -245815132 -130034008 22562887 105416736 99555556 69932013 64485896 69670391
4863 69670391 62007469 50227848 49669932 52815664 47376664 39337682 38828636 40939203
4855 40939203 37011998 30803909 29177253 28759954 24525283 20985150 23188207 26052684
4847 26052684 23411763 18990136 18325179 18131560 13777514 9633907 11702157 16486137
4839 16486137 17134262 14953106 15261888 16937718 15568085 12717261 12930276 15067708 15139289
4830 15139289 14392708 16168037 17766784 14123435 7457857 4878497 7593431 10229769
$$ packed form
4886b6186957l004499p693909o864731m09703l00988p347730p143391P67617k837901
4877f1022192j9375386k2596351q338971j4833241n5339990o8636563M327562
4870b45815132J15781124J52596895Q2853849n861180k9623543n446117N184495
4863F9670391p662922j1779621n57916L145732n439000q038982n09046K110567
4855D0939203l927205o208089j626656m17299m234671l540133K203057K864477
4847B6052684k640921m421627o64957j93619m354046m143607K068250M783980
4839A6486137O48125k181156L08782J675830j369633k850824K13015K137432P1581
4830A5139289p46581J775329J598747l643349o665578k579360K714934K636338
$$ plain form
4822 10229769 10130759 10067992 11846639 13661140 13995363 12847007 9562385 4569762 2250155
4813 2250155 6481994 13992557 17643124 15739604 12574494 10447171 7410905 3132604
4805 3132604 633165 907155 1464857 1888679 5471033 12961152 19412902 20266496 16996925
4796 16996925 13882573 12227961 10823852 9776261 10506928 12802427 14360319 13251043
4788 13251043 9680584 5662863 3615750 4648615 7547538 9755099 9573410 7226621
4780 7226621 4255973 2526780 3129153 5188967 6346941 5479406 4159244 4198532 4869631
4771 4869631 4424653 3391850 3857502 5780632 6702798 5562432 4327773 4777752 5736442
4762 5736442 5184651 3794581 4247415 7124961 9316857 7591188 2893680 -509506 -340250
$$ packed form
4822A0229769r9010o2767J778647J814501L34223j148356l284622m992623k319607
4813B250155M231839P510563L650567j903520l165110k127323l036266m278301
4805C132604k499439K73990N57702M23822L582354P490119O451750Q53594l269571
4796A6996925l114352j654612j404109j047591P30667K295499J557892j109276
4788A3251043l570459m017721k047113J032865K898923K207561j81689k346789
4780G226621k970648j729193O02373K059814J157974q67535j320162L9288O71099
4771D869631m44978j032803M65652J923130R22166j140366j234659M49979R58690
4762E736442n51791j390070M52834K877546K191896j725669m697508l403186J69256
$$ plain form
4753 -340250 1028058 457076 -1065158 93739 4582132 9013542 10860097 11278818 11945365
4744 11945365 12064991 10414186 7879595 5811981 3963796 2245054 2342249 4886453 6885530
4735 6885530 5137875 974914 -1543836 -1266870 -519592 -553775 39835 1962257 3397522
4726 3397522 2732155 857050 -431902 -737154 -704591 -475794 555061 2821309 5649288
4717 5649288 7078720 5297494 1008761 -2474949 -2670698 -762668 204500 -833660 -2356106
4708 -2356106 -2719031 -1559749 709062 3082465 3913490 2223553 -1029065 -4030879 -5953470
4699 -5953470 -6786568 -6435130 -5365287 -4912210 -5180759 -3928039 262675 4899620 6370746
4690 6370746 4966152 4074230 4757931 4513061 1887511 -859520 -970802 1330720 3903260
$$ packed form
4753c40250J368308n70982j522234J158897M488393M431410J846555M18721O66547
4744A1945365J19626j650805k534591k067614j848185j718742R7195K544204J999077
4735F885530j747655m162961k518750K76966P47278l4183N93610J922422J435265
4726C397522o65367j875105j288952l05252L2563K28797J030855K266248K827979
4717E649288J429432j781226m288733l483710j95749J908030R67168j038160j522446
4708b356106l62925J159282K268811K373403Q31025j689937l252618l001814j922591
4699e953470q33098L51438J069843M53077k68549J252720M190714M636945J471126
4690F370746j404594q91922O83701k44870k625550k747031j11282K301522K572540
$$ plain form
4681 3903260 5372337 5539873 4606445 3101106 1566250 -227647 -2624891 -4517794 -4129024
4672 -4129024 -1781584 -29011 -174200 -340212 1824087 5786314 8695299 8504906 5623854
4663 5623854 2119192 23236 -78897 685849 936136 766195 1372607 3101152 4928019
4654 4928019 6031588 6825708 8096258 9985629 12164641 14250938 15685013 15679769 13563023
4645 13563023 9157250 3291620 -1852790 -3964841 -3051266 -1733218 -2077632 -3228147
4637 -3228147 -3480612 -3307298 -4209476 -5581424 -5322097 -3245283 -1358796 -705492 -323847
4628 -323847 377354 524996 -392166 -1583714 -2307502 -2334895 -887641 2740063 7141948
4619 7141948 9632200 9636394 8982881 8303001 5822730 803366 -4495199 -7910006 -10067534
$$ packed form
4681C903260J469077J67536r33428j505339j534856j793897k397244j892903L88770
4672d129024K347440J752573j45189j66012K164299L962227K908985j90393k881052
4663E623854l504662k095956j02133P64746K50287j69941O06412J728545J826867
4654D928019J103569P94120J270550J889371K179012K086297J434075n244k116746
4645A3563023m405773n865630n144410k112051R13575J318048l44414j150515
4637c228147k52465J73314r02178j371948K59327K076814J886487O53304L81645
4628c23847P01201J47642r17162j191548p23788k7393J447254L627704M401885
4619G141948K490252M194o53513o79880k480271n019364n298565l414807k157528
$$ plain form
4610 -10067534 -12046527 -12495410 -9607735 -4676690 -1156328 -601808 -1380465 -1121613 996855
4601 996855 4090646 6426873 6605820 4789849 2593386 1322863 856382 507252 -8117
4592 -8117 -858774 -2073820 -2617165 -977063 2344067 4436673 3470401 1326581 1161031
4583 1161031 3333440 5497567 6025155 5446044 4740549 4072524 3565263 3912213 5502674
4574 5502674 7601896 8850564 8308225 5996457 2833669 150882 -948364 49904 2935299
4565 2935299 6492598 8684734 8213060 6176136 5189770 6337665 7819442 7148696 3816954
4556 3816954 -865361 -5563437 -9426235 -11473919 -10962583 -8539379 -6033715 -4641123
4548 -4641123 -3842339 -2535578 -837059 -60438 -810002 -1818001 -1374392 458504 2033078
$$ packed form
4610a0067534j978993m48883K887675M931045L520362N54520p78657K58852K118468
4601I96855L093791K336227J78947j815971k196463j270523m66481l49130n15369
4592h117q50657j215046n43345J640102L321130K092606r66272k143820j65550
4583A161031K172409K164127N27588n79111p05495o68025n07261L46950J590461
4574E502674K099222J248668n42339k311768l162788k682787j099246R98268K885395
4565B935299L557299K192136m71674k036924r86366J147895J481777o70746l331742
4556C816954m682315m698076l862798k047684N11336K423204K505664J392592
4548d641123P98784J306761J698519P76621p49564j007999M43609J832896J574574
$$ plain form
4539 2033078 2415923 2259814 2159303 1652095 605443 68390 515137 573411 -992937
4530 -992937 -3161177 -4103330 -3669512 -2697084 -1034580 1610839 3869246 4231147 3787259
4521 3787259 5020305 8236487 11424624 13128251 13199930 11562995 8906715 7643404 8936023
4512 8936023 9624784 5885282 -671925 -4837644 -5316763 -5303549 -5388796 -2109662 4506223
4503 4506223 8174574 4881494 -800307 -2284236 210185 2105330 2291367 3194085 5237912
4494 5237912 6490677 6750136 7422613 7989025 6661030 4138087 3054941 3955633 4998379
4485 4998379 5223705 5103955 4445930 2784661 1273512 1242372 1625710 844571 292934
4476 292934 2499691 6549649 9016651 9024410 8618435 8367051 6649814 3572385 1518473
$$ packed form
4539B033078L82845j56109j00511n07208j046652n37053M46747N8274j566348
4530i92937k168240r42153M33818R72428J662504K645419K258407L61901m43888
4521C787259J233046L216182L188137J703627P1679j636935k656280j263311J292619
4512H936023O88761l739502o557207m165719m79119J3214q5247L279134O615885
4503D506223L668351l293080n681801j483929K494421J895145J86037R02718K043827
4494E237912J252765K59459O72477N66412j327995k522943j083146R00692J042746
4485D998379K25326j19750o58025j661269j511149l1140L83338p81139n51637
4476B92934K206757M049958K467002P759m05975k51384j717237l077429k053912
$$ plain form
4467 1518473 1047287 109757 -1618890 -1523167 1221000 3345138 2226226 -4298 233911
4458 233911 2579501 3340210 513586 -3902840 -6314097 -5065763 -1812294 206582 -399443
4449 -399443 -1719470 -1247862 858077 2770655 4155915 5814556 6797868 5119297 1640116
4440 1640116 44962 1982758 5070844 6863815 7932394 9365572 9922989 8052043
4432 8052043 4946506 3188015 3271242 3359336 1904198 -879903 -3630839 -4863333 -3870256
4423 -3870256 -1414375 808674 1686184 1194108 -345824 -2397534 -3782905 -3569065 -2436083
4414 -2436083 -1830348 -1964402 -2198919 -2861567 -4416519 -5155725 -2654170 2026526 4511479
4405 4511479 2510860 -1467773 -3762518 -3305005 -680436 3580896 7999731 10088069
$$ packed form
4467A518473m71186r37530j728647R5723K744167K124138j118912k230524K38209
4458B33911K345590P60709k826624m416426k411257J248334L253469K018876o06025
4449c99443j320027M71608K105939J912578J385260J658641R83312j678571l479181
4440A640116j595154J937796L088086J792971J068579J433178N57417j870946
4432H052043l105537j758491Q3227Q8094j455138k784101k750936j232494R93077
4423c870256K455881K223049Q77510m92076j539932k051710j385371K13840J132982
4414b436083O05735j34054k34517o62648j554952p39206K501555M680696K484953
4405D511479k000619l978633k294745M57513K624569M261332M418835K088338
$$ plain form
4397 10088069 9446808 8790017 9901837 10806460 9202071 6464421 5417805 5847621 5263539
4388 5263539 2976806 461725 -1545892 -3353482 -4099841 -2175189 1862406 5187607
4380 5187607 6045006 5327063 4443335 3403743 1639656 -686858 -2868587 -4156627 -3659395
4371 -3659395 -713699 4085904 8849945 11835683 12620286 11745102 9695574 6619872 2933771
4362 2933771 -284111 -2125035 -3180024 -5121072 -8216411 -10251116 -9335037 -6944567
4354 -6944567 -6061325 -6665967 -5753150 -2217674 1145085 1783196 957743 1306205 2934616
4345 2934616 4120026 4260098 3727962 1937089 -1974558 -7049285 -11191644 -13636691 -15015006
4336 -15015006 -15452206 -14520313 -12845048 -11790678 -11296167 -9644657 -5893616 -1383303 1698245
$$ packed form
4397A0088069o41261o56791J111820R04623j604389k737650j046616M29816n84082
4388E263539k286733k515081k007617j807590p46359J924652M037595L325201
4380E187607Q57399p17943q83728j039592j764087k326514k181729j288040M97232
4371c659395K945696M799603M764041K985738P84603q75184k049528l075702l686101
4362B933771l217882j840924j054989j941048l095339k034705R16079K390470
4354f944567Q83242o04642R12817L535476L362759O38111q25453L48462J628411
4345B934616J185410J40072n32136j790873l911647n074727m142359k445047j378315
4336a5015006m37200R31893J675265J054370M94511J651510L751041M510313L081548
$$ plain form
4327 1698245 2519021 1991358 1442712 1282371 1020110 527571 698691 2041471 2999145
4318 2999145 1169678 -3446018 -7750544 -8728545 -6302917 -2681105 -132275 161350 -1527791
4309 -1527791 -3580695 -4615852 -5127996 -6080888 -6152207 -3021290 2125120 4507384 1728525
4300 1728525 -2833242 -4457957 -2472158 755607 3650193 5745233 6328624 5476621 4735060
4291 4735060 4483553 2786178 -567106 -1565439 2757593 8686584 9839676 5600792 1116303
4282 1116303 -422444 -831437 -2163409 -3479014 -3509802 -2824457 -2022902 -828070 -40471
4273 -40471 -1401233 -4334458 -5660662 -3876822 -1178322 40448 218088 833465 2021035
4264 2021035 3537062 5874642 8602970 9419038 6781404 2267465 -1258591 -2802648
$$ packed form
4327A698245Q20776n27663n48646j60341k62261m92539J71120J342780R57674
4318B999145j829467m615696m304526r78001K425628L621812K548830K93625j689141
4309a527791k052904j035157n12144r52892p1319L130917N146410K382264k778859
4300A728525m561767j624715J985799L227765K894586K095040N83391q52003p41561
4291D735060k51507j697375l353284r98333M323032N928991J153092m238884m484489
4282A116303j538747m08993j331972j315605l0788O85345Q01555J194832P87599
4273d0471j360762k933225j326204J783840K698500J218770J77640O15377J187570
4264B021035J516027K337580K728328Q16068k637634m513939l526056j544057
$$ plain form
4256 -2802648 -3314681 -3713983 -4194805 -4711855 -4940117 -4199699 -2237489 280305 2481511
4247 2481511 4014307 4848886 4953525 4374035 3288326 2203870 2365098 4945006 8897356
4238 8897356 10879566 8996348 5615317 4432147 5576597 6026451 4329458 2194353
4230 2194353 1378305 1600285 1967097 2289035 2593606 3155678 4919427 7892952 9578508
4221 9578508 7555537 3306783 620229 417677 354705 -656344 -1441743 -2441787 -6117615
4212 -6117615 -11963380 -15306415 -13469953 -9658254 -8120741 -8585424 -8375913 -7247393 -6747724
4203 -6747724 -6753353 -5970795 -4667392 -4066590 -3937059 -3147999 -1722269 -274839 1554926
4194 1554926 4106802 6237893 6895732 7059883 7953771 8308648 5858622 1150902 -2431638
$$ packed form
4256b802648n12033l99302m80822n17050k28262P40418J962210K517794K201206
4247B481511J532796Q34579J04639n79490j085709j084456J61228K579908L952350
4238H897356J982210j883218l381031j183170J144450M49854j696993k135105
4230B194353q16048K21980L66812L21938L04571N62072J763749K973525J685556
4221I578508k022971m248754k686554k02552o2972j011049p85399j000044l675828
4212f117615n845765l343035J836462L811699J537513m64683K09511J128520M99669
4203f747724n629P82558J303403O00802J29531P89060J425730J447430J829765
4194A554926K551876K131091O57839J64151Q93888L54877k450026m707720l582540
$$ plain form
4185 -2431638 -2627023 -598536 976075 824382 -364206 -1499493 -2453467 -3607437 -4444726
4176 -4444726 -3870021 -2521772 -3071285 -6575961 -10193047 -10949671 -10159099 -10822364 -12155000
4167 -12155000 -11018611 -7874703 -6215192 -6247999 -4794324 -2024017 -2135419 -5840025 -8496532
4158 -8496532 -7949905 -7760493 -9894730 -11166859 -10427719 -11627172 -15235045 -15507583 -13006293
4149 -13006293 -19828430 -41026310 -58543489 -48728252 -13399809 20881629 34719404
4142 34719404 33280456 29946637 27549323 22955740 18488721 18492912 20908870 21086095 20055093
4133 20055093 21773522 25118065 25154040 20671797 15254410 12062852 11514677 12744453 14058336
4124 14058336 13414258 11071723 9896668 10928119 11330755 9061599 6318967 5461228 4897605
$$ packed form
4185b431638j95385K028487J574611j51693j188588j135287r53974j153970q37289
4176d444726N74705J348249n49513l504676l617086p56624P90572o63265j332636
4167a2155000J136389L143908J659511l2807J453675K770307j11402l704606k656507
4158h496532N46627J89412k134237j272129P39140j199453l607873k72538K501290
4149a3006293o822137k1197880j7517179R815237L5328443L4281438J3837775
4142C4719404j438948l333819k397314m593583m467019M191K415958J77225j031002
4133B0055093J718429L344543L5975m482243n417387l191558n48175J229776J313883
4124A4058336o44078k342535j175055J031451M02636k269156k742632q57739n63623
$$ plain form
4115 4897605 2592208 475995 1243381 3388591 3811625 3309357 5030276 8925244 12004208
4106 12004208 13150656 13823915 14765509 15516229 16380877 17551723 17244169 14089428 10424433
4097 10424433 9710031 11493507 12395785 11231279 9450675 7278116 3566576 -620845
4089 -620845 -2360219 -1225510 300570 1143898 2686973 4885293 5197521 2811688 643477
4080 643477 1331941 3803801 5449672 5475744 4528034 2979201 1184335 -131409 -1065599
4071 -1065599 -2698611 -4991797 -6069745 -4826624 -2864424 -2423953 -3294778 -3063894 -40578
4062 -40578 4808735 8574164 8874183 6097850 3061211 1815432 1360560 -367910 -3046258
4053 -3046258 -4441275 -4046267 -3892903 -5226595 -6505696 -5796659 -3575340 -1862860 -1558736
$$ packed form
4115D897605k305397k116213P67386K145210M23034n02268J720919L894968L078964
4106A2004208J146448O73259R41594P50720Q64648J170846l07554l154741l664995
4097A0424433p14402J783476R02278j164506j780604k172559l711540m187421
4089f20845j739374J134709J526080Q43328J543075K198320L12228k385833k168211
4080F43477O88464K471860J645871K6072r47710j548833j794866j315744r34190
4071a065599j633012k293186j077948J243121J962200M40471q70825K30884L023316
4062d0578M849313L765429L00019k776333l036639j245779m54872j728470k678348
4053c046258j395017L95008J53364j333692j279101P09037K221319J712480L04124
$$ plain form
4044 -1558736 -1795891 -1463706 -499026 328184 636053 1198097 2870171 4646532 4130775
4035 4130775 898466 -2015288 -1582826 1453544 4167854 5544310 6479540 6684277 4804671
4026 4804671 1625614 105702 1574685 4247409 5904034 5800299 3882724 784560
4018 784560 -1244444 -366076 1584891 1107764 -1297719 -1376303 1895376 3929486 1407230
4009 1407230 -2483518 -2836726 299235 3593651 5901460 8011425 9098049 7788159
4001 7788159 5566024 5068326 5739388 4970302 2952822 2495361 4194478 5683157 5945779
3992 5945779 6576980 8060376 8521982 7420488 6990350 8225140 8538422 5830748 2495781
3983 2495781 2520583 5840802 8209961 6427137 1838042 -1494593 -975172 2362343 5312317
$$ packed form
4044a558736k37155L32185R64680Q27210L07869N62044J672074J776361n15757
4035D130775l232309k913754M32462L036370K714310J376456R35230K04737j879606
4026D804671l179057j519912J468983K672724J656625j03735j917575l098164
4018G84560k029004Q78368J950967m77127k405483p8584L271679K034110k522256
4009A407230l890748l53208L135961L294416K307809K109965J086624j309890
4001G788159k222135m97698O71062p69086k017480m57461J699117J488679K62622
3992E945779O31201J483396M61606j101494m30138J234790L13282k707674l334967
3983B495781K4802L320219K369159j782824m589095l332635N19421L337515K949974
$$ plain form
3974 5312317 5872086 4898949 4166658 3680409 2248941 82230 -1242639 -1418865 -1732270
3965 -1732270 -2188384 -729677 3381211 7517298 8869632 8095907 7765891 8384513 8317597
3956 8317597 7147297 6709364 8421070 11268181 13038681 12473911 9801639 6092386 2610336
3947 2610336 243877 -822656 -732636 522414 2683887 4578341 4796201 3308811 1832234
3938 1832234 2156498 4307550 6621261 7562036 7231520 6892093 7099874 6883302 5234240
3929 5234240 2856647 1387405 1057785 579967 -174432 1040569 5939847 12370626 15620188
3920 15620188 13310663 7941429 4182314 4296157 6555884 7639133 6053963 3267620
3912 3267620 1832227 2737625 4693664 5653290 4643533 2425181 1026389 2389740 6524110
$$ packed form
3974E312317N59769r73137p32291m86249j431468k166711j324869j76226l13405
3965a732270m56114J458707M110888M136087J352334p73725l30016O18622o6916
3956H317597j170300m37933J711706K847111J770500n64770k672272l709253l482050
3947B610336k366459j066533R0020J255050K161473J894454K17860j487390j476577
3938A832234L24264K151052K313711R40775l30516l39427K07781k16572j649062
3929E234240k377593j469242l29620m77818p54399J215001M899278O430779L249562
3920A5620188k309525n369234l759115J13843K259727J083249j585170k786343
3912C267620j435393R05398J956039R59626j009757k218352j398792J363351M134370
$$ plain form
3903 6524110 10990185 13209182 13261871 13147415 13355183 12243942 9556249 8158129 10294813
3894 10294813 13788759 14512592 11822327 8956547 8281963 8688447 8064208 6127743 4050123
3885 4050123 2972755 3557035 5486533 6898304 5875110 2994470 716854 -194050 -1473979
3876 -1473979 -3685993 -4295052 -1443451 2289816 2609111 -916195 -4553899 -5354143 -3920164
3867 -3920164 -2050316 -44548 2523721 4950522 5781548 4545870 2236743 294690
3859 294690 -398192 278396 2037460 4564637 7438143 9750538 10380026 9112154 7175260
3850 7175260 6170920 6673591 8181017 9948360 11326067 11763131 11246889 10532754 10351646
3841 10351646 10609747 10804660 10819220 10829822 10940304 11345848 12104232 12239342 10240210 6434007
$$ packed form
3903F524110M466075K218997N2689j14456K07768j111241k687693j398120K136684
3894A0294813L493946P23833k690265k865780o74584M06484o24239j936465k077620
3885D050123j077368N84280J929498J411771j023194k880640k277616r10904j279929
3876a473979k212014o09059K851601L733267L19295l525306l637704q00244J433979
3867c920164J869848K005768K568269K426801Q31026j235678k309127j942053
3859B94690o92882O76588J759064K527177K873506K312395O29488j267872j936894
3850G175260j004340N02671J507426J767343J377707M37064n16242p14135j81108
3841A0351646K58101J94913J4560J0602J10482M05544P58384J35110j999132l806203
$$ plain form
3831 6434007 3587608 3616523 4783238 4076561 1474788 -490168 -823055 -916885 -1284322
3822 -1284322 -485988 1786005 3369188 2910524 2120214 2855613 3957509 3300350 1565809
3813 1565809 1407880 3478813 5616458 5940010 4878223 3896691 3627738 3577837 2783663
3804 2783663 691803 -1979189 -3573975 -3369804 -2513487 -2242551 -1970720 -376903 2265687
3795 2265687 4298459 4798620 4106198 2685576 1018767 258537 1175658 2510944 2203177
3786 2203177 404285 -609220 113788 866800 211169 -745682 -377126 768213 1145540
3777 1145540 1104459 2486574 5403831 7292878 5988517 2701298 848099 2100305 4518289
3768 4518289 5043327 3164037 1068460 362134 262889 -203999 68108 2505321 5870012
$$ packed form
3831F434007k846399K8915J166715p06677k601773j964956l32887r3830l67437
3822a284322P98334K271993J583183m58664p90310P35399J101896o57159j734541
3813A565809j57929K070933K137645L23552j061787r81532k68953m9901p94174
3804B783663k091860k670992j594786K04171Q56317K70936K71831J593817K642590
3795B265687K032772N00161o92422j420622j666809p60230R17121J335286l07767
3786B203177j798892j013505P23008P53012o55631r56851L68556J145339L77327
3777A145540m1081J382115K917257J889047j304361l287219j853199J252206K417984
3768D518289N25038j879290k095577p06326r9245m66888K72107K437213L364691
$$ plain form
3759 5870012 7442711 6963198 6919181 8504807 9721364 8509497 5640427 3115592 1478528
3750 1478528 236340 -642666 -1312296 -2652361 -4446547 -4340680 -815309 3835956 5841333
3741 5841333 4550157 2362216 768814 -725940 -1957822 -1552743 273435 1192388 260873
3732 260873 -439087 926789 3148126 4046316 3447728 2318551 726517 -1200907 -1763296
3723 -1763296 410934 3891959 6293208 7861934 10623102 14334893 16232836 15197708
3715 15197708 13414352 12842866 12389608 10050548 6018813 1983725 -1303664 -4032354
3707 -4032354 -5829501 -5996704 -4898009 -3792901 -3406380 -3441859 -3122342 -1602759 1438043
3698 1438043 4886472 6774939 6694918 6634681 8255300 10378440 10666754 8865784 6635704
$$ packed form
3759E870012J572699m79513m4017J585626J216557j211867k869070k524835j637064
3750A478528j242188q79006o69630j340065j794186J05867L525371M651265K005377
3741E841333j291176k187941j593402j494754j231882M05079J826178R18953r31515
3732B60873o99960J365876K221337Q98190n98588j129177j592034j927424n62389
3723a763296K174230L481025K401249J568726K761168L711791J897943j035128
3715A5197708j783356n71486m53258k339060m031735m035088l287389k728690
3707d032354j797147j67203J098695J105108L86521l5479L19517J519583L040802
3698A438043L448429J888467q0021o0237J620619K123140K88314j800970k230080
$$ plain form
3689 6635704 4957195 3679565 2980324 2958767 2145488 -965652 -4799284 -5847821 -3513494
3680 -3513494 -1066860 -780093 -915485 780617 3200767 3892101 3046092 2817485 3832764
3671 3832764 4909792 5552903 6399635 7561523 8533616 9421422 10430645 10605290 9042769
3662 9042769 6960856 6380923 6869066 5834616 2366639 -1271242 -2497933 -982543 2186127
3653 2186127 6090175 9774199 11819018 11366414 9114290 6660788 5021816 3830414
3645 3830414 1888284 -972899 -2535093 -247772 4557122 6701347 3440964 -1411735
3637 -1411735 -2711694 -1482327 -2917617 -7785016 -11007996 -9506218 -6290933 -4745144
3629 -4745144 -3533282 -323922 3252250 4159493 2810385 1745969 1557036 1524008 2358955
$$ packed form
3689F635704j678509j277630o99241k1557q13279l111140l833632j048537K334327
3680c513494K446634K86767j35392J696102K420150O91334q46009k28607J015279
3671C832764J077028O43111Q46732J161888R72093Q87806J009223J74645j562521
3662I042769k081913n79933M88143j034450l467977l637881j226691J515390L168670
3653B186127L904048L684024K044819m52604k252124k453502j638972j191402
3645C830414j942130k861183j562194K287321M804894K144225l260383m852699
3637a411735j299959J229367j435290m867399l222980J501778L215285J545789
3629d745144J211862L209360L576172R07243j349108j064416j88933l3028Q34947
$$ plain form
3620 2358955 4690412 6407689 5266038 2966784 2887517 4651038 4916725 3192515 2771392
3611 2771392 5428277 8800116 9991645 8887884 6996933 5500157 5161113 5854195 5653873
3602 5653873 2686233 -1701646 -3949614 -2745882 -11827 2678947 5602728 8261713
3594 8261713 8681466 6756630 5297600 5950193 6655718 5065982 2126941 210262 -239013
3585 -239013 -69077 678739 2006616 2715271 2218742 2276940 4602576 7745171 8625631
3576 8625631 6573704 3909197 2956211 4026207 5794637 6339976 4598382 2092394 2186771
3567 2186771 6130186 10871895 12379208 10031270 6126215 2506694 -54486 -402416
3559 -402416 2073762 5392267 6597160 5556759 4753960 5106377 4531660 1481406 -2200402
$$ packed form
3620B358955K331457J717277j141651k299254p9267J763521K65687j724210m21123
3611B771392K656885L371839J191529j103761j890951j496776l39044O93082k00322
3602E653873k967640m387879k247968J203732K734055K690774K923781K658985
3594H261713M19753j924836j459030O52593P05525j589736k939041j916679m49275
3585b39013J69936P47816J327877P08655m96529N8198K325636L142595Q80460
3576H625631k051927k664507r52986J069996J768430N45339j741594k505988R4377
3567B186771L943415M741709J507313k347938l905055l619521k561180l47930
3559d02416K476178L318505J204893j040401q02799L52417n74717l050254l681808
$$ plain form
3550 -2200402 -3165689 -102700 5349997 10235996 12427223 12113525 11373874 11465212 10934166
3541 10934166 7749614 2758157 -1010144 -2330807 -2698181 -2927000 -1551553 2119032
3533 2119032 5695610 6394558 4476784 2124114 176224 -1908068 -3735797 -4044526 -3040706
3524 -3040706 -2600393 -3677635 -5093259 -5424770 -4626173 -3010729 -98619 4089369 7480523
3515 7480523 7546729 4542343 1629039 1231065 2504547 3177269 2602120 1645078 626262
3506 626262 -586294 -844121 1480019 5440400 7559196 6140150 3671513 3416542 5304423
3497 5304423 7090247 8026510 8827772 8939828 6841855 3122637 529827 262169 482272
3488 482272 -500228 -1548465 -568830 2340589 5047619 5875490 4789390 2706822 690310
$$ packed form
3550b200402r65287L062989N452697M885999K191227l13698p39651R1338n31046
3541A0934166l184552m991457l768301j320663l67374k28819J375447L670585
3533B119032L576578O98948j917774k352670j947890k084292j827729l08729J003820
3524c040706M40313j077242j415624l31511P98597J615444K912110M187988L391154
3515G480523O6206l004386k913304l97974J273482O72722n75149r57042j018816
3506F26262j212556k57827K324140L960381K118796j419046k468637k54971J887881
3497E304423J785824R36263Q01262J12056k097973l719218k592810k67658K20103
3488D82272r82500j048237R79635K909419K707030Q27871j086100k082568k016512
$$ plain form
3479 690310 -389711 -132552 1284633 3194658 4437424 3827083 1504741 -634452 -1140560
3470 -1140560 -1289337 -3467820 -7349020 -9807494 -9186472 -7361105 -6279716 -4639549 -251306
3461 -251306 5604833 8857460 7550076 3865473 831930 -1102639 -3206914 -5611847
3453 -5611847 -7019010 -6909998 -6278646 -5436733 -2536356 3880381 11277958 14460957 11461125
3444 11461125 6136664 3334116 3214946 2616562 514634 -1081584 -1144394 -1042765 -1469043
3435 -1469043 -1147871 348600 1342973 898954 329494 575277 826799 1234887 3781107
3426 3781107 8071787 9381070 4314009 -3784227 -8702261 -8954392 -7694242 -6507875
3418 -6507875 -4030490 -723421 -278468 -4498420 -9910089 -11432393 -7653685 -1385771
$$ packed form
3479F90310j080021K57159J417185J910025J242766o10341k322342k139193n06108
3470a140560j48777k178483l881200k458474O21022J825367J081389J640167M388243
3461b51306N856139L252627j307384l684603l033543j934569k104275k404933
3453e611847j407163J09012O31352Q41913K900377O416737P397577L182999k999832
3444A1461125n324461k802548j19170n98384k101928j596218o2810J01629m26278
3435a469043L21172J496471R94373m44019n69460K45783K51522M08088K546220
3426C781107M290680J309283n067061q098236m918034k52131J260150J186367
3418f507875K477385L307069M44953m219952n411669j522304L778708O267914
$$ plain form
3410 -1385771 3378601 4352172 2518749 1467732 3653126 7098284 7634020 4457028 1107377
3401 1107377 552499 1986003 3443413 4836199 6644894 7756584 6687249 3680225
3393 3680225 43114 -3379578 -5793371 -5990665 -3890235 -1423037 -472660 -913241 -1717034
3384 -1717034 -2577031 -3209121 -2766014 -1639939 -2158736 -5336080 -8379418 -7949840 -4802279
3375 -4802279 -2404227 -1703184 -454311 2285374 4299149 3769954 1975081 1071983 1332731
3366 1332731 2002416 3013931 4181306 4246329 2658319 1279020 2366643 5370260 7439313
3357 7439313 6833674 4281813 1235006 -1412412 -2667107 -1348446 2392741 6586879
3349 6586879 9380537 10661719 11029325 10133601 7281630 3152608 -513119 -2968207 -4992430
$$ packed form
3410a385771M764372R73571j833423j051017K185394L445158N35736l176992l349651
3401A107377n54878J433504J457410J392786J808695J111690j069335l007024
3393C680225l637111l422692k413793j97294K100430K467198R50377m40581q03793
3384a717034q59997o32090M43107J126075n18797l177344l043338M29578L147561
3375d802279K398052P01043J248873K739685K013775n29195j794873r03098K60748
3366A332731O69685J011515J167375O5023j588010j379299J087623L003617K069053
3357G439313o05639k551861l046807k647418j254695J318661L741187M194138
3349F586879K793658J281182L67606q95724k851971m129022l665727k455088k024223
$$ plain form
3340 -4992430 -7083300 -8260857 -7451098 -5364902 -3984090 -4161177 -4408579 -2530234 1537356
3331 1537356 4853666 4033020 -1063697 -6773412 -9324362 -8439829 -6342086 -4033205 -578615
3322 -578615 3836798 6482044 5044455 603864 -3667062 -5670436 -5138220 -2680141 180759
3313 180759 1167594 -370808 -1690075 736936 6917500 13238115 16393713 15827511 12764020
3304 12764020 8892027 5884003 4116906 1786279 -2657595 -7214459 -7983577 -4556694
3296 -4556694 -1134477 -1281308 -4060561 -6723523 -8717539 -10877944 -12469539 -11598607 -7939004
3287 -7939004 -3247864 431621 1939175 1180125 -572777 -1170695 508578 3518466 6111259
3278 6111259 7115594 5848408 2399519 -1242704 -2325069 -862416 -140328 -2136806
$$ packed form
3340d992430k090870j177557Q09759K086196J380812j77087k47402J878345M067590
3331A537356L316310q20646n096717n709715k550950Q84533K097743K308881L454590
3322e78615M415413K645246j437589m440591m270926k003374N32216K458079K860900
3313A80759R86835j538402j319267K427011O180564O320615L155598n66202l063491
3304A2764020l871993l008024j767097k330627m443874m556864p69118L426883
3296d556694L422217j46831k779253k662962j994016k160405j591595Q70932L659603
3287g939004M691140L679485J507554p59050j752902n97918J679273L009888K592793
3278F111259J004335j267186l448889l642223j082365J462653P22088j996478
$$ plain form
3270 -2136806 -4380128 -3372037 619803 4561031 6956826 8457258 9183365 8360871 6373113
3261 6373113 4753241 4146013 4135541 4710406 5970736 6842030 6094258 4271146 2796282
3252 2796282 1847438 1061946 1292477 3108500 4523230 3355986 1316005 2183685 5801938
3243 5801938 7518407 4477429 -787035 -4192932 -4556674 -2890331 -191292 2254082
3235 2254082 2759736 1358067 230465 554299 809346 -401123 -1950965 -2274728 -1843772
3226 -1843772 -1688414 -1289830 -40178 755804 -385206 -2466889 -3229708 -2305796 -1281258
3217 -1281258 -1121282 -1154161 -347589 1477734 3285379 3142077 28191 -4008563 -5147735
3208 -5147735 -2424810 541247 -144417 -4217962 -8643269 -11534810 -12553607 -11157199
$$ packed form
3270b136806k243322J008091L991840L941228K395795J500432P26107q22494j987758
3261F373113j619872o07228j0472N74865J260330Q71294p47772j823112j474864
3252B796282r48844p85492K30531J816023J414730j167244k039981Q67680L618253
3243E801938J716469l040978n264464l405897l63742J666343K699039K445374
3235B254082N05654j401669j127602L23834K55047j210469j549842l23763M30956
3226a843772J55358L98584J249652P95982j141010k081683p62819R23912J024538
3217a281258J59976l2879Q06572J825323J807645j43302l113886m036754j139172
3208e147735K722925K966057o85664m073545m425307k891541j018797J396408
$$ plain form
3200 -11157199 -7387711 -3546244 -2171071 -2504468 -1462025 1837240 4821202 5036310
3192 5036310 2869936 119195 -2384225 -4792512 -6945310 -7909133 -6645581 -3232407
3184 -3232407 398965 1782802 683591 -450326 212870 1356625 784462 -958217 -1313201
3175 -1313201 580678 3052952 4519075 4883950 4377861 3028833 1611564 1355716 2157399
3166 2157399 2360196 724218 -2305068 -5279160 -6769845 -6060138 -3978547 -2649926 -3171034
3157 -3171034 -4024740 -3095509 -482714 2322584 5100898 8454510 11292417 11456711 8976679
3148 8976679 6311216 5095739 4869284 5150793 6236266 7490270 7448675 6386301 6275176
3139 6275176 7294432 7043324 4582863 2686559 4135898 7815245 10613854 11672751
$$ packed form
3200a1157199L769488L841467J375173l33397J042443L299265K983962K15108
3192E036310k166374k750741k503420k408287k152798r63823J263552L413174
3184c232407L631372J383837j099211j133917O63196J143755n72163j742679l54984
3175a313201J893879K472274J466123L64875n06089j349028j417269k55848Q01683
3166B157399K02797j635978l029286k974092j490685P09707K081591J328621n21108
3157c171034q53706R29231K612795K805298K778314L353612K837907J64294k480032
3148H976679k665463j215477k26455K81509J085473J254004m1595j062374j11125
3139F275176J019256k51108k460461j896304J449339L679347K798609J058897
$$ plain form
3131 11672751 12569258 14262556 15845162 15927961 13948597 10486653 7028354 4738169 3095283
3122 3095283 957034 -783332 390791 4703194 8809569 9904676 9020148 8408031 7720176
3113 7720176 5261348 1453970 -1757384 -4021358 -6403203 -8706823 -9636294 -9348977 -9262913
3104 -9262913 -9309231 -7871238 -4762060 -1902130 -450513 563045 1931291 2621164 1643472
3095 1643472 39160 -364128 718352 1995412 2269708 1403380 179707 -274025 528568
3086 528568 1729992 2098601 1847994 2443645 4219815 5458045 4731159 3062366 2374369
3077 2374369 2404019 877598 -2954954 -6385519 -5906552 -1302318 3932711 6330893 5794089
3068 5794089 4789434 4897669 5166905 3991406 1751130 814371 2907910 6884267 9491475
$$ packed form
3131A1672751Q96507J693298J582606Q2799j979364l461944l458299k290185j642886
3122C095283k138249j740366J174123M312403M106375J095107q84528o12117o87855
3113G720176k458828l807378l211354k263974k381845k303620r29471K87317Q6064
3104i262913m6318J437993L109178K859930J451617J013558J368246O89873r77692
3095A643472j604312m03288J082480J277060K74296q66328j223673m53732Q02593
3086E28568J201424L68609k50607N95651J776170J238230p26886j668793o87997
3077B374369K9650j526421l832552l430565M78967M604234N235029K398182n36804
3068E794089j004655J08235K69236j175499k240276r36759K093539L976357K607208
$$ plain form
3059 9491475 8650515 5856076 4675269 6558848 8942445 8301294 4370329 108648 -2006107
3050 -2006107 -2011650 -943238 742611 2643993 4008600 4775066 5727674 6829792 6759084
3041 6759084 4979752 2867615 1701663 882063 -681952 -2747795 -4571817 -6185068
3033 -6185068 -7426270 -7173234 -5235672 -3538969 -3392888 -3010669 -228601 3487463 4676995
3024 4676995 2850992 740783 -168847 -1092258 -2631843 -3384835 -2959952 -3376304 -5741829
3015 -5741829 -7894944 -7277656 -4438697 -1923603 -1112468 -1766554 -3292328 -4603299 -3805637
3006 -3805637 -33744 4834288 7906028 8497300 8352027 8881571 9464221 8640821 6123872
2997 6123872 3261953 1715896 1733981 1953584 1317763 749133 1867165 4297697 5830603
$$ packed form
3059I491475q40960k794439j180807J883579K383597o41151l930965m261681k114755
3050b006107n543J068412J685849J901382J364607P66466R52608J102118p0708
3041F759084j779332k112137j165952q19600j564015k065843j824022j613251
3033f185068j241202K53036J937562J696703J46081L82219K782068L716064J189532
3024D676995j826003k110209r09630r23411j539585p52992M24883m16352k365525
3015e741829k153115O17288K838959K515094Q11135o54086j525774j310971P97662
3006c805637L771893M868032L071740N91272j45273N29544N82650q23400k516949
2997F123872k861919j546057J8085K19603o35821n68630J118032K430532J532906
$$ plain form
2988 5830603 5494624 4762676 5033516 5629453 5361693 4507859 3839356 3018580 1590337
2979 1590337 536647 1054174 2350674 2297847 58885 -3131041 -5430944 -5579668 -3238300
2970 -3238300 557658 3753079 5329557 6578778 9165131 12520145 14514965 14143630
2962 14143630 12033521 8855352 5044403 1856363 753819 1449208 2020953 1175712 -788523
2953 -788523 -3000743 -4455902 -3821552 -866249 2004647 2039715 326184 1078452 5793064
2944 5793064 10687298 11503713 8512473 4746894 1538830 -1307239 -2445486 232229
2936 232229 5607488 9101128 7525332 2484829 -1846229 -3056882 -2009329 -1112710 -1738107
2927 -1738107 -2853376 -2219824 566244 2932185 2366537 -276908 -2359881 -3580729 -5777349
$$ packed form
2988E830603l35979p31948K70840N95937k67760q53834o68503q20776j428243
2979A590337j053690N17527J296500n2827k238962l189926k299903j48724K341368
2970c238300L795958L195421J576478J249221K586353L355014J994820l71335
2962A4143630k110109l178169l810949l188040j102544O95389N71745q45241j964235
2953g88523k212220j455159O34350K955303K870896L5068j713531P52268M714612
2944E793064M894234Q16415k991240l765579l208064k846069j138247K677715
2936B32229N375259L493640j575796n040503m331058j210653J047553Q96619o25397
2927a738107j115269O33552K786068K365941n65648k643445k082973j220848k196620
$$ plain form
2918 -5777349 -8626680 -8868038 -5137385 -686671 793832 -210468 -938429 -830273 -1192215
2909 -1192215 -1793230 -1047386 960087 2617431 3705415 5272219 6708424 6109280 3937224
2900 3937224 3119025 4624898 6095234 6118275 6614664 9003503 11086800 10525884 8943980
2891 8943980 9278602 10765508 10109464 6819728 3989104 3851901 5401414 6521340 6025511
2882 6025511 3558545 -98244 -2541780 -2007272 -253163 -633880 -3011691 -3432696 286613
2873 286613 5423453 8181367 8238516 7707125 7518851 6932056 5500006 3752996 2477083
2864 2477083 2260040 2932283 2975656 984344 -1624680 -1392877 2380021 5701791 4771785
2855 4771785 1131379 -497499 1604108 4761155 6198647 6125401 6298302 7566807 9361212
$$ packed form
2918e777349k849331k41358L730653M450714J480503j004300p27961J08156l61942
2909a192215o01015P45844K007473J657344J087984J566804J436205n99144k172056
2900C937224q18199J505873J470336K3041M96389K388839K083297n60916j581904
2891H943980L34622J486906o56044l289736k830624j37203J549513J119926m95829
2882F025511k466966l656789k443536N34508J754109l80717k377811m21005L719309
2873B86613N136840K757914N7149n31391j88274n86795j432050j747010j275913
2864B477083k17043O72243M3373j991312k609024K31803L772898L321770r30006
2855D771785l640406j628878K101607L157047J437492p3246J72901J268505J794405
$$ plain form
2846 9361212 10207253 8508842 4112588 -791770 -3602774 -4197594 -4613626 -5899098 -6909627
2837 -6909627 -6577825 -5675614 -5362564 -5237416 -4116838 -2134751 -790551 -892017 -1403477
2828 -1403477 -783848 1044598 2742320 3483221 3983915 5161446 6681726 7924660 9592447
2819 9592447 12451953 14607337 12481551 5589460 -1644368 -4409522 -2419466 1179815
2811 1179815 4178499 6465433 8084069 8789598 9234512 10297467 11239381 10537355 8546500
2802 8546500 7284329 7403326 7460993 6627170 6019784 6453868 6654409 5031136 2206887
2793 2206887 629569 2003998 5468076 7948420 6647669 2129530 -1487827 -796659
2785 -796659 2812038 5076302 4553824 3967565 5549708 7781933 8128482 6816849 6057481
$$ packed form
2846I361212Q46041j698411m396254m904358k811004n94820m16032j285472j010529
2837f909627L31802R02211L13050J25148J120578J982087J344200j01466n11460
2828a403477O19629J828446J697722P40901N00694J177531J520280J242934J667787
2819I592447K859506K155384k125786o892091p233828k765154J990056L599281
2811A179815K998684K286934J618636P05529M44914J062955R41914p02026j990855
2802H546500j262171J18997N7667q33823o07386M34084K00541j623273k824249
2793B206887j577318J374429L464078K480344j300751m518139l617357O91168
2785g96659L608697K264264n22478n86259J582143K232225L46549j311633p59368
$$ plain form
2776 6057481 6935428 8734962 10229944 10240861 8111380 5102942 4077992 6071233 8229187
2767 8229187 7050074 2849292 -973790 -2418442 -2372355 -1952056 -901237 860829 2284012
2758 2284012 2771246 3090812 3703100 3628107 2176898 543534 144322 236732 -1050019
2749 -1050019 -3652343 -5357312 -4856214 -3308816 -2196657 -1217790 458434 2165609 2776463
2740 2776463 3037752 4773925 7826183 9874570 9716227 8693180 8159171 7702388 7071643
2731 7071643 7560603 9501649 10389853 8106121 4540470 3100438 3677097 3305047 1191208
2722 1191208 -470412 -666503 -859133 -1551258 -1229096 174707 371476 -1158518 -1665484
2713 -1665484 190025 1608433 211347 -1956615 -2196227 -1903235 -3657767 -6080666 -6110904
$$ packed form
2776F057481Q77947J799534J494982J0917k129481l008438j024950J993241K157954
2767H229187j179113m200782l823082j444652M6087M20299J050819J762066J423183
2758B284012M87234L19566O12288p4993j451209j633364l99212R2410j286751
2749a050019k602324j704969N01098J547398J112159R78867J676224J707175O10854
2740B776463K61289J736173L052258K048387j58343j023047n34009m56783o30745
2731G071643M88960J941046Q88204k283732l565651j440032N76659l72050k113839
2722A191208j661620j96091j92630o92125L22162J403803J96769j529994n06966
2713a665484J855509J418408j397086k167962k39612K92992j754532k422899l0238
$$ plain form
2704 -6110904 -4642233 -4952036 -6480899 -5471946 -1882778 -285721 -2565392 -4589878
2696 -4589878 -2397034 2408993 6144985 8360719 10387663 11421895 9910342 7242950
2688 7242950 6376804 7441811 7851897 6471232 4762852 3758870 2681979 1165285 422536
2679 422536 1214186 2575469 3724620 5638399 9328223 13697630 16634374 17552502 17393569
2670 17393569 16569558 14597440 11862677 10010671 9768065 9681067 8181142 5936592 4705409
2661 4705409 4525298 3870504 2430233 1635455 1912265 1518889 -627637 -2704560 -2306229
2652 -2306229 167725 2261820 2702683 1983453 464267 -1876422 -4062495 -4780594 -4611553
2643 -4611553 -5465007 -7326828 -7646548 -4817029 -514892 2376086 2643005 661039 -2830872
$$ packed form
2704f110904J468671l09803j528863J008953L589168J597057k279671k024486
2696d589878K192844M806027L735992K215734K026944J034232j511553k667392
2688G242950q66146J065007M10086j380665j708380j003982j076891j516694p42749
2679D22536P91650J361283J149151J913779L689824M369407K936744R18128j58933
2670A7393569q24011j972118k734763j852006k42606q6998j499925k244550j231183
2661D705409j80111o54794j440271p94778K76810l93376k146526k076923L98331
2652b306229K473954K094095M40863p19230j519186k340689k186073p18099J69041
2643d611553q53454j861821l19720K829519M302137K890978K66919j981966l491911
$$ plain form
2634 -2830872 -6393048 -7560003 -4626836 1470193 7946344 12440723 14029881 12964593
2626 12964593 10413966 7902719 6086644 4314888 1796725 -1250853 -3787102 -4627774
2618 -4627774 -3084652 -105219 1416804 -575663 -3802945 -3239785 2608423 9228843
2610 9228843 11670108 10559671 10145508 11907414 13166143 11500946 7603789 3464399
2602 3464399 115217 -2195720 -3452858 -4238644 -5398799 -6924474 -8098296 -8572071 -8102606
2593 -8102606 -5769619 -1350238 2796208 3593492 1435610 247725 2463685 5958569
2585 5958569 7186364 5573313 3254066 1889498 1619500 2388621 4423613 7328697 9863632
2576 9863632 10851203 9841343 7035018 2976937 -1751212 -6543540 -10206630 -10924776 -8013307
$$ packed form
2634b830872l562176j166955K933167O097029O476151M494379J589158j065288
2626A2964593k550627k511247j816075j771756k518163l047578k536249q40672
2618d627774J543122K979433J522023j992467l227282N63160N848208O620420
2610I228843K441265j110437m14163J761906J258729j665197l897157m139390
2602C464399l349182k310937j257138p85786j160155j525675j173822m73775M69465
2593h102606K332987M419381M146446P97284k157882j187885K215960L494884
2585E958569J227795j613051k319247j364568k69998P69121K034992K905084K534935
2576I863632R87571j009860k806325m058081m728149m792328l663090p18146K911469
$$ plain form
2567 -8013307 -3654089 -1378582 -2399428 -4809615 -6771433 -8667512 -11176210 -13148110
2559 -13148110 -13098356 -11501050 -9819403 -8225066 -6053700 -3720060 -2292144 -1679767 -1073346
2550 -1073346 -760565 -1556742 -2597592 -1737034 1542642 5252813 7207945 6748443 4112148
2541 4112148 -31253 -3857777 -4924460 -2428104 2044435 6396269 9364779 9762703
2533 9762703 6417586 166782 -5540747 -7728613 -7041609 -6661284 -8464222 -11034698 -11052801
2524 -11052801 -6198967 2512748 10759530 14302854 13121760 11141223 11160730 11611805 9736385
2515 9736385 6388209 5253137 7830417 11592559 13366611 12520875 10189694 7144751
2507 7144751 3706364 852873 74768 1892696 4819109 6109683 4138484 292540
$$ packed form
2567h013307M359218K275507j020846k410187j961818j896079k508698j971900
2559a3148110M9754J597306J681647J594337K171366K333640J427916O12377O06421
2550a073346L12781p96177j040850Q60558L279676L710171J955132m59502k636295
2541D112148m143401l826524j066683K496356M472539M351834K968510L97924
2533I762703l345117o250804n707529k187866O87004L80325j802938k570476j8103
2524a1052801M853834Q711715Q246782L543324j181094j980537J9507M51075j875420
2515I736385l348176j135072K577280L762142J774052q45736k331181l044943
2507G144751l438387k853491p78105J817928K926413J290574j971199l845944
$$ plain form
2499 292540 -2242444 -2063727 -858123 -352616 365972 2566967 4410720 2931181 -849424
2490 -849424 -2337831 213019 3027161 2354583 -202092 -538455 1948646 4395081 5252424
2481 5252424 5634871 6160505 5725507 4133414 3277453 4419395 6180875 6632368 6034464
2472 6034464 6063312 7111172 7707855 6437568 3607404 1043887 545547 2240963 4235177
2463 4235177 4297389 2204236 84147 221825 2797998 5867162 7244843 6454819 5178118
2454 5178118 5596461 7845355 9534433 8572876 5970323 4611791 5592713 7391633 8637347
2445 8637347 9606473 10258839 8900484 4429192 -1425749 -5771591 -7531353 -7282342 -5226945
2436 -5226945 -1346070 3008152 5823151 6749282 6999276 7053738 6364623 5317940 5180826
$$ packed form
2499B92540k534984J78717J205604N05507P18588K200995J843753j479539l780605
2490h49424j488407K550850K814142o72578k556675l36363K487101K446435Q57343
2481E252424L82447N25634m34998j592093q55961J141942J761480M51493n97904
2472F034464K8848J047860N96683j270287k830164k563517m98340J695416J994214
2463D235177O2212k093153k120089J37678K576173L069164J377681p90024j276701
2454E178118M18343K248894J689078r61557k602553j358532R80922J798920J245714
2445H637347R69126O52366j358355m471292n854941m345842j759762K49011K055397
2436e226945L880875M354222K814999R26131K49994N4462o89115j046683j37114
$$ plain form
2427 5180826 5475776 3688827 -1090047 -6000098 -7478542 -5358838 -2580181 -1850978 -3764050
2418 -3764050 -6959401 -8737580 -6839806 -2413901 34613 -2160422 -5765702 -5462756
2410 -5462756 -907881 3395181 5140488 6979187 10810191 13344935 10568421 4065377
2402 4065377 -791584 -1673268 -780737 -176287 592326 1752956 1658148 -603793 -3317174
2393 -3317174 -4412025 -3861667 -2543952 -619056 1320477 1304236 -1511296 -4514573 -4304533
2384 -4304533 -1229784 1175712 1305737 1459288 3875093 7149505 8415042 7598151 7221953
2375 7221953 8413359 9405318 8610052 7331915 7966332 10398245 11865118 10448930 7441388
2366 7441388 5804671 7121706 10468058 13490614 14069919 11694856 7966643 5272468
$$ packed form
2427E180826K94950j786949m778874m910051j478444K119704K778657P29203j913072
2418c764050l195351j778179J897774M425905K448514k195035l605280L02946
2410e462756M554875M303062J745307J838699L831004K534744k776514o503044
2402D065377m856961q81684Q92531O04450P68613J160630r4808k261941k713381
2393c317174j094851N50358J317715J924896J939533j6241k815532l003277K10040
2384d304533L074749K405496J30025J53551K415805L274412J265537q16891l76198
2375G221953J191406R91959p95266j278137O34417K431913J466873j416188l007542
2366G441388j636717J317035L346352L022556N79305k375063l728213k694175
$$ plain form
2358 5272468 4407384 4140240 3602271 3857880 5832514 7805340 6992401 3221597 -1054301
2349 -1054301 -4306386 -7107011 -9325400 -8849717 -4748962 211821 2311302 1150582
2341 1150582 -545768 -624052 720122 2291034 3196390 2882008 1480131 420749 1445364
2332 1445364 4466392 7123829 6964717 3850773 82528 -1776256 -1251043 -64538 222328
2323 222328 554 177399 -122225 -2289086 -4788158 -3786659 1647351 7455056 9443143
2314 9443143 8121850 6724630 6563100 6979379 8050973 10008623 10992899 8805605 4555966
2305 4555966 1476822 322026 -966545 -3088165 -4232786 -3556847 -2595757 -2341242 -1797382
2296 -1797382 -398431 880669 1775650 3264703 4768529 3861721 370308 -2161046 -1165077
$$ packed form
2358E272468q65084k67144n37969K55609J974634J972826q12939l770804m275898
2349a054301l252085k800625k218389M75683M100755M960783K099481j160720
2341A150582j696350p8284J344174J570912R05356l14382j401877j059382J024615
2332A445364L021028K657437j59112l113944l768245j858784N25213J186505K86866
2323B22328k21774J76845k99624k166861k499072J001499N434010N807705J988087
2314I443143j321293j397220j61530M16279J071594J957650R84276k187294m249639
2305D555966l079144j154796j288571k121620j144621O75939R61090K54515N43860
2296a797382J398951J279100Q94981J489053J503826r06808l491413k531354R95969
$$ plain form
2287 -1165077 1308126 1913595 761190 365041 1610712 3275340 4279976 4179947 2530769
2278 2530769 -165091 -1842221 -1001555 1496219 4179228 7061042 10363641 12843276
2270 12843276 13478684 13325911 13444835 12407490 8403813 2720224 -1450057 -2824455 -2279568
2261 -2279568 -308823 3004082 6129930 7085019 6180795 5441275 5554535 5668284 5731743
2252 5731743 6491666 7462522 7494005 7149244 7877695 9016451 8472212 6339693 4711458
$$ packed form
2287a165077K473203O05469j152405l96149J245671J664628J004636j00029j649178
2278B530769k695860j677130Q40666K497774K683009K881814L302599K479635
2270A2843276O35408j52773J18924j037345m003677n683589m170281j374398N44887
2261b279568J970745L312905L125848R55089r04224p39520J13260J13749O3459
2252E731743P59923R70856L1483l44761P28451J138756n44239k132519j628235
$$ [...]
##END NTUPLES=NMR SPECTRUM
##END=
