##TITLE=31Pdec_DE-91rm_3h
 , 64 sc
 16.4.2025
##JCAMPDX= 6.0         $$ Bruker NMR JCAMP-DX V2.0
##DATA TYPE= NMR SPECTRUM
##DATA CLASS= NTUPLES
##ORIGIN= UXNMR, Bruker Analytische Messtechnik GmbH
##OWNER= root
$$ XWIN-NMR		Version 3.5
$$ Tue Apr 15 13:56:46 2025 Russian Standard Time (UT+4h)  she@DPX200
##.OBSERVE FREQUENCY= 81.013821
##.OBSERVE NUCLEUS= ^31P
##.ACQUISITION MODE= SIMULTANEOUS
##.ACQUISITION SCHEME= undefined
##.AVERAGES= 64
##.DIGITISER RES= 17
##SPECTROMETER/DATA SYSTEM= spect
##.PULSE SEQUENCE= zgpg30
##.SOLVENT NAME= DMSO
##.SHIFT REFERENCE= (INTERNAL, DMSO, 0, 198.062)
##AUDIT TRAIL= $$ (NUMBER, WHEN, WHO, WHERE, WHAT)
$$ ##TITLE= Audit trail, XWIN-NMR		Version 3.5
$$ ##JCAMPDX= 5.01
$$ ##ORIGIN= Bruker BioSpin GmbH
$$ ##OWNER= she
$$ F:/spectra/data/she/nmr/P31/2/pdata/1/auditp.txt
$$ ##AUDIT TRAIL=  $$ (NUMBER, WHEN, WHO, WHERE, WHAT)
(   1,<2025-04-15 13:55:03.45 +0400>,<she>,<DPX200>,
      <created by zg, POWCHK disabled, PULCHK disabled
       configuration hash MD5:
       00 E9 B6 7A A2 85 ED C7 34 08 36 98 17 FE 4E 26
       data hash MD5: 32K
       EF 15 7C 2F FF B5 0B 0F E6 E1 DE DB AC 58 5D F7>)
(   2,<2025-04-15 13:55:23.50 +0400>,<she>,<DPX200>,
      <Start of raw data processing
       efp BC_mod = 2 LB = 1.5 FT_mod = 6 PKNL = 1 PHC0 = 1255.392 PHC1 = 522.2943 SI = 64K 
       data hash MD5: 64K
       DA CF 78 8A 47 DA B0 3E 2B 31 19 48 1B E1 08 91>)
(   3,<2025-04-15 13:55:57.21 +0400>,<she>,<DPX200>,
      <pk PHC0 = -8.587622 PHC1 = 0 
       data hash MD5: 64K
       BC 3D CB 01 68 1E 2A 2A 99 6A 66 13 73 E9 82 67>)
(   4,<2025-04-15 13:56:00.68 +0400>,<she>,<DPX200>,
      <abs ABSG = 5 
       data hash MD5: 64K
       C1 33 FA F3 65 1D 4E 00 EE F6 FA 02 19 96 A0 F7>)
(   5,<2025-04-15 13:56:22.04 +0400>,<she>,<DPX200>,
      <pk PHC0 = 6.369893 PHC1 = 0 
       data hash MD5: 64K
       96 87 8B B2 A6 16 84 C1 16 30 8A 8A E2 5B CC 30>)
$$ ##END=
$$ 
$$ hash MD5
$$ 18 E3 26 EE 59 56 6E FF 4D 91 7A 1A 79 41 81 95
##$RELAX= 
##$RELAX= 
##$RELAX= 
##$RELAX= 
##$RELAX= 
##$RELAX= 
##$RELAX= 
##$RELAX= 
$$ Bruker specific parameters
$$ --------------------------
##$DU= <F:/spectra>
##$EXPNO= 2
##$NAME= <P31>
##$PROCNO= 1
##$TYPE= <nmr>
##$USER= <she>
##$AMP= (0..31)
100 100 100 100 100 100 100 100 100 100 100 100 100 100 100 100 100 100 
100 100 100 100 100 100 100 100 100 100 100 100 100 100 
##$AQSEQ= 0
##$AQ_mod= 1
##$AUNM= <au_zg>
##$AUTOPOS= <>
##$BF1= 81.014009
##$BF2= 200.13
##$BF3= 200.13
##$BF4= 200.13
##$BF5= 200.13
##$BF6= 200.13
##$BF7= 200.13
##$BF8= 200.13
##$BYTORDA= 1
##$CFDGTYP= 0
##$CFRGTYP= 5
##$CHEMSTR= <none>
##$CNST= (0..31)
1 1 145 1 1 1 1 1 1 1 1 1 1 1 1 1 1 1 1 1 1 1 1 1 1 1 1 1 1 1 1 1 
##$CPDPRG= <waltz16>
##$CPDPRG1= <>
##$CPDPRG2= <waltz16>
##$CPDPRG3= <>
##$CPDPRG4= <mlev>
##$CPDPRG5= <mlev>
##$CPDPRG6= <mlev>
##$CPDPRG7= <mlev>
##$CPDPRG8= <mlev>
##$CPDPRGB= <>
##$CPDPRGT= <>
##$D= (0..31)
0 1 0 0 0 0 0 0 0 0.06 0 0.03 2e-05 3e-06 0 0 0.0002 0 0 0 0 0 0 0 0 0 
0 0 0 0 0 0 
$$ [...]
##$SUBNAM3= <"">
##$SUBNAM4= <"">
##$SUBNAM5= <"">
##$SUBNAM6= <"">
##$SUBNAM7= <"">
##$SUBNAM8= <"">
##$SUBNAM9= <"">
##$SW= 400.765351723535
##$SWIBOX= (0..15)
0 1 3 0 0 0 0 0 0 0 0 0 0 0 0 0 
##$SW_h= 32467.5324675325
##$TD= 32768
##$TD0= 1
##$TE= 0
##$TE2= 300
##$TE3= 300
##$TEG= 300
##$TL= (0..7)
0 120 53 12 22 120 120 120 
##$TP= (0..7)
150 150 150 150 150 150 150 150 
##$TP07= 0
##$TPNAME0= <>
##$TPNAME1= <>
##$TPNAME2= <>
##$TPNAME3= <>
##$TPNAME4= <>
##$TPNAME5= <>
##$TPNAME6= <>
##$TPNAME7= <>
##$TPOAL= (0..7)
0.5 0.5 0.5 0.5 0.5 0.5 0.5 0.5 
##$TPOFFS= (0..7)
0 0 0 0 0 0 0 0 
##$TUNHIN= 0
##$TUNHOUT= 0
##$TUNXOUT= 0
##$USERA1= <user>
##$USERA2= <user>
##$USERA3= <user>
##$USERA4= <user>
##$USERA5= <user>
##$V9= 5
##$VALIST= <valist>
##$VCLIST= <CCCCCCCCCCCCCCC>
##$VD= 0
##$VDLIST= <DDDDDDDDDDDDDDD>
##$VPLIST= <PPPPPPPPPPPPPPP>
##$VTLIST= <TTTTTTTTTTTTTTT>
##$WBST= 1024
##$WBSW= 4
##$XGAIN= (0..3)
0 0 0 0 
##$XL= 0
##$YL= 0
##$YMAX_a= 78911
##$YMIN_a= -89829
##$ZGOPTNS= <>
##$ZL1= 120
##$ZL2= 120
##$ZL3= 120
##$ZL4= 120
##$ABSF1= 198.0616
##$ABSF2= -202.7028
##$ABSG= 5
##$ABSL= 3
##$ALPHA= 0
##$AQORDER= 0
##$ASSFAC= 0
##$ASSFACI= 0
##$ASSFACX= 0
##$ASSWID= 0
##$AUNMP= <proc_1d>
##$AZFE= 0.1
##$AZFW= 0.5
##$BCFW= 0
##$BC_mod= 2
##$BYTORDP= 0
##$COROFFS= 0
##$CY= -3
##$DATMOD= 1
##$DC= 0
##$DFILT= <>
##$DTYPP= 0
##$F1P= 0
##$F2P= 0
##$FCOR= 1
##$FTSIZE= 65536
##$FT_mod= 6
##$GAMMA= 0
##$GB= 0
##$INTBC= 1
##$INTSCL= 9.790993e-09
##$ISEN= 30
##$LB= 1.5
##$LEV0= 0
##$LPBIN= 0
##$MAXI= 10000
##$MC2= 0
##$MEAN= 0
##$ME_mod= 0
##$MI= 50
##$NCOEF= 0
##$NC_proc= -5
##$NLEV= 6
##$NOISF1= 182.463
##$NOISF2= 159.3651
##$NSP= 0
##$NTH_PI= 0
##$NZP= 0
##$OFFSET= 198.0616
##$PC= 4
##$PHC0= 1253.174
##$PHC1= 522.2943
##$PH_mod= 1
##$PKNL= yes
##$PPARMOD= 0
##$PSCAL= 0
##$PSIGN= 0
##$REVERSE= no
##$SF= 81.0140089999434
##$SI= 65536
##$SIGF1= 159.3651
##$SIGF2= -187.1042
##$SINO= 113.3802
##$SIOLD= 16384
##$SREGLST= <1H.CDCl3>
##$SSB= 0
##$STSI= 65536
##$STSR= 0
##$SW_p= 32467.5324675325
##$SYMM= 0
##$S_DEV= 0
##$TDeff= 32768
##$TDoff= 0
##$TI= <>
##$TILT= no
##$TM1= 0
##$TM2= 0
##$TOPLEV= 0
##$USERP1= <user>
##$USERP2= <user>
##$USERP3= <user>
##$USERP4= <user>
##$USERP5= <user>
##$WDW= 1
##$XDIM= 65536
##$YMAX_p= 378785539
##$YMIN_p= -18062814
$$ End of Bruker specific parameters
$$ ---------------------------------
##NTUPLES= NMR SPECTRUM
##VAR_NAME=  FREQUENCY,     SPECTRUM/REAL,   SPECTRUM/IMAG
##SYMBOL=    X,             R,               I
##VAR_TYPE=  INDEPENDENT,   DEPENDENT,       DEPENDENT
##VAR_FORM=  AFFN,          ASDF,            ASDF
##VAR_DIM=   65536,         65536,           65536
##UNITS=     HZ,            ARBITRARY UNITS, ARBITRARY UNITS
##FACTOR=    0.49542278885378, 1,            1
##FIRST=     16045.7642231865, 0,            0
##LAST=      -16421.768244346, 0,            0
##MIN=       -16421.768244346, -18062814,    0
##MAX=       16045.7642231865, 378785539,    0
$$ Real data points
##PAGE= N=1
##DATA TABLE= (X++(R..R)), XYDATA
$$ [...]
46911g58979k01204q5063N2125O3605l4905k8592J51450K46604M7498k43262l11767
46900a102490k29643k82246m03044k32469K27475M86614K74010k9742N7031M42519
46890g91985O58037N09110J94609p9692k70538l51069k98238k00036j30246K2042
46880g38006L32335N41204L37132q8194k04598M8263R4163l87055q51079o14818
46870a530653J15794M96914K06989k20994k74557r9314l2389O441K56907N71251
46860e03611N82691K74486l1715j85619l08929l96149k30056J89268M82294L59666
46850B32326J7723j36122J3358K39539K94431J10788k10786m55926m13808q8644
46840c97121K45189L02372O1160k80679n35261o21793n23148k68479N9681L57013
$$ y = [-758979, -960183, -1045246, -993121, -929516, -964421, -993013, -841563, -594959, -547461, -790723, -1102490, -1332133, -1614379, -2017423, -2249892, -2022417, -1535803, -1261793, -1291535, -1234504, -791985, -133948, 375162, 569771, 490079, 219541, -131528, -429766, -629802, -760048, -738006, -405671, 135533, 472665, 384471, 179873, 228136, 322299, -64756, -915835, -1530653, -1414859, -917945, -710956, -931950, -1206507, -1305821, -1338210, -1331769, -1074862, -503611, 79080, 353566, 321851, 136232, -172697, -568846, -798902, -609634, -127340, 232326, 250049, 113927, 127285, 366824, 661255, 772043, 561257, 105331, -308477, -397121, -151932, 150440, 211600, -69079, -604340, -1226133, -1749281, -2017760, -1958079, -1601066]
46830a601066N13560M20734Q3818k61891l14631n4743K17654K57950J21415m0510
46820f57710k09505l77300l96397j70599J29291K40665J16015r8499k82243l80277
46810b086559l43789k05111j08352j07181n5617J37317K98333K36827N1427l6486
46800b219191j1202K1573R7782K82759M20008L15917R4735M2744J55573J74067
46790f25235L4912n9379j3118O3994J39901K84837L76770J60879k95268n60751
46780d92458m05060r5576L1127J1464P2102K36187L30873K51321N0820j48116
46770a57316k42888k27875k04507k28803k04914o5717N4995M2949N5142K56025
46760i22909M45500L31506N1292l9877l977j85608m77724l86481P6561K79306
$$ y = [-1601066, -1087506, -666772, -582954, -844845, -1159476, -1214219, -996565, -738615, -617200, -657710, -867215, -1244515, -1640912, -1811511, -1682220, -1441555, -1325540, -1424039, -1706282, -2086559, -2430348, -2635459, -2743811, -2850992, -2906609, -2769292, -2470959, -2234132, -2182705, -2219191, -2230393, -2208820, -2111038, -1828279, -1408271, -1092354, -997619, -954875, -799302, -625235, -590323, -649702, -662820, -598826, -458925, -174088, 202682, 363561, 68293, -492458, -897518, -993094, -961967, -950503, -878401, -642214, -311341, -60020, -9200, -157316, -400204, -628079, -832586, -1061389, -1266303, -1332020, -1277025, -1234076, -1178934, -922909, -477409, -145903, -94611, -134488, -138465, -324073, -801797, -1188278, -1111717, -832411]
46750h32411k3148k82073j09899P5321j34643l51439r2470K78383J10676l96467
46740a758170m55854Q6856N84831N97573L50556J52939Q470q2864M554K05434
46730c05675K69299J80247J59737K10741J08208j04574q7237K21273M40445K94796
46720A387260o9315m10184o31045o16100k82142Q3320R905m52289o85393l79124
46710b045107J8811J3689k28642k52567l295K69365M85499O71414O56852K93992
46700a19989j53377k54010K3555L25215M12374L22945J20601j52358l04780j48957
46690G1219J40864J61644j43683l60868j94561J01253J07099j48419k46737J6217
46680d95972L69444M71477L37432J95404Q5164j27439l79587l88954j23270J9501
$$ y = [-832411, -855559, -1137632, -1247531, -1172210, -1306853, -1658292, -1750762, -1472379, -1361703, -1758170, -2214024, -2127168, -1542337, -944764, -594208, -441269, -432799, -515663, -511109, -305675, -36376, 143871, 303608, 514349, 622557, 517983, 430746, 652019, 1092464, 1387260, 1317945, 907761, 276716, -339384, -621526, -538206, -528301, -980590, -1665983, -2045107, -2026296, -2012607, -2241249, -2493816, -2497111, -2227746, -1742247, -1070833, -413981, -119989, -273366, -527376, -503821, -178606, 233768, 556713, 677314, 524956, 220176, 71219, 212083, 373727, 230044, -130824, -325385, -224132, -117033, -265452, -512189, -495972, -126528, 344949, 682381, 877785, 962949, 835510, 455923, 66969, -56301, -36800]
46670c6800k35525n45001l77516J89337N33306L42036m0751k23407k74209l85631
46660a054161m15047j24324L42371N82501M46344J46285p9360j70946j63756j20664
46650f10757j38205k53983l59600l25778j75576l1530M5957P1682O9551Q3884
46640a624355J56518K15367J31301k4725J3868K93733M57837K19477j73673k58488
46630e93140r246J74031P7733p6193k9424J65713K85326J99784o0431l13617k83310
46619d62774J28396N91729O21297J65023l22874m81090m39498m67520n03800l12207
46609a483318N9220K94892K61733J72549K36782L50682K66782k7093k47488j53370
46599b68629J42892K84160Q3343k55467l83028k00484Q5415K49070K48158J44523
$$ y = [-36800, -272325, -817326, -1194842, -1005505, -472199, -130163, -170914, -394321, -668530, -1054161, -1469208, -1593532, -1251161, -668660, -222316, -76031, -155391, -326337, -490093, -610757, -748962, -1002945, -1362545, -1688323, -1863899, -1895429, -1849472, -1777790, -1708239, -1624355, -1467837, -1252470, -1121169, -1145894, -1132026, -838293, -380456, -160979, -334652, -593140, -602386, -428355, -350622, -426815, -456239, -290526, -5200, 194584, 134153, -179464, -462774, -334378, 257351, 878648, 1043671, 720797, 239707, -199791, -667311, -1171111, -1483318, -1424098, -1129206, -867473, -694924, -458142, -107460, 159322, 132229, -115259, -268629, -125737, 158423, 241766, -13701, -396729, -597213, -511798, -262728, -14570, 129953]
46589A29953j9027k02423l45521m28051m57775l59017k0466M48550O67654L82635
46579b03488j60641m42531k61410Q3771K22128J32155N3371J30886K71984K77366
46569A03591K9237l76983o31035m54679O1994M97969N78265M45321L01781K6926
46559E82387n11014r34357o66412J84290P69886N66296L9071r5737J34921J99849
46549B69180m033q9842L9353Q510l03606m37036m3153N23605O70060L44841k975
46538I74904p9133j8928o2025k23860l22829j96182J22673L91231L76208J14441
46528A076500j38190k27362k24084k21719k16849k34875l33090m00449k24704
46519a144822J19811K53707N5052o6524K54043P44362Q39999M58320M4198q3542
$$ y = [129953, 110926, -91497, -437018, -865069, -1322844, -1681861, -1702327, -1253777, -586123, -203488, -364129, -806660, -1068070, -984299, -762171, -630016, -576645, -445759, -173775, 103591, 132828, -244155, -875190, -1329869, -1267875, -769906, -191641, 253680, 555461, 582387, 71373, -862984, -1529396, -1345106, -575220, -8924, 30147, -65590, 69331, 269180, 265147, 175305, 214658, 223168, -80438, -517474, -560627, -37022, 633038, 977879, 974904, 895771, 876843, 814818, 590958, 268129, 71947, 194620, 585851, 962059, 1076500, 938310, 710948, 486864, 265145, 48296, -186579, -519669, -920118, -1144822, -1025011, -771304, -716252, -782776, -528733, 215629, 1055628, 1513948, 1558146, 1474604]
46509A474604n6916j11165k36206k77661j80321l2747K9248n9939k03900k14509
46499A30488n5701O8748k2646k36400l30868k00810O1902K72739K47866k6942
46489i1624k49665q6261K92027L13780j46243m55372j20891M23405M56913N4933
46479C91002j32088L2754O7352j80142k65184M276J71204r9367m41626l77295
46469h29114k8477J69756J24107M8950L2515J2861J8693J18173K35425K44916
46459A47805J48917J8503j03889j51337p4975o240j22163k89082j76681J73750
46449d35392L01668K8064k32290j30704P8794K9849j31772p6261Q3039J5490j96588
46438f66103j92808L0997J46367Q5596J05633K61903L01558J42694J7404K6176
$$ y = [1474604, 1417688, 1306523, 1070317, 792656, 612335, 579588, 608836, 548897, 344997, 130488, 74787, 143535, 120889, -115511, -446379, -647189, -585287, -312548, -64682, -91624, -341289, -427550, -135523, 178257, 32014, -423358, -544249, -120844, 336069, 391002, 258914, 291668, 359020, 178878, -86306, -82030, 89174, -10193, -451819, -829114, -857591, -687835, -563728, -514778, -482263, -469402, -450709, -332536, -97111, 147805, 296722, 315225, 211336, 59999, -14976, -21216, -143379, -432461, -609142, -435392, -133724, -105660, -337950, -468654, -389860, -360011, -491783, -568044, -485005, -469515, -666103, -858911, -827914, -681547, -595951, -490318, -228415, 73143, 215837, 233241, 259417]
46428B59417n2412l43575n93340n00425j16375K41089L29526J53822p1998j02462
46418g96733P8405K05944Q8462r1353o0580P2117k7970l27457l85757o811M24228
46407h27505M41034P9862k28924j82026J43849M39821M47172J71142j34011k51215
46397I9199k21648j72522o6921J34071K03133q4600m75529m74618q4980J74855
46387i69560R8037Q7013L79839N42102J65854l87426m99554k22388p9047j59019
46377a044149q8977J67390J89141j19801k88828o2752J60503K3427j72542q169
46367a244757K90682J98030k25338l80178k6849L89433L98189O6953k30911k71438
46357a036184n7403K63750M06925J47302l20956m79931j25938L37239M49546K75505
$$ y = [259417, 207005, -136570, -729910, -1230335, -1346710, -1105621, -776095, -622273, -694271, -796733, -718328, -512384, -423922, -515275, -575855, -503738, -531708, -859165, -1244922, -1251733, -827505, -386471, -306609, -535533, -717559, -573710, -133889, 313283, 484425, 350414, 99199, -122449, -294971, -361892, -227821, -24688, -109288, -584817, -1059435, -1144415, -969560, -871523, -784510, -404671, 137431, 303285, -84141, -583695, -806083, -885130, -1044149, -1133126, -965736, -776595, -896396, -1185224, -1247976, -1087473, -1064046, -1236588, -1244757, -954075, -756045, -981383, -1361561, -1388410, -998977, -600788, -533835, -764746, -1036184, -1093587, -829837, -422912, -275610, -596566, -1076497, -1202435, -865196, -415650, -140145]
46347a40145J60122J53658N3057j38636k08921j40813j22415j38261N5066M55504
46337a1784O83990M90435R4383j63683k54010l33656m12514l88694k75770j64987
46327g36290m7251J30059K85882K63337N4489j57698j97386q3131j0527j29151
46317f27667l11041k39812J57475N09428M58947J86726J28680K60071J39674k96575
46307C65906n38390k95691N0046J11932R7920K91947M01720L2408n03975n32415
46297e18592l1588L41343K23575n5509j19479m3393m6139j13976j18613k0719
46287e03090J43968K47062O8606l81879o43122l20963K43130L35108j05639m01809
46277a318628j69069J87039K24302J15882J99833L79994L89585K58106J12801
$$ y = [-140145, 19977, 173635, 226692, 88056, -120865, -261678, -384093, -522354, -467288, -11784, 672206, 1162641, 1257024, 1093341, 839331, 505675, 93161, -295533, -571303, -736290, -783541, -653482, -367600, -104263, -49774, -207472, -404858, -487989, -498516, -627667, -938708, -1178520, -1021045, -511617, -52670, 134056, 262736, 522807, 662481, 365906, -172484, -468175, -418129, -306197, -208277, 83670, 485390, 517798, 13823, -518592, -550180, -208837, 14738, -40771, -160250, -203643, -249782, -363758, -482371, -503090, -359122, -112060, -43454, -425333, -1068455, -1389418, -1146288, -811180, -916819, -1318628, -1487697, -1300658, -1076356, -960474, -760641, -380647, 8938, 267044, 379845]
46268C79845j33782m87322n88672j83509L72250N29648K82609N4511J3876l6558
46258B02896j75308k20625q7090P8016J48275J26212M632k04609l15112j20108
46248e62821K76059N19702M19630R4410k65458n40025n88600k92282K17156N61488
46238a60741M66197K7811l98499n06325k60618P4913J48375j34453m85004n38444
46228a766788k51453J01854K91109L58473M60497N68274M26639j08295p17092
46219f36782q07837k14686M86998O46427L56852K08161L42405L29345K2379j34377
46209E98885Q6384K28986o9428m08852k92784J7333k7376l22015l74436k32170
46199g95473l27959n43009k96610L84073P25190L49622j77992k51113j8116R1307
$$ y = [379845, 246063, -241259, -829931, -1013440, -641190, -111542, 171067, 225578, 239454, 202896, 27588, -193037, -280127, -202111, -53836, 72376, 77008, -127601, -442713, -562821, -286762, 232940, 652570, 746980, 481522, -58503, -647103, -939385, -722229, -160741, 305456, 333267, -65232, -571557, -832175, -757262, -608887, -743340, -1228344, -1766788, -2018241, -1916387, -1625278, -1266805, -806308, -238034, 188605, 80310, -636782, -1444619, -1659305, -1172307, -525880, -169028, 39133, 381538, 710883, 733262, 598885, 685269, 914255, 844827, 435975, 143191, 160524, 133148, -188867, -563303, -795473, -1123432, -1666441, -1963051, -1578978, -853788, -504166, -682158, -933271, -951387, -860080]
46189h60080P4467J44835K36999J78782P6560J37704L03039L53755K17599l7208
46179H26452l18364m72516l79460k02543k32382l66731j58608M28493P91447N31023
46169D46811O4446l1453J21973L5539k74965l60815j30073L5466o7739k21005
46159c81815k38940k16951k38269k13851j04546J9285J95932N22644Q32419P73827
46149I49735L25727r6100j94065j45933k22616l37794k51691l2564Q708j91339
46139a87932l04045n8343L20738L12328k32554p86548p05546m8373M52054L38826
46129h99395J9961J17164N09915N20949k6793m94474l22925K14387M46802J82271
46119B67862j92010l11045k09074j39918k49037m33045m29244j05653K91716L45670
$$ y = [-860080, -785613, -640778, -403779, -224997, -148437, -10733, 292306, 646061, 863660, 826452, 508088, 35572, -343888, -546431, -778813, -1145544, -1304152, -875659, -84212, 446811, 511257, 479804, 601777, 637316, 362351, 1536, -128537, -93071, -160810, -381815, -620755, -837706, -1075975, -1289826, -1394372, -1375087, -1179155, -656511, 175908, 949735, 1275462, 1179362, 985297, 839364, 616748, 278954, 27263, -5301, 3407, -187932, -491977, -550320, -229582, 82746, -149808, -936356, -1641902, -1690275, -1238221, -899395, -879434, -762270, -252355, 268594, 241801, -252673, -575598, -361211, 85591, 267862, 75852, -235193, -444267, -584185, -833222, -1266267, -1695511, -1801164, -1509448, -1163778]
46109a163778J2578k62513j40047J51592K05881N7166M5480K19370L04551K12637
46099c57083J35115J11671l5785k55585k41355k1353n1761m29432n42260L3204
46089a654624P54748Q55541N03154M48610P11694N27964l01825r24814o85723
46080B34725j01971j6787l51813l95642J6332L35800J99029j33146k59555r2626
46070e65654K18030M50493L83902K0867k90477k52252n0508o0598k35608k07618
46060e89423O8571K40965J46595K6279Q9913K70702M69329O43474O09814J89592
46050B165811l78633o14782m68030l52324m31025l91135p3361K26736K93358K70794
46040B47409J83138k01001p06870o45962J37336P60632M84109j73894k64060J31319
$$ y = [-1163778, -1151200, -1413713, -1553760, -1402168, -1196287, -1139121, -1093641, -874271, -569720, -357083, -221968, -110297, -146082, -401667, -643022, -664375, -716136, -1145568, -1687828, -1654624, -899876, -44335, 458819, 907429, 1619123, 2147087, 1845262, 920448, 234725, 132754, 115967, -235846, -631488, -615156, -279356, -80327, -213473, -473028, -565654, -347624, 102869, 486771, 507638, 217161, -35091, -85599, -146197, -381805, -589423, -520852, -279887, -133292, -107013, -17100, 253602, 722931, 1366405, 1976219, 2165811, 1787178, 1172396, 704366, 352042, -78983, -470118, -543479, -316743, -23385, 247409, 430547, 229546, -477324, -1123286, -985950, -225318, 258791, 84897, -179163, -47844]
46030d7844J77667k63109m71351j28993K16927J37975n2834J5791J43542J9964
46020b52265j93942j79293o251L4836p0052p7098J04452K72135J88054j27328
46010c06752l60829k16407J71365K88746j06626n78111n58827j34056J33346M2313
46000a625838p0433K8235J70168K14143K80473M01409L77391J71630N1526J35877
45990A34581J73788q612j94728j56021l2493p0645k24534k58503o8085K62624
45980d42628N43017N30646J45165l04128l90840j33956L7748o9351k06400j95195
45970d85922j73183j78741l928L12225L62308L7024j97638l2612J95276J49618
45960a5573Q5349K79666L96869O6072l41982k45975J63579K46026j6946r0724
$$ y = [-47844, 129823, -133286, -604637, -733630, -516703, -378728, -431562, -415771, -272229, -252265, -446207, -625500, -631751, -596915, -666967, -744065, -639613, -367478, -179424, -306752, -667581, -883988, -712623, -423877, -530503, -1108614, -1667441, -1801497, -1668151, -1625838, -1696271, -1668036, -1497868, -1283725, -1003252, -601843, -224452, -52822, -1296, 134581, 308369, 299757, 105029, -50992, -83485, -154130, -378664, -637167, -705252, -442628, 100389, 631035, 776200, 472072, 81232, -52724, -14976, -84327, -290727, -485922, -659105, -837846, -841774, -529549, -167241, -130217, -327855, -360467, -165191, -15573, 69776, 349442, 746311, 812383, 470401, 224426, 388005, 634031, 617085, 526361]
45950E26361Q8962K7037l47329m50163k7699L49187J28685m25333o51102l28619
45940a110013J97680M60621K42365k45952m66992j19154M00021M61663J02882
45931g6879n3099J97475L41560M3365l06576k77523o1806k2205p6426k0555j9982
45920c32651k21711k63103J89631O93433N30795j72514n59157k84334O5701k9500
45910c83410k74326j55947K23734L83160K15126L4710K1954L9259k2267o5346
45900A6647j3045M6943L5900J7470O0877J05778O4614l0679p7920m4664J6624
45889A98545N3488N3558L0578Q234k1705j30970l41448m54407j81117M13117P84934
45878D12807N03731j39788m48990k17053P6625K6162j80815k07094j09984r4866
$$ y = [526361, 615323, 642360, 295031, -155132, -182831, 166356, 295041, -130292, -781394, -1110013, -912333, -451712, -209347, -455299, -922291, -1041445, -641424, -179761, -76879, -129978, 67497, 409057, 452422, 145846, -131677, -193483, -215688, -292114, -312669, -332651, -554362, -817465, -627834, 65599, 596394, 423880, -135277, -419611, -353910, -383410, -657736, -813683, -589949, -206789, 8337, 43047, 65001, 104260, 81993, 16647, 3602, 50545, 86445, 103915, 164792, 270570, 335184, 304505, 226585, 181921, 198545, 252033, 305591, 336169, 344403, 322698, 191728, -149720, -604127, -785244, -372127, 412807, 916538, 776750, 327760, 110707, 187332, 213494, 32679, -174415, -284399, -379265]
45868c79265o1372J63518L69201K28485j00087j38737J61929L27053P3893l15783
45858C28835m56862l07075k2027K68462L88519J75303k06669l31048p9660J58828
45848h3394N5760k03308k61352r2727R7749K14290K30859N0759k96642n12078
45838h00084l65434j5705K49778L89760M59355L35274m7514l79055l14144k7158
45828e14927r948l41748n56862k92968K54663O12507N23672J08907k70592k91109
45818g78405K0415K71340J60675j37654k55841j66456j30465j93132r8494K66009
45808a042008O56697P71441N18079k3865o40295r71822p63396j86317L19345N22878
45798h39263M83743K46098j66455m86294l95094m4322Q6185n1406J1746L94120
$$ y = [-379265, -440637, -277119, 92082, 320567, 220480, 81743, 243672, 570725, 644618, 328835, -128027, -435102, -457129, -188667, 199852, 375155, 168486, -162562, -242222, -83394, -27634, -230942, -492294, -585021, -487272, -272982, -42123, 8636, -288006, -800084, -1165518, -1181223, -931445, -541685, -82330, 252944, 205430, -173625, -487769, -514927, -524875, -866623, -1423485, -1716453, -1461790, -849283, -325611, -216704, -487296, -778405, -757990, -486650, -325975, -463629, -719470, -885926, -1016391, -1209523, -1308017, -1042008, -385311, 386130, 904209, 880344, 240049, -731773, -1495169, -1681486, -1362141, -839263, -355520, -109422, -275877, -762171, -1157265, -1201587, -1115402, -1166808, -1155062, -760942]
45788g60942N19232L1762m93525l39928K48659M38220O6257k01578J9009K71150
45778b01684M5503m17157n02991j03823K75917K09797j40275k65918N2321M55958
45768e92352M26653l5718l56231j31223L00731L24065q3526l61106k09372N0530
45758f67549Q7939O0476K01994K96915J6187m27426m65208n927L79855K57385
45748b65359p2362n3127K99412M39388J08563k80378k36341J20468K62125K3238
45738C45627j96104n7352K30909K78910J10058M3703J11841J3601l07947m63966
45728A09280k05770J19799K6670l99972o17157l69699M0768K52913K69634K68891
45718e04643K80602K47733K10307K07797J18252j85846n68360p02079m17714J24768
$$ y = [-760942, -241710, -209948, -703473, -1043401, -794742, -356522, -290265, -491843, -472834, -201684, -156181, -573338, -1076329, -1180152, -904235, -694438, -834713, -1100631, -1048310, -592352, -165699, -201417, -557648, -688871, -388140, -64075, -147601, -508707, -718079, -667549, -579610, -519134, -317140, -20225, -4038, -431464, -896672, -902599, -522744, -265359, -337721, -390848, -91436, 347952, 456515, 176137, -60204, 60264, 322389, 345627, 149523, 92171, 323080, 601990, 712048, 755751, 867592, 881193, 573246, 109280, -96490, 23309, 49979, -349993, -967150, -1336849, -1296081, -1043168, -773534, -504643, -224041, 23692, 233999, 441796, 560048, 374202, -194158, -896237, -1313951, -1189183]
45708a189183N81440O52103K56125l53291p07719n56456j75681n0996k46350l29077
45698b119085J138M68133N95919L40531Q0653N7082J05351r305k25155k93076
45688i97814j31390Q0296J37793L1932r3898j36240j22314j27005j70284k27802
45678a756726k80344k86310j61760J04023L47906L87988K69394J88467J71299
45669a016063O4086r3528M155M18054O74553L52203k25071l39371J17444M86893
45659D43355L03651p6567r8825J40306J10711k90312n86289m28528l8811J74392
45649c46917J23302k1674j67842l27052m19508l04808k4608J69360J07317q3036
45639a295466j36969L0870K54878L33824K32093O7004k4545J4638J33122K19202
$$ y = [-1189183, -607743, 44360, 300485, -52806, -760525, -1316981, -1492662, -1543658, -1790008, -2119085, -2117947, -1649814, -1053895, -713364, -632711, -575629, -470278, -479583, -704738, -997814, -1129204, -1048908, -911115, -879183, -973081, -1109321, -1231635, -1358640, -1528924, -1756726, -2037070, -2323380, -2485140, -2381117, -2033211, -1645223, -1375829, -1187362, -1016063, -951977, -1045505, -1041350, -623296, 51257, 403460, 178389, -160982, -43538, 443355, 747006, 670439, 571614, 711920, 822631, 532319, -53970, -482498, -521309, -346917, -223615, -245289, -413131, -740183, -1159691, -1464499, -1489107, -1319747, -1212430, -1295466, -1432435, -1401565, -1146687, -812863, -580770, -513766, -538311, -523673, -390551, -171349]
45629a71349K25216K25510K59399J59548k55327p67728q13406j60957O57683Q95253
45619B53842M66968l5986j60830n4910n9136k09392l28633l48270l14494k36846
45609a027687j09934K8761J68504L10150L26758P5468k57623k36823J96471M91520
45599c4435J97257l55508m79784p1951L20887L14403J10612M1000R4133P8683
45589B15297k8433j07174j07973p9479p0800r7285j39989j45627q3376J8971J49631
45578d76237L26460M44077K82020j43180m26733k70978L6050J8754k41462k46176
45568f97405P6752K42129K7830j60828r062J66414j1894l19264l18957p9954J8466
45557a065773l6984L6530K06483J48795j28094k11318P0585L77532L74884J45639
$$ y = [-171349, 53867, 279377, 538776, 698324, 442997, -324731, -1138137, -1299094, -641411, 253842, 720810, 684824, 523994, 469084, 409948, 200556, -128077, -476347, -790841, -1027687, -1137621, -1108860, -940356, -630206, -303448, -227980, -485603, -722426, -525955, -34435, 162822, -192686, -672470, -744421, -423534, -109131, 1481, 42481, 136614, 215297, 186864, 79690, -28283, -107762, -178562, -275847, -415836, -561463, -644839, -625868, -476237, -149777, 294300, 576320, 433140, 6407, -264571, -228521, -209767, -451229, -697405, -620653, -378524, -350694, -511522, -520584, -354170, -366064, -685328, -1004285, -1084239, -1065773, -1102757, -1066227, -859744, -710949, -839043, -1050361, -979776, -602244, -227360, -81721]
45547h1721o3890j68280j42020Q5662M17826N34010K83119p0873k16115k13347
45537C64371l01990m50861m06462j25021J35641J79179R0930L1760N319o0543
45527e37677j33353j16504k3539Q950r3820k16184j70280N7671K39459J49500
45517h35777j34511k73194o6931K63343L16622J3417k88983k38180R1744L45751
45507h06699L52202K41660J34197k5849k23593k22616J03323M58846M53241J58595
45497F23307K050J06022J26918j31243l45704j90905J01472R0664j64806k00671
45487A7104J03484L25662J50033j80401k69326j28450n1895j12343j08635K0605
45477b34162M2539j91662m24581k73693K17783N49898L75221n6437k53427j36516
$$ y = [-81721, -145611, -313891, -455911, -370249, 47577, 581587, 864706, 793833, 577718, 364371, 62381, -388480, -794942, -919963, -784322, -605143, -514213, -482453, -477134, -537677, -671030, -787534, -811073, -802123, -895943, -1112127, -1282407, -1224736, -985277, -835777, -970288, -1243482, -1310413, -1047070, -730448, -717031, -1006014, -1244194, -1152450, -806699, -454497, -212837, -78640, -104489, -328082, -550698, -447375, 11471, 464712, 623307, 625357, 731379, 858297, 727054, 381350, 190445, 291917, 382581, 217775, 17104, 120588, 446250, 596283, 415882, 146556, 18106, -33789, -146132, -254767, -234162, -191623, -383285, -807866, -1081559, -863776, -313878, 61343, 4906, -248521, -385037]
45467c85037l9872j11548j06649J09303K51045P9814j49559q3017J34231J01418
45457a99871j43383j71595J24247L68322L18765J72126J17924N3582m9578N1592
45447F42131L99131N60303K16693k79336l71484j02432J9853j63669k80661q2533
45437E57996J69139J30161j32935k85652j79812J7386O9042p4431k44623k49766
45427b23495j08787l6977j46259k64181j77008M9381J82229J90579K60569M32328
45417A58379M74535K29760j08714k30035j06852J0457l5769j21064p6515K0615
45407B14797m8443k70860l25306O990M88285O69697M27275M5410k00132k86054
45397G21659k50537o1840K00266L01660J65434O21m4318j00398k42189k19156
$$ y = [-385037, -424909, -536457, -643106, -533803, -282758, -202944, -352503, -435520, -301289, -199871, -343254, -514849, -390602, -22280, 296485, 468611, 586535, 640117, 590539, 642131, 1041262, 1601565, 1818258, 1538922, 1167438, 1065006, 1084859, 921190, 640529, 557996, 727135, 857296, 724361, 438709, 258897, 276283, 345325, 270894, 26271, -223495, -332282, -369259, -515518, -779699, -956707, -907326, -725097, -534518, -273949, 158379, 632914, 862674, 753960, 523925, 417073, 427530, 391761, 270697, 194182, 214797, 166354, -104506, -429812, -422822, 65463, 735160, 1162435, 1207845, 1007713, 721659, 471122, 409282, 609548, 911208, 1076642, 1077263, 1032945, 932547, 690358, 471202]
45387D71202J60358O03047O67267L85838J72450J98687K56818K06493J57703J65049
45377C444912R6685r1582k26370j59300N5797K63926L20143J44730j38725k27632
45367C482584n0418J0756l43571p46539o01222Q81L66603K07490m5259k4119J03900
45356B361086J39298J98485K79546Q0978l91640o12054l36020n3135j66362l04251
45346A195931m7007K23476m1251n21093n09542j38515j60147o09395o78019m5210
45336a330772N88497N98442K77505J75342K56787K05317N8783K8113K6023j56871
45326G27166m29967n26542l74454p8066K59388M69113L36615n5808k75556j04977
45316e3088J17833L4944j49963l7353K54510K45572j21526l57776j54390J92641
$$ y = [471202, 631560, 1234607, 1901874, 2287712, 2460162, 2658849, 2915667, 3122160, 3279863, 3444912, 3541597, 3450015, 3223645, 3064345, 3120142, 3384068, 3704211, 3848941, 3710216, 3482584, 3432166, 3442922, 3099351, 2352812, 1751590, 1752471, 2119074, 2326564, 2281305, 2257186, 2361086, 2500384, 2698869, 2978415, 3059393, 2667753, 2055699, 1719679, 1666544, 1500182, 1195931, 1148924, 1372400, 1331149, 810056, 300514, 161999, 1852, -607543, -1285562, -1330772, -742275, -143833, 133672, 309014, 565801, 771118, 829901, 858014, 884037, 727166, 297199, -229343, -603797, -681863, -422475, 46638, 383253, 327445, 51889, -53088, 64745, 99689, -50274, -87627, 166883, 412455, 290929, -66847, -221237, -28596]
45306b8596K51050K8392j43586j06435j5526l7926j02744j4575K62481N26452
45296F18987N64968L94698K01418Q5807j8833j80844l41001l79641k36871L4572
45286G43260K72734L14821J89542J03723J20397K7809k53684l68504k6799L71659
45276A494958J79522m61174o75416r9898N85178O74004L54243J60001Q7243j37396
45266B161265l56471k51283j2617l1314j26941J70963O84109P19859J81065k35717
45256B902918j24853P9815o0395k78159j61868J11445J26878n9272q5592Q4064
45246B534981J91589J92915K64807L71524K69392k9099j87915n0637J16145N6947
45236C730649n8881P3892L37244K67109k51718o85744m97814J02745M20952K30022
$$ y = [-28596, 222454, 250846, 107260, 825, -14701, -52627, -155371, -169946, 92535, 618987, 1183955, 1578653, 1780071, 1865878, 1847045, 1666201, 1325200, 945559, 708688, 743260, 1015994, 1330815, 1520357, 1624080, 1744477, 1772286, 1518602, 1150098, 1123299, 1494958, 1674480, 1213306, 537890, 437992, 1023170, 1697174, 2051417, 2211418, 2298661, 2161265, 1804794, 1553511, 1540894, 1509580, 1382639, 1553602, 2237711, 2957570, 3138635, 2902918, 2778065, 2857880, 2797485, 2519326, 2357458, 2468903, 2595781, 2536509, 2450917, 2534981, 2726570, 2919485, 3184292, 3555816, 3825208, 3796109, 3608194, 3557557, 3673702, 3730649, 3671768, 3745660, 4082904, 4350013, 4098295, 3412551, 2914737, 3017482, 3438434, 3668456]
45226C668456J5115J52162L31768J29155k63335l56882j43397n883k2976M6238
45216C550421J59978J4131k95196k86715N5613Q7937n15340j137967j009495k25230
45206C98137M53902N44337J93302j97929l48392k27746o7213j22953l06122k75033
45196D4290J8011K29860K14748K55145M63789M64956O1584k63270l5334M05937
45186A859716L84315j01288m42684l23914J2559K76131L69280K21470j08704k67036
45176A879845l4301K06603l6231n43675o56578k64725J23065K40909K92497L02309
45166A509718Q034m53873n18671j14281J10326j65028l46126J20512P99420Q77379
45156A827410L09831k52231m13910l44657k86711k66897k58535k40566j05716
$$ y = [3668456, 3683571, 3835733, 4167501, 4296656, 4033321, 3676439, 3533042, 3527159, 3504183, 3550421, 3710399, 3724530, 3429334, 3142619, 3198232, 3286169, 2770829, 1632862, 623367, 398137, 852039, 1396376, 1589678, 1391749, 1043357, 815611, 748398, 625445, 319323, 44290, 62301, 292161, 506909, 762054, 1225843, 1690799, 1752383, 1489113, 1453779, 1859716, 2244031, 2142743, 1700059, 1376145, 1388704, 1664835, 2034115, 2255585, 2146881, 1879845, 1845544, 2052147, 2015916, 1472241, 815663, 550938, 674003, 914912, 1207409, 1509718, 1517752, 1063879, 545208, 430927, 541253, 376225, 30099, 150611, 950031, 1827410, 2137241, 1885010, 1471100, 1126443, 839732, 572835, 314300, 73734, -31982]
45147c1982K03539M95254M96063J98823j07931j17184K42955P00897P72171K37802
45137C090407m65632o41579j97074K50548K44588K9543O504J10006P4948o1111
45127B441148j23478j64776k76581l10932j69627r9602l01231n04627l65007m5114
45117H0173M7791r1687j41372j2216J10661J55768J81283J42965L0628M4079K29869
45106G77942K09406k24773n32853j15362O24179O95349l0856o11234m07731J17164
45096E01231K83291J54233J51968K57542J51592j58989l54546l03068j78761j44723
45086C59770j65356j08621Q4260K92359K84195J2126k35798j88102Q698M2907
45076C86438j6957J51673M93308N59617K03791j75141k16871q771K24105M20815
$$ y = [-31982, 171557, 666811, 1162874, 1361697, 1253766, 1136582, 1379537, 2080434, 2852605, 3090407, 2624775, 1983196, 1786122, 2036670, 2281258, 2310801, 2317305, 2427311, 2502259, 2441148, 2317670, 2152894, 1876313, 1565381, 1395754, 1296152, 994921, 490294, 125287, 80173, 127964, 36277, -105095, -117311, -6650, 149118, 330401, 473366, 503994, 548073, 777942, 987348, 762575, 229722, 114360, 738539, 1433888, 1403032, 791798, 384067, 501231, 784522, 938755, 1090723, 1348265, 1499857, 1340868, 986322, 683254, 504493, 359770, 194414, 85793, 170053, 462412, 746607, 758733, 522935, 334833, 343531, 386438, 369481, 521154, 1014462, 1574079, 1777870, 1602729, 1385858, 1377087, 1601192, 2022007]
45066B022007N28234M49135K94807K99045L81242K46159J158J07632N57392P42763
45056E629574M38175K52291O75851J299979J532157J552525J913647K609211L232496
45047A9135906L759067M441820N042169M808673L264094O41516k338665m761012
45039C3993568n832387n446564m373646l502626l003387k529337j945653j393132
45031E966836q92409m20865j98667l84524o60894o20075l63352k14083j06515
45022B105452J43284K51283j16268n65125m39859O6856J61158k41634m16275j25277
45012H23595k417l53246n44181o9148N88558P20455L70190J5382j58298j60212
45002A230678R5685M81496N40869J55164j55115l3799J45478k304j89335q8259
$$ y = [2022007, 2550241, 2999376, 3294183, 3593228, 3974470, 4220629, 4221787, 4329419, 4886811, 5629574, 6067749, 6320040, 6995891, 8295870, 9828027, 11380552, 13294199, 15903410, 19135906, 22894973, 27336793, 32378962, 37187635, 40451729, 41093245, 38754580, 33993568, 28161181, 22714617, 18340971, 14838345, 11834958, 9305621, 7359968, 5966836, 5074427, 4653562, 4454895, 4070371, 3409477, 2789402, 2426050, 2211967, 2105452, 2248736, 2500019, 2383751, 1818626, 1378767, 1445623, 1606781, 1365147, 948872, 823595, 821178, 467932, -76249, -145397, 443161, 1163616, 1533806, 1549188, 1390890, 1230678, 1326363, 1807859, 2348728, 2503892, 2348777, 2314978, 2460456, 2458152, 2268817, 2180558]
44992B180558n2172m53888q20161m97609J87185L63762j3775j91870P5264K23052
44982A000346j9391j59203J32310M20719K56244j06359k00403q6886j27748l47342
44972G62287m64770l67523j87381k4638J18297K12541K30613K31047K53757K09805
44962I74035K6162j61410j12216K12442N30493M79093m373n60412p45947n03091
44952A34776j63944K9407J81681M05793N03802K53998j73833l99410l08317o3258
44942D00695K21356M82505N07580J31950l89387n82213l39560J9445K55041M01177
44932A108589M56559K99929l043j87798j92094k20199l15401k48472L6406K49067
44922I83543K04788Q7617O7359J7954j43102j90383L5953L03781L66320L89911
$$ y = [2180558, 2128386, 1674498, 854337, 356728, 543913, 907675, 893900, 702030, 777294, 1000346, 980955, 821752, 954062, 1374781, 1631025, 1524666, 1324263, 1237377, 1109629, 762287, 297517, -70006, -257387, -282025, -163728, 48813, 279426, 510473, 764230, 974035, 1000197, 838787, 726571, 939013, 1469506, 1948599, 1944226, 1383814, 637867, 134776, -29168, 239, 181920, 587713, 1091515, 1345513, 1171680, 772270, 463953, 400695, 622051, 1104556, 1612136, 1744086, 1354699, 772486, 432926, 452371, 707412, 1108589, 1565148, 1865077, 1862034, 1674236, 1482142, 1261943, 946542, 698070, 734476, 983543, 1188331, 1275948, 1343307, 1361261, 1218159, 1027776, 1063729, 1367510, 1733830, 2123741]
44912B123741O33782R30609R08381N94229L65487L44154K67965L1831k7455M12234
44902F584958J159538J717884J914557K106809K713978L695958M648187N340720
44894B9882589N868548O119552N405466L077559m97569l979342o190394o924706
44886C2761703o597494n585992m212638k969785k245979j922272j603341j192436
44878F431766r29576r16753r40545q01702n49327l16915j39825k3332k9990j95880
44868A587921m40081o13559n90315l14130J52534N91238P14878L88595j89587
44859A287494n62480l84845K00736O45282N64864J50672j26504j03634R56l885
44849A668656j03919k67381m69651n18132k12838K61715M71751L36332K04558
$$ y = [2123741, 2757523, 3688132, 4596513, 5190742, 5556229, 5900383, 6168348, 6200179, 6172724, 6584958, 7744496, 9462380, 11376937, 13483746, 16197724, 19893682, 24541869, 29882589, 35751137, 41870689, 47276155, 50353714, 49856145, 45876803, 39686409, 32761703, 26164209, 20578217, 16365579, 13395794, 11149815, 9227543, 7624202, 6431766, 5502190, 4585437, 3644892, 2843190, 2293863, 1976948, 1837123, 1813791, 1783801, 1587921, 1147840, 534281, -56034, -370164, -217630, 373608, 1088486, 1477081, 1287494, 725014, 340169, 540905, 1186187, 1751051, 1901723, 1775219, 1671585, 1672541, 1668656, 1564737, 1297356, 827705, 309573, 96735, 358450, 830201, 1166533, 1371091]
44840A371091K50365K54019J30907J50700L77042M28837J51818o374K60677N21154
44830C890236L08374n3879Q251L50168M23776K50819K70037M22632K62247j03009
44820F029652o9659M11586P10430N81728N09021P56837R17642P49446O80789J034455
44810A2311927J443458J533418J549372J759810J821897J350874O24349Q3078
44802B2478183m28594j235446k010306k141996j726947j467606j648952j855342
44794I962994j702836j287851q61466n28898l23091k03306L374L21815M05572
44785E786307o66n12176n05414J9338M93747O47608P61035J032250J259276J254954
44775A0236259J072146P12989J14742m78461o73910n93639p92704j319050j499573
$$ y = [1371091, 1621456, 1875475, 2006382, 2157082, 2534124, 2962961, 3114779, 3108405, 3369082, 3890236, 4198610, 4144731, 4152982, 4503150, 4926926, 5177745, 5447782, 5870414, 6132661, 6029652, 5959993, 6371579, 7082009, 7663737, 8172758, 8929595, 9847237, 10596683, 11277472, 12311927, 13755385, 15288803, 16838175, 18597985, 20419882, 21770756, 22395105, 22478183, 22049589, 20814143, 18803837, 16661841, 14934894, 13467288, 11818336, 9962994, 8260158, 6972307, 6110841, 5581943, 5258852, 5055546, 5058920, 5380735, 5786307, 5785641, 5273465, 4768051, 4787389, 5281136, 5928744, 6689779, 7722029, 8981305, 10236259, 11308405, 12021394, 12136136, 11657675, 10983765, 10390126, 9597422, 8278372, 6778799]
44766F778799r94144m17787m18008o96061n76652j19298O5404j47604k94559j75974
44756C004116j07822k60261l70347k66305j39776r8156O5041L97065N22891J88898
44746B935344k73881l99425k44146k04974l57173l98294j99759o201j3187q0517
44736G57787k1092O7295l3242k90137m20061k46657P7672K46893J39419o2108
44726B15769r1346Q5509K27988J21746j54119l46360l48403k57408j41766M6454
44716f41936K76936L69179K47532R6811R0332J09087n0492l03400l78168k36064
44706d20183r7685n3581L6049J85081J52110j64728m74897m58149j79607P1970
44696a403620J75057J71376M7379j95716l68480k78365k3332J55367K34737L46620
$$ y = [6778799, 5784655, 5366868, 4948860, 4252799, 3676147, 3556849, 3622253, 3474649, 3180090, 3004116, 2896294, 2636033, 2265686, 1999381, 1859605, 1761449, 1826490, 2223555, 2746446, 2935344, 2661463, 2262038, 2017892, 1812918, 1455745, 1057451, 857692, 851491, 838304, 757787, 736695, 803990, 770748, 480611, 60550, -186107, -108435, 138458, 277877, 215769, 124423, 209932, 437920, 559666, 405547, 59187, -289216, -546624, -688390, -641936, -365000, 4179, 251711, 348522, 438854, 547941, 497449, 194049, -184119, -420183, -517868, -571449, -535400, -350319, -198209, -362937, -837834, -1295983, -1475590, -1403620, -1228563, -1057187, -1009808, -1205524, -1574004, -1852369, -1875701, -1720334, -1485597, -1138977]
44686a138977M35363L19648P5497o447J07726J27234n8388j63258L1609L15013
44676D5020L69567K01310J3099j18131j84367q0130K11003M21628K99457q973
44666A169483j72986j80598k95120n57334o92548n52495l09279j09568J42686
44657a557759M86625O70138M75559J09395j2769J89431L77534K70435k76j03083
44647I05230M5877J84207N5088k41498l50143j10048K31674L60963L31690M47368
44637A860408P52722R37500Q38506P37739R27319J211009J181182Q73140P36284
44628A0055809R18703R74690M68232m24285j152054j423279j350309j124779q43607
44619F099121n92455m28795k83533r0502J2386j57209m77374n94055l85322j09568
$$ y = [-1138977, -703614, -383966, -308469, -314916, -207190, -79956, -138344, -301602, -269993, 45020, 414587, 615897, 628996, 510865, 326498, 246368, 457371, 878999, 1178456, 1169483, 996497, 815899, 520779, -36555, -729103, -1281598, -1590877, -1700445, -1557759, -1071134, -400996, 74563, 183958, 171189, 360620, 738154, 1008589, 1008313, 905230, 951107, 1135314, 1190402, 948904, 598761, 488713, 720387, 1081350, 1413040, 1860408, 2613130, 3550630, 4389136, 5126875, 6054194, 7265203, 8446385, 9319525, 10055809, 10974512, 11949202, 12417434, 11993149, 10841095, 9417816, 8067507, 6942728, 6099121, 5506666, 5077871, 4794338, 4703836, 4716222, 4559013, 4081639, 3487584, 3102262, 2992694]
44609B992694k2950q8697j58785k00770k07476j02343R8072K09929J32430M588
44599B656692l4182n1958j36589k14359k42717l44897n14522m47559J526M27687
44589A099122L51917p1054k73934j01636P9654N8695J9437L9335r3406l73514
44579G34616m11797o4408K21705M7513l26901l99452j46686R0371J95826L07399
44569B48186M17360L91360L03082L34755L84215J75280k31307m32633k68209n9276
44559A262813j29973l77166m85247l51417j14670R4369K50267L31542K57524l3492
44549G04550m43372o75258m55086J09439N01030L05509k81486o31609l67017K78624
44539i54676P76457Q22311N13226J47052o7245j31452j34813q1700M3951R1604
$$ y = [2992694, 2969744, 2881047, 2722262, 2521492, 2314016, 2211673, 2309745, 2519674, 2652104, 2656692, 2622510, 2570552, 2433963, 2219604, 1976887, 1631990, 1117468, 669909, 671435, 1099122, 1451039, 1379985, 1106051, 1004415, 1084069, 1142764, 1162201, 1201536, 1108130, 734616, 322819, 258411, 480116, 527629, 200728, -198724, -345410, -255039, -59213, 248186, 665546, 1056906, 1359988, 1694743, 2078958, 2254238, 2022931, 1590298, 1322089, 1262813, 1132840, 755674, 270427, -80990, -195660, -101291, 148976, 480518, 738042, 704550, 261178, -414080, -869166, -759727, -258697, 46812, -234674, -866283, -1233300, -954676, -178219, 644092, 1157318, 1304370, 1237125, 1105673, 970860, 889160, 933111, 1024715]
44529A024715j19388m06001k95200K80608O86299L68331l03330m80303j5367L72172
44519A112536J70854k48457k74418Q8290L67406L33701J74388Q5384J9495j58494
44509A670685m50160o70486n68885r2398M34357N51205J71131l00632m38371k23821
44499H2625Q2624K96535L82933L38962J90519K7912p9563j35823j22263K9820
44489A094281K98167N28212O00327N15730K97526n339j95667p3403K19119K90969
44479C569922P0219m4385J99020M69237L39483o6068k89714k11061r3760p0148
44469C872745M251J84564K91283K05278M3097l4003O738J19706K40927K96580
44459E231166K90004L31767M43233M39240J99704p1512j14696k6595r8519l21963
$$ y = [1024715, 905327, 499326, 204126, 484734, 1171033, 1539364, 1236034, 755731, 740364, 1112536, 1283390, 1034933, 760515, 848805, 1216211, 1549912, 1724300, 1809684, 1829179, 1670685, 1220525, 550039, -18846, -111244, 323113, 874318, 1045449, 744817, 306446, 82625, 165249, 461784, 844717, 1183679, 1374198, 1402110, 1322547, 1186724, 1064461, 1094281, 1392448, 1920660, 2520987, 3036717, 3334243, 3328904, 3133237, 3059834, 3278953, 3569922, 3640141, 3595756, 3794776, 4264013, 4603496, 4537428, 4247714, 4036653, 3942893, 3872745, 3876996, 4061560, 4352843, 4558121, 4601218, 4567215, 4573953, 4693659, 4934586, 5231166, 5521170, 5852937, 6296170, 6735410, 6935114, 6863602, 6748906, 6722311, 6623792, 6301829]
44449F301829m00757k30733j2767J28905K77819M13301L38034N0841j38137l5960
44439F692375J71822K59113K79100L41001L34411J46822m1204K3178K61614L65049
44429H833281K48165J38053J88514K33373K4700m13829p93796q89740p62543o20127
44419F186051n29184l83020j50670J4237Q288m1184O800N5612m1251j64983r3183
44408D867513Q6910N0358k72757n88547o64927n63739l99615j98677q1673k24264
44398B010582m79703m03361J14846N69294M82196N9244j31718O0914K71319J88543
44388B742156r8047l06148k74511p0703P0887l1465k57937k88209m5123J71045
44378A611945J34817J8901L7367M3260j77354m24486l10100J36666M83830M81083
$$ y = [6301829, 5901072, 5670339, 5657572, 5786477, 6064296, 6477597, 6815631, 6866472, 6728335, 6692375, 6864197, 7123310, 7402410, 7743411, 8077822, 8224644, 8183440, 8206618, 8468232, 8833281, 9081446, 9219499, 9408013, 9641386, 9666086, 9252257, 8458461, 7568721, 6806178, 6186051, 5656867, 5273847, 5123177, 5137414, 5145702, 5104518, 5111318, 5166930, 5125679, 4960696, 4867513, 4954423, 5004781, 4732024, 4143477, 3478550, 2914811, 2515196, 2316519, 2234846, 2010582, 1530879, 1127518, 1242364, 1811658, 2293854, 2353098, 2221380, 2282294, 2553613, 2742156, 2644109, 2337961, 2063450, 1992747, 2063634, 2032169, 1774232, 1486023, 1440900, 1611945, 1746762, 1765663, 1803030, 1846290, 1668936, 1244450, 934350, 1071016, 1554846, 2035929]
44368B035929K78956P8884r7921k65522l81626m30378l86485j58308J96408L37251
44358A207188O9882k17818N266N95104Q66381N82834K60179L18557M89340L82046
44348D558959J62610K17708M59664M55918J21764j32111O0946O04455J054095
44339G564008R92316L66546l96141p23903n00908j99026k60561n41697n98089
44330E702545l45325j20256j60929l38813m28639l93664l28442k77172j87498
44321C121807O668K51415L12884j9777n87869q88964o23475q2216K19892J84448
44311A894813J48781L25963N24064M81657K38085K5959p2852j98872m39165n89189
44301B339244l27391L08887P67904N44804j33955n04793k28193J94401J63951
$$ y = [2035929, 2314885, 2393769, 2295848, 2030326, 1648700, 1218322, 831837, 673529, 869937, 1207188, 1277070, 1059252, 1064518, 1659622, 2526003, 3108837, 3369016, 3687573, 4176913, 4558959, 4721569, 4939277, 5398941, 5854859, 5976623, 5844512, 5905458, 6509913, 7564008, 8556324, 8922870, 8526729, 7802826, 7301918, 7102892, 6842331, 6300634, 5702545, 5357220, 5236964, 5076035, 4737222, 4308583, 3914919, 3586477, 3309305, 3121807, 3128475, 3379890, 3692774, 3672997, 3085128, 2196164, 1572689, 1490473, 1710365, 1894813, 2043594, 2369557, 2893621, 3375278, 3613363, 3639322, 3566470, 3367598, 2928433, 2339244, 2011853, 2320740, 3088644, 3633448, 3499493, 2994700, 2766507, 2960908, 3124859]
44292C124859k10403l87046j91843Q9076K44279L04604K53051K3634k06823j48310
44282B895078J32595K54800Q9838q2976m4595J20526L14809N58949P44877O83503
44272E667404N12651N91063Q32802O88157N8883l37681M7014P54569J030258R51331
44262A0796451J151059J679791J925246J644228J350029J519922J999991K405717
44254B4472434K622236K658877K415815J875334J232814O21111k8067o88378j134533
44245C4047643j348931j694266k373035k986152k996742k471734k001622j951041
44237A6224120k106185k061732j692529j189727q08565o48752o09450n41899m41797
44228F123484l99745l68394j86997Q4300J13919k28378n85070n64630k89021j64731
$$ y = [3124859, 2914456, 2527410, 2335567, 2424643, 2668922, 2973526, 3226577, 3250211, 3043388, 2895078, 3027673, 3282473, 3372311, 3289335, 3244740, 3365266, 3680075, 4239024, 4983901, 5667404, 6180055, 6771118, 7603920, 8292077, 8350960, 8013279, 8060293, 8814862, 9845120, 10796451, 11947510, 13627301, 15552547, 17196775, 18546804, 20066726, 22066717, 24472434, 27094670, 29753547, 32169362, 34044696, 35277510, 35898621, 35870554, 35182176, 34047643, 32698712, 31004446, 28631411, 25645259, 22648517, 20176783, 18175161, 16224120, 14117935, 12056203, 10363674, 9173947, 8365382, 7716630, 7107180, 6565281, 6123484, 5723739, 5355345, 5168348, 5252648, 5366567, 5138189, 4553119, 3988489, 3699468, 3534737]
44218C534737k50862k37835LK30481K77406K34912J77250J3931k05718j73471
44208C600834K45911O96201P09658K73110k01195l64366k06169N0230J37708q4381
44198D857541m63713o26072l81138J8468J97094J37173J07634J81628J35578j24857
44188D039336l46851l09101j88905k99922n80964o34702k95820J00447J62829
44179A646347j9551k1024K91220N45362L82857m1673k91732k33452j09354q8433
44169B060567p0384J4868M8445Q406R5105L40988M00530P2906k16920O9720P06609
44158C530840Q77361K96456l64038l97737K5050K26355q613k66506j81155J37800
44148C875813L67585L56691J77000j991l0716Q7105J60807L7539j63228j94599
$$ y = [3534737, 3283875, 3046040, 3046043, 3276524, 3553930, 3788842, 3966092, 3980023, 3774305, 3600834, 3846745, 4542946, 5252604, 5525714, 5324519, 4960153, 4753984, 4804214, 4941922, 4857541, 4393828, 3767756, 3386618, 3405086, 3602180, 3739353, 3846987, 4028615, 4164193, 4039336, 3692485, 3383384, 3194479, 2894557, 2313593, 1678891, 1383071, 1483518, 1646347, 1626796, 1605772, 1896992, 2442354, 2825211, 2783538, 2491806, 2258354, 2149000, 2060567, 1990183, 2005051, 2053496, 2061902, 2157007, 2497995, 2898525, 2971431, 2754511, 2824231, 3530840, 4408201, 4704657, 4340619, 3942882, 3967932, 4194287, 4185674, 3919168, 3738013, 3875813, 4243398, 4600089, 4777089, 4775098, 4744382, 4831487, 4992294, 5029833, 4866605, 4672006]
44138D672006l5756Q7414M0412n9705o7491p794K5162J4696j2717l9316p706J45068
44126D754273L42057M07312L31356L23580M84147O10696N16213L75477M94944
44117H640055Q24326R94380Q52300O69815P10732Q34313P21560L48228O503j03270
44107A4498942r6365j73465l19162l43417j63812Q0088K31856L58117O83086J278582
44097A6034450J919941K326193K483016K617356K866545L096950L087518K781878
44089C7213847K281212J676819J021338M59481K60108O10726J360856K033058
44081D6917445K204873J944052J767156K013975K317403J946324P53717m74240
44073E9390705q19620j86025Q21861J797250K882845M233051N628683O890099
$$ y = [4672006, 4636250, 4723664, 4764076, 4704371, 4636880, 4629086, 4654248, 4668944, 4656227, 4616911, 4609205, 4754273, 5096330, 5503642, 5834998, 6158578, 6642725, 7253421, 7769634, 8145111, 8640055, 9464381, 10458761, 11311061, 11980876, 12691608, 13525921, 14247481, 14595709, 14602212, 14498942, 14402577, 14229112, 13909950, 13566533, 13402721, 13482809, 13714665, 14072782, 14755868, 16034450, 17954391, 20280584, 22763600, 25380956, 28247501, 31344451, 34431969, 37213847, 39495059, 41171878, 42193216, 42652697, 42912805, 43523531, 44884387, 46917445, 49122318, 51066370, 52833526, 54847501, 57164904, 59111228, 59864945, 59390705, 58571085, 58385060, 59206921, 61004171, 63887016, 68120067, 73748750, 80638849]
44065H0638849Q322129J0371460J3015012J5839962J8620940K1443500K4284377
44058A92536229K6854238K8899175L0224266L0212898K7751944K2162439J4220006
44051C72861195N924344r23664n941002j0108052j4663558j9938709k4989613
44044C02220941k8273384k8823954k6900744k3563107j9761576j5955292j2403204
44037A46539680r399682p065329n170381l434617j948401j131681j302640k391956
44029A14694993m007557n607383o621676o632212n634003m152910l011704k826610
44021G6200938l581620m656689n364852n523696n445130n374396n144260m524473
44013C6585822l707032l127492k851066k483988j789153j076425p75502q54442
$$ y = [80638849, 88960978, 99332438, 112347450, 128187412, 146808352, 168251852, 192536229, 219390467, 248289642, 278513908, 308726806, 336478750, 358641189, 372861195, 378785539, 377861875, 371920873, 361812821, 347149263, 327210554, 302220941, 273947557, 245123603, 218222859, 194659752, 174898176, 158942884, 146539680, 137139998, 130074669, 124904288, 121469671, 119521270, 118389589, 117086949, 114694993, 110687436, 105080053, 98458377, 91826165, 86192162, 82039252, 79027548, 76200938, 72619318, 67962629, 62597777, 57074081, 51628951, 46254555, 41110295, 36585822, 32878790, 29751298, 26900232, 24416244, 22627091, 21550666, 20775164, 19920722]
44005A9920722r29204q04913o22214n39593n60510o68772q59901r96405q89086
43996A3050124o01214m32689m95161n38102l47146r3992q1916l10410n21717n62136
43986I065641m70538l01047r3883L8214K7238J3293J63310L61557L23383M67l78171
43975H749464o55154q46259q85246o19293j63363Q7196j9185j64985q7685j8544
43965E376946k77158o76558p36109l63645P0195K90590L66154L84385K70538N2116
43955D757454k4682J58397L53816K67808k2121j67200m232K41864K17581j62654
43945E616031n91451o61727l18148O1619J34513K0196M7695J75284K7641m30398
43935D081255o63056k66502L91992O01007K19363k22980l04695j95079k33243
$$ y = [19920722, 18991518, 18186605, 17564391, 17024798, 16464288, 15795516, 14935615, 13939210, 13050124, 12448910, 12016221, 11521060, 10982958, 10635812, 10541820, 10459904, 10149494, 9627777, 9065641, 8595103, 8294056, 8200173, 8238387, 8265625, 8278918, 8442228, 8803785, 9127168, 9127635, 8749464, 8094310, 7248051, 6362805, 5743512, 5580149, 5667345, 5648160, 5483175, 5395490, 5376946, 5099788, 4423230, 3687121, 3323476, 3393671, 3684261, 4050415, 4434800, 4705338, 4757454, 4732772, 4891169, 5244985, 5512793, 5490672, 5323472, 5319240, 5561104, 5778685, 5616031, 5024580, 4362853, 4044705, 4106324, 4240837, 4261033, 4308728, 4484012, 4511653, 4081255, 3418199, 3151697, 3543689, 4144696, 4364059, 4141079, 3836384, 3641305, 3408062]
43926C408062l53123j97967L24508Q52939R46931N14862j36968n78163n76760
43917D204321k57764K7244O2047K043J46546M81257O47898M71100K80310M44214
43907F509216P50547O46027P1088m05012m22156l33897n62607q68228p48168k94168
43897D342642o6782k16337l26077j71349n2238j94382l41621k28083l0305j8077
43887B697391r2784k0446J42675K04572K08309L12513M56771M50375K75383N6189
43877D690948j31012k04362l2676L06424M47879K07943r1846q2729J18009K03653
43867E432231K40737M57259O89536O14357M13298N92286J164116J638832J882696
43858A3125348K327391L139877L806729L836339L339955K609551J663916O19899
$$ y = [3408062, 3054939, 2856972, 3181480, 4034419, 4981350, 5496212, 5359244, 4781081, 4204321, 3946557, 3973801, 4035848, 4037891, 4184437, 4665694, 5313592, 5784692, 6065002, 6509216, 7259763, 7905790, 7976878, 7571866, 7149710, 6815813, 6253206, 5384978, 4636810, 4342642, 4275860, 4059523, 3733446, 3562097, 3509859, 3315477, 2973856, 2745773, 2715468, 2697391, 2604607, 2584161, 2726836, 2931408, 3139717, 3452230, 3909001, 4359376, 4634759, 4690948, 4559936, 4355574, 4322898, 4629322, 5077201, 5285144, 5193298, 5110569, 5228578, 5432231, 5672968, 6130227, 6819763, 7434120, 7847418, 8439704, 9603820, 11242652, 13125348, 15452739, 18592616, 22399345, 26235684, 29575639, 32185190, 33849106, 34469005]
43850C4469005K740J30668N19182M39427j50557p19700r91939j110380j084128
43841C1504318o42612K94055J434265K491362L397587M095282M475069M624604
43833E1673930M824605N162728N398006N317786M981827M475885L650940K298964
43825H7784671M55929j621846l671379n458107o675618p007574o379443n123467
43817E2303166l828185k930200k394075j842796j055324k48877K23620L34489
43809D0561818L38382L21231O1268n70702j297419j721820j826921j968481k354773
43800C1542583k732508k714877k295759j839178j592213j456335j313284j289277
43792A6309152j460766j538598j223965p53605o30901q21930p48696k35236R4277
$$ y = [34469005, 34471745, 34602413, 35121595, 35561022, 35410465, 34690765, 33698826, 32588446, 31504318, 30861706, 31155761, 32590026, 35081388, 38478975, 42574257, 47049326, 51673930, 56498535, 61661263, 67059269, 72377055, 77358882, 81834767, 85485707, 87784671, 88240600, 86618754, 82947375, 77489268, 70813650, 63806076, 57426633, 52303166, 48474981, 45544781, 43150706, 41307910, 40252586, 40003709, 40227329, 40561818, 40900200, 41221431, 41282699, 40711997, 39414578, 37692758, 35865837, 33897356, 31542583, 28810075, 26095198, 23799439, 21960261, 20368048, 18911713, 17598429, 16309152, 14848386, 13309788, 12085823, 11332218, 10701317, 9879387, 9130691, 8895455, 8989732]
43783H989732k77793r20753j037671n88917k43232l32608m61762k27984J87667
43774E086679L57064J80120j07320k85775l20540k95615l01029l31480k80625
43765C701479j02999P3136J02552J3609p7590j24767q6621J17247L97219M65793
43755D479058K76123K19108N20552P36557L72005k33256l04900J79178M50452
43746F694877J49633k14843k11332j06989j79124j39360K27810M79131K11019
43737F910822j40008R6767P53944J080136Q68997O35922P43479R96990J138722
43728A3085771J191002J232199J282964J463459J848098K143980J942635J329191
43720B5519299Q15715O17144M29132J2004m49230p23837q76334j037158j174193
$$ y = [8989732, 8711939, 7791186, 6753515, 6164598, 5921366, 5588758, 5126996, 4899012, 5086679, 5443743, 5623863, 5516543, 5230768, 4910228, 4614613, 4313584, 3982104, 3701479, 3598480, 3671616, 3774168, 3787777, 3710187, 3585420, 3498799, 3616046, 4013265, 4479058, 4755181, 4974289, 5494841, 6231398, 6603403, 6370147, 6065247, 6244425, 6694877, 6844510, 6629667, 6418335, 6311346, 6132222, 5992862, 6220672, 6699803, 6910822, 6770814, 6867581, 7621525, 8701661, 9570658, 10206580, 10950059, 11947049, 13085771, 14276773, 15508972, 16791936, 18255395, 20103493, 22247473, 24190108, 25519299, 26335014, 26952158, 27381290, 27393294, 26944064, 26220227, 25343893, 24306735, 23132542]
43711B3132542j290427j540397j934501k185902k063936j691454j316662j000592
43703A0108671p09736n19505n20339o47899p58179p67350o35972l66956r7742
43694E084993j7959j10290j60587j04486j32043l23550m32086k36653P8521J41670
43684C787530j15530m06396m78141l60284k22408j32237k4287J30540K04409N9789
43674B442985j83908k20191q157P8768j92680m56179k58127J52761J34695k76099
43664A213868l09422L14080Q13189M65460k85521m84936m4717K63014K6871l19367
43654A652519k92778k2601R8674r220j30335p0770K12577N93334P81066N54937
43644C367403P9738k14065j39988O1198J17648P0131Q8769J50088R2457r8620
$$ y = [23132542, 21842115, 20301718, 18367217, 16181315, 14117379, 12425925, 11109263, 10108671, 9398935, 8879430, 8359091, 7711192, 6953013, 6185663, 5549691, 5182735, 5084993, 5067034, 4956744, 4796157, 4691671, 4559628, 4236078, 3803992, 3567339, 3645860, 3787530, 3672000, 3265604, 2787463, 2427179, 2204771, 2072534, 2048247, 2178787, 2383196, 2442985, 2259077, 2038886, 2030729, 2109497, 1916817, 1460638, 1202511, 1355272, 1489967, 1213868, 904446, 1218526, 2031715, 2497175, 2211654, 1726718, 1682001, 1945015, 1971886, 1652519, 1359741, 1337140, 1435814, 1426594, 1296259, 1225489, 1438066, 2031400, 2812466, 3367403, 3447141, 3233076, 3093088, 3154286, 3271934, 3342065, 3430834, 3580922, 3673379, 3574759]
43634C574759k30305j29224J52474L87596M33028M10780N45912Q19667R48325
43625F913012P95203O12954P01316R95422J225071J333735J456629J594713J630761
43616A7258816J604975J645198J664123J475101J181859J049144R57942M49475
43608B7286633n41401j433596j722994j586077j473132j440509j270078j014444
43600A6804402r78338j218212j426336j346804j055601p87356o65753o40286n67868
43591H117848l47403n2093J08002K9678j39147j78266m8817J06884J42907J9831
43581G759424j81423l06490k79597k23156k92404m04869l49014j66076j25435
43572E430960k52838k39975K1884K04976R3201k4706J29236K81734O7096k63254
$$ y = [3574759, 3344454, 3215230, 3367704, 3755300, 4188328, 4599108, 5145020, 5964687, 6913012, 7708215, 8321169, 9022485, 10017907, 11242978, 12576713, 14033342, 15628055, 17258816, 18863791, 20508989, 22173112, 23648213, 24830072, 25879216, 26837158, 27286633, 26745232, 25311636, 23588642, 22002565, 20529433, 19088924, 17818846, 16804402, 15826064, 14607852, 13181516, 11834712, 10779111, 9991755, 9326002, 8685716, 8117848, 7770445, 7718352, 7826354, 7856032, 7716885, 7538619, 7489802, 7596686, 7739593, 7759424, 7578001, 7271511, 6991914, 6768758, 6476354, 6071485, 5722471, 5556395, 5430960, 5178122, 4938147, 4960031, 5165007, 5258208, 5233502, 5362738, 5644472, 5711568, 5448314]
43562E448314j77240K53042M39149K30028J39798M90287Q97396Q62852M37658
43553I021284L1580q8300J23972N87946J033393J133487R18464P77638Q69477
43544A4408941Q78080N97480L73885N99383J079335J345218J387392J612872K177985
43535B4460571K804973L249076L571002L917762M345354M889164N543772O167961
43527E8949635O671176P279228Q315426R688416J0882380J1503969J1566582J1191368
43519A36048180J0355424R082362P609588O166780M771746L421405K313259J641825
43511A81410569J215713M44408j243576l951482p184567j0126236j2136872j3066194
43503A35361763j3112400j2491359j1363443r970433q600607p404141o410007
$$ y = [5448314, 5271074, 5524116, 5963265, 6193293, 6333091, 6823378, 7720774, 8583626, 9021284, 9052864, 8964564, 9088536, 9676482, 10709875, 11843362, 12761826, 13539464, 14408941, 15287021, 15884501, 16258386, 16857769, 17937104, 19282322, 20669714, 22282586, 24460571, 27265544, 30514620, 34085622, 38003384, 42348738, 47237902, 52781674, 58949635, 65620811, 72900039, 81215465, 90903881, 101786261, 113290230, 124856812, 136048180, 146403604, 155485966, 163095554, 169262334, 174034080, 177455485, 179768744, 181410569, 182626282, 183070690, 181827114, 177875632, 170691065, 160564829, 148427957, 135361763, 122249363, 109758004, 98394561, 88424128, 79823521, 72419380, 66009373]
43496F6009373n678163n208971m755417m042855l203417k668328k565250k566144
43488C5320828k421693k240864k071139j660009r56189m37891n00811q26672q43706
43479B3361854n65057m17621m08159r9197N88754J176339J364125J419658J601174
43470B8021870J674664J306808N69782k49211j037738j759420k228429k295052
43462B4003274k076322j759567j369366r44516p00645p42187q29878p20487n30913
43453A4329393m74693m67469l34763j82467j59140o2127L41928P67679P33530
43444A4491871L55856K27208M88962O56166M89499L87249O35579Q79910P51482
43435A9363782N10226N87358R11255J199853J535618K043299K299333J774140
$$ y = [66009373, 60331210, 55122239, 50366822, 46323967, 43120550, 40452222, 37886972, 35320828, 32899135, 30658271, 28587132, 26927123, 25970934, 25533043, 25032232, 24205560, 23361854, 22796797, 22379176, 21971017, 21871820, 22460574, 23636913, 25001038, 26420696, 28021870, 29696534, 31003342, 31573124, 31323913, 30286175, 28526755, 26298326, 24003274, 21926952, 20167385, 18798019, 17853503, 17152858, 16410671, 15580793, 14860306, 14329393, 13854700, 13387231, 13052468, 12870001, 12710861, 12648734, 12990662, 13758341, 14491871, 14847727, 15074935, 15563897, 16220063, 16709562, 17096811, 17732390, 18612300, 19363782, 19874008, 20461366, 21372621, 22572474, 24108092, 26151391, 28450724, 30224864]
43427C0224864P30868l1402l24934p48059j591075k289575k295390j891170j681140
43418B0102987j710008j592885j223381q32596n05104j31690K02383K29606m2787
43409A4496525k44906j23583J47352K43236P8214j81724l46870l52370k69470
43400A3446404k19249k22638j64950M371J13240k9643l25242m82611m11772k88423
43390A1419487k02297p367L59840O48708N78250K09501j50319l03882k38911M0471
43380A2353481N00785R19759J015862Q39129Q28221J316809K112798K754060L107458
43371B5748362L493694M214987N194981O172473O999421P528550P413464O395416
43363G3161348M756675L092657J528121m49410l125284n851374p574042p889577
$$ y = [30224864, 30955732, 30924330, 30599396, 29851337, 28260262, 25970687, 23675297, 21784127, 20102987, 18392979, 16800094, 15576713, 14744117, 14239013, 14107323, 14309706, 14539312, 14496525, 14251619, 14128036, 14275388, 14518624, 14596838, 14415114, 14068244, 13715874, 13446404, 13227155, 13004517, 12839567, 12843938, 12957178, 12927535, 12602293, 12119682, 11707910, 11419487, 11217190, 11209823, 11569663, 12218371, 12796621, 13006122, 12855803, 12551921, 12313010, 12353481, 12854266, 13774025, 14789887, 15629016, 16457237, 17774046, 19886844, 22640904, 25748362, 29242056, 33457043, 38652024, 44824497, 51823918, 59352468, 66765932, 73161348, 77918023, 81010680, 82538801, 82089391, 78964107, 73112733, 65538691, 57649114]
43355E7649114p229443o177564n053033m079763l420124k909477k197491j338086
43347B5244133q54420j005368j363244j401768j168142j030048j043538r87313
43339A6390292q40355p92297q48926q04720n91679l49234j72533o1577n8151j49892
43329A1720928j29174J19730K86881k4n17544o18090j17901M46703N72810L42842
43319A2107161M3615k85658o20255o92201l81973p0389j69177n11232o34225n05339
43309H280327m95022o97280p62246m81566j27060k8781j13876q8009R7151J78504
43299E762142n5522m72780o98479m79959O9576O08459R06751R57951P96461M17613
43289G812213n3834l44931l39865k21001j50218k6079K29628L76357J57095k65713
$$ y = [57649114, 50419671, 44242107, 39189074, 35109311, 31689187, 28779710, 26582219, 25244133, 24389713, 23384345, 22021101, 20619333, 19451191, 18421143, 17377605, 16390292, 15549937, 14757640, 13908714, 13103994, 12512315, 12163081, 11990548, 11928971, 11870820, 11720928, 11591754, 11711484, 11998365, 11998341, 11480797, 10862707, 10744806, 11191509, 11764319, 12107161, 12150776, 11865118, 11244863, 10552662, 10170689, 10100300, 9931123, 9419891, 8785666, 8280327, 7785305, 7088025, 6325779, 5844213, 5717153, 5688372, 5574496, 5486487, 5583638, 5762142, 5706620, 5233840, 4535361, 4055402, 4124978, 4733437, 5640188, 6598139, 7394600, 7812213, 7758379, 7413448, 7073583, 6852582, 6702364, 6676285, 6905913, 7282270, 7439365, 7173652]
43279G173652n09534m90860m14050l57886k45117j32595j21111m2075L03218O21146
43269E784788L89847k72073n83407j70288L89129M21575O1541j41566r9345j22454
43259E657747k55647k49378p5005N4049J32236L48930O13440N59604J21949k95506
43249F612419l68620k32575j55172j39085n3818P5156J32129J06852L4311j26641
43239E884956l62568m57957k01945K64705M98086K32694k71251m72285j55314
43230D959121K95147L30760r2723m58111l45063O1997K83342J79298J4257k1113
43220E206912l8220j65799l02554k70774o0793J67331K31532O4132j86467k27872
43210D417428L4186K78461J34202k62797l96537j01758J91013J01563j53818j33794
$$ y = [7173652, 6664118, 6173258, 5759208, 5401322, 5156205, 5023610, 4902499, 4860424, 5163642, 5784788, 6174635, 5902562, 5319155, 5148867, 5537996, 5959571, 6021112, 5879546, 5780201, 5657747, 5402100, 5152722, 5077717, 5131766, 5264002, 5612932, 6226372, 6785976, 6907925, 6612419, 6243799, 6011224, 5856052, 5716967, 5663149, 5738305, 5870434, 5977286, 6011597, 5884956, 5522388, 5064431, 4862486, 5127191, 5625277, 5857971, 5586720, 5114435, 4959121, 5254268, 5585028, 5492305, 5034194, 4689131, 4751128, 5034470, 5213768, 5228025, 5206912, 5168692, 5002893, 4700339, 4429565, 4368772, 4536103, 4767635, 4831767, 4645300, 4417428, 4451614, 4730075, 4864277, 4601480, 4204943, 4103185, 4294198, 4395761, 4241943, 4108149]
43200D108149J77108M22119M08410K51389P9250p6401j28903J4554K30023K61736
43190E747434O2388j75873l35798m60664m96176k54607K27889N57766M10844o7425
43180E215778m57259n13898k64145J62845N51962N76301Q8359n35024o32254J2051
43170D204716Q50607J143402P36262J20622k02436k15558k12742l14101l20027
43161E790745l8954L77197N39796K65740j76647l37404p5408L04241M22875K56566
43151G328747J17959K50126N42084O79421N00654J30030k11717m31252n63291
43142H342761o24107n58953l37242k5821K65801M65201N33778M49329K59059J03626
43132H873432R7032J92476K40039J55622m6598l30762n95831o01120j89595L52568
$$ y = [4108149, 4285257, 4707376, 5115786, 5367175, 5446425, 5370024, 5241121, 5255675, 5485698, 5747434, 5809822, 5633949, 5298151, 4837487, 4341311, 4086704, 4314593, 4872359, 5283203, 5215778, 4758519, 4244621, 3980476, 4143321, 4695283, 5271584, 5359943, 4824919, 4192665, 4204716, 5055323, 6198725, 6934987, 7055609, 6853173, 6637615, 6424873, 6110772, 5790745, 5751791, 6128988, 6668784, 6934524, 6757877, 6420473, 6345065, 6649306, 7072181, 7328747, 7446706, 7696832, 8238916, 8918337, 9418991, 9549021, 9337304, 8906052, 8342761, 7718654, 7159701, 6822459, 6796638, 7062439, 7527640, 8061418, 8510747, 8769806, 8873432, 8970464, 9162940, 9402979, 9558601, 9512003, 9181241, 8585410, 7984290, 7794695, 8147263]
43122H147263M49487n4552n86379n37162p0248J53570m7558j66384J55806N77925
43112H021768O04267K84224k165j75993m29998p07967o94480l60969j05433j87748
43102F245506l40553j77994K09522L54271N7497l21156l18631M1459K96068J54038
43092F200027j54447k50148j24818l7729k3947J18005L44980L15663k0981k14007
43082F152598J9422L00440J68106j78469k23914K4293J31690K9634N2108J88475
43072F664383r84n60877q92502o32589k08231j29296k26264o2711K94417M51066
43062D696412L62845L00399K97195J41854j41428k65210j44604j4842n2811j93830
43052D985980l41512m63000m49147j66815K82515N83537N53238L02219L6625j29860
$$ y = [8147263, 8596750, 8542198, 7955819, 7418657, 7348409, 7501979, 7454421, 7288037, 7443843, 8021768, 8626035, 8910259, 8908094, 8732101, 8302103, 7594136, 6899656, 6538687, 6433254, 6245506, 5904953, 5726959, 5936481, 6290752, 6348249, 6027093, 5708462, 5749921, 6045989, 6200027, 6045580, 5795432, 5670614, 5632885, 5608938, 5726943, 6071923, 6387586, 6366605, 6152598, 6172020, 6472460, 6640566, 6462097, 6238183, 6262476, 6394166, 6423800, 6475908, 6664383, 6663399, 6102522, 5210020, 4577431, 4369200, 4239904, 4013640, 3950929, 4245346, 4696412, 5059257, 5359656, 5656851, 5798705, 5657277, 5392067, 5247463, 5232621, 5179810, 4985980, 4644468, 4181468, 3732321, 3565506, 3848021, 4431558, 4984796, 5287015, 5323640, 5193780]
43042E193780j59846o4180O9299J26645N7473j30417l79495n26532m00831r1142
43032C694754Q5004L8787R4806M70926Q15185O18165n8221o29813o94446l72017
43022D063130k0815Q2528j28435m02835l10966K11873O42924N50982K53415L04452
43012E246253N66300M49729m0323k64948p127K05039K1235k24805k29639k45605
43002E476109n04378p41939p26706o70308o60468l12595M43134Q43817L01738
42993C448404n60412p14142k01065J03382k8067N8210O20381J000377O81798P5710
42983D484576j80600j20097j76166m33824o08725n28804k68037N1488L24853M44573
42973B989237L95837K70013R4535j91758n20860o50567m40213j5360L94312O12679
$$ y = [5193780, 5033934, 4969754, 5039053, 5165698, 5223171, 5092754, 4713259, 4186727, 3785896, 3694754, 3779758, 3818545, 3913351, 4384277, 5199462, 5817627, 5759406, 5129593, 4435147, 4063130, 4042315, 4124843, 3996408, 3593573, 3282607, 3494480, 4137404, 4688386, 4941801, 5246253, 5812553, 6262282, 6221959, 5957011, 5949884, 6154923, 6176158, 5951353, 5721714, 5476109, 4971731, 4229792, 3503086, 2832778, 2172310, 1859715, 2302849, 3146666, 3448404, 2887992, 2173850, 1972785, 2076167, 2048100, 2106310, 2726691, 3727068, 4408866, 4484576, 4303976, 4183879, 4007713, 3573889, 2965164, 2436360, 2168323, 2219811, 2544664, 2989237, 3385074, 3655087, 3749622, 3557864, 3037004, 2386437, 1946224, 1930864, 2325176, 2937855]
42963B937855N19840J53451j63881r2153K53540L90323J27160j69010j09611K13002
42953D060516M46727M31845K16533j35923n04884o58398m89152j93882l6321m0691
42943C096370n4622J9994J71763K94689J82872k50875o61001n09737J89541P39728
42933C218722O69446M01489N80378J060487J154334P10179K62228R1886j64844
42924G984305p39025j167982r41307l02590P6188n597j65041j14555J200j3562
42914D612034o4926L2731K47868L90604L64868K33901R0233n0966k35730m69095
42904E151522o31181n60231k84391p6278j24407k21035j0035M57689P09889N00563
42894D912105J68516J23594K48124J60947j10314j74250N7894K44366K42732L68499
$$ y = [2937855, 3457695, 3611146, 3447265, 3355112, 3608652, 3998975, 4126135, 3957125, 3847514, 4060516, 4507243, 4939088, 5155621, 5019698, 4514814, 3856416, 3367264, 3173382, 3137061, 3096370, 3041748, 3061742, 3233505, 3528194, 3711066, 3460191, 2799190, 2289453, 2478994, 3218722, 3888168, 4289657, 4870035, 5930522, 7084856, 7795035, 8057263, 8149149, 7984305, 7245280, 6077298, 5135991, 4833401, 4909589, 4903992, 4738951, 4624396, 4625596, 4612034, 4547108, 4579839, 4827707, 5218311, 5583179, 5817080, 5907313, 5856347, 5620617, 5151522, 4520341, 3960110, 3675719, 3599441, 3475034, 3253999, 3243964, 3701653, 4411542, 4912105, 5080621, 5204215, 5452339, 5613286, 5502972, 5328722, 5386616, 5630982, 5873714, 6242213]
42884F242213P73645J011633O33054p4243m03167j49455K09093K00373j60874
42875H282272n70790p57281n75860j14926K42518J62987j78242k74956K3044L23136
42865F561902K84340P1483N0672K98340N96500P16850N65483K26472l6693j8585
42855I316764J22093L2430l04835n19354m22884k72670l07837m00078l93736m17635
42845F432258n59738n83353l24686n9080p5067j70489j5681K35979K04879l2909
42835E052113o0951J77135L26422K41809J50749J76282J78295J15137J05228Q0079
42825F542298j59273m82309n17576k86203k17707l97186l78798K189K27769q8189
42815D245015m99891l71721J52793M00488J59631j49214j95458j00839n8429k9825
$$ y = [6242213, 7015858, 8027491, 8660545, 8586302, 8183135, 8033680, 8242773, 8443146, 8282272, 7711482, 6954201, 6378341, 6263415, 6505933, 6668920, 6490678, 6215722, 6238766, 6561902, 6846242, 6917725, 6968397, 7266737, 7863237, 8580087, 9145570, 9372042, 9335349, 9316764, 9438857, 9471287, 9166452, 8647098, 8224214, 7951544, 7643707, 7243629, 6849893, 6432258, 5872520, 5289167, 4964481, 4905401, 4830334, 4659845, 4644164, 4880143, 5085022, 5052113, 4991162, 5168297, 5494719, 5736528, 5887277, 6063559, 6241854, 6356991, 6462219, 6542298, 6383025, 5900716, 5383140, 5096937, 4879230, 4482044, 4103246, 4105435, 4333204, 4245015, 3745124, 3373403, 3526196, 3926684, 4086315, 3937101, 3741643, 3640804, 3582375, 3552550]
42805C552550P7705K38918L96850N01872M48012J83645j20234k23110j22186j1626
42795D922396J2403j8980j40681l83983n40965l32222J39125M28163L57942K75119
42785D718317N04115Q20632P58261K78594j86518l23829k66268k62762k87654
42776E752888j76883l234m2291l44101n76045m34675o6030J13516n7894l40928
42766C824323m44846l14539n5919K07462L43984K78764J23042N6247L5817j35101
42756C919234l96236m23200j85481j21757m52528o86902k85083M46592P07357
42747B521996L50012M5791K27866N00010L70034L3473j4538K08025K55530l108
42737D495091k10842j05179J14083J23543q1783k56763k72155k31269k46603k51607
$$ y = [3552550, 3630255, 3869173, 4266023, 4767895, 5215907, 5399552, 5279318, 5056208, 4934022, 4922396, 4934799, 4915819, 4775138, 4391155, 3850190, 3517968, 3657093, 4085256, 4443198, 4718317, 5222432, 6043064, 6801325, 7079919, 6893401, 6569572, 6303304, 6040542, 5752888, 5576005, 5572771, 5530480, 5186379, 4610334, 4175659, 4109629, 4223145, 4165251, 3824323, 3379477, 3064938, 3009019, 3216481, 3560465, 3839229, 3962271, 4018518, 4054335, 3919234, 3522998, 3099798, 2914317, 2792560, 2340032, 1653130, 1368047, 1814639, 2521996, 2872008, 2917799, 3145665, 3645675, 4015709, 4049182, 4034644, 4242669, 4498199, 4495091, 4284249, 4179070, 4293153, 4416696, 4334913, 4078150, 3805995, 3574726, 3328123, 3076516]
42727C076516j25090O0095P4196j23815k44200m3980K76027L09807K3011k29216
42717C053351k75561l32908n00740m67234l3570M03799L38180p2424k04667J20062
42707B028288M33532L95708K63100L49094M51261K11301k13131k93550J07718
42698C733321N17725M69677M0177l59105m91430m14062k50457p5655K1458k1213
42688C170436r7952J533L10944N87672N81996L09739l5004l24366n03462m54816
42678C546720j00741L51850N18683K88506l6681j69575j85779k57298k66680j1542
42668C677463L28803L30758m1840l24509k05198N6991R4192N141J29620M53691
42658D505112O53068O54410P13303Q72219P78111K66070k22833j59180L26027
$$ y = [3076516, 2951426, 3011521, 3085717, 2961902, 2717702, 2673722, 2949749, 3259556, 3282567, 3053351, 2777790, 2444882, 1944142, 1476908, 1443338, 1847137, 2185317, 2112893, 1908226, 2028288, 2461820, 2857528, 3120628, 3469722, 3920983, 4132284, 3919153, 3625603, 3733321, 4251046, 4720723, 4760900, 4401795, 3910365, 3496303, 3245846, 3170191, 3191649, 3170436, 3072484, 3074017, 3384961, 3972633, 4554629, 4864368, 4829364, 4504998, 4001536, 3546720, 3445979, 3797829, 4316512, 4605018, 4568337, 4398762, 4212983, 3955685, 3689005, 3677463, 4006266, 4337024, 4295184, 3970675, 3765477, 3822468, 3916660, 3921801, 4051421, 4505112, 5158180, 5812590, 6525893, 7398112, 8176223, 8442293, 8219460, 8060280, 8386307]
42649H386307N83157K75864k81313o43116p38329p08415n49568j98785J78233
42640F304035K94791J27771n0731o8174o3291k07519l98784l98143j68118J06898
42630E478735K97916M41721N52593N12700K61213l7902j69949j38017q7373m640
42620G106997K77401P19191R60720P51797L34226J56768L01829M68069M80808
42611A1557806M74267M85862K46236l58500q89140q05616k16513K06885Q2188
42602A0783475k74109l94359k85828k79209m71201o09840m75373j47855J20804
42593G966505J64741K3738j06037n1109J50172K88043K66740K37208L23943L53355
42583I617299Q4966l49271n33536l46890j48488k14492k66405J21404P88722J064440
$$ y = [8386307, 8969464, 9245328, 8964015, 8320899, 7582570, 6874155, 6324587, 6125802, 6304035, 6598826, 6726597, 6675866, 6607692, 6544401, 6336882, 5938098, 5539955, 5371837, 5478735, 5776651, 6218372, 6770965, 7283665, 7544878, 7506976, 7337027, 7199010, 7111637, 7106997, 7384398, 8103589, 9064309, 9816106, 10150332, 10307100, 10608929, 11076998, 11557806, 12032073, 12517935, 12764171, 12405671, 11516531, 10710915, 10494402, 10701287, 10783475, 10509366, 10115007, 9829179, 9549970, 9078769, 8468929, 7993556, 7845701, 7966505, 8131246, 8154984, 8048947, 7997838, 8148010, 8436053, 8702793, 8940001, 9263944, 9617299, 9702265, 9352994, 8819458, 8472568, 8324080, 8109588, 7843183, 7964587, 8753309, 9817749]
42573I817749O26011o7423l86848l07917k82384m89387n91174k85761K10800M28668
42563H672334K27637r0002j93509p6124K1331p5801k91555m03040l12750j84773
42553G293748k38256m23897m55116k11642O9871J42399J07400K02047L59572K93463
42543G139589k703j72007l216K63001L00211J41989N4749J27123K22407K63686
42533H334829L38357N02003O33515N49561K16865j79413m02215m24762m53045
42524I115695n81368n48888j07173M30970M30226j59766n89756l06857K48378
42515G931461L10514o6093j63024K34249N37339L32281j2057k0605J47556P2689
42505I304310j99028k97929j72836j05219j82774j99612o9295M7220P0269J29344
$$ y = [9817749, 10443760, 10376337, 9989489, 9681572, 9399188, 8909801, 8318627, 8032866, 8243666, 8672334, 8899971, 8809969, 8616460, 8540336, 8561667, 8485866, 8194311, 7791271, 7478521, 7293748, 7055492, 6631595, 6176479, 5964837, 6034708, 6177107, 6284507, 6486554, 6846126, 7139589, 7136886, 6964879, 6961663, 7224664, 7524875, 7666864, 7721613, 7848736, 8071143, 8334829, 8673186, 9175189, 9808704, 10358265, 10575130, 10395717, 9993502, 9568740, 9115695, 8534327, 7985439, 7878266, 8309236, 8739462, 8579696, 7989940, 7683083, 7931461, 8241975, 8175882, 8012858, 8247107, 8784446, 9116727, 9104670, 9084065, 9231621, 9304310, 9105282, 8807353, 8634517, 8529298, 8346524, 8146912, 8077617, 8124837, 8195106, 8324450]
42495H324450K82461L83664L29631K10115J13934j1078j98342l44252l64653l14153
42485H411777k38323o3261K23638M10468K59927j71644n54069o15043l69977n1223
42475G242270J07715L6667j43906k46890j88336j7566J97863M19018N51048M54240
42465H412123J36715j70543k52169j44965k7953J7084j9253k18539o02597r01561
42455F228342p55362k13124K41704K85833J20746Q3765J69065J95300K07676L43368
42445F907313M42595K29338j47263k07014J38565M02228K52774Q343Q5451L12891
42435H425221K24551j87809m83195m36415k46272r4185P0429K36719K25650J7789
42425G752483j40626j09290l6740k7350N9004K75404L62795J32806j62297j52070
$$ y = [8324450, 8606911, 8990575, 9320206, 9530321, 9644255, 9633177, 9434835, 9090583, 8725930, 8411777, 8173454, 8110193, 8333831, 8744299, 9004226, 8832582, 8278513, 7663470, 7293493, 7242270, 7349985, 7386652, 7242746, 6995856, 6807520, 6789954, 6987817, 7406835, 7957883, 8412123, 8548838, 8378295, 8126126, 7981161, 7953208, 7970292, 7951039, 7732500, 7129903, 6228342, 5472980, 5259856, 5501560, 5787393, 5908139, 5991904, 6160969, 6356269, 6563945, 6907313, 7349908, 7579246, 7431983, 7224969, 7363534, 7765762, 8018536, 8026879, 8112330, 8425221, 8649772, 8461963, 7978768, 7542353, 7296081, 7201896, 7272325, 7509044, 7734694, 7752483, 7611857, 7502567, 7465827, 7438477, 7497481, 7772885, 8135680, 8268486, 8106189, 7954119]
42415G954119J17701K65779Q0440l15393o95673q70465p03757k79791K0087j04397
42405E468650m57649n81779l56337p0503O2067J09800J18204k9216l15881m72288
42395C475068l29537n5660J18330J82891K02196J18832q2916k13292j12993Q6322
42385C389241J59228J18618J16378J22456j4441k18451j91382J53893M83834M19587
42375D538961K5955k22300J4917N07332O62060K07999m35952o38102l43358j21628
42365D195884l63404p30988o40526o6480M60573N59857L62899J60186N284k02903
42355C740382m60403o45553o67919n22446k59312K6540K20549K60588J85580J19791
42345A997797J99917M32375N88208L77290j62850n92702n56166k17961o719m3784
$$ y = [7954119, 8071820, 8337599, 8418039, 8102646, 7406973, 6536508, 5832751, 5552960, 5573047, 5468650, 5011001, 4429222, 4072885, 4002382, 4064449, 4174249, 4292453, 4263237, 3947356, 3475068, 3145531, 3089871, 3208201, 3391092, 3593288, 3712120, 3629204, 3415912, 3302919, 3389241, 3548469, 3667087, 3783465, 3905921, 3891480, 3673029, 3481647, 3635540, 4119374, 4538961, 4564916, 4342616, 4357533, 4864865, 5526925, 5734924, 5298972, 4660870, 4317512, 4195884, 3832480, 3101492, 2460966, 2394486, 2855059, 3414916, 3777815, 3938001, 3943285, 3740382, 3279979, 2634426, 1966507, 1444061, 1184749, 1211289, 1431838, 1692426, 1878006, 1997797, 2197714, 2630089, 3218297, 3595587, 3432737, 2840035, 2283869, 2065908, 2059189, 2015405]
42335B015405j07618p7640n4827l8701J28760L94409M33250J32897j77186j87455
42325B461294o067J36806K76399M88999N47162K07382l11142n49789m38801l02782
42315B509461k74319j37106J79791L72949K14684r0910k24638j84621j70533k10623
42305A984135j47506Q0932L34675M30562L21065J48047J30752L05100M03005J82136
42295D172903j44453j19057K47015L69678n3285m83519k82261K80396L62420j91561
42285D158276o07285l53234Q9151K3416l96866m73428m9758L48387L94129L50134
42275C482922M46081M35118Q6213l13961l71178k09855k27954l99036l29736J9482
42265B618096J99976j1092k45371j52165L7990n9327k88738j66995L34259O96576
$$ y = [2015405, 1907787, 1830147, 1775320, 1736619, 1865379, 2259788, 2693038, 2825935, 2648749, 2461294, 2455227, 2592033, 2868432, 3357431, 3904593, 4111975, 3800833, 3251044, 2812243, 2509461, 2235142, 2098036, 2277827, 2650776, 2865460, 2774550, 2549912, 2365291, 2194758, 1984135, 1836629, 1917561, 2252236, 2682798, 3003863, 3151910, 3282662, 3587762, 3990767, 4172903, 4028450, 3909393, 4156408, 4526086, 4472801, 3989282, 3707021, 3987417, 4349837, 4158276, 3550991, 3197757, 3286908, 3310324, 2913458, 2440030, 2390272, 2738659, 3132788, 3482922, 3929003, 4364121, 4450334, 4136373, 3765195, 3555340, 3327386, 2928350, 2598614, 2618096, 2818072, 2806980, 2561609, 2409444, 2447434, 2388107, 2099369, 1932374, 2266633, 2963209]
42255B963209N77727K22486L8098R2321J96291K23102J52646j5984k22709l45696
42245C881491l61159l71155l91402k90876l8603J97400L15682M07011M65501K70074
42235D083964j92088m78796k44630J84386K41172k4705n4964K78690M40632R9161
42225D332822l23362k95290N4076K16842O5409j03328j04627k9761L2314N3145
42215C898240j00338n02730q40635o42496O1590O51938O48222K42192q0626j80757
42205C154600k51342l43550k55283R0670M19438L83862k7451m53155n07047j36235
42195B074507L37864N10948K47820k13776m76414l13885J36785M67282L46971
42186C118102j35318n20474m62031j11376R9631L220j63181j45905K6516J92265
$$ y = [2963209, 3540936, 3763422, 3801520, 3893841, 4090132, 4313234, 4465880, 4449896, 4227187, 3881491, 3520332, 3149177, 2757775, 2466899, 2428296, 2625696, 2941378, 3348389, 3813890, 4083964, 3891876, 3413080, 3168450, 3352836, 3594008, 3569303, 3514339, 3793029, 4233661, 4332822, 4009460, 3714170, 3768246, 3985088, 4050497, 3947169, 3842542, 3812781, 3845095, 3898240, 3797902, 3295172, 2454537, 1812041, 1873631, 2525569, 3173791, 3415983, 3335357, 3154600, 2903258, 2559708, 2304425, 2395095, 2814533, 3198395, 3170944, 2717789, 2210742, 2074507, 2412371, 2923319, 3171139, 2957363, 2480949, 2167064, 2303849, 2771131, 3118102, 2982784, 2462310, 2000279, 1888903, 1988534, 1991754, 1828573, 1682668, 1709184, 1901449]
42176A901449K72149K28486M1405j17351O5789N79537Q92553N56842j45155n37104
42166C738600m32294k30804j61541J1350L57397M25074q3822p11856q30213n40735
42156A541156m18042n15371k98749L75742Q83264P09635J84369o5998p285n5225
42146B333496k84330l26452l1728K56434K22272K4128K4585L00600O22682P82039
42136C923726P42521N31102J66259k67041n87061o54957n32229m22270m16897
42127B483153l74536j47216J35391J90519m043j49563p1568J8032j07929k82863
42117A689377k00074O9275J62553j0513j46458m5180R4153O649k55527m28901
42107I35354l56442p6450K62743M79099M74581L42638K41240J60007k846j48524
$$ y = [1901449, 2173598, 2402084, 2443489, 2326138, 2391927, 2971464, 3864017, 4420859, 4275704, 3738600, 3306306, 3075502, 2913961, 2925311, 3282708, 3707782, 3623960, 2912104, 2081891, 1541156, 1123114, 607743, 308994, 684736, 1568000, 2277635, 2462004, 2396006, 2388721, 2333496, 2049166, 1722714, 1690986, 1947420, 2169692, 2193820, 2218405, 2519005, 3141687, 3923726, 4666247, 5197349, 5363608, 5096567, 4509506, 3854549, 3322320, 2900050, 2483153, 2108617, 1961401, 2096792, 2287311, 2283268, 2133705, 2062137, 2080169, 1972240, 1689377, 1489303, 1558578, 1721131, 1710618, 1564160, 1518980, 1613133, 1619782, 1364255, 935354, 578912, 502462, 765205, 1244304, 1718885, 2061523, 2302763, 2462770, 2459924, 2311400]
42097B311400m1593K79074M58780L24208J36890J88279M13927N97990O99114P65512
42087F133581P80088Q01255R82591J221408J108484N30947j0093p5192M2290j93512
42077A1321847o84643r11387q27549q54782j035319r21338m23249o8756j64682
42068E430142l27314j93124l8085k45341o06939o63404m25841k57301k45107j75207
42058B252479j4423L1440p9622j29870J6177K24422K71730O6641k63032m06923
42048A969019j48034K78510L34664j23079n63129m65095j4066K46694K08527J90111
42038A914122L00266L17423J69956N8703N4931p877j71587k51387j58356J5627
42028B241821K52520N65660P03695L83822r7002l7132O61302J204370R84838M52114
$$ y = [2311400, 2269807, 2548881, 3007661, 3331869, 3468759, 3657038, 4070965, 4668955, 5368069, 6133581, 6913669, 7714924, 8697515, 9918923, 11027407, 11558354, 11548261, 11473069, 11515359, 11321847, 10637204, 9725817, 8898268, 8043486, 7008167, 6086829, 5663580, 5594824, 5430142, 5102828, 4909704, 4871619, 4626278, 4019339, 3355935, 2930094, 2672793, 2427686, 2252479, 2238056, 2269496, 2189874, 2060004, 2076181, 2300603, 2572333, 2638974, 2375942, 1969019, 1820985, 2099495, 2434159, 2311080, 1747951, 1282856, 1268790, 1515484, 1724011, 1914122, 2214388, 2531811, 2701767, 2760470, 2815401, 2807524, 2635937, 2384550, 2226194, 2241821, 2494341, 3060001, 3763696, 4147518, 4050516, 4013384, 4674686, 5879056, 6863894, 7316008]
42018G316008M09215Q42394J090980R67684R80752J374829J609456J120105J75735
42009A5887158m48945m81780m26241p90354j363933j502419j024230n15415n92830
42000H741011j080846j234472p25355k5288K98986K81980K65999K34528r7559
41991F658984o45831r11055o69952l08872k62355m20462l72582m8388K14764J99990
41981C434241R1968J28399K02257L0631l59174n62376l03194J67103L59643J57441
41971C346939p8993k0702K34554L52911J51377l17772q61250j151220q52249k6150
41961G77445P16897P94331L32168m3265n5634k2861j93582l11080j06329J63718
41951B051808Q8508k16308k68023L3046K85258K50921J73713K61057K71391o1083
$$ y = [7316008, 7725223, 8567617, 9658597, 10626281, 11607033, 12981862, 14591318, 15711423, 15887158, 15438213, 14956433, 14530192, 13739838, 12375905, 10873486, 9849256, 9333841, 8741011, 7660165, 6425693, 5700338, 5675050, 5974036, 6256016, 6522015, 6756543, 6658984, 6013153, 5102098, 4432146, 4123274, 3860919, 3440457, 3067875, 3019487, 3234251, 3434241, 3526209, 3654608, 3856865, 3887496, 3528322, 2965946, 2662752, 2829855, 3189498, 3346939, 3267946, 3247244, 3481798, 3834709, 3986086, 3668314, 2807064, 1655844, 803595, 777445, 1494342, 2288673, 2620841, 2577576, 2521942, 2499081, 2305499, 1994419, 1888090, 2051808, 2140316, 1924008, 1655985, 1689031, 1974289, 2225210, 2398923, 2659980, 2931371, 2870288]
41941B870288m82312n06606j26919J60659N1556j99173k11331M228J55799J16833
41931A833022L9341Q2129K03564K39577R3930j62126l38664k95350r2001P0672
41921A674094R5290J13421L07783O52151Q95470P99779L75988r2151k71662r7564
41911D452599J39921J16185j44191l53810m07915m85786o33180n61794j05680
41902B016349L77506M10544O2788j59565l0830J70533J75000P5974O2533J31152
41892C291984K18269L41490M47551L76361J48736M5082K07775L98944L60610J81779
41882F018581O5832l5217k45186m03267k39562J67506M41858L99382K05939N7647
41872F433513k8712r1884j27619j38007j01975O4260L31152M54824L35326L51945
$$ y = [2870288, 2387976, 1881370, 1754451, 1915110, 1966666, 1767493, 1556162, 1560390, 1716189, 1833022, 1872363, 1954492, 2158056, 2397633, 2491563, 2329437, 1990773, 1695423, 1603422, 1674094, 1769384, 1882805, 2190588, 2842739, 3738209, 4537988, 4913976, 4821825, 4550163, 4452599, 4592520, 4708705, 4564514, 4210704, 3802789, 3317003, 2683823, 2122029, 2016349, 2393855, 2804399, 2867187, 2707622, 2676792, 2847325, 3022325, 3098299, 3160832, 3291984, 3510253, 3851743, 4299294, 4675655, 4824391, 4869473, 5077248, 5476192, 5836802, 6018581, 6084413, 6049196, 5804010, 5400743, 5161181, 5328687, 5770545, 6169927, 6375866, 6433513, 6404801, 6312917, 6185298, 6047291, 5945316, 6009576, 6340728, 6795552, 7130878, 7482823]
41862G482823R16681J708362J854471J033809o1310o18998o34715n82049n57598
41853A0541476l18570J5728n4838o31678j135788j049722n77565k68725k48246
41844F272072j91793M9702K05210M8210k05166j88686P1499J71114j05024m55975
41834E671163m39764m6368L01099K99957J15853Q3974K31895L01529J85960R4053
41824F799351J92543K88846P5788l95049p25105o79802m66393l90717m25863l21448
41814C952151l6714J75637J19981j06494k73516k60071r7557Q2321J07906o2047
41804C601597j90529J1117M26977N42947P8858n89161q63237o21077k22578M2616
41794B217530J82557K25043Q2630k04192l76833k75603n8573M2662K9525M7689
$$ y = [7482823, 8399504, 10107866, 11962337, 12996146, 12934836, 12315838, 11681123, 11099074, 10541476, 10222906, 10238634, 10183796, 9552118, 8416330, 7366608, 6789043, 6520318, 6272072, 6080279, 6129981, 6335191, 6383401, 6178235, 5989549, 6061048, 6232162, 6127138, 5671163, 5231399, 5185031, 5486130, 5786087, 5901940, 5985914, 6217809, 6519338, 6705298, 6799351, 6991894, 7280740, 7356528, 6961479, 6236374, 5556572, 5090179, 4699462, 4273599, 3952151, 3915437, 4091074, 4211055, 4104561, 3831045, 3570974, 3473417, 3555738, 3663644, 3601597, 3411068, 3422185, 3849162, 4392109, 4470967, 3881806, 3018569, 2397492, 2174914, 2217530, 2400087, 2625130, 2707760, 2503568, 2126735, 1851132, 1792559, 1835221, 1864746, 1912435]
41784A912435J22376J57770J29703J13812J42377J64895J49205J11753M4430p0873
41774B977883j44769j4951K93359M52541J82188l01620m43990o7539L36515K77178
41764C546795k8007l1478K12494R7245m74965p55369k52191M00909K91499m25197
41754B581735p59684l32487J73395J04506k99280m24607j55621J54337K60377
41745A302671K15246J47682J12747P9362m7874k77865l93153j87289J50928K06014
41735A308469n7849k25539p5169J09359N2292j02303j56757k36207m45507m96945
41725c26156j10283M52267O74654M54382J14236r5018j38626k280K49682L30312
41715A603170L8211l61094m30361j68953M4754N3557N8970J75106K55024K11712
$$ y = [1912435, 2034811, 2192581, 2322284, 2436096, 2578473, 2743368, 2892573, 3004326, 3048756, 2977883, 2833114, 2818163, 3111522, 3564063, 3746251, 3444631, 3000641, 2933102, 3269617, 3546795, 3518788, 3487310, 3699804, 3797049, 3322084, 2566715, 2314524, 2715433, 3006932, 2581735, 1822051, 1489564, 1662959, 1767465, 1468185, 1043578, 887957, 1042294, 1302671, 1517917, 1665599, 1778346, 1857708, 1809834, 1531969, 1138816, 951527, 1102455, 1308469, 1250620, 1025081, 949912, 1059271, 1111563, 1009260, 852503, 616296, 170789, -326156, -436439, 15828, 690482, 1144864, 1259100, 1164082, 1025456, 1023176, 1272858, 1603170, 1641381, 1280287, 849926, 680973, 725727, 779284, 838254, 1013360, 1268384, 1480096]
41705A480096J48819J04877o060j40922j34060j2482J5373o2734m2828O7518p176
41694A410421k89116l61841L6862N50052O44851L09317j7008q3729p2121k02464
41684A925224l73329l09415M9765M32298N23037L19464J14005J01458J36592L291
41674B922390j99266j60508J85269N35611N88358L47299J8460k20576k83354j62784
41664C570899N1231K30144L36448M41283O11269Q22640R37702P30854Q8069p06143
41654G114396j077216p75749k22992J2881q7067j46107o8896j09949l18420m05528
41644C915353k45382p6113p3554j08703p1130o5373j17227k8896K80148N83884
41634C993007O70809N73480L49187l6758m53833n89986l96805k13251k33699k06665
$$ y = [1480096, 1628915, 1733792, 1727732, 1586810, 1452750, 1440268, 1455641, 1392907, 1350079, 1417597, 1410421, 1121305, 759464, 796326, 1346378, 1991229, 2300546, 2283538, 2199809, 2127688, 1925224, 1551895, 1242480, 1292245, 1724543, 2247580, 2567044, 2681049, 2782507, 2919099, 2922390, 2723124, 2562616, 2747885, 3283496, 3871854, 4219153, 4237613, 4017037, 3733683, 3570899, 3622130, 3852274, 4188722, 4630005, 5241274, 6063914, 7001616, 7732470, 7820539, 7114396, 6037180, 5261431, 5038439, 5051320, 4964253, 4818146, 4749250, 4639301, 4320881, 3915353, 3669971, 3593858, 3520304, 3411601, 3340471, 3275098, 3157871, 3128975, 3409123, 3993007, 4663816, 5237296, 5586483, 5549725, 5095892, 4505906, 4109101, 3895850, 3662151, 3455486]
41624C455486Q8887M29965N21640M59951M86691N61305N12942L63554J76161j48857
41614F907725n79367p34738l71237J48709K98643J04642j1292P6789J37354R2983
41604F070211J05013J81284J42008j4946r9741q3095j00848j11977P5976M07517
41594F571402N45573L01366j59107n47717o62740m29647q431K15168L7387k58722
41584E604532l09112k23438l35458n49809m51856k1719L01636L11030K66294L53854
41574D945954M24880L99726M19103M17443O6081o06455j026949q30337l77983
41565C831463j82524k03448j05664J05113J39456q5284l83030n79311n69150k84555
41555A683066J14678K30005q6685m32675l61771J2384K70131L32229M17534M96899
$$ y = [3455486, 3544373, 3974338, 4495978, 4955929, 5442620, 6003925, 6516867, 6880421, 7056582, 6907725, 6328358, 5593620, 5222383, 5371092, 5669735, 5774377, 5763085, 5839874, 5977228, 6070211, 6175224, 6356508, 6498516, 6483570, 6383829, 6300734, 6199886, 6087909, 6163885, 6571402, 7116975, 7418341, 7259234, 6711517, 6048777, 5619130, 5610699, 5825867, 5863254, 5604532, 5295420, 5071982, 4736524, 4186715, 3734859, 3713140, 4014776, 4325806, 4592100, 4945954, 5370834, 5770560, 6189663, 6607106, 6673187, 6066732, 5039783, 4209446, 3831463, 3648939, 3445491, 3339827, 3444940, 3584396, 3499112, 3116082, 2536771, 1967621, 1683066, 1797744, 2027749, 1941064, 1508389, 1146618, 1159002, 1429133, 1761362, 2178896, 2675795]
41545B675795K92604j72101m80861l82634p6478J68529L30935M27990L24133j0504
41535C097408k84472j95502J76528N18858P16158Q70919R56391P74083L42342
41526F972713L1387Q9825K41950O6812l30401m25577r7988R0485l23383j001450
41516E314373j242145q70035k85504J69848M14183L28343j50546o11332m48567
41507B618618K62014P16088M66225K5587L0268L08831L04185L1842k4468K10947
41497D950137K82581k9713l75836m04604k34551j58901k02413k06314j56690j95324
41487C268372l61496m75142l11226J25131N18807N16300J17337k97361l90398
41478B710324k07094j6289L8204j762o0074q0091k6640L2902l9449k21610k84199
$$ y = [2675795, 2968399, 2796298, 2315437, 1932803, 1856325, 2024854, 2355789, 2783779, 3107912, 3097408, 2812936, 2617434, 2793962, 3312820, 4028978, 4899897, 5856288, 6630371, 6972713, 7004100, 7093925, 7335875, 7402687, 7072286, 6646709, 6548721, 6639206, 6315823, 5314373, 4072228, 3202193, 2916689, 3086537, 3500720, 3829063, 3678517, 3067185, 2618618, 2880632, 3596720, 4062945, 4088532, 4118800, 4427631, 4731816, 4763658, 4739190, 4950137, 5232718, 5203005, 4827169, 4422565, 4188014, 4029113, 3826700, 3620386, 3463696, 3268372, 2906876, 2431734, 2120508, 2245639, 2764446, 3280746, 3398083, 3100722, 2710324, 2503230, 2486941, 2525145, 2523383, 2463309, 2383218, 2356578, 2389480, 2350031, 2128421, 1844222]
41467A844222j16227P7502Q5366J1431O0384J67380J18184p1290j68774o0467
41457A947711J44318K70706J68064k14610o43001o79176k13278K80316L24493
41448A385543O8188l3975N2915K4869j14668p1797J10159N1684k47991k98410
41438I26517P8560L90907K27779j07829r7749K25404M15548K65008n4321l27229
41428A942595m50677l84430k11055j27796j76008j33904J34332M22380M85195
41419A500632L76949K45638L9804k65025l83683p4452L69849M21529N5662k34236
41409B052667j56939O9403J98708L05002M60840M52113J17539k74747l21013l5216
41399B868357J84151R9566j13137j87188j23637j22799k72126m16551l28072L6499
$$ y = [1844222, 1727995, 1805497, 1890863, 1902294, 1962678, 2130058, 2248242, 2176952, 2008178, 1947711, 2092029, 2362735, 2530799, 2316189, 1673188, 994012, 780734, 1061050, 1385543, 1453731, 1419756, 1472671, 1497540, 1382872, 1311075, 1421234, 1472918, 1224927, 926517, 1005077, 1395984, 1623763, 1515934, 1418185, 1643589, 2059137, 2324145, 2269824, 1942595, 1491918, 1107488, 896433, 768637, 592629, 458725, 593057, 1015437, 1500632, 1877581, 2123219, 2163023, 1897998, 1514315, 1439863, 1809712, 2231241, 2286903, 2052667, 1895728, 1965131, 2163839, 2468841, 2929681, 3381794, 3499333, 3224586, 2903573, 2868357, 3052508, 3152074, 3038937, 2851749, 2728112, 2605313, 2333187, 1916636, 1588564, 1625063]
41389A625063M52487O18670M53365J64825j5183j07512k94538n90425p62462o29912
41379I14378l03087l1829P6961Q6461P8963J09365K19727L53030L41783J50270
41369A996022J7916J34660K90903J72323p8106k5001L11084L80499m4652m66590
41359B689058m36735k48763l78428o32364m75865L0432L00346J56726L0737J62315
41349A197459K29678k2914l16976k82276K3711L07708M46141M69812M05299L21275
41339B778917L00684K45613j9437l60733l99997r8603J08432m2228k57892k15101
41329B039655q5028j78168l72723l08963L1050L14818L31673J79322N1166N0672
41319B053474J35442J17533j32122m05329l46653j6128J11549j14576k36496N5678
$$ y = [1625063, 2077550, 2696220, 3149585, 3314410, 3299227, 3191715, 2897177, 2306752, 1544290, 914378, 611291, 579462, 656423, 742884, 821847, 931212, 1150939, 1503969, 1845752, 1996022, 2013938, 2148598, 2439501, 2611824, 2533718, 2508717, 2819801, 3200300, 3155648, 2689058, 2252323, 2003560, 1625132, 992768, 516903, 547335, 847681, 1004407, 1035144, 1197459, 1427137, 1404223, 1087247, 804971, 828682, 1136390, 1582531, 2052343, 2457642, 2778917, 3079601, 3325214, 3305777, 2945044, 2545047, 2446444, 2554876, 2512648, 2254756, 2039655, 1954627, 1776459, 1403736, 1094773, 1125823, 1440641, 1772314, 1951636, 2002802, 2053474, 2188916, 2306449, 2174327, 1768998, 1422345, 1406217, 1517766, 1403190, 1166694, 1222372]
41309A222372L55474J84944k08462k71921m4062J5237j18123m1197K84462M33116
41299A811840K47366M2499j6856j38224l42377k82746J10195L36155L1240m53376
41289A345716n62224k97289p1861m7030l3754O5135J11118L5820j0163J01197
41279F36665K66456K84317J18394o0229r2392k9291l8498j35951j54191k5185
41269G70095Q1933K6780p7170p7041l8271o1174k3823J94869L92187L01238O7042
41258A556665O1193K67062K81394l4001l20405k52198N5323K91007K98773R1763
$$ y = [1222372, 1577846, 1762790, 1554328, 1282407, 1238345, 1253582, 1135459, 1094262, 1378724, 1811840, 2059206, 2101705, 2084849, 1946625, 1604248, 1321502, 1431697, 1767852, 1799092, 1345716, 783492, 486203, 414342, 367312, 333558, 398693, 509811, 545631, 535468, 636665, 903121, 1187438, 1305832, 1245603, 1153211, 1123920, 1085422, 949471, 795280, 770095, 852028, 878808, 801638, 724597, 686326, 625152, 601329, 796198, 1188385, 1489623, 1556665, 1617858, 1884920, 2166314, 2132313, 1811908, 1559710, 1615033, 1906040, 2204813, 2296576]
$$ [...]
##END NTUPLES=NMR SPECTRUM
##END=
