##TITLE=31Pdec_DE-91_oil
 CDCl3, 64 sc
 16.4.2025
##JCAMPDX= 6.0         $$ Bruker NMR JCAMP-DX V2.0
##DATA TYPE= NMR SPECTRUM
##DATA CLASS= NTUPLES
##ORIGIN= UXNMR, Bruker Analytische Messtechnik GmbH
##OWNER= root
$$ XWIN-NMR		Version 3.5
$$ Wed Apr 16 14:03:45 2025 Russian Standard Time (UT+4h)  she@DPX200
##.OBSERVE FREQUENCY= 81.013821
##.OBSERVE NUCLEUS= ^31P
##.ACQUISITION MODE= SIMULTANEOUS
##.ACQUISITION SCHEME= undefined
##.AVERAGES= 64
##.DIGITISER RES= 17
##SPECTROMETER/DATA SYSTEM= spect
##.PULSE SEQUENCE= zgpg30
##.SOLVENT NAME= CDCl3
##.SHIFT REFERENCE= (INTERNAL, CDCl3, 0, 198.062)
##AUDIT TRAIL= $$ (NUMBER, WHEN, WHO, WHERE, WHAT)
$$ ##TITLE= Audit trail, XWIN-NMR		Version 3.5
$$ ##JCAMPDX= 5.01
$$ ##ORIGIN= Bruker BioSpin GmbH
$$ ##OWNER= she
$$ F:/spectra/data/she/nmr/P31/2/pdata/1/auditp.txt
$$ ##AUDIT TRAIL=  $$ (NUMBER, WHEN, WHO, WHERE, WHAT)
(   1,<2025-04-16 14:02:52.39 +0400>,<she>,<DPX200>,
      <created by zg, POWCHK disabled, PULCHK disabled
       configuration hash MD5:
       00 E9 B6 7A A2 85 ED C7 34 08 36 98 17 FE 4E 26
       data hash MD5: 32K
       64 F8 D6 1F BE 2F 3C AD 2B 05 B3 66 3A E0 1C 8E>)
(   2,<2025-04-16 14:02:54.67 +0400>,<she>,<DPX200>,
      <Start of raw data processing
       efp BC_mod = 2 LB = 1.5 FT_mod = 6 PKNL = 1 PHC0 = 1253.174 PHC1 = 522.2943 SI = 64K 
       data hash MD5: 64K
       63 B9 3E CD D0 14 C0 83 F5 4A 8A EB 44 38 C5 CB>)
(   3,<2025-04-16 14:03:14.76 +0400>,<she>,<DPX200>,
      <pk PHC0 = 6.731004 PHC1 = 0 
       data hash MD5: 64K
       6A 98 AE 1E FF F1 16 44 73 FC 55 D4 4E 20 C3 C8>)
(   4,<2025-04-16 14:03:19.40 +0400>,<she>,<DPX200>,
      <abs ABSG = 5 
       data hash MD5: 64K
       EF AA D5 CF DC 10 1E D1 3C 53 52 C4 55 79 2C A9>)
$$ ##END=
$$ 
$$ hash MD5
$$ 4F FD 6E 1F 34 71 94 FD 49 38 34 D7 44 B9 DE CA
##$RELAX= 
##$RELAX= 
##$RELAX= 
##$RELAX= 
##$RELAX= 
##$RELAX= 
##$RELAX= 
##$RELAX= 
$$ Bruker specific parameters
$$ --------------------------
##$DU= <F:/spectra>
##$EXPNO= 2
##$NAME= <P31>
##$PROCNO= 1
##$TYPE= <nmr>
##$USER= <she>
##$AMP= (0..31)
100 100 100 100 100 100 100 100 100 100 100 100 100 100 100 100 100 100 
100 100 100 100 100 100 100 100 100 100 100 100 100 100 
##$AQSEQ= 0
##$AQ_mod= 1
##$AUNM= <au_zg>
##$AUTOPOS= <>
##$BF1= 81.014009
##$BF2= 200.13
##$BF3= 200.13
##$BF4= 200.13
##$BF5= 200.13
##$BF6= 200.13
##$BF7= 200.13
##$BF8= 200.13
##$BYTORDA= 1
##$CFDGTYP= 0
##$CFRGTYP= 5
##$CHEMSTR= <none>
##$CNST= (0..31)
1 1 145 1 1 1 1 1 1 1 1 1 1 1 1 1 1 1 1 1 1 1 1 1 1 1 1 1 1 1 1 1 
##$CPDPRG= <waltz16>
##$CPDPRG1= <>
##$CPDPRG2= <waltz16>
##$CPDPRG3= <>
##$CPDPRG4= <mlev>
##$CPDPRG5= <mlev>
##$CPDPRG6= <mlev>
##$CPDPRG7= <mlev>
##$CPDPRG8= <mlev>
##$CPDPRGB= <>
##$CPDPRGT= <>
##$D= (0..31)
0 1 0 0 0 0 0 0 0 0.06 0 0.03 2e-05 3e-06 0 0 0.0002 0 0 0 0 0 0 0 0 0 
0 0 0 0 0 0 
##$DATE= 1744797771
##$DBL= (0..7)
120 120 120 11 120 120 24 19 
##$DBP= (0..7)
150 150 150 150 150 150 150 150 
##$DBP07= 0
##$DBPNAM0= <>
##$DBPNAM1= <>
$$ [...]
##$SUBNAM3= <"">
##$SUBNAM4= <"">
##$SUBNAM5= <"">
##$SUBNAM6= <"">
##$SUBNAM7= <"">
##$SUBNAM8= <"">
##$SUBNAM9= <"">
##$SW= 400.765351723535
##$SWIBOX= (0..15)
0 1 3 0 0 0 0 0 0 0 0 0 0 0 0 0 
##$SW_h= 32467.5324675325
##$TD= 32768
##$TD0= 1
##$TE= 0
##$TE2= 300
##$TE3= 300
##$TEG= 300
##$TL= (0..7)
0 120 53 12 22 120 120 120 
##$TP= (0..7)
150 150 150 150 150 150 150 150 
##$TP07= 0
##$TPNAME0= <>
##$TPNAME1= <>
##$TPNAME2= <>
##$TPNAME3= <>
##$TPNAME4= <>
##$TPNAME5= <>
##$TPNAME6= <>
##$TPNAME7= <>
##$TPOAL= (0..7)
0.5 0.5 0.5 0.5 0.5 0.5 0.5 0.5 
##$TPOFFS= (0..7)
0 0 0 0 0 0 0 0 
##$TUNHIN= 0
##$TUNHOUT= 0
##$TUNXOUT= 0
##$USERA1= <user>
##$USERA2= <user>
##$USERA3= <user>
##$USERA4= <user>
##$USERA5= <user>
##$V9= 5
##$VALIST= <valist>
##$VCLIST= <CCCCCCCCCCCCCCC>
##$VD= 0
##$VDLIST= <DDDDDDDDDDDDDDD>
##$VPLIST= <PPPPPPPPPPPPPPP>
##$VTLIST= <TTTTTTTTTTTTTTT>
##$WBST= 1024
##$WBSW= 4
##$XGAIN= (0..3)
0 0 0 0 
##$XL= 0
##$YL= 0
##$YMAX_a= 20946
##$YMIN_a= -7634
##$ZGOPTNS= <>
##$ZL1= 120
##$ZL2= 120
##$ZL3= 120
##$ZL4= 120
##$ABSF1= 198.0616
##$ABSF2= -202.7028
##$ABSG= 5
##$ABSL= 3
##$ALPHA= 0
##$AQORDER= 0
##$ASSFAC= 0
##$ASSFACI= 0
##$ASSFACX= 0
##$ASSWID= 0
##$AUNMP= <proc_1d>
##$AZFE= 0.1
##$AZFW= 0.5
##$BCFW= 0
##$BC_mod= 2
##$BYTORDP= 0
##$COROFFS= 0
##$CY= -3
##$DATMOD= 1
##$DC= 0
##$DFILT= <>
##$DTYPP= 0
##$F1P= 0
##$F2P= 0
##$FCOR= 1
##$FTSIZE= 65536
##$FT_mod= 6
##$GAMMA= 0
##$GB= 0
##$INTBC= 1
##$INTSCL= 9.790993e-09
##$ISEN= 30
##$LB= 1.5
##$LEV0= 0
##$LPBIN= 0
##$MAXI= 10000
##$MC2= 0
##$MEAN= 0
##$ME_mod= 0
##$MI= 50
##$NCOEF= 0
##$NC_proc= -8
##$NLEV= 6
##$NOISF1= 182.463
##$NOISF2= 159.3651
##$NSP= 0
##$NTH_PI= 0
##$NZP= 0
##$OFFSET= 198.0616
##$PC= 4
##$PHC0= 1259.905
##$PHC1= 522.2943
##$PH_mod= 1
##$PKNL= yes
##$PPARMOD= 0
##$PSCAL= 0
##$PSIGN= 0
##$REVERSE= no
##$SF= 81.0140089999434
##$SI= 65536
##$SIGF1= 159.3651
##$SIGF2= -187.1042
##$SINO= 113.3802
##$SIOLD= 16384
##$SREGLST= <1H.CDCl3>
##$SSB= 0
##$STSI= 65536
##$STSR= 0
##$SW_p= 32467.5324675325
##$SYMM= 0
##$S_DEV= 0
##$TDeff= 32768
##$TDoff= 0
##$TI= <>
##$TILT= no
##$TM1= 0
##$TM2= 0
##$TOPLEV= 0
##$USERP1= <user>
##$USERP2= <user>
##$USERP3= <user>
##$USERP4= <user>
##$USERP5= <user>
##$WDW= 1
##$XDIM= 65536
##$YMAX_p= 187036604
##$YMIN_p= -187370773
$$ End of Bruker specific parameters
$$ ---------------------------------
##NTUPLES= NMR SPECTRUM
##VAR_NAME=  FREQUENCY,     SPECTRUM/REAL,   SPECTRUM/IMAG
##SYMBOL=    X,             R,               I
##VAR_TYPE=  INDEPENDENT,   DEPENDENT,       DEPENDENT
##VAR_FORM=  AFFN,          ASDF,            ASDF
##VAR_DIM=   65536,         65536,           65536
##UNITS=     HZ,            ARBITRARY UNITS, ARBITRARY UNITS
##FACTOR=    0.49542278885378, 1,            1
##FIRST=     16045.7642231865, 0,            0
##LAST=      -16421.768244346, 0,            0
##MIN=       -16421.768244346, -187370773,   0
##MAX=       16045.7642231865, 187036604,    0
$$ Real data points
##PAGE= N=1
##DATA TABLE= (X++(R..R)), XYDATA
$$ [...]
6760a348209K141638K170154L65769q61104q43559q61266n80271J517612M259637
6751E960401M310731J065353k338467l417820k730595j464884K01867J587462
6743C174048J331739j92218q41287m4856L01369o85064j032218R79033L923621
6734F914167M986511L141345m25422l533138m010695j472221J149005J75824l638480
6725C286896n191830j995891J786569J048842k818294l949290m38512L262682
6717e008828K818011n53255k573271j441813R91602K220766J490178j97428j154230
6708c408268l29985J544914K403435J171177p23645j068429K09548J021697Q9322
6699I09766j383044j599676n49336N50257J229869J745458J678897L82944j183412
$$ y = [-1348209, 793429, 2963583, 3329352, 2468248, 1624689, 763423, 183152, 1700764, 5960401, 10271132, 11336485, 8998018, 5580198, 2849603, 1384719, 1586586, 3174048, 4505787, 4313569, 3472282, 3427426, 3728795, 3043731, 2011513, 2990546, 6914167, 11900678, 15042023, 14616601, 11083463, 7072768, 5600547, 6749552, 6925376, 3286896, -1904934, -3900825, -2114256, -1065414, -3883708, -7832998, -8271510, -5008828, -2190817, -2744072, -5317343, -6759156, -5767554, -3546788, -2056610, -2254038, -3408268, -3738253, -2193339, 210096, 1381273, 657628, -410801, -201253, 820444, 909766, -473278, -2072954, -2622290, -2072033, -842164, 903294, 2582191, 2965135, 1781723]
6690A781723r68057J222082K925811K106548l26505k061324k168252j223258J13492
6681A402260J253688J353189K03257j219466k073103k536641k513972j081458
6673e212246J371218K375185Q99468k35445J660614M336015L438152o90655l215482
6664D726824j898639K39605L27553l49008L81493J752103J924939J047481Q1989
6655H234340j183677k693444k836665j047079K48609j040689k980351k119807
6647e418763J368197L878855L165287M66073j808093k302279q93421J303427K202659
6638A961942P60969j437330k091341j220887o80758j161602j485761o23286J211380
6629d766674L175523M087064K753949l36036k465543j805141k54121q03247k818050
$$ y = [1781723, 813666, 2035748, 4961559, 7068107, 6741602, 4680278, 2512026, 1288768, 1402260, 2655948, 4009137, 4212394, 2992928, 919825, -1616816, -4130788, -5212246, -3841028, -1465843, -566375, -801820, 858794, 5194809, 8632961, 7942306, 4726824, 2828185, 3067790, 3395343, 3046335, 3427828, 5179931, 7104870, 8152351, 8234340, 7050663, 4357219, 1520554, 473475, 722084, -318605, -3298956, -5418763, -4050566, -171711, 2993576, 3459649, 1651556, -650723, -1544144, -240717, 1961942, 2722911, 1285581, -805760, -2026647, -2707405, -3869007, -5354768, -5978054, -4766674, -1591151, 2495913, 5249862, 4913826, 2448283, 643142, 389021, -414226, -3232276]
6620c232276k932472m37680J593652J210555K95856Q92954J739551P33181j210812
6611a347491j401279N07205J988534J081221j342948k918998k327582k66578J543178
6602d484738K109709J917479J820730J687001R72159K31582O36195J898362K192077
6593H980556N89446j790559l533844m329364l993099j864902J566936L916828
6585d58002L443489J457954O37959J563000K431202J814668J95184j177261j685273
6576H222920j464288j060518j113697j738255k236165j918418r70966R119R04142
6567a366126J801572K269790J791920O72848l12159r64214j568935j998698j778734
6558a452736r50672j22992K13031j81788j387241k694098k509239k67150J969038
$$ y = [-3232276, -6164748, -6602428, -5008776, -3798221, -3502365, -2609411, -869860, -136679, -1347491, -2748770, -2241565, -253031, 828190, -514758, -3433756, -5761338, -6027916, -4484738, -2375029, -457550, 1363180, 3050181, 4022340, 4253922, 4890117, 6788479, 8980556, 9570002, 7779443, 4245599, -83765, -4076864, -5941766, -4374830, -458002, 2985487, 4443441, 5081400, 6644400, 9075602, 10890270, 11085454, 9908193, 8222920, 6758632, 5698114, 4584417, 2846162, 609997, -1308421, -2279387, -2270268, -1366126, 435446, 2705236, 4497156, 5170004, 4857845, 3893631, 2324696, 325998, -1452736, -2403408, -2526400, -2313369, -2495157, -3882398, -6576496, -9085735, -9352885, -7383847]
6549g383847J639069m95274p87756K153397M826975L219497j443129l746493q19080
6540b836641M113000N662354K317799k517259m636548k998101P8786J560366L37030
6531A080786k056908k950890j074061K122971L822907K647712r7040k088249k453692
6522a046464k044237j530753l35274J903358L666763K853656j17454k026188p31089
6513E92318J709088J418474k172320n479633n394802k871464q26560j20937N70690
6504a2575146J880287K869243K836828K142617J128862q6416o24379M56890K094951
6495A23737J931320r5458j061445O09994K259136O58757l008819m596816k623390
6486e802984M01792K087796K620530K574659J253040j218162k472861q21938J798739
$$ y = [-7383847, -5744778, -6240052, -7027808, -4874411, -47436, 3172061, 1728932, -2017561, -2836641, 1276359, 6938713, 9256512, 6739253, 2102705, -895396, -816610, 743756, 1080786, -976122, -3927012, -5001073, -2878102, 944805, 3592517, 3495477, 1407228, -1046464, -3090701, -4621454, -4956728, -3053370, 613393, 3467049, 3349595, 1323407, 592318, 2301406, 3719880, 1547560, -3932073, -9326875, -12198339, -13024899, -13145836, -12575146, -10694859, -7825616, -4988788, -2846171, -1717309, -1803725, -2428104, -1971214, 123737, 2055057, 1959599, 898154, 1508148, 3767284, 4426041, 1417222, -3179594, -5802984, -5401192, -3313396, -692866, 1881793, 3134833, 1916671, -556190, -1378128, 420611]
6477D20611K141040K32430p49395P24816K231294J021365j777151k548464k14811
6468A481735K244349J890035l06878j190181M2887J140939N40228m71094k29894
6459E142126O13445M97489l55957o58175o30530j599537l161449l017085k86993
6450c456666K734915L160742Q24025j839208k592970j463085l72092j019993k885176
6441f909508l478263j061702L168193O234453O340827M020802R87237j142960
6433H159079j581999j001203r01199j423605r71537O58757P07361k339699m794763
6424c488808k120018L538620N126798O65601l643883k346930J995325L663233
6416C389938J806775m79716j898387l047210k898619r0933L237029L398767O04193
$$ y = [420611, 2561651, 2794081, 2044686, 2769502, 5000796, 6022161, 4245010, 1696546, 1481735, 3726084, 5616119, 5309241, 4119060, 4161947, 5302886, 5843114, 5372020, 5142126, 5755571, 6253060, 5897103, 5238928, 4608398, 3008861, -152588, -3169673, -3456666, -721751, 2438991, 3263016, 1423808, -1169162, -2632247, -3004339, -4024332, -6909508, -10387771, -11449473, -8281280, -2046827, 4294000, 8314802, 9302039, 8159079, 6577080, 5575877, 4674678, 3251073, 2279536, 2938293, 3645654, 1305955, -3488808, -5608826, -2070206, 3056592, 3722193, 78310, -2268620, -273295, 3389938, 5196713, 4716997, 2818610, -228600, -3127219, -3218152, 18877, 3417644, 4021837]
6407D021837j470324j197186k03751N74253J769822K393529L09428l189081l706926
6398f98399k67283K612748J546085q37719m88143J817304K304777P8649k350932
6389C717087l094036k282597l46187K126042L232451J260388k484209m512932
6381b383993l175785l06102J282226O29729j042865j703704k94730J951548K426831
6372b616845L54175j708962r98245J586097K671700J168599l98026K41312J957439
6363B257244K184135O83038k90898P04801K230506J839183n79201k418835j756860
6354D853113j47460o11510l192963m582051k800911j02336M03935q20236j068340
6345h068759R6707O57808J60300O69517K902153M295173K661657l31383j454026
$$ y = [4021837, 2551513, 1354327, 1150576, 1724829, 3494651, 5888180, 6197608, 3008527, -698399, -965682, 1647066, 3193151, 2355432, 1867289, 3684593, 5989370, 6068019, 3717087, 623051, -1659546, -2005733, 120309, 3352760, 4613148, 2128939, -2383993, -5559778, -5865880, -4583654, -3953925, -4996790, -6700494, -6995224, -5043676, -2616845, -2262670, -3971632, -4969877, -3383780, -712080, 456519, 58493, 299805, 2257244, 4441379, 5124417, 4833519, 5538320, 7768826, 9608009, 9028808, 6609973, 4853113, 4705653, 4094143, 901180, -3680871, -6481782, -6584118, -6180183, -7000419, -8068759, -7972052, -7314244, -7153944, -6484427, -3582274, 712899, 3374556, 3043173, 1589147]
6336A589147l40421N76765j36123j344870j520787o10021O32288J638503J768355
6327B252836L84215j915036l144627k136346k40248L87868k46651k50779R47859
6318c960909J593959O61141j3178J408102L115908J748242k128688l965966j722129
6309c263518Q53090k07327k977484k706280O97864K726300J540603L40989J200378
6300a795385J345342j373082l373305m22810M622523M808933o11608m549222k173419
6291c522033K482650L045165j79012k060391r53282j0232q80078j178657O46732
6282b609138K165087R31670j466909k046425r56638m86636r55374o41492P98914
6273e266941J767004J582362J276747J220725N38514m42551J68666K397035L106938
$$ y = [1589147, 1248726, 1825491, 1689368, 344498, -1176289, -1786310, -1154022, 484481, 2252836, 2637051, 722015, -2422612, -4558958, -4799206, -4411338, -4657989, -4908768, -3960909, -2366950, -1705809, -1718987, -310885, 2805023, 4553265, 2424577, -1541389, -3263518, -2410428, -2617755, -5595239, -8301519, -7603655, -4877355, -3336752, -2995763, -1795385, -450043, -1823125, -5196430, -5619240, -996717, 3812216, 3200608, -1348614, -3522033, -1039383, 2005782, 1826770, -233621, -1186903, -1197135, -2077213, -3255870, -2609138, -444051, 487619, -979290, -3025715, -3982353, -4468989, -5424363, -6065855, -5266941, -3499937, -1917575, -640828, 579897, 1118411, 675860, 844526, 3241561, 6348499]
6264F348499K75339l322600l388499l9859K383728J267523j324925k276149j460047
6255a536990o70446l33808O09593K240925L050511K002172r0388j673077k063585
6246A534907j541384n76963M33109J135743J527191J967787K339845J642563o34656
6237G828142k972968l008058o33451J402668Q56275j253229k458049k235871j751937
6228d226478j108865N64159K369470J958552m57083j287261J307896L904191K248951
6219E273532k384528m648479k417787Q10858J375648J52568J95887J968839L159228
6210C485766K235276K10775j020431q42996k12494l85777j542022k652967k820016
6201c544886k317841j699578n07118J735490L560568K627713o89003k780549j155055
$$ y = [6348499, 6623838, 3301238, -87261, -127120, 2256608, 3524131, 2199206, -76943, -1536990, -2207436, -2541244, -1931651, 309274, 3359785, 5361957, 5271569, 3598492, 1534907, -6477, -583440, -150331, 985412, 2512603, 4480390, 6820235, 8462798, 7828142, 4855174, 1847116, 1213665, 2616333, 3472608, 2219379, -238670, -2474541, -4226478, -5335343, -4771184, -2401714, -443162, -900245, -2187506, -879610, 3024581, 5273532, 2889004, -1759475, -4177262, -3366404, -1990756, -1838188, -1642301, 326538, 3485766, 5721042, 5931817, 4911386, 4068390, 3855896, 3470119, 1928097, -724870, -3544886, -5862727, -7562305, -8069423, -6333933, -2773365, -145652, -834655, -3615204, -4770259]
6192d770259K212561L453034J601772q88107j657974o36525R51216J989266J749208
6183D004192K11405j514647k064893j316286k25331P16734J821338K987954L327668
6174G948134K332961N02049j502848l424925m786977m632840k609972J32193J707629
6165d334596J136538p64034j906292o73471K233580L984825K574504n79715k155490
6156d84151j087211K30326n70063k597072l137192j366811Q28322J466249O45524
6147f072079n8137M69355J863669K807046K392543J078192J55618J93660M44974
6138C274841R4023m77040l63273K22779j21519k154833m589402n006453k284937
6129a1405814J991603M815518M626988K650456J094519N91837K70324j48935J21348
$$ y = [-4770259, -2557698, 895336, 2497108, 1609001, -48973, -685498, 265718, 2254984, 4004192, 4215597, 2700950, 636057, -680229, -905560, -188826, 1632512, 4620466, 7948134, 10281095, 10783144, 9280296, 5855371, 1068394, -3564446, -6174418, -6042225, -4334596, -3198058, -3962092, -5868384, -6541855, -4308275, -323450, 2251054, 1671339, -484151, -1571362, -1341036, -1911099, -4508171, -7645363, -9012174, -8183852, -6717603, -6072079, -6130216, -5660861, -3797192, -990146, 1402397, 2480589, 2636207, 2829867, 3274841, 3368864, 2891824, 2528551, 2751330, 2629811, 474978, -4114424, -9120877, -11405814, -9414211, -4598693, 28295, 2678751, 3773270, 4365107, 4635431, 4486496, 4607844]
6120D607844J149627J670206R32277l14012j463384k938590m204961k974787J339479
6111b196301N035282M080912j36330k429313j050241M72442m74628j633532l55573
6102A312718J505745P25416j553789j344731J786614L889517K516987q9604q50644
6093G898229O47L21330n17134j581586k370840k868394k358522j14073K792110
6084A201767L894247J994156j432918l857316m133818k966957j487156j82760
6076f970755O49114L50592j100842j880695J86041M223226O092805L242344j404809
6067C387021k648946L80507L329439K539305o96787k736895k177092l73521Q50587
6058A853618M25350j611604l435875k485237J161160L830932K611350o29670j837032
$$ y = [4607844, 5757471, 7427677, 8359954, 8045942, 6582558, 3643968, -560993, -3535780, -2196301, 2838981, 6919893, 6783563, 4354250, 3304009, 3776451, 3301823, 1668291, 1312718, 2818463, 3543879, 1990090, 645359, 2431973, 6321490, 8838477, 8748873, 7898229, 7898876, 8220206, 7703072, 6121486, 3750646, 882252, -1476270, -1590343, 1201767, 5096014, 7090170, 5657252, 1799936, -2333882, -5300839, -6787995, -6970755, -6321641, -5971049, -7071891, -8952586, -8766545, -4543319, 1549486, 4791830, 3387021, 738075, 1118582, 4448021, 6987326, 6290539, 3553644, 1376552, 1003031, 1853618, 2278968, 667364, -2768511, -5253748, -4092588, -261656, 2349694, 1720024, -117008]
6049a17008k71312J313485J347757J165618J834785K273675J492801K70889n70518
6040H740172j475645k497690k264654q7261K428145L294069K395414P17173j119598
6031A0130125k285970j522124P50061J776479L8168k126873j993425r79974k316785
6022A469682n108280m934386q21382K631089J865186o09918o56338R46425K57669
6013d960253k981623m441061j400457L517206N975980M889946K356581M20829
6005C377148m05189l63580J87303P47330R09949O78425L00166M2937J44119M11915
5995F030523l0457j635360l064366k357631Q7384J366363o5589k011028j662818
5986c342979K83250R45610j59678o51583N66612J594273R52299J14976Q23359
$$ y = [-117008, -388320, 925165, 2272922, 3438540, 5273325, 7547000, 9039801, 9310690, 8740172, 7264527, 4766837, 2502183, 2414922, 4843067, 8137136, 10532550, 11249723, 10130125, 7844155, 6322031, 7072092, 8848571, 8886739, 6759866, 4766441, 3786467, 1469682, -3638598, -8572984, -9394366, -6763277, -4898091, -5508009, -6164347, -5217922, -4960253, -7941876, -12382937, -13783394, -10266188, -4290208, 599738, 2956319, 3377148, 2971959, 2608379, 2795682, 3543012, 4452961, 5131386, 5431552, 5474489, 5618608, 6030523, 6000066, 4364706, 1300340, -1057291, -969907, 396456, 330867, -1680161, -3342979, -3059729, -2114119, -2273797, -2925380, -2358768, -764495, 187804, 302780, 1126139]
5977A126139J861164R43127j256939j646137P23178L011042K396183j71476j435302
5968E550979j99212J372296R03294j150044k540815k435591j942039j505028L8885
5959a907275K575940K999142r04986n908288o164580q57860M438678N194974L186670
5950B652415K176586J820304m43089l754003m563617k254171O2351L85361j92147
5941d110010n97748j191784j377257M63768L325921L480665L7444k602591m93859
5932c065451M137174N817039K764941j803665m084557k970004N5869K105525Q93026
5923C849897k489580l884671j103132K724814L176330N26387j220299l22099J055301
5914B312948J024955M46561N20553O93003O7398j070444k025441k456495j953721
$$ y = [1126139, 2987303, 3930430, 2673491, 1027354, 1750532, 4761574, 7157757, 6986281, 5550979, 5351767, 6724063, 7627357, 6477313, 3936498, 1500907, -441132, -1946160, -1907275, 668665, 3667807, 2762821, -3145467, -9310047, -10167907, -5729229, -534255, 2652415, 4829001, 6649305, 6206216, 2452213, -2111404, -4365575, -4303224, -3917863, -4110010, -4707758, -5899542, -7276799, -6813031, -3487110, -6445, 30999, -2571592, -3065451, 1071723, 6888762, 9653703, 7850038, 3765481, 795477, 851346, 2956871, 3849897, 1360317, -2524354, -3627486, -902672, 2273658, 2800045, 1579746, 1257647, 2312948, 3337903, 3784464, 4305017, 4998020, 5065418, 3994974, 1969533, -486962, -2440683]
5905b440683m51353P68097L04826r76958q17195R91129K269361J944169J390973
5896B982366J552048J285551j80498j511570j529785j154300j419941j413317
5888a389446K7425K132300L427774L665698K973955Q57904k067335l221529j378228
5879E028518P23733j33791k799271l525197j771545o89964j850868l143894k799292
5870a0961571k079865k244188j707207J291373N087545O373571M668487K562428
5862B990573J836784J633311P51398k86700m40657n6729k96007j271929j904496
5853B955548j479065m13635N78803J212746J252101L05646j370712k563053k412977
5844a934598j511187p87210L9913J542698K628485J492860j279287k695430j273642
$$ y = [-2440683, -2892036, -2123939, -1819113, -2796071, -3613266, -2622137, -352776, 1591393, 2982366, 4534414, 5819965, 5639467, 4127897, 2598112, 1443812, 23871, -1389446, -1362021, 770279, 4198053, 7863751, 10837706, 11695610, 9628275, 6406746, 5028518, 5752251, 5618460, 2819189, -706008, -2477553, -3167517, -5018385, -8162279, -10961571, -13041436, -15285624, -16992831, -15701458, -10613913, -4240342, 428145, 2990573, 4827357, 6460668, 7212066, 6925366, 6484709, 6427980, 6131973, 4860044, 2955548, 1476483, 1062848, 1641651, 2854397, 4106498, 4412144, 3041432, 478379, -1934598, -3445785, -4232995, -4193082, -2650384, -21899, 1470961, 191674, -2503756, -3777398]
5835c777398J029785K042518K407826L392701L587048Q48051l295729m576881
5827A657921j743955J532485J614033o25541j805556o69310J167569J971369J542927
5818D641942O00104j6672K60211J022286Q62080r16117k888803k969014j101781
5809e05764O99430J007826L73521j82545n77925p55352K35007K666415M440886
5800G401499K988529j048552l975296l569637j609761o90565m17195J071010L157176
5791C307208L314939J316091k40623j53578l32725k033866l299888k231813l65773
5782g20028j70103j057581q04437M75252R38183O15416R85157J415269k38535
5773A438593l160215l492774n4115L171292K326237j035502k367864j84947K731464
$$ y = [-3777398, -2747613, -705095, 1702731, 5095432, 8682480, 9530531, 6234802, 1657921, -86034, 1446451, 3060484, 2434943, 629387, -39923, 1127646, 3099015, 4641942, 5242046, 5225374, 5485585, 6507871, 7369951, 6453834, 3565031, 596017, -505764, 193666, 1201492, 1575013, 1392468, 814543, 59191, 294198, 2960613, 7401499, 10390028, 9341476, 5366180, 1796543, 186782, -503783, -920978, 150032, 3307208, 6622147, 7938238, 7697615, 7544037, 7211312, 5177446, 1877558, -354255, -720028, -890131, -1947712, -2752149, -2276897, -1338714, -723298, 261859, 1677128, 1438593, -1721622, -5214396, -5268511, -2097219, 229018, -806484, -3174348, -3359295, -627831]
5764f27831L362523J575003o89724j857619j934561j752546j381323L1345K299277
5755i75456L239231J381966j210957j318193O09129J021362j047466k357998p70445
5746a428827J279108Q19164j019668j173871O44553K174714J989327K18932k560186
5737I43246m816989m163774n81413K118768R37890j757212j464740K099620N363018
5728a321586O359222N869541L933616k46897m735774n630061k509483N84751Q00360
5719C103689l79545q72535j172768j855620j340847J164443L073680J666003j782404
5710A604096l727705l027372j556280r66326r14712k84216J201794K537316K198711
5701b934694o3274k269943k319937q60219j80801m58514K11302J840998J996183
$$ y = [-627831, 2734692, 4309695, 3619971, 1762352, -172209, -1924755, -3306078, -3274733, -975456, 2263775, 3645741, 2434784, 1116591, 1725720, 2747082, 1699616, -658382, -1428827, -149719, 669445, -350223, -1524094, -879541, 1295173, 3284500, 3503432, 943246, -3873743, -8037517, -8618930, -6500162, -5562272, -7319484, -8784224, -6684604, -1321586, 5037636, 10907177, 14840793, 14593896, 9858122, 4228061, 1718578, 2303329, 3103689, 2724144, 1851609, 678841, -1176779, -2517626, -1353183, 1720497, 3386500, 1604096, -2123609, -5150981, -6707261, -7673587, -8588299, -8872515, -7670721, -5133405, -2934694, -2997968, -5267911, -7587848, -8448067, -8628868, -9087382, -8876080, -7035082, -5038899]
5692e038899K41822m71739J279907K656694J296863n87573j39075J171023M66701
5683H75724j135770o23942J126534N92981k111664l088573r26526J368381J376715
5674b546140J12154j018310k131916k518308k99370L692561N242303K363310j349187
5665A547097j640780N35905J071038j029010k599782j098295K131871L737018
5657B655062K080985j236118l029649j757405Q70831K037791J222344K36485K30013
5648C310339N79149P65559J046650Q53057q88853l031336k688782J45313J481740
5639A572836r98465m044952l576221q62248k06161k045306k648216l45720K064074
5630a1090379J909709K60202m01877M25102J658061K536181K771002K179867J265992
$$ y = [-5038899, -4797077, -5268816, -3988909, -1332215, -35352, -622925, -762000, 409023, 875724, -260046, -883988, 242546, 835527, -1276137, -4364710, -5291236, -3922855, -2546140, -2433986, -3452296, -5584212, -8102520, -8401890, -4709329, 532974, 2896284, 1547097, -93683, 442222, 1513260, 484250, -2115532, -3213827, -1081956, 2655062, 4736047, 3499929, 470280, -1287125, -416294, 1621497, 2843841, 3080326, 3310339, 3889488, 4655047, 5701697, 6554754, 5665901, 2634565, -54217, 91096, 1572836, 574371, -3470581, -7046802, -7909050, -8115211, -10160517, -12808733, -13154453, -11090379, -9180670, -8920468, -9322345, -8897243, -7239182, -4703001, -1931999, 247868, 1513860]
5621A513860J017948J307018O80593j372020l063061k289542O67383L281680L305669
5612E049528P50829k250256l302863j846646M54601J538637P84074j159427l302054
5603c283577m222281k400728J602952M329106L094229k5524m87619K494687M853379
5594E954624L322812o25857l575719m234739l225298j239741O91758J076573N9715
5585a795872p2229J655010K803237J056848j930966k849399j477430k80764k93056
5576c184621l78226j5494J23848J63563Q49587J511513Q47214m06118l76610M94251
5566c71093N7161j340383q35510J890506L165665O82796k785670l183366k70538
5557b990432L077442M506089L292847Q3973k587124j863751J371992K582169r0682
$$ y = [1513860, 2531808, 3838826, 4519419, 3147399, 84338, -2205204, -1537821, 1743859, 5049528, 5800357, 3550101, 247238, -1599408, -1144807, 393830, 1177904, 18477, -3283577, -7505858, -9906586, -8303634, -3974528, -880299, -905823, -1393442, 1101245, 5954624, 9277436, 8651579, 5075860, 841121, -2384177, -3623918, -2932160, -1855587, -1795872, -1868101, -213091, 2590146, 3646994, 1716028, -1133371, -2610801, -2891565, -3184621, -3562847, -3578341, -3454493, -3290930, -2441343, -929830, -82616, -488734, -865344, -371093, -313932, -1654315, -2489825, -599319, 2566346, 3249142, 463472, -2719894, -2990432, 87010, 4593099, 7885946, 7969919, 5382795, 3519044, 4891036, 7473205, 7382523]
5548G382523k676873j586607M36917r69160l940137l093355J254840L049458R6258
5539d6136k559612p94989K583837L074198J211242K55555M65526j78918j540580
5530B470123j482133M63842K578579L513112L148404J732256O1886n32990j12267
5521A1840812n72514k370212k817880j79828K609724J734332j565586k837349
5513E841499j304038m42307j638175j990143J89267J941609K45741l077049l909139
5504d142735j283521K291821M448140M466877K353158j065588l562412l183580
5496C22160n70446J770535K352598J705020Q79585K85625j35947o97817j802049
5487D109264l089709l149765j218768J162475J596847k6705j235734k34531J749667
$$ y = [7382523, 4705650, 3119043, 3555960, 2586800, -1353337, -4446692, -3191852, -142394, -46136, -2605748, -3400737, -816900, 2257298, 3468540, 3724095, 4189621, 4010703, 2470123, 987990, 1451832, 4030411, 7543523, 10691927, 12424183, 12486069, 11953079, 11840812, 11268298, 8898086, 6080206, 5900378, 8510102, 10244434, 8678848, 5841499, 4537461, 4095154, 2456979, 466836, 656103, 2597712, 2843453, -233596, -4142735, -5426256, -3134435, 1313705, 5780582, 8133740, 7068152, 3505740, 322160, -248286, 1522249, 3874847, 5579867, 6459452, 6745077, 6609130, 5911313, 4109264, 1019555, -2130210, -3348978, -2186503, -589656, -616361, -1852095, -2086626, -336959]
5478c36959K127336J19957k583681l862059l018959q65473J139848J686640L55053
5469e238297j855597l089542k310104l36107J198337J697370J790084J875674
5461f268182J560855Q39454O72782J551789K356770J767703K63716m69032J87682
5452B463537J273895J816415J664806P99389q77647k776864l765802l463393k513264
5443e378928j389802J8434J387076J752912R45470J86240M85813J224869J102249
5434C34333j06167j471287k160081k115800j759089j466410j155152k15449J760495
5425h354607M038457N064153M047638J895583L42031L19398J132138J076422p29213
5416H832000k827303k559307M63671L032577K032783j229526k484808j97133K493570
$$ y = [-336959, 1790377, 1910334, -673347, -4535406, -7554365, -8419838, -7279990, -5593350, -5238297, -7093894, -10183436, -12493540, -12829647, -11631310, -9933940, -8143856, -6268182, -4707327, -3867873, -3195091, -1643302, 713468, 2481171, 2744887, 2275855, 2463537, 3737432, 5553847, 7218653, 8018042, 7140395, 4363531, 597729, -2865664, -5378928, -6768730, -6750296, -5363220, -3610308, -2664838, -2478598, -1992785, -767916, 334333, 228166, -1243121, -3403202, -5519002, -7278091, -8744501, -9899653, -10115102, -8354607, -4316150, 748003, 4795641, 6691224, 7033255, 7352653, 8484791, 9561213, 8832000, 6004697, 3445390, 3909061, 6941638, 8974421, 7744895, 5260087, 5062954, 7556524]
5407G556524K159334o65784k811416k495628o56246P46160N32083j009671k378694
5398I76662k215878q19139K15794o805p78851q64330L65646K583946M210484L140710
5388F808239m79555k914227q26405L630422M790841R90647l161897l133033J24910
5379E829942K778359L139101J957363K57835q48892l55654O62263m45530l594604
5370I380183n013658k832812l45988o86293j675415m3647K315801J466820j320811
5361A244180j209786K164618M000923J896543j128831k032001j439887p41229
5353B754530J49254O01436j144927m389667n488835k826206Q59473K785171L551949
5344c147822M387009M201955J929661p55764j697731j404112j639106k382132
$$ y = [7556524, 9715858, 9050074, 6238658, 3743030, 3086784, 3832944, 4365027, 3355356, 976662, -1239216, -2058355, -1842561, -1849366, -2628217, -3492547, -3126901, -542955, 3667529, 6808239, 6328684, 3414457, 2588052, 6218474, 11009315, 11999962, 8838065, 5705032, 5829942, 8608301, 11747402, 13704765, 13962600, 13113708, 12758054, 13420317, 12974787, 9380183, 4366525, 1533713, 1187725, 501432, -1173983, -1217630, 1098171, 2564991, 1244180, 34394, 2199012, 6199935, 8096478, 6967647, 4935646, 3495759, 2754530, 2903784, 3505220, 2360293, -2029374, -7518209, -10344415, -9484942, -6699771, -3147822, 1239187, 5441142, 7370803, 6615039, 4917308, 3513196, 1874090, -508042]
5336e08042k259672q62436R97391K344216K288612N02031j688641k187440q90876
5327b264857J10607k64830p27830k43916K97964J85918L44521J269249J645518
5318C52344N92724o48808q09328n41632q11790j140184r08926o93342r23780r43012
5308f475734n82046p24993j106926K21341L714479O747144O816671M385188J200995
5299A4196119j917922m182544m314508k757030j908902k317859j383897K045290
5291b541253M806764L891675J024697k77866K75542Q74907J318426K085893J868837
5282A3327622k89400k284039k030095j269607k385354l526824j587206J641587
5274A596684J629419j379612k568768l73345J410961M08673o43618R30148L209368
$$ y = [-508042, -2767714, -3630150, -2632759, -288543, 2000069, 2502100, 813459, -1373981, -2264857, -2154250, -2419080, -3146910, -3390826, -3092862, -2906944, -2562423, -1293174, 352344, 945068, 296260, -513068, -1054700, -1866490, -3006674, -3915600, -4608942, -5532722, -6475734, -7057780, -7782773, -8889699, -8668358, -4953879, 1793265, 8609936, 12995124, 14196119, 12278197, 8095653, 3781145, 1024115, -884787, -3202646, -4586543, -2541253, 2265511, 6157186, 7181883, 6904017, 7179559, 8054466, 9372892, 11458785, 13327622, 13038222, 10754183, 8724088, 7454481, 5069127, 1542303, -44903, 1596684, 3226103, 1846491, -722277, -1095622, 315339, 724012, 80394, 1010542, 4219910]
5265D219910L035966P96979q29486q05318j51352J66178P3224l9291K63224P44329
5255G474363L07126j286984k170429p59896J335988J346500k65351n41623Q72184
5246F311878Q08264k415368o133708o845230m289203p99486J565512K272966K159530
5237g364845K560363L478926L065902M93156j791704j213938O98590N88461j173717
5228f58806j333632K91411N33062j022484q60677J968726L249622J49488l946002
5219a629292m364574j445005J348267K613507K937093K102783j31900k097440
5211f66561k011694n22857O51638J057706P05489r16167l001759k957345j02283
5202g763833K476790K234950Q81895J019999J645396M44838j564192j538656M89996
$$ y = [4219910, 7255876, 8052855, 7223369, 6418051, 6266699, 6432877, 6506101, 6466810, 6730034, 7474363, 7781489, 6494505, 4324076, 3564180, 4900168, 6246668, 5981317, 5439694, 6311878, 7120142, 4704774, -1428934, -8274164, -12563367, -13362853, -11797341, -9524375, -7364845, -4804482, -1325556, 1740346, 2233502, 441798, -772140, -73550, 514911, -658806, -1992438, -1701027, -1167965, -2190449, -3051126, -1082400, 2167222, 2316710, -1629292, -5993866, -7438871, -6090604, -3477097, -540004, 1562779, 1430879, -666561, -2678255, -3201112, -2549474, -1491768, -786279, -1702446, -4704205, -7661550, -7763833, -5287043, -3052093, -2170198, -1150199, 495197, 940035, -624157, -2162813, -1672817]
5193a672817K097122K474247K386793J281916j641925m160910k924423J270718
5185h89279L800617K325285o18329j732118p37457P19868J376673P28422q13937
5176D159745j583309l47762J492264J461864j99573p04424J033358K794396K370873
5167A0477432K79811j601122k164021j203679O64555J643831K56498k248595l031851
5158C072859j730458j018830k251255l174453j579438J095456J969626Q50275
5150b766218j16484J95996J047839J577963J380190p6747k592448m174769k910451
5141h435129J31173J844466J142733J21222P38288K369516L519462L931049L606104
5132H968884J667013j696756l629090j715152J928364K622744o14009l642443
$$ y = [-1672817, 424305, 2898552, 5285345, 6567261, 4925336, 764426, -2159997, -889279, 2911338, 5236623, 4618294, 2886176, 2148719, 2868587, 4245260, 4973682, 4159745, 2576436, 2228674, 3720938, 5182802, 4983229, 4278805, 5312163, 8106559, 10477432, 10757243, 9156121, 6992100, 5788421, 6452976, 8096807, 8353305, 6104710, 3072859, 1342401, 323571, -1927684, -5102137, -6681575, -5586119, -3616493, -2766218, -2882702, -2686706, -1638867, -60904, 1319286, 1242539, -1349909, -5524678, -8435129, -8303956, -6459490, -5316757, -5195535, -4457247, -2087731, 1431731, 5362780, 8968884, 10635897, 8939141, 5310051, 3594899, 5523263, 8146007, 7531998, 3889555]
5124C889555k879467L02289K282059J851509K03303j685078l245340l349298j658315
5115d288783m1068l88155j767002j827283j99506J581710K560735K577442J203351
5106e88559j009325j524775R59278L611440L222377J439905J936790L520429J591755
5097A3159315l502948n684416k283769J753569J450301j497721k861455k210176
5089a677300j321406q1871J950471K915252J483777k20746l7498N32429m89883
5080C053225j537887n54339O65865m93167k475940k163526m13327j53207o40505
5071d712808J123399M208667M409418J146920j236480Q5571K802309L353658J154116
5062A2334770k012398m174436m095986k096892r4310P34736J414544K553804K280916
$$ y = [3889555, 1010088, 1312377, 3594436, 5445945, 5649248, 3964170, 718830, -2630468, -4288783, -4329851, -4718006, -6485008, -8312291, -8511797, -6930087, -4369352, -1791910, -588559, -1597884, -3122659, -2163381, 1448059, 4670436, 6110341, 8047131, 11567560, 13159315, 9656367, 3971951, 1688182, 3441751, 4892052, 3394331, 532876, -1677300, -2998706, -3080577, -1130106, 1785146, 3268923, 3048177, 3010679, 3543108, 3053225, 1515338, 960999, 1626864, 1133697, -1342243, -3505769, -3919096, -4072303, -4712808, -3589409, 619258, 5028676, 6175596, 4939116, 5024687, 7826996, 11180654, 12334770, 10322372, 6147936, 2051950, -44942, -139252, 595484, 2010028, 4563832, 6844748]
5053F844748l86510k374032o71342K269313J906351r82928j523318J173034K685487
5044H940803N55615k309070k725419j227210L95631J512097J308264j122896m025850
5035A301965l957414p99473J679870J365615K68286L42247P04472N26772R05344
5026B337684K006110J872438M4461r60892J77361J155363J900j597888j420457
5017C616080m27356o53960j534450j098771N81215J547401P68412q51172j680382
5008B67017p14178J503165K981467K337085N99787l55456m97984p95966o47929
4999D677008R79169K486092J142387k365325m265568k857228j88952J520167J907855
4990C035605R95758p81878j196331J297401L884352K501591j485354k687812j14939
$$ y = [6844748, 6458238, 4084206, 3412864, 5682177, 7588528, 6605600, 5082282, 6255316, 8940803, 9496418, 7187348, 4461929, 3234719, 3630350, 5142447, 6450711, 5327815, 1301965, -2655449, -3454922, -1775052, -409437, -141151, 201096, 905568, 1432340, 2337684, 4343794, 6216232, 6260693, 5299801, 5477162, 6632525, 6634425, 5036537, 3616080, 3188724, 2534764, 1000314, -98457, 482758, 2030159, 2798571, 1947399, 267017, -447161, 1056004, 4037471, 6374556, 6974343, 6618887, 6120903, 5324937, 4677008, 5656177, 8142269, 9284656, 6919331, 2653763, -203465, -392417, 1127750, 3035605, 4031363, 3249485, 2053154, 3350555, 7234907, 9736498, 8251144, 5563332, 5448393]
4981E448393J340383r89320l610079l124034j142702k74274Q5977J037749J397005
4972A69098N11732J79048J185066J451944q9319j336025p97437Q8625K65173Q21467
4962B449372J754347J188740m27807P1298K851748L811601J235812j248030p87634
4953A0899447O32127P53104N26402M61346j129273l539906k978828O80174K400557
4944H705150K21072j470380k07785J66597k458919l561641l55719K297002M18036
4935C753413j720735M82118L411272K031543r64197o18788J352127J057732M59458
4926I243943K651995M219523Q58772l967139m458221k069426j296341p27992K681785
4917G136899N171597J765741l742378m178835o34953Q87102M57687J782714K863827
$$ y = [5448393, 6788776, 5799456, 2189377, -934657, -2077359, -2351633, -2265656, -1227907, 169098, 680830, 859878, 2044944, 3496888, 3407569, 2071544, 1274107, 1362732, 1627905, 2449372, 4203719, 5392459, 4964652, 5035950, 7887698, 11699299, 12935111, 11687081, 10899447, 11531574, 12284678, 12811080, 13272426, 12143153, 8603247, 5624419, 6304593, 8705150, 8926222, 7455842, 7248057, 7414654, 4955735, 1394094, 1038375, 3335377, 3753413, 2032678, 2514796, 5926068, 7957611, 6993414, 6374626, 7726753, 8784485, 9243943, 11895938, 16115461, 16974233, 13007094, 8548873, 6479447, 5183106, 4455114, 7136899, 12308496, 14074237, 10331859, 6153024, 5518071, 6405173, 6862860, 8645574, 11509401]
4908A1509401j56088l531339j378734K957498K424364n52296J284152N571331
4900A8128289L878846k645094m832950j247698J070072M14160J496031L749890
4892B0011546K124427j370172l46436L224451K657916L48587L051902O955083
4884C6657304M200128R13M090245J0109244O062020k30606O441766J6231589Q927360
4875I2489963j992185J4421431L9741096J1162328p9653642j45646666j09045918
4868a78523593q847180N1394110L7850524P734073Q311700K0850469J5051902
4861d6177995J043967O04118P297519M812343k047952p98768M059819K298190
4853b8908759j635716J014457N514427L505143o63447Q91361M306071K385085
$$ y = [11509401, 11353313, 7821974, 6443240, 9400738, 11825102, 11272806, 12556958, 18128289, 22007135, 19362041, 14529091, 13281393, 14351465, 14765625, 16261656, 20011546, 22135973, 20765801, 20419365, 23643816, 26301732, 26650319, 29702221, 36657304, 40857432, 40858345, 44948590, 55057834, 61119854, 60889248, 67331014, 83562603, 92489963, 90497778, 104919209, 144660305, 155822633, 76168991, -69477675, -178523593, -187370773, -135976663, -98126139, -90392066, -82080366, -61229897, -46177995, -45134028, -44529910, -37232391, -32420048, -34468000, -35266768, -31206949, -28908759, -30544475, -29530018, -24015591, -20510448, -21173895, -20282534, -15976463, -13591378]
4845a3591378j093062O92424L924158J772266j968278Q1422M811639M166498p79966
4836a984277l082915k378126k922724l630496q98500K356377P89060l405981m150278
4827a9307860j965343j541996j978367R64220N279474M987786N72907j816849
4819a4806028p05037l61676k021692k165498J78588J778138J479385J616845K460811
4810a2546164J279357k094433m034399k540981M04494K536166L589752L672045
4802i734163K752112J734606J265612L48970j251888j219129J453959L334505
4794a315416J426574j408309q60734J415041P11184k151679j912247J871953L591458
4785A367825P14766k197806r28593K204015K629669Q5936k301987k855728k349982
$$ y = [-13591378, -14684440, -13992016, -10067858, -8295592, -10263870, -10182448, -5370809, -1204311, -1984277, -5067192, -7445318, -10368042, -13998538, -14897038, -12540661, -11751601, -15157582, -19307860, -21273203, -22815199, -24793566, -23829346, -18549872, -13562086, -12989179, -14806028, -15511065, -15872741, -17894433, -20059931, -19881343, -18103205, -16623820, -15006975, -12546164, -11266807, -13361240, -17395639, -19936620, -19532126, -16995960, -13406208, -9734163, -6982051, -5247445, -3981833, -3632863, -4884751, -6103880, -4649921, -1315416, 111158, -1297151, -2157885, -742844, -31660, -2183339, -4095586, -2223633, 1367825, 2082591, -115215, -1043808, 1160207, 3789876, 3875812, 1573825, -1281903, -3631885]
4776c631885j770746j388464j292376j373250j182380m94196L41168P31240K46441
4767i814448q34574j055486J016111M405714O010331M343683J429406k80135r81715
4758D238887j880610k513947j931920q80039m83976j56479J021366K224623K215100
4749A853005J240759k12812k569360n043347m871495j342946J881565J626838
4741g437793n2004L89214J895529R55880j850041k446333J40603K467249K166810
4732c770886O70955q2881r7516K29817J103031K092224K256999J783044J527812
4723E712599J262074L34903p22873j344482k355405l882956l707133p71553J727128
4714c747698O30803j755039j154972J421184J407311j225153j695544J467688
$$ y = [-3631885, -5402631, -6791095, -8083471, -9456721, -10639101, -11133297, -10792129, -10060889, -9814448, -10649022, -11704508, -10688397, -6282683, -272352, 4071331, 5500737, 5220602, 4238887, 2358277, -155670, -2087590, -2967629, -3451605, -3608084, -2586718, -362095, 1853005, 3093764, 2880952, 311592, -4731755, -9603250, -10946196, -9064631, -7437793, -7489797, -7100583, -5205054, -4249174, -6099215, -8545548, -8404945, -5937696, -3770886, -3099931, -3182812, -3280328, -3050511, -1947480, 144744, 2401743, 4184787, 5712599, 6974673, 7309576, 6586703, 5242221, 2886816, -996140, -4703273, -5474826, -3747698, -3116895, -4871934, -6026906, -4605722, -3198411, -4423564, -6119108, -4651420]
4706d651420M035476L049650O43991q50328k373524m437191m780517k462468j62624
4697a1988955K61311O30545K263690K957271J223825k62829R23707K414548R13750
4688f63137k049125k536314n77540J84107j560422l050581j796107J179195K866656
4679h003268J421293k103056m178881j935449L064513N704935L402277m90823
4671c118459j260158J077941K812470K170535Q33158M16225L87468k65653j475110
4662A578417k581555k897205j790481M37992K018920J474711l64569j492871j446553
4653e063194j290911j271467m38893J206874K022932Q50529j392726k821769k344929
4644a0543554k8540L095040M996754L667998o03732m551188m849598j789684J043940
$$ y = [-4651420, -615944, 2433706, 3077697, 2227369, -146155, -4583346, -9363863, -11826331, -11988955, -11727644, -11097099, -8833409, -5876138, -4652313, -4915142, -3991435, -1576887, -663137, -2712262, -5248576, -5826116, -5642009, -7202431, -10253012, -12049119, -10869924, -8003268, -6581975, -8685031, -12863912, -14799361, -11734848, -6029913, -2627636, -3118459, -4378617, -3300676, -488206, 1682329, 2515487, 2931712, 3319180, 3053527, 1578417, -1003138, -3900343, -5690824, -5252832, -3233912, -1759201, -2123770, -3616641, -5063194, -6354105, -7625572, -8064465, -6857591, -4834659, -3984130, -5376856, -8198625, -10543554, -10572094, -7477054, -2480300, 1187698, 583966, -3967222, -8816820, -10606504, -9562564]
4635i562564J070019m65734q00743L78781J104955Q20810J376524L469106M505959
4626A897113K103844j858581l291862j318121R46467R13344p00876j979194k266874
4617e554740j637079M4819K230150L297119K337654M74970m96343j20624O01191
4608A177117M64084q07224k046663j493633Q94864K531640J160376j753527k700107
4599b573073j038948K89508o22157k011047j563788J93713J259902J144774Q12918
4590d108198Q94366J385745K137157K508493J518201o95732k473725k450699r47285
4581b231677P79039J616043R47380n99806r56193Q73002K429010O54517l024208
4572D87107m015971j401859P71515L29739K92191K713095M083686J183984k511140
$$ y = [-9562564, -8492545, -8958279, -9759022, -9380241, -8275286, -7454476, -6077952, -2608846, 1897113, 4000957, 2142376, -1149486, -2467607, -1521140, -607796, -1308672, -3287866, -5554740, -7191819, -7147000, -4916850, -1619731, 717923, 1192893, 696550, 575926, 1177117, 1641201, 833977, -1212686, -2706319, -1811455, 720185, 1880561, 127034, -2573073, -3612021, -3322513, -3944670, -5955717, -7519505, -7325792, -6065890, -4921116, -4108198, -3213832, -1828087, 309070, 2817563, 4335764, 3640032, 1166307, -1284392, -2231677, -1452638, 163405, 1110785, 510979, -445214, 427788, 2856798, 3511315, 487107, -3528864, -4930723, -4159208, -3829469, -3537278, -824183, 3259503, 4443487, 1932347]
4563A932347j753561J909914K539958p01344k739879j113831Q37051M22204l67189
4554I65670N41401J399835K18322j421586j197035J05270N11320L32144P48467
4545B203808P86711j131503l741087m089430j757310O74124J346760J013076Q76784
4536c818067O03079o04345k251690k928259j925836J25871J959785K650042K113479
4527d075941R74496j7779n18306o56325p62653j083242j601028k001840j848330
4518a1590948q86068O95035K198904K776881K167126J045526K84161n6757n16019
4509c882159j173917j554577j482081j093973j54022J298776J717671m79999l710680
4500a0514961m016626m95309K598570J547347j291072r75724K519093M422137
$$ y = [1932347, 178786, 2088700, 4628658, 3927314, 1187435, 73604, 910655, 1332859, 965670, 1507071, 2906906, 3125228, 1703642, 506607, 611877, 1123197, 1455341, 2203808, 2990519, 1859016, -1882071, -5971501, -7728811, -7054687, -5707927, -4694851, -3818067, -3214988, -3819333, -6071023, -8999282, -10925118, -10799247, -8839462, -6189420, -4075941, -3101445, -3119224, -3637530, -4293855, -5056508, -6139750, -7740778, -9742618, -11590948, -12477016, -11781981, -9583077, -6806196, -4639070, -3593544, -3309383, -3366140, -3882159, -5056076, -6610653, -8092734, -9186707, -9340729, -8041953, -6324282, -6804281, -10514961, -14531587, -15026896, -12428326, -10880979, -12172051, -13147775, -10628682, -6206545]
4492f206545K473244j82123l80127O53383L09233r59537q04211J158747K991288
4483i46648K981111R19477k207663m477726m072742j415951P15217M14057j063715
4474i154583j348161k7289J647679K817201L179102K241377J51541j594690j860085
4465c947908j381612j114725l73428J444399K683899J620853j87614J38747J925897
4456H08508J506227j938892m586364l335674M8776K008146J883873J319036R89334
4447a297030N12118L12858R75337J409317J19874j880550j691600J557678N100266
4438E118268N432849J822345l299221o538679o101111l072578k66099P59610J122298
4429e022318K338184L561988K759580J82883j433243n20317J317580J721866M61984
$$ y = [-6206545, -3733301, -3915424, -4295551, -3642168, -3332935, -4292472, -5096683, -3937936, -946648, 2034463, 2953940, 746277, -3731449, -7804191, -9220142, -8504925, -8090868, -9154583, -10502744, -10530033, -8882354, -6065153, -2886051, -644674, -493133, -2087823, -3947908, -5329520, -6444245, -6817673, -5373274, -2689375, -1068522, -1256136, -1117389, 808508, 2314735, 375843, -4210521, -7546195, -7497419, -5489273, -3605400, -2286364, -1297030, -784912, -472054, 503283, 1912600, 2032474, 151924, -1539676, 18002, 5118268, 10551117, 12373462, 9074241, 2535562, -3565549, -6638127, -6904226, -6144616, -5022318, -2684134, 877854, 3637434, 3820317, 2387074, 1866757, 3184337, 4906203, 5368187]
4420E368187j114173k214972k856723k778127j554126K96217J360459P95374o68821
4411c366705j402808n56292R44829J320776M4446j459506j708684j072026q10233
4402h066203q52004o6486J436127K041291J026035l46557p11727k19421L51264
4393e407681Q10076J222452J501266J843531K388454K171043M9041k888441l833182
4384b143441k038032k4364J41692m23188k3038N35142k29178j337538p46325J212101
4374e076169K338606J822936P11448k66037j177016j708724j472364r57418n47149
4365f331887M10733J805621J601812j103802l468192k417016N77594J755521R66477
4356f203139J166731K632372K407854n5121j414660J17838K139297K580364K789748
$$ y = [5368187, 4254014, 2039042, -817681, -3595808, -5149934, -4853717, -3493258, -2697884, -3366705, -4769513, -5325805, -4380976, -3060200, -3015754, -4475260, -6183944, -7255970, -8066203, -8918207, -8984693, -7548566, -5507275, -4481240, -4827797, -5539524, -5758945, -5407681, -4597605, -3375153, -1873887, -30356, 2358098, 4529141, 4578182, 1689741, -2143441, -4181473, -4205837, -4064145, -4487333, -4510371, -3975229, -4204407, -5541945, -6288270, -5076169, -2737563, -914627, -203179, -469216, -1646232, -3354956, -4827320, -5784738, -6331887, -5921154, -4115533, -2513721, -3617523, -7085715, -9502731, -8925137, -7169616, -6203139, -5036408, -2404036, 3818, -51303, -1465963, -1348125, 791172, 3371536, 6161284]
4347F161284L847247L601717L73891l335415m016409j995938l63422p16027k332654
4338A224274m002081m500054k758967M30292K352454J757682O55092J026835J734573
4329b079900P62711j323995k436506j932469m98834J313079K505815J481492j392804
4320c601411l024940j675589L08292L02553m80550K14445J215791J59185j747756
4311h329980j636075l14791q71100k576732j391110L022551N865888M256078J203538
4302g71733L89530Q63064k44628k682355l887847l034037j511012m12857K95227
4293a0996648Q01866J213316J633376J488033j01504k288926k426945M46463L509388
4284f721581L525164J205131j02466N63463P49087j162404l278498l044210q67138
$$ y = [6161284, 10008531, 13610248, 13984139, 10648724, 6632315, 4636377, 4272955, 3556928, 1224274, -2777807, -7277861, -10036828, -9606536, -7254082, -5496400, -4841308, -3814473, -2079900, -1317189, -2641184, -5077690, -7010159, -7508993, -6195914, -3690099, -2208607, -3601411, -6626351, -8301940, -7993648, -7691095, -8171645, -7957200, -6741409, -6582224, -8329980, -9966055, -10280846, -11151946, -13728678, -15119788, -12097237, -6231349, -1975271, -771733, -382203, 480861, 236233, -2446122, -6333969, -9368006, -10879018, -11291875, -10996648, -10194782, -8981466, -7348090, -5860057, -5961561, -8250487, -10677432, -10230969, -6721581, -3196417, -1991286, -2093752, -1530289, -781202, -1943606, -5222104, -8266314, -9133452]
4275i133452Q57717J174088J057029J052471N50766m52811r04036o64667j070488
4266g533383k440441k821488q21611J808738K385963R11141n95076j233603j309770
4257a1649530m14369J596492K563662N32878k076730r06733L421101N318435K401037
4248G86243r86338o94352J218093P69823j393193j961852q56631o87742j823820
4239e629769k179089j246851p33665j378143k049421j849874p75132J262591L893420
4230a0685933N387940M386034J911983q7933j222195j955813j886814q40098k85922
4221e278751j369850k742089k496912r66215M47874J610368K665057K556752R60011
4212d613755j86493M28972J115451L29761k04608J287872K739451J374617j302122
$$ y = [-9133452, -8275735, -7101647, -6044618, -4992147, -4441381, -4894192, -5798228, -6462895, -7533383, -9973824, -12795312, -13616923, -11808185, -9422222, -8511081, -9106157, -10339760, -11649530, -12063899, -10467407, -7903745, -7370867, -9447597, -10354330, -6933229, -1614794, 786243, -200095, -894447, 323646, 1093469, -299724, -2261576, -3118207, -3805949, -5629769, -7808858, -9055709, -9789374, -11167517, -13216938, -15066812, -15841944, -14579353, -10685933, -5297993, -911959, 1000024, 912091, -310104, -2265917, -4152731, -4992829, -5278751, -6648601, -9390690, -11887602, -12853817, -12405943, -10795575, -8130518, -5573766, -4613755, -4800248, -4371276, -3255825, -2926064, -3130672, -1842800, 896651, 2271268, 969146]
4203I69146j769774j41984O10867j72174n95534k13542l51116j048044j123961
4194c836116n80928k2978J044821K544109K392788k00498k408140k096658j577938
4185d741538l205386m560333k701750J50381N40420J31149K209850M943930M582781
4176b650496K545157K483802K990724M81500l176015l527714j655274j626226
4168d134542k383794n38134J469818p39322l951198j843349L094957K995257j570745
4159g601052k614250J358050M070323L437538L024511K453111j365980m784363
4151b022112k331164J146973k066850o452765k296123L452784k288363j1180060
4143b4037680m932231P226484n40260j6719493M920646O7388803J01187332N2543003
$$ y = [969146, -800628, -942612, -331745, -503919, -1099453, -1312995, -1664111, -2712155, -3836116, -4417044, -4440022, -3395201, -851092, 1541696, 1341198, -1066942, -3163600, -4741538, -7946924, -12507257, -15209007, -15058626, -14518206, -14387057, -12177207, -7233277, -2650496, -105339, 2378463, 5369187, 5850687, 2674672, -853042, -2508316, -4134542, -6518336, -7056470, -5586652, -6325974, -10277172, -12120521, -9025564, -6030307, -7601052, -10215302, -8857252, -4786929, -1349391, 1675120, 4128231, 2762251, -2022112, -4353276, -3206303, -5273153, -11725918, -14022041, -10569257, -12857620, -24037680, -28969911, -21743427, -22283687, -39003180, -34082534, 33306269, 134493601, 187036604]
4135A87036604l3847129o9615683l8181484j458086j690560j5113299j0205949
4128A6924414K439395J269885o141530k844168N070112K807943n410432o612128
4120G503491k698475l112074n380883j569034M945129N508150J561625M1110M57950
4111G256989j124483k296153J53841J945876r03314l326679l23372L007697Q26616
4102E217018k200570P1151L039141p9027m882989l470094J030894N62071k704457
4093c416862p01434N098811N975602J210129j629449k47654L72133j162173q53864
4084D645239J622522K136906N83485R31565K727329J394518k741345m137462j195389
4075E967368J924478K822176K887180J960014j665611n846497o174887k984680
$$ y = [187036604, 153189475, 83573792, 45392308, 43934222, 42243662, 27130363, 16924414, 19363809, 20633694, 14492164, 11647996, 16718108, 19526051, 14115619, 7503491, 4805016, 1692942, -3687941, -5256975, -311846, 5196304, 6757929, 6799039, 7256989, 6132506, 3836353, 3990194, 5936070, 5032756, 1706077, 1382705, 4390402, 5217018, 3016448, 3087599, 6126740, 6047713, 1164724, -2305370, -1274476, -712405, -3416862, -4118296, 980515, 6956117, 8166246, 6536797, 6289143, 6661276, 5499103, 4645239, 6267761, 8404667, 8988152, 9919717, 12647046, 14041564, 11300219, 7162757, 5967368, 7891846, 10714022, 13601202, 15561216, 13895605, 8049108, 1874221, -1110459]
4067a110459m09851P67833K657676L936212J509396k384276k560517J36919K25709
4058B768642k377942k194866J545617L180365O11227j285614M79905K337740J108298
4049F173372j080006j665934j576676j743101j030790K62151r3627j682099j432822
4040c869532P36872J663523J041877J710054L033368R36322l844378m848002J5854
4031c424042M374351K920202j234287k675367j493314o57156m21107K70282O25800
4022a714638J2120k24970K28827n10795k316685j982138J095170K858126J139753
4013a415230o32114L24425J230167p67053k914889j557721J435459K061435P33572
4004a501949L29873N09052p35229j985743k17480L479440M801379K298167j417354
$$ y = [-1110459, -1520310, -752477, 1905199, 5841411, 7350807, 4966531, 2406014, 2542933, 2768642, 390700, -1804166, -258549, 2921816, 3533043, 2247429, 2727334, 5065074, 6173372, 5093366, 3427432, 1850756, 107655, -923135, -660984, -754611, -2436710, -3869532, -3132660, -1469137, -427260, 1282794, 4316162, 5252484, 1408106, -3439896, -3424042, 950309, 3870511, 2636224, -39143, -1532457, -2189613, -2610720, -2340438, -1714638, -1702518, -1927488, -1698661, -2209456, -4526141, -6508279, -5413109, -2554983, -1415230, -2047344, -1722919, -492752, -1259805, -4174694, -5732415, -4296956, -2235521, -1501949, -1172076, -663024, -1398253, -3383996, -3601476, -122036, 4679343, 6977510, 5560156]
3995E560156l888265m625627l390030k88841K597682K750945L87648k088773l183117
3986f168222k769033o51261K667489M702443L371759L36262o30957J414750L492620
3977E765850K703742m78772l277755l720375k266566q35690m15180n9818J086828
3968a497736J732895L15701j721608j391185J049934K060962K84257j435066q35897
3959a437743M76432M92013J86897R61324J646808Q28829l71109n28626n04990
3950A749835j108596p22453J634646L253082J287959k418967l648446j658651
3942a631591O16104J215690Q49867O78327J173545K511816L771382K836916n62047
3933A1460009l175927k256828K89174P96116n99575q07595Q25455J742651N27002
$$ y = [5560156, 1671891, -2953736, -6343766, -6632607, -4034925, -1283980, -896332, -2985105, -6168222, -8937255, -9588516, -6921027, -2218584, 1153175, 1489437, 858480, 2273230, 5765850, 8469592, 7990820, 4713065, 992690, -1273876, -2109566, -2524746, -2584564, -1497736, 235159, 550860, -1170748, -2561933, -1511999, 548963, 833220, -601846, -1437743, -961311, -469298, -282401, 678923, 2325731, 3154560, 2783451, 2254825, 1749835, 641239, -81214, 1553432, 4806514, 6094473, 3675506, 27060, -1631591, -1015487, 200203, 1050070, 1728397, 2901942, 5413758, 9185140, 12022056, 11460009, 8284082, 6027254, 6316428, 7112544, 6512969, 5705374, 6530829, 8273480, 8800482]
3924H800482j365146k297269k010567n47684J667089K800214J304237j491598
3916F859758k942193k796923k681149k479992n02606K792681M531146L389092
3908F169814J040425p60824j823003j903903l91336J651857J819537k94369k359039
3899C149159k645836j824589p84943Q24334K867608L826416K839121Q16139j298875
3890G768534l406323m666683l392582K11058L237045L438049J778540M63359Q7191
3881E518188p6750n84100j777805l619347m528809k338175K248554N186844L866791
3872C895391N20124j125841p45465m74917p06458l4523J334491J479354K46376
3863D388532k02205R31589J546475l976k304827l170294k687795k210732j789136
$$ y = [8800482, 7435336, 5138067, 3127500, 2579816, 4246905, 7047119, 8351356, 6859758, 3917565, 1120642, -1560507, -4040499, -4543105, -1750424, 2780722, 6169814, 7210239, 6449415, 4626412, 2722509, 2331173, 3983030, 5802567, 5508198, 3149159, 503323, -1321266, -2106209, -1281875, 1585733, 5412149, 8251270, 9067409, 7768534, 4362211, -304472, -3697054, -3485996, -248951, 3189098, 4967638, 5430997, 5518188, 5441438, 4857338, 3079533, -539814, -5068623, -7406798, -5158244, 28600, 3895391, 4415515, 3289674, 2544209, 2069292, 1362834, 1328311, 2662802, 4142156, 4388532, 4186327, 5117916, 6664391, 6660415, 4355588, 1185294, -1502501, -3713233, -5502369]
3854e502369o40523P19464Q66115l53880j718510k434015k460205j384593J126861
3845a1781655L722271M144666K059926n21729j953397k272280j513611R14024
3837g201785M119226N298330L067051n90608l230682m764462n572840m308577
3829a3184347n09687K566093J409181k383792l793552r84839L133131N586632
3821h161180O019386M796853K220401M5013J49940J172765J33826k193208j897617
3812B286179J187953K255902p74466l398559j647050J518889J237604j527201
3804A139251k281417m63809N82780k97006r30262l01433J03100n08002j189007
3795d145805j466415j631680j064836Q79625K696985K319533M74380m10613j55342
$$ y = [-5502369, -6142892, -5423428, -4557313, -4911193, -6629703, -9063718, -11523923, -12908516, -11781655, -8059384, -3914718, -1854792, -2376521, -4329918, -6602198, -8115809, -7201785, -3082559, 2215771, 5282822, 4692214, 1461532, -3302930, -8875770, -13184347, -13694034, -11127941, -9718760, -12102552, -15896104, -16880943, -13747812, -8161180, -2141794, 2655059, 4875460, 4920473, 5070413, 6243178, 6377004, 4183796, 2286179, 3474132, 5730034, 4955568, 1557009, -90041, 1428848, 2666452, 1139251, -1142166, -1605975, -1023195, -1320201, -2250463, -2551896, -2448796, -2956798, -4145805, -5612220, -7243900, -8308736, -7429111, -4732126, -2412593, -1938213, -2348826, -2504168]
3786b504168o19193j934798k198918q86461N14006J304560K004857K036601K77324
3777b006190j847802j287531J877358L839711K313729n35773j645171q85835M1703
3768a35801K63082j47768q75996j035666K86682K357152L208210K180515L95978
3759F496388j356675l044537l693830k046877O21996J317575k01514q26332Q60666
3750a873140K267790J344407J18796R64948K158362O33222k686601m029466k396340
3741c498022n46263m53941r12863k36068J204092K089980J950048R25089p40867
3732b18815k088150j704858K86673J614536N55536j515336j816241n5326J147735
3723c794246M1605j863743k197921r43203L55317J316623K492759L224754K341521
$$ y = [-2504168, -3123361, -5058159, -7257077, -8143538, -7629532, -6324972, -4320115, -2283514, -2006190, -3853992, -5141523, -3264165, 575546, 2889275, 2353502, 708331, -177504, -135801, 127281, -20487, -896483, -1932149, -1645467, 711685, 3919895, 6100410, 6496388, 5139713, 2095176, -1598654, -3645531, -3023535, -1705960, -1907474, -2733806, -1873140, 394650, 1739057, 1857853, 2822801, 4981163, 5614385, 2927784, -1101682, -3498022, -4044285, -4498226, -5411089, -5647157, -4443065, -2353085, -403037, 522052, -218815, -2306965, -4011823, -3725150, -2110614, -1555078, -3070414, -4886655, -4941981, -3794246, -3752641, -5616384, -7814305, -8757508, -8402191, -7085568, -4592809, -1368055, 973466]
3714I73466P58977N49858J240064J60650k854185m590470l539040k122096j913367
3705a1336143p57255K341925L717598Q54611k056650q1046L831098K995331j872163
3696b362694l431680K57508K649119j61965k998759n68293L613813L103420j197535
3687a097066l109203r62026J030248L30243p96687l41591J11426j086968k256092
3678h177716r59630J917240L069097J241657j101804j117378O48663J231232l04555
3669c553194j426054j56027J538169O98981j723047k119162J27509J747859P56853
3660d108113q67371p89846L51302O80239k41560j748112k923317k285238Q82202
3651a1049814M116608L679093n6760k364959p28796J853297K010058P53961M62356
$$ y = [973466, 1732443, 2282301, 3522365, 3683015, 828830, -3761640, -7300680, -9422776, -11336143, -12093398, -9751473, -6033875, -5179264, -7235914, -7316960, -3485862, -490531, -2362694, -5794374, -5536866, -2887747, -3049712, -6048471, -6616764, -3002951, 100469, -1097066, -4206269, -5168295, -4138047, -3807804, -4604491, -4946082, -4834656, -5921624, -8177716, -9137346, -7220106, -4151009, -2909352, -4011156, -5128534, -4479871, -3248639, -3553194, -4979248, -5135275, -3597106, -2898125, -4621172, -6740334, -6612825, -4864966, -4108113, -4975484, -5765330, -5414028, -4733789, -4975349, -6723461, -9646778, -11932016, -11049814, -6933206, -3254113, -3310873, -5675832, -6404628, -4551331, -2541273, -1787312, -1324956]
3642a324956N84649l27524j183467m61067O18247M09466O8892J031574J595396
3633A011210j67773k210644j361989J385159K701292K413620K568238K418045
3625H757158m05562m344175n034113k255091m59571j519249k195175l56298J451829
3616f360247J027586L46412J263500J597659o62335k714878j016223K397372K524534
3607a596620p94497k531987j27203K881389K293278j032469l025627j863642O49786
3598e147592K090291J822606P04988j50982k18268L245n70786k074459k929391
3589f470348j603671J026104K340038J286260k45052l8050J605893K627559J853038
3580B381771k60031k593430l698222k105063J751851M481230K927475j508037
$$ y = [-1324956, -740307, -1067831, -2251298, -2712365, -2094118, -1684652, -1615760, -584186, 1011210, 843437, -1367207, -2729196, -1344037, 1357255, 3770875, 6339113, 8757158, 8351596, 4007421, -1026692, -3281783, -3741354, -5260603, -7455778, -7812076, -6360247, -5332661, -4986249, -3722749, -2125090, -2787425, -5502303, -6518526, -4121154, -1596620, -2391117, -4923104, -5050307, -2168918, 124360, -908109, -3933736, -5797378, -5147592, -3057301, -1234695, -529707, -680689, -898957, -895712, -1466498, -3540957, -6470348, -8074019, -7047915, -4707877, -3421617, -3666669, -3704719, -2098826, 528733, 2381771, 2121740, -471690, -4169912, -6274975, -4523124, -41894, 2885581, 1377544]
3572A377544m024238k391487M78412Q66613r64902j842457m9776L027138M840411
3563A317258M013527J250437j232830j612297k53393Q44424L88495j171389k620403
3554I23829k832135j152044J452929K227751k15896l119461k717626J95886J331421
3545c905346l02928q88677J646820L910770K432125q63442j761304L53794K844051
3536C465863L886056L297472J268599r79309j137340R74356K033478l88274m062198
3527H358703n319218l888766j822214J16130J966925K687424J859568J143072
3519E101624J087233p74299n186833p676391m322438J657243M181334K882552
3511c049975J867057J900022K64442k500522k478528O02703K418586J166686j3766
$$ y = [1377544, -2646694, -5038181, -4559769, -3693156, -4658058, -6500515, -6550291, -3523153, 1317258, 5330785, 6581222, 5348392, 3736095, 3482702, 4327126, 4715621, 3544232, 923829, -1908306, -3060350, -1607421, 620330, 404434, -2715027, -5432653, -5236767, -3905346, -4208274, -5096951, -3450131, 460639, 2892764, 2029322, 268018, 621812, 3465863, 7351919, 10649391, 11917990, 10938681, 9801341, 10775697, 12809175, 12420901, 8358703, 3039485, -849281, -2671495, -2555365, -588440, 2098984, 3958552, 5101624, 6188857, 5414558, 227725, -7448666, -11771104, -10113861, -5932527, -3049975, -1182918, 717104, 981546, -1518976, -3997504, -3394801, -976215, 190471, 176705]
3502A76705Q74637J513762N0869j634330j498605k73468Q01452J603921J414626
3493C029569o23972k513188j052373K629657L709688Q99843j786859j860157j705936
3484G26272l035456l254877l84164K960332L721265K601302J233375q01647l169460
3475E96942l206442n30044Q38156j373584l388979j310274K475265L430842K011575
3466d56543J545047J702042l77042m042172n477344l424319k71203J917833K731675
3457f152026J786010n01112j622522k10320Q16738j514588m297257k119015M216147
3448i597945P842166N340688Q83574p16410l14078j138094k972295l096832r62200
3439d731426J224843J770530J110281M99507O05850J254625J653099J038825l85637
$$ y = [176705, 1051342, 2565104, 2615973, 981643, -516962, -790430, 11022, 1614943, 3029569, 2405597, -107591, -1159964, 1469693, 5179381, 6079224, 4292365, 2432208, 726272, -2309184, -5564061, -5948225, -2987893, 733372, 3334674, 4568049, 3766402, 596942, -2609500, -3139544, -2301388, -3674972, -7063951, -8374225, -5898960, -2468118, -456543, 1088504, 2790546, 2413504, -1628668, -7106012, -10530331, -10801534, -8883701, -6152026, -4366016, -4867128, -6489650, -6699970, -5883232, -7397820, -11695077, -13814092, -9597945, -1755779, 3584909, 4468483, 3752073, 3437995, 2299901, -672394, -3769226, -4731426, -3506583, -1736053, -625772, -126265, 479585, 1734210, 3387309, 4426134, 4040497]
3430D040497j461386j319083k43920Q63782J396749J205188L70790p52268j464605
3421B635744j174440k01455J73568q05736j835897p83041J915124K795790J9852
3412B739509l143795k259379J819496L918070J863617r78155j304607j70451Q3061
3403B567366k26739K76389J077541R82908M08914L20152N10542N57349O20839
3394G095261J6686k507117n587375n395718j122301K776008K488858M1707n32532
3385b726523O72123Q72992j74915m81111K29891P05323J057913J951911K172137
3376D279741M92892j319629r38309L89380j03686j715390j379764J106943L074430
3367C886608L574734L799802L305416L21754l853470n137043k398257P34167J021852
$$ y = [4040497, 2579111, 1260028, 1016108, 1879890, 3276639, 4481827, 4852617, 4100349, 2635744, 1461304, 1259849, 1433417, 627681, -1208216, -1991257, -76133, 2719657, 2739509, -404286, -2663665, -844169, 3073901, 4937518, 3959363, 2654756, 2484305, 2567366, 2340627, 2617016, 3694557, 4677465, 5086379, 5406531, 5917073, 6474422, 7095261, 7111947, 4604830, -982545, -6378263, -7500564, -4724556, -2235698, -2193991, -2726523, -2054400, -1181408, -1356323, -1837434, -1607543, -902220, 155693, 2107604, 4279741, 4772633, 3453004, 2514695, 2904075, 2800389, 1084999, -294765, 812178, 3886608, 7461342, 11261144, 14566560, 14888314, 11034844, 5897801, 3499544, 4233711, 5255563]
3358E255563n45448j321632p41780r7147m21629j591862k393296j413070J075961
3349b194340K857582K613782J534002N55645j551494m798582n605875j729899
3341h319179L017841L783611K184064L107108N735556M663976l80150l347617
3333A0445210j666437j01997k236263m577422k893024R29059K544564J469164
3325C912854k93294k261824m069246l314956Q16971M270651K795146j770882l949576
3316c864156k224455k53507q22704k203711j328975J843381M438768M183470J807390
3307A575501k31667r19666j385152k094761j451044J055009K529708N82075k296550
3298b636547k177391P737M08804o50669N52963L471708L191176p49391k496486
$$ y = [5255563, 4710115, 3388483, 2646703, 2549556, 2127927, 536065, -1857231, -3270301, -2194340, 663242, 3277024, 4811026, 5366671, 3815177, -983405, -6589280, -8319179, -5301338, -1517727, 666337, 3773445, 9509001, 14172977, 13792827, 10445210, 8778773, 8676776, 6440513, 1863091, -1029933, -100874, 2443690, 3912854, 3619560, 1357736, -2711510, -6026466, -5209495, -938844, 1856302, 85420, -3864156, -6088611, -6342118, -7164822, -9368533, -10697508, -8854127, -4415359, -231889, 1575501, 1343834, 424168, -960984, -3055745, -4506789, -3451780, -922072, -339997, -2636547, -4813938, -4806201, -4397397, -5048066, -4495103, -1023395, 2167781, 1418390, -1078096]
3289a078096M92999K841449K47783l272973k371165Q13451R22329j600890k137798
3280e142911K41824K557190L520789L800189K423483j587215n265830m686457
3272d138938j080674R11890L30143L38244K070548K973637J574180l63968j006070
3263A608992m14221P72933J746118J158392p91909j148647J640129M038834J962400
3254A0573021k677609m712174l521249k638537k631338p08396K593294L026447
3246f96541J48484j174713J175625L041157J215159j482085j691612p83027o96552
3237i44105N11285M136027O093662K469331l118328l756157P31644L939237K618990
3228A2681586L66640N36706Q77537j907670n936201o309902k140688J982759J927028
$$ y = [-1078096, -585097, 2256352, 2504135, -768838, -3140003, -2326552, -1404223, -3005113, -5142911, -4901087, -2343897, 1176892, 4977081, 7400564, 5813349, 547519, -4138938, -5219612, -4307722, -3977579, -3639335, -1568787, 1404850, 2979030, 2615062, 1608992, 1194771, 1967704, 3713822, 4872214, 4080305, 2931658, 4571787, 8610621, 10573021, 7895412, 3183238, -338011, -2976548, -5607886, -6316282, -3722988, -696541, -548057, -1722770, -547145, 2494012, 3709171, 2227086, 535474, -247553, -944105, -432820, 3703207, 9796869, 12266200, 9147872, 5391715, 6123359, 10062596, 12681586, 13048226, 13584932, 14462469, 12554799, 6618598, 308696, -1831992, 150767, 2077795]
3219B077795r34348k025705K56875K796496K434396J91003q85197m58165p29838
3210B723312k155821k610929j293569k08370m71694k41936J652734K888487J278638
3201A560852j018070l78053K517814L446452Q08639k407356l190995j966050n71936
3192a198703N52745J711275K380312J889386N84644p52357j699526j762939m93965
3183A210872J095013P52881j991665m317685l373205j48443J894256J522638P70431
3174b584907J203208J642594O52640p77182p69357N11372J340643J165615J053060
3165C437686J641343K229670J932747M91767j900442m243683m504732j548536
3157b464180K598435M278297K426346m64724j961329k141351j714948k55097J990040
$$ y = [2077795, 1143447, -882258, -625383, 2171113, 4605509, 4796512, 3911315, 3453150, 2723312, 567491, -2043438, -3337007, -3545377, -4017071, -4259007, -2606273, 282214, 1560852, 542782, 164729, 2682543, 6128995, 6937634, 4530278, 1339283, -626767, -1198703, -645958, 1065317, 3445629, 5335015, 5919659, 5167302, 3467776, 1704837, 1210872, 2305885, 3058766, 1067101, -3250584, -6623789, -6772232, -4877976, -3355338, -2584907, -1381699, 260895, 913535, 136353, -633004, -121632, 1219011, 2384626, 3437686, 5079029, 7308699, 9241446, 9733213, 7832771, 3589088, -915644, -2464180, 134255, 4412552, 6838898, 6374174, 4412845, 2271494, 556546, 301449, 2291489]
3148B291489K734543N38466k389307k803314q63838N84210M33416J32663K69295
3139I27623n08439k338703k753115j61165L225496M016587K101795L99088N11809
3130E420976P76872o44481k407854j576899J744255L579190J160211k798011l356615
3121A897644k30741J834509K17752j695394j73213K495190J388419k936133m650039
3112a852006j283350K551866K048043r87017j453956J254919K697876J28552l671099
3103e66172m311372j295084J955701K464490N74328j263584j323782J04070J506252
3094b155153J667961O71255k61249q0352P88023Q74115l85208j825664k166440
3085b872712j519117m40734J317271L536421M172738J759353j391362j435130
$$ y = [2291489, 5026032, 5564498, 3175191, 371877, -491961, 92249, 525665, 658328, 927623, 419184, -1919519, -4672634, -4833799, -1608303, 2408284, 4510079, 4909167, 5420976, 6197848, 5553367, 3145513, 1568614, 3312869, 6892059, 8052270, 5254259, 1897644, 1666903, 3501412, 3719164, 2023770, 1850557, 4345747, 5734166, 2798033, -1852006, -3135356, -583490, 1464553, 477536, -976420, 278499, 2976375, 3104927, -566172, -4877544, -6172628, -4216927, -1752437, -1178109, -2441693, -3765475, -3661405, -2155153, -487192, 184063, -77186, -157538, 630485, 1504600, 1119392, -706272, -2872712, -4391829, -4832563, -3515292, 21129, 4193867, 5953220, 4561858, 3126728]
3077C126728J359447K536879m2224l140625l416068k272811k533756l188661j331795
3068h902886K372104M168180K593600L424j105005m45297J195096K808942L001184
3059E689342J297020o44512j187692j279860k483672l633830k564597k14518O12499
3050d409820R383N09054K015456J567482j207717k783817j246930R01943J210376
3041c434590P46749R53253O00161j367918k854444j471690J672638L600591L125061
3032A569811Q76870k206666m300865k968518J368576M359123K994491L2628j1469
3023A713981K413684K943055J62640k532054k153206K12941J787384J450487k80150
3014E718762k396657l416601k107495N43264J530494o18722l509670l556084m62390
$$ y = [3126728, 4486175, 7023054, 6980830, 3840205, 424137, -1848674, -4382430, -7571091, -8902886, -6530782, -2362602, 230998, 234422, -870583, -1315880, -120784, 2688158, 5689342, 6986362, 6341850, 5154158, 3874298, 1390626, -2243204, -4807801, -5022319, -4409820, -4400437, -3891383, -1875927, -308445, -1516162, -4299979, -5546909, -4644966, -3434590, -2687841, -1734588, -1134427, -2502345, -5356789, -6828479, -5155841, -1555250, 1569811, 2446681, 240015, -4060850, -7029368, -5660792, -1301669, 1692822, 1725450, 1713981, 4127665, 7070720, 7233360, 4701306, 2548100, 2761041, 4548425, 5998912, 5718762, 3322105, -94496, -2201991, -1658727, -128233, -746955, -4256625, -7812709, -8275099]
3005h275099K470594K559673Q03559j7304Q43693J678565J290429M78359J36027
2996A968496j94721p20146j64878K017294L656652K378973q99158l357709m178842
2987E05961m309530l299838n4881L417330L175741o89844l104445q70357K793888
2978b435975K931381n36714l471959l026112j34392K374596K439378M23011r83182
2969b419968K77751K541577K407370o3843j293403l5692O55481r06641j603854
2960d41222J137741M208077L158462q35100k741556r20113J553406K034087J017883
2951H171665r2093p74536q38762m05252l06835q33153q69241J57116Q83066L13648
2941E405623l56626k63461q49114k656415k784224Q42252M928690M761817J016611
$$ y = [-8275099, -5804505, -3244832, -2441273, -2458577, -1614884, 63681, 1354110, 1832469, 1968496, 1773775, 1053629, 888751, 2906045, 6562697, 8941670, 8042512, 4684803, 505961, -3803569, -7103407, -7158288, -3740958, -565217, -1255061, -4359506, -5229863, -2435975, 495406, -41308, -3513267, -6539379, -6673771, -4299175, -1859797, -1436786, -2419968, -2142217, 399360, 2806730, 2742887, 1449484, 1413792, 2069273, 1162632, -441222, 696519, 4904596, 8063058, 7227958, 4486402, 3566289, 5119695, 7153782, 8171665, 8079572, 7305036, 6466274, 6061022, 5754187, 4921034, 4051793, 4208909, 5091975, 5405623, 5048997, 4785536, 3936422, 1280007, -1504217, -661965, 4266725, 9028542, 10045153]
2932A0045153j773163k119523k188239k513484j320264R67131J521450j03376
2924B515685j421672j592989k074516k425623m11885K936331L545190R69716l13660
2915A726577J756744L354790J361373j426493j218871P54814J096453k16637j101417
2906F087333j453392k112642k099031o02673M43314n13049j147552J029098L480872
2897C112278J914680k484894m162924j358815J744544J735619K54843L809M79269
2888A238409M0447p49712m36304O64308J384845J763367K162602J724731j91217
2879G601476k138191k335975j461502j339503j425846N44964M129172N447565
2871I022160K394591j939418l425777k653082l351210n859179o023197j601416
$$ y = [10045153, 8271990, 6152467, 3964228, 1450744, 130480, 1097611, 2619061, 2515685, 1094013, -498976, -2573492, -4999115, -5411000, -2474669, 1070521, 2040237, 1726577, 3483321, 6838111, 8199484, 6772991, 5554120, 6308934, 7405387, 7188750, 6087333, 4633941, 2521299, 422268, -180405, 262909, -250140, -1397692, -368594, 3112278, 5026958, 2542064, -1620860, -2979675, -1235131, 500488, 755331, 759140, 1238409, 1278856, 529144, 92840, 757148, 2141993, 3905360, 6067962, 7792693, 7601476, 5463285, 3127310, 1665808, 326305, -1099541, -554577, 3574595, 9022160, 11416751, 9477333, 6051556, 3398474, 47264, -5811915, -11835112, -13436528]
2863a3436528L609061M436685J026836j901723j402974R23311K299959K224174
2855b221199J780388J432300P70234l55649j334545j265354J42266J858616K141478
2846B948535N27109j262199j308426Q7774J097293J003014P17121Q14661O12758
2837E237640m28413j582165j685408m63737J183976J805582N35400j789613l029077
2828b15815j949603L94607K089214K388038J563218j04442j902553k375826j096348
2819a209510J56037k84560j406390j229391p4621K77272j00480L85063J582282
2810a904298J698553P63492Q73064K361067K778794Q62310j226259j200735R7837
2801E103825N48308J1755k14045K9487l55189j760681l170669l317049j923913
$$ y = [-13436528, -9827467, -5390782, -4363946, -6265669, -7668643, -6745332, -4445373, -2221199, -440811, 991489, 1761723, 1406074, 71529, -1193825, -1051559, 807057, 2948535, 3475644, 2213445, 905019, 992793, 2090086, 3093100, 3810221, 4624882, 5237640, 4809227, 3227062, 1541654, 1077917, 2261893, 4067475, 4602875, 2813262, -215815, -2165418, -1770811, 318403, 2706441, 4269659, 4165217, 2262664, -113162, -1209510, -1053473, -1338033, -2744423, -3973814, -4048435, -3771163, -3871643, -3486580, -1904298, -205745, 557747, 1430811, 3791878, 6570672, 7432982, 6206723, 5005988, 5103825, 5652133, 5663888, 5449843, 5479330, 5124141, 3363460, 192791, -3124258, -5048171]
2792e048171j0222R38164N78973K95043J360828K874967K705401L52567k297141
2783A750409l034026j310566J392712K450885L84687k782667l121145j67698J645030
2774b792379o59786l554429k167554J855095K881896M30435l21606K619911M965300
2765C256883L557515J125697R14535J549317N63587j145697j941220k956393n261295
2756c37071o438932l805936R86489L869452L303560Q21455j536239k163162m37865
2747e738249J589651N53186l113001m424003p47490L823213M247134J547747J32933
2738b128879Q03010R41003j28422n57423J14245M94028L31907N54649P36533l61307
2728G99344k079379k429779j057693N91028J457858J368933M21482l91235N05945
$$ y = [-5048171, -5058393, -4120229, -3541256, -3246213, -1885385, 989582, 3694983, 4047550, 1750409, -1283617, -2594183, -1201471, 1249414, 1634101, -1148566, -4269711, -4437409, -2792379, -3452165, -7006594, -9174148, -7319053, -4437157, -4006722, -4328328, -1708417, 3256883, 6814398, 7940095, 8854630, 10403947, 10967534, 9821837, 7880617, 4924224, -337071, -6776003, -10581939, -9595450, -5725998, -2422438, -1600983, -3137222, -5300384, -5738249, -4148598, -3595412, -6708413, -11132416, -11879906, -8056693, -3809559, -2261812, -2128879, -1325869, -384866, -513288, -1070711, -956466, -462438, -130531, 424118, 1160651, 799344, -1280035, -3709814, -4767507, -4176479, -2718621, -1349688, -928206, -1319441, -813496]
2719h13496K588489K945818O14369j409042q21134M04194M6929k02742J440595
2710D793980K262410p43089m741945m645133r04667J831165K222362K500605K511840
2701E087528J7617l356405l087260O60491K657324J007322j74042J665158L172794
2692G650527J166544k030806k763719j590906j204351j808348j785649q44570
2684c211278P5554M26948j24425j772392l268106k552837K33782K451447K561467
2675e179840J825478J583384J225299l8315j474307j960464j258301L00150J907164
2666c069752K247825J092877K50773R68701J675319Q00088n6171Q42404J390053
2657F142117p81902k931600j120506K282676J874583j109999m63764L574032L671855
$$ y = [-813496, 1774993, 4720811, 5335180, 3926138, 3105004, 3509198, 3556127, 3353385, 4793980, 7056390, 6313301, 1571356, -3073777, -3978444, -2147279, 75083, 2575688, 5087528, 5105145, 1748740, -1338520, -678029, 1979295, 2986617, 2812575, 4477733, 7650527, 8817071, 6786265, 4022546, 2431640, 1227289, -581059, -2366708, -3211278, -3135724, -2708776, -2833201, -4605593, -7873699, -10426536, -10192754, -7741307, -5179840, -3354362, -1770978, -545679, -583994, -2058301, -4018765, -5277066, -4976916, -3069752, -821927, 270950, 521723, 1490424, 3165743, 3965831, 3909660, 4752064, 6142117, 5360215, 2428615, 1308109, 3590785, 5465368, 4355369, 3891605, 7465637, 11137492]
2648A1137492j884599n248930j758042K285432L29018l794529l148404P07416
2640a375146J462601j064854j917043o1781J045970L21352j22115J02505l99351
2631b007862r91688k12738N11857q31882k459102j581937K80015L9365q38217
2622h092189J131537M285883L676057m68093k664411q84983Q95395j59478j896491
2613d176773k030809j566514j397978j77040K227344L203970J596901k3251O15370
2604a728780K213264K511880J372007m60820k945132n299598n385464k415116
2596a2137759J482958L787837M138586L524341K642592J831108J123785N874j474534
2587D924788j758448J8399J567056M9715l266498m309225k137086J08056N98611
$$ y = [11137492, 9252893, 4003963, 2245921, 4531353, 4860371, 1065842, -2082562, -1375146, 87455, -977399, -2894442, -2956223, -1910253, -1588901, -1711016, -1608511, -2007862, -2999550, -3212288, -2700431, -3532313, -5991415, -7573352, -7293337, -7253972, -8092189, -6960652, -2674769, 1001288, 533195, -2131216, -3016199, -2120804, -2280282, -4176773, -6207582, -7774096, -9172074, -9349114, -7121770, -3917800, -2320899, -2344150, -1728780, 484484, 2996364, 4368371, 3907551, 962419, -4337179, -9722643, -12137759, -10654801, -6866964, -2728378, 795963, 3438555, 5269663, 6393448, 6399322, 4924788, 3166340, 3184739, 4751795, 4801510, 1535012, -2774213, -4911299, -4803243, -4204632]
2578d204632J117118K736363L238020J045464j553404j710474j10358O85739O3819
2569A307655p21388r28181o64913j8653O77108Q13383O83117J257428K125555
2560D531111J606907k94304j386641q64741q09341k490757l758791k357000L75073
2551e448484J700821J577413J695731J811727K68983k316899l062830r70279J431649
2542c312168J548532J766p75794m1555O65186K00415l30775P29210K674324K754172
2532D113313n4017l007987k748507L79273K898379K662958Q50179m42400o16764
2523D034427k30636K9773m62714j641548k005741j21672K830694L801063J696822
2514G930468j247228k537834k151222j469385j185104j234551j454256j406581
$$ y = [-4204632, -3087514, -351151, 2886869, 3932333, 2378929, 668455, 558097, 1243836, 1307655, 586267, -341914, -1006827, -1025480, -348372, 465011, 1148128, 2405556, 4531111, 6138018, 5843714, 4457073, 3592332, 2782991, 292234, -3466557, -5823557, -5448484, -3747663, -2170250, -474519, 1337208, 1606191, -710708, -3773538, -4743817, -3312168, -1763636, -1761870, -2537664, -2579219, -1914033, -1713618, -2044393, -1315183, 1359141, 4113313, 4059296, 1051309, -1697198, -1317925, 1580454, 4243412, 5093591, 4651191, 4034427, 3803791, 3833564, 3370850, 1729302, -276439, -398111, 2432583, 6233646, 7930468, 6683240, 4145406, 1994184, 524799, -660305, -1894856, -3349112, -4755693]
2506d755693o01168O03688J389774J862813K642925L161863K228910L23469q12620
2497F043961r99388j627324k619706k214182l82983N94743J1193j3416J372330
2488A65228J693738o88895l384960l492923j715988l51613L28508R11124N92040
2479e943741o98220l27777L126890O049157M135514q51873l290608j856170n04822
2470a61650j214787j059362J812358M005337J826619k712427m379770j703217
2462c586899J641414J983726k82524k105700j503032R12564L202794L872931K493788
2453F629062l43285k894183k880910J59846L293114K944577l42786k251647q09803
2444C503985O12167j445203m943868n338003k299251N01655J356158J926489K725537
$$ y = [-4755693, -5356861, -4753173, -3363399, -1500586, 1142339, 4304202, 6533112, 6856581, 6043961, 5044573, 3417249, 797543, -1416639, -1799622, -1204879, -1193686, -1207102, 165228, 1858966, 1170071, -2214889, -5707812, -7423800, -7775413, -7446905, -6535781, -5943741, -6641961, -6969738, -3842848, 2206309, 6341823, 5489950, 2199342, 343172, -161650, -1376437, -2435799, -623441, 3381896, 5208515, 2496088, -1883682, -3586899, -1945485, 38241, -244283, -2349983, -3853015, -2940451, 262343, 4135274, 6629062, 6285777, 3391594, 510684, 670530, 3963644, 6908221, 6565435, 4313788, 3503985, 4116152, 2670949, -2272919, -7610922, -9910173, -9408518, -8052360, -6125871, -3400334]
2435c400334J726086j263368k829411p27695K561216L344728J451778p52069k001078
2426a890147k368536j527841N76947K197098J295947j647661m032415m077018
2418a1473626k141802L49429K070158K398199J981306K152403K918024K516703
2410G70794J28949k153831j765177P41073K372510J536789n30177j880645j727265
2401b506980l69820J169107J561513O68413K57545J604947K974859J731471j398220
2392E692835k996571k094926j401497k390654k665903l85736J892178J074379
2384c275895j141582p74559K030986L448875K329698J520379K294176K127305
2376H559383k33235j810814l40314J447623J16227k683459k930633q87603l72452
$$ y = [-3400334, -1674248, -2937616, -5767027, -6494722, -3933506, -588778, 863000, 110931, -1890147, -4258683, -5786524, -5209577, -3012479, -1716532, -3364193, -7396608, -11473626, -13615428, -13265999, -11195841, -8797642, -6816336, -4663933, -1745909, 770794, 899743, -1254088, -3019265, -2278192, 94318, 1631107, 1100930, -779715, -2506980, -2876800, -1707693, -146180, 522233, 779778, 2384725, 5359584, 7091055, 5692835, 2696264, 601338, -800159, -3190813, -5856716, -6242452, -4350274, -3275895, -4417477, -5192036, -3161050, 287825, 2617523, 4137902, 6432078, 8559383, 8326148, 6515334, 6175020, 7622643, 7738870, 5055411, 2124778, 1237175, 864723]
2367H64723k146909k860590j050998M02327n65269j567902J05360K661590K298167
2358a859501j043008l492042k444393M61590J890290P63327j025891j223752J73576
2349g799804J350055J509182J930692L252764L381628M78561l115610l336505
2341b349037n56887O68211j228365k275765M03174L734739L817829K162100K348178
2332F724177L285670J194223l091423m458359j267801K315828K671972Q66061
2324H240348r03218k661340m397481m276392j780312L64758J20692n51858R06464
2315d938339L210207L259543R09696j364130k265766k127989p34332J964972L636245
2306A550107J637425k605678m663972l067518r23717o47985n52300J368830L362480
$$ y = [864723, -1282186, -4142776, -5193774, -4791447, -5356716, -6924618, -6819258, -4157668, -1859501, -2902509, -6394551, -8838944, -8377354, -6487064, -5723737, -6749628, -7973380, -7799804, -6449749, -4940567, -3009875, 242889, 3624517, 4103078, 987468, -2349037, -2905924, -2237713, -3466078, -5741843, -5338669, -1603930, 2213899, 4375999, 6724177, 10009847, 11204070, 8112647, 3654288, 2386487, 4702315, 7374287, 8240348, 7337130, 4675790, 278309, -3998083, -5778395, -5413637, -5292945, -5844803, -4938339, -1728132, 1531411, 2441107, 1076977, -1188789, -3316778, -4051110, -2086138, 1550107, 3187532, 581854, -4082118, -7149636, -8073353, -8721338, -9273638, -7904808, -4542328]
2297d542328K651460K47032l99977J272800K286100R02226r33783q47592O39558
2288A275496J406899P14968m94887j155929p66577N15275J502088P99510r80137
2279B816706j187313J214550L367841K046079j511023k982490r74093J237672
2271D027929O29384j554999k149896m19889J713995K505599J733875J6490j742227
2262D760261k633026k499165k021631j503847m55000R80783J433572K47194j113610
2253b804469r33065L92282J263444J334341J466382J757222J297479j07303j278825
2244B387488j015823N24843J839711J355050p90832k321791j340368P84728R40509
2235B363515j070972k092927q51776l14516k510828m318248k116248J908736K726170
$$ y = [-4542328, -1890868, -1643836, -2043813, -771013, 1515087, 2417313, 1483530, 635938, 1275496, 2682395, 3397363, 2902476, 1746547, 979970, 1495245, 2997333, 3796843, 2816706, 1629393, 2843943, 6211784, 8257863, 6746840, 3764350, 2790257, 4027929, 4657313, 3102314, 952418, 532529, 2246524, 4752123, 6485998, 6502488, 4760261, 2127235, -371930, -2393561, -3897408, -4352408, -3371625, -1938053, -1690859, -2804469, -3737534, -3345252, -2081808, -747467, 718915, 2476137, 3773616, 3666313, 2387488, 1371665, 1896508, 3736219, 5091269, 4300437, 1978646, 638278, 1423006, 2363515, 1292543, -800384, -1652160, -1966676, -4477504, -8795752, -10912000, -9003264, -6277094]
2226f277094K05778j152840K87193J348460J61937q41506L74374K240908L068573
2217e84217L672660M229101K446978k206060n894219n329897k448435q58976l92636
2208g365701R94937K318958J149739j270406j206050J571414L272940J923165
2200A388996k33855r80366j106849j717882j748495j88128J572130J748469Q68030
2191c97950M79018M41710m38587j848814k119020q59078L05935P5548p40773n44210
2181e646221P52610J719634J430823N01795m7393n414M66580J479158K597111
2172C248683K296300r4866k414446j795335J100252K408785M42204j827430j335265
2163B028882M08750j29388k898533m439735l160721j228931p49442q61456J28212
$$ y = [-6277094, -6071316, -7224156, -6936963, -5588503, -5426566, -6268072, -5893698, -3652790, -584217, 3088443, 7317544, 9764522, 7558462, 1664243, -3665654, -6114089, -6973065, -7365701, -6370764, -4051806, -2902067, -4172473, -5378523, -3807109, -534169, 1388996, 1155141, 174775, -932074, -2649956, -4398451, -4586579, -3014449, -1265980, -397950, 81068, 522778, 84191, -1764623, -3883643, -4742721, -4436786, -4361238, -5102011, -5646221, -4893611, -3173977, -1743154, -1241359, -1288752, -1294166, -827586, 651572, 3248683, 5544983, 5450117, 3035671, 1240336, 2340588, 4749373, 5191577, 3364147, 2028882, 2437632, 2308244, -590289, -5030024, -8190745, -9419676, -10169118, -11030574, -10902362]
2154a0902362J780089K331338J388251L66939N77321J729835K315566J228020
2146H14997q67887j962899r01217J197898K361165K152421J679588J569030J177095
2137G220191j62626k200156m159929n111114m043125q04699K868448M479694L347528
2128A434212J159489k72585p99170j169907j571635j575791q78029M13939J793110
2119a466367K466386J989351Q77039J2762n04808j220197k126700k505273k004574
2110d482381j029587J359R46615J468533J157727K22356o55759j025831n83774
2101c980742R75737K901605L053738N00712k154351j521459J557990K610386j78542
2092C765074l303426l145308j020908n19603j878159k155298j20465K051570K090489
$$ y = [-10902362, -9122273, -6790935, -5402684, -5035745, -4458424, -2728589, -413023, 814997, -52890, -2015789, -2917006, -1719108, 642057, 2794478, 4474066, 6043096, 7220191, 7057565, 4857409, 697480, -4413634, -8456759, -9261458, -6393010, -1913316, 1434212, 2593701, 2321116, 1521946, 352039, -1219596, -2795387, -3673416, -3259477, -1466367, 1000019, 2989370, 3866409, 3879171, 3374363, 2154166, 27466, -2477807, -4482381, -5511968, -5510609, -4563994, -3095461, -1937734, -1715378, -2371137, -3396968, -3980742, -3005005, -103400, 2950338, 3451050, 1296699, -224760, 1333230, 3943616, 3765074, 461648, -2683660, -3704568, -4224171, -6102330, -8257628, -8378093, -6326523, -4236034]
2083d236034L71572j115482j017257M78478J877772J481400p81233k815818k623930
2074h380532p09539Q41060J135574R65033R38127P18560J17380m07047m65145
2065e246529M337R59029J765990J079364j444935l878433m040628k281781n64995
2056a3648581N22061J652033K318092J420136K19331J377207M309165M884531
2048C053975J283294l001758m093860k718133j604242o51800J724148M288870
2040a719506M126508J431312o04418o49688m96489j161138j233515j06972L49191
2031f4715j043543k502638j987708j15106J433338K575701L867085M321820K501515
2022H985749q67218l290442l304323j557265M81757J636741J278443k24613j458085
$$ y = [-4236034, -3864462, -4979944, -5997201, -5518723, -3640951, -2159551, -2940784, -5756602, -8380532, -9090071, -8249011, -7113437, -6148404, -5210277, -4491717, -4374337, -4781384, -5246529, -5242192, -4283163, -2517173, -1437809, -2882744, -6761177, -10801805, -13083586, -13648581, -13126520, -11474487, -9156395, -7736259, -7516928, -6139721, -1830556, 3053975, 4337269, 1335511, -2758349, -5476482, -7080724, -7732524, -6008376, -1719506, 2407002, 3838314, 3233896, 2584208, 2087719, 926581, -306934, -413906, -64715, -1108258, -3610896, -5598604, -5713710, -4280372, -1704671, 2162414, 6484234, 8985749, 8118531, 4828089, 1523766, -33499, 448258, 2084999, 3363442, 3138829, 1680744]
2013A680744j331933l00760M35760L79388l27008j505409k430150j669633J080059
2004c988942L695902L797556J756376j15036q93726j519486k119629j375815P28280
1995c4520J871721O11190j075059l28681K501972M209053K757434o86360l617231
1986F209519m510003l190680n53172J501961J313371l73755o93875J646672M098020
1977E448058L470978N56476r73559j48370j8044k285844l979294k194649N46283
1968D22035k53651l687330m306422m16851L412297L516700K049934K087057K176864
1959E000633k14186l125058k831249j87388P69618m55739o15102Q95226P63662
1950D17j972659l360602o05705L258734L739289R54355j701471k609719k421331
$$ y = [1680744, 348811, 48051, 483811, 863199, 536191, -969218, -3399368, -5069001, -3988942, -293040, 3504516, 5260892, 5145856, 4252130, 2732644, 613015, -762800, -34520, 1837201, 2448391, 1373332, 1044651, 3546623, 7755676, 10513110, 9826750, 6209519, 1699516, -1491164, -2044336, -542375, 770996, 397241, -296634, 1350038, 5448058, 8919036, 9475512, 8501953, 8353583, 8335539, 6049695, 2070401, -124248, 422035, 168384, -3518946, -7825368, -8242219, -4829922, -1313222, 736712, 2823769, 5000633, 4786447, 1661389, -1169860, -1357248, -587630, -1043369, -1658471, -763245, 417, -1972242, -5332844, -5938549, -2679815, 1059474, 2013829, 312358, -2297361, -4718692]
1941d718692j240904J156654L013222J846539j661145l655725j848552J579449
1933e529154K878060J343325k35171N90272K814619L358744J099632j668986k280232
1924B371109j015527j54738n95537j186014j031827n12386K5495O90873J008653
1915c99899L73469k82725O00122K355417K569425R64408P9336J047170J577376
1906H884099j74397k444629k776706j733178j167739q42382L51214J379586L99609
1897A875477j801217k606978j311128N13515J861179K879460K940602R23031k288383
1888B985558l988764k963627q16368M40209M85274N712n07659o75403j27653Q81492
1878d281229J430672Q66141m82736j428528p54589J393062K961690K153455K54990
$$ y = [-4718692, -5959596, -4802942, -1789720, 56819, -1604326, -5260051, -7108603, -5529154, -2651094, -1307769, -1542940, -952668, 1861951, 5220695, 6320327, 4651341, 2371109, 1355582, 1200844, 605307, -580707, -1612534, -2124920, -2099425, -1408552, -399899, -26430, -309155, 290967, 2646384, 5215809, 6180217, 6259553, 7306723, 8884099, 8709702, 6265073, 3488367, 1755189, 587450, -254932, 96282, 1475868, 1875477, 74260, -2532718, -3843846, -3330331, -1469152, 1410308, 4350910, 5273941, 2985558, -1003206, -3966833, -4783201, -4342992, -3857718, -3852006, -4359665, -5035068, -5162721, -4281229, -2850557, -1984416, -2467152, -3895680, -4650269, -3257207, -295517, 1857938, 2112928]
1869B112928K90752K279164K538231p54967m201976l930765j176777J33735o53209
1860c362884j112740m42465M7797K96756J321846K178768J137221l99709N31435
1851A96025K920505K559090q84170k521217K20066L371213K460874j143103l160864
1842D018419k525735j137020N8311J190907J396330M155j307469n25813J409127
1833B581212K045442J277829R50755J256143O04963r06596r81985J020703K249181
1824A0097647K7304m126761n979902l632678M15566K496933J931489J058223J673062
1815C960883K854953K719534J016043j035418k477953k920792k039043l56686
1807A721521K91510r88064k099537m95656K590213L187718J25312l257679l742694
$$ y = [2112928, 2403680, 4682844, 7221075, 6466108, 2264132, -1666633, -2843410, -2709675, -3362884, -4475624, -4918089, -4870292, -4573536, -3251690, -1072922, 64299, -335410, 196025, 3116530, 5675620, 4791450, 2270233, 2490299, 5861512, 8322386, 7179283, 4018419, 1492684, 355664, 413975, 1604882, 3001212, 3005367, 1697898, 1172085, 2581212, 4626654, 5904483, 6855238, 8111381, 8716344, 7809748, 6827763, 7848466, 10097647, 10124951, 5998190, 18288, -3614390, -3198824, -701891, 1229598, 2287821, 3960883, 6815836, 9535370, 10551413, 9515995, 7038042, 4117250, 2078207, 1721521, 2013031, 1024967, -1074570, -1570226, 1019987, 4207705, 4333017, 1075338, -2667356]
1798b667356j946237j73537R75211K048076K649186J965376M30924p05169r23290
1789A653184o11279l26923m49632q53070p17716M27575J631189J752720J357132
1780C863180J607748J810012N09235j306225j192635M00990K91032k104921l284897
1771E93519j121892J688101J867908K14394n31712Q5800P72357J117350J186406
1762E872231L37825j286356j906585p96437J57670m24779j008881n3212J060511
1753A951987M88471r61293j657878j708823j251188R10252M004384L926238q88987
1744D813163n270032l766967J172546K839848K03587j760621p62083J34454j038441
1735c434546k029663j233296m97096j004529p78902J319077K814684J407881j325699
$$ y = [-2667356, -4613593, -4787130, -3811919, -1763843, 885343, 2850719, 3281643, 2576474, 1653184, 1041905, 714982, 265350, -587720, -1305436, -877861, 753328, 2506048, 3863180, 5470928, 7280940, 7790175, 6483950, 5291315, 5692305, 5983337, 3878416, 593519, -528373, 1159728, 3027636, 3242030, 2710318, 2796118, 3568475, 4685825, 5872231, 6210056, 4923700, 3017115, 2220678, 2378348, 1953569, 944688, 891476, 1951987, 2440458, 1479165, -178713, -1887536, -3138724, -2228472, 1775912, 5702150, 4813163, -456869, -4223836, -3051290, -211442, -7855, -1768476, -2530559, -2396105, -3434546, -5464209, -6697505, -7194601, -8199130, -8978032, -7658955, -4844271, -3436390, -4762089]
1726d762089k363590j139933Q11057K064354J677723n66088k906872k597308N57537
1717i225209L503238L792547K141867K64895j418078k566798j838808R79650L439213
1708i27483L041696M44317j456452r35195J156182K733814K393542M78719j288818
1699E640322j627613j056197q36377j076484r24168r2330J001634J959807K079015
1690E067609M21074k237344l004879o14827J930483J164979j820109l326800k599426
1681e019240j604687m96563K036530M383705L120058r85116l070071j394710L85058
1672b645036l52717j387392m47989Q25870N32601J06303J231042K573084K492452
1663B928218J903503J754488P87963j525711k989621k301699j448215j816381
$$ y = [-4762089, -7125679, -8265612, -7454555, -5390201, -3712478, -4278566, -7185438, -9782746, -9225209, -5721971, -1929424, 212443, 477338, -940740, -3507538, -5346346, -4366696, -927483, 2114213, 2558530, 1102078, 166883, 1323065, 4056879, 6450421, 6929140, 5640322, 4012709, 2956512, 2120135, 1043651, 119483, 27153, 1028787, 2988594, 5067609, 5488683, 3251339, 246460, -368367, 1562116, 2727095, 906986, -2419814, -5019240, -6623927, -7120490, -5083960, -700255, 2419803, 1434687, -1635384, -3030094, -2645036, -2997753, -4385145, -4833134, -4007264, -3474663, -3368360, -2137318, 435766, 2928218, 4831721, 6586209, 7374172, 5848461, 2858840, 557141, -891074, -2707455]
1655b707455j487871O04766J728940K18839o64964J770909L986691J430505l488719
1646A391641m615155j313925J564232J862537K011307K844379J703626k014838
1638C433804m615157l381353j85090J875418K280784J907384R31558m47881j276526
1629E22941j061147k60561P61614J714868J626510P4615j394793j351911j118256
1620d86120k515097l939100k259394J832325M289188L585829K107498J240210
1612C855339o05707l802507n426463l447923J49392K387516K773458K192671J057930
1603h66294J64990P67715K256081K295306N32498p05669n78162j066668k539319
1594B60478k062587J271194L425859J378070j753263j844963o10207j956073m186328
$$ y = [-2707455, -4195326, -3590560, -1861620, -1642781, -2307745, -536836, 3449855, 4880360, 1391641, -3223514, -4537439, -2973207, -1110670, 900637, 3745016, 5448642, 3433804, -1181353, -4562706, -4747796, -2872378, -591594, 1315790, 2247348, 1799467, 522941, -538206, -798767, -37153, 1677715, 3304225, 3378840, 1984047, 632136, -486120, -3001217, -6940317, -9199711, -7367386, -3078198, 507631, 2615129, 3855339, 3249632, -552875, -5979338, -9427261, -9277869, -6890353, -4116895, -1924224, -866294, -701304, 66411, 2322492, 4617798, 5150296, 4444627, 3866465, 2799797, 260478, -1802109, -530915, 2894944, 4273014, 2519751, 674788, 64581, -1891492, -6077820]
1585f077820k347905K697272M441706P35054k822014j665159J273400J303171
1577b462295n27930j71162K288562L061459P90134j999338l112955k783912j630253
1568f547690K65985J902351J792572M53646N0116J015080J457283O34626L79627
1559A403596J758148K795243J489445q63391j665564r55464q85169k047263k772637
1550a743056j947269m68478K95040J019p42334q18846N90468K473756K255960
1541a03740o71909k942464j311251K261253L041506O21438n58956J554474L359379
1532E249730J656416j076129q13602J578118K007433m10949k493049j999474k22517
1523C475977N03869n67455k521454l533630k083345R37748K199740n5735l083886
$$ y = [-6077820, -8425725, -5728453, -1286747, -551693, -3373707, -5038866, -3765466, -2462295, -2990225, -3161387, -872825, 2188634, 2978768, 979430, -2133525, -4917437, -6547690, -6281705, -4379354, -2586782, -2133136, -2083020, -1067940, 389343, 1023969, 1403596, 3161744, 5956987, 7446432, 6583041, 4917477, 3962013, 3076844, 1029581, -1743056, -3690325, -4158803, -3863763, -3862744, -4605078, -5423924, -4833456, -2359700, -103740, -775649, -3718113, -5029364, -2768111, 273395, 894833, 335877, 1890351, 5249730, 6906146, 5830017, 5016415, 6594533, 8601966, 8191017, 5697968, 3698494, 3475977, 3979846, 3412391, 890937, -2642693, -4726038, -3788290, -1588550, -1644285, -4728171]
1514d728171l094412n36328J012409M33396M4837J079361J907126J573982J588236
$$ y = [-4728171, -7822583, -8358911, -7346502, -6913106, -6868269, -5788908, -3881782, -2307800, -719564]
$$ [...]
##END NTUPLES=NMR SPECTRUM
##END=
