##TITLE=31Pdec_DE-91_4_oil_TFA
 CDCl3, 64 sc
 18.4.2025
##JCAMPDX= 6.0         $$ Bruker NMR JCAMP-DX V2.0
##DATA TYPE= NMR SPECTRUM
##DATA CLASS= NTUPLES
##ORIGIN= UXNMR, Bruker Analytische Messtechnik GmbH
##OWNER= root
$$ XWIN-NMR		Version 3.5
$$ Fri Apr 18 16:14:43 2025 Russian Standard Time (UT+4h)  she@DPX200
##.OBSERVE FREQUENCY= 81.013821
##.OBSERVE NUCLEUS= ^31P
##.ACQUISITION MODE= SIMULTANEOUS
##.ACQUISITION SCHEME= undefined
##.AVERAGES= 64
##.DIGITISER RES= 17
##SPECTROMETER/DATA SYSTEM= spect
##.PULSE SEQUENCE= zgpg30
##.SOLVENT NAME= CDCl3
##.SHIFT REFERENCE= (INTERNAL, CDCl3, 0, 198.062)
##AUDIT TRAIL= $$ (NUMBER, WHEN, WHO, WHERE, WHAT)
$$ ##TITLE= Audit trail, XWIN-NMR		Version 3.5
$$ ##JCAMPDX= 5.01
$$ ##ORIGIN= Bruker BioSpin GmbH
$$ ##OWNER= she
$$ F:/spectra/data/she/nmr/P31/2/pdata/1/auditp.txt
$$ ##AUDIT TRAIL=  $$ (NUMBER, WHEN, WHO, WHERE, WHAT)
(   1,<2025-04-18 16:10:20.09 +0400>,<she>,<DPX200>,
      <created by zg, POWCHK disabled, PULCHK disabled
       configuration hash MD5:
       00 E9 B6 7A A2 85 ED C7 34 08 36 98 17 FE 4E 26
       data hash MD5: 32K
       D8 E0 A3 D7 79 AD DB 9D 23 9A 8D 2D 33 21 44 78>)
(   2,<2025-04-18 16:13:21.48 +0400>,<she>,<DPX200>,
      <Start of raw data processing
       efp BC_mod = 2 LB = 1.5 FT_mod = 6 PKNL = 1 PHC0 = 1249.73 PHC1 = 522.2943 SI = 64K 
       data hash MD5: 64K
       3A 3D 76 EE 38 BD B3 0F FD E7 57 92 55 C0 C6 84>)
(   3,<2025-04-18 16:13:56.70 +0400>,<she>,<DPX200>,
      <pk PHC0 = 190.9845 PHC1 = -575.5992 
       data hash MD5: 64K
       64 22 2F EC 16 F4 4E 6E C2 95 B0 25 E7 45 E5 06>)
(   4,<2025-04-18 16:14:04.07 +0400>,<she>,<DPX200>,
      <abs ABSG = 5 
       data hash MD5: 64K
       1D C3 64 9F 81 C6 04 A4 2B 84 AF 9A 16 10 8D C7>)
$$ ##END=
$$ 
$$ hash MD5
$$ AC FF 7A 4B F2 EC 5A 79 A0 1D BC 7E B0 E0 09 3F
##$RELAX= 
##$RELAX= 
##$RELAX= 
##$RELAX= 
##$RELAX= 
##$RELAX= 
##$RELAX= 
##$RELAX= 
$$ Bruker specific parameters
$$ --------------------------
##$DU= <F:/spectra>
##$EXPNO= 2
##$NAME= <P31>
##$PROCNO= 1
##$TYPE= <nmr>
##$USER= <she>
##$AMP= (0..31)
100 100 100 100 100 100 100 100 100 100 100 100 100 100 100 100 100 100 
100 100 100 100 100 100 100 100 100 100 100 100 100 100 
##$AQSEQ= 0
##$AQ_mod= 1
##$AUNM= <au_zg>
##$AUTOPOS= <>
##$BF1= 81.014009
##$BF2= 200.13
##$BF3= 200.13
##$BF4= 200.13
##$BF5= 200.13
##$BF6= 200.13
##$BF7= 200.13
##$BF8= 200.13
##$BYTORDA= 1
##$CFDGTYP= 0
##$CFRGTYP= 5
##$CHEMSTR= <none>
##$CNST= (0..31)
1 1 145 1 1 1 1 1 1 1 1 1 1 1 1 1 1 1 1 1 1 1 1 1 1 1 1 1 1 1 1 1 
##$CPDPRG= <waltz16>
##$CPDPRG1= <>
##$CPDPRG2= <waltz16>
##$CPDPRG3= <>
##$CPDPRG4= <mlev>
##$CPDPRG5= <mlev>
##$CPDPRG6= <mlev>
##$CPDPRG7= <mlev>
##$CPDPRG8= <mlev>
##$CPDPRGB= <>
##$CPDPRGT= <>
##$D= (0..31)
0 1 0 0 0 0 0 0 0 0.06 0 0.03 2e-05 3e-06 0 0 0.0002 0 0 0 0 0 0 0 0 0 
0 0 0 0 0 0 
##$DATE= 1744978219
##$DBL= (0..7)
120 120 120 11 120 120 24 19 
##$DBP= (0..7)
150 150 150 150 150 150 150 150 
##$DBP07= 0
##$DBPNAM0= <>
##$DBPNAM1= <>
$$ [...]
##$SUBNAM3= <"">
##$SUBNAM4= <"">
##$SUBNAM5= <"">
##$SUBNAM6= <"">
##$SUBNAM7= <"">
##$SUBNAM8= <"">
##$SUBNAM9= <"">
##$SW= 400.765351723535
##$SWIBOX= (0..15)
0 1 3 0 0 0 0 0 0 0 0 0 0 0 0 0 
##$SW_h= 32467.5324675325
##$TD= 32768
##$TD0= 1
##$TE= 0
##$TE2= 300
##$TE3= 300
##$TEG= 300
##$TL= (0..7)
0 120 53 12 22 120 120 120 
##$TP= (0..7)
150 150 150 150 150 150 150 150 
##$TP07= 0
##$TPNAME0= <>
##$TPNAME1= <>
##$TPNAME2= <>
##$TPNAME3= <>
##$TPNAME4= <>
##$TPNAME5= <>
##$TPNAME6= <>
##$TPNAME7= <>
##$TPOAL= (0..7)
0.5 0.5 0.5 0.5 0.5 0.5 0.5 0.5 
##$TPOFFS= (0..7)
0 0 0 0 0 0 0 0 
##$TUNHIN= 0
##$TUNHOUT= 0
##$TUNXOUT= 0
##$USERA1= <user>
##$USERA2= <user>
##$USERA3= <user>
##$USERA4= <user>
##$USERA5= <user>
##$V9= 5
##$VALIST= <valist>
##$VCLIST= <CCCCCCCCCCCCCCC>
##$VD= 0
##$VDLIST= <DDDDDDDDDDDDDDD>
##$VPLIST= <PPPPPPPPPPPPPPP>
##$VTLIST= <TTTTTTTTTTTTTTT>
##$WBST= 1024
##$WBSW= 4
##$XGAIN= (0..3)
0 0 0 0 
##$XL= 0
##$YL= 0
##$YMAX_a= 5352
##$YMIN_a= -25029
##$ZGOPTNS= <>
##$ZL1= 120
##$ZL2= 120
##$ZL3= 120
##$ZL4= 120
##$ABSF1= 198.0616
##$ABSF2= -202.7028
##$ABSG= 5
##$ABSL= 3
##$ALPHA= 0
##$AQORDER= 0
##$ASSFAC= 0
##$ASSFACI= 0
##$ASSFACX= 0
##$ASSWID= 0
##$AUNMP= <proc_1d>
##$AZFE= 0.1
##$AZFW= 0.5
##$BCFW= 0
##$BC_mod= 2
##$BYTORDP= 0
##$COROFFS= 0
##$CY= -3
##$DATMOD= 1
##$DC= 0
##$DFILT= <>
##$DTYPP= 0
##$F1P= 0
##$F2P= 0
##$FCOR= 1
##$FTSIZE= 65536
##$FT_mod= 6
##$GAMMA= 0
##$GB= 0
##$INTBC= 1
##$INTSCL= 9.790993e-09
##$ISEN= 30
##$LB= 1.5
##$LEV0= 0
##$LPBIN= 0
##$MAXI= 10000
##$MC2= 0
##$MEAN= 0
##$ME_mod= 0
##$MI= 50
##$NCOEF= 0
##$NC_proc= -9
##$NLEV= 6
##$NOISF1= 182.463
##$NOISF2= 159.3651
##$NSP= 0
##$NTH_PI= 0
##$NZP= 0
##$OFFSET= 198.0616
##$PC= 4
##$PHC0= 1440.714
##$PHC1= -53.30487
##$PH_mod= 1
##$PKNL= yes
##$PPARMOD= 0
##$PSCAL= 0
##$PSIGN= 0
##$REVERSE= no
##$SF= 81.0140089999434
##$SI= 65536
##$SIGF1= 159.3651
##$SIGF2= -187.1042
##$SINO= 113.3802
##$SIOLD= 16384
##$SREGLST= <1H.CDCl3>
##$SSB= 0
##$STSI= 65536
##$STSR= 0
##$SW_p= 32467.5324675325
##$SYMM= 0
##$S_DEV= 0
##$TDeff= 32768
##$TDoff= 0
##$TI= <>
##$TILT= no
##$TM1= 0
##$TM2= 0
##$TOPLEV= 0
##$USERP1= <user>
##$USERP2= <user>
##$USERP3= <user>
##$USERP4= <user>
##$USERP5= <user>
##$WDW= 1
##$XDIM= 65536
##$YMAX_p= 558399614
##$YMIN_p= -106847584
$$ End of Bruker specific parameters
$$ ---------------------------------
##NTUPLES= NMR SPECTRUM
##VAR_NAME=  FREQUENCY,     SPECTRUM/REAL,   SPECTRUM/IMAG
##SYMBOL=    X,             R,               I
##VAR_TYPE=  INDEPENDENT,   DEPENDENT,       DEPENDENT
##VAR_FORM=  AFFN,          ASDF,            ASDF
##VAR_DIM=   65536,         65536,           65536
##UNITS=     HZ,            ARBITRARY UNITS, ARBITRARY UNITS
##FACTOR=    0.49542278885378, 1,            1
##FIRST=     16045.7642231865, 0,            0
##LAST=      -16421.768244346, 0,            0
##MIN=       -16421.768244346, -106847584,   0
##MAX=       16045.7642231865, 558399614,    0
$$ Real data points
##PAGE= N=1
##DATA TABLE= (X++(R..R)), XYDATA
$$ [...]
7388B026897j0243044j1195625l581183M498289N594918J093490k124528n37987
7380a4468773K879154L787864K106582Q31624Q59878J28139k069647l327095j927614
7371a1199888O55474K681995M511991O177496N933552L589146J787971J311627
7363A5449364q66697n485685p569382l841833Q21817K71220l423163m129600j998281
7354a0772240j823924l361333j846640K634261M757179L132997J841215K170131
7346c268354P98940k552258l422659l37556K865953L899172M132053K990756j603264
7337C502783n984076l173869N047438Q082319J945659m902264n261860k534812
7329c278682j079190J949893P687591Q829517J313011o057534m094015K224897
$$ plain form
7388 2026897 -8216147 -19411772 -22992955 -18494666 -12899748 -11806258 -13930786 -14468773
7380 -14468773 -11589619 -7801755 -5695173 -4863549 -4003671 -3875532 -5945179 -9272274 -11199888
7371 -11199888 -10544414 -7862419 -3350428 2827068 8760620 12349766 14137737 15449364
7363 15449364 14582667 9096982 1527600 -2314233 -1492416 -1221196 -4644359 -8773959 -10772240
7354 -10772240 -12596164 -15957497 -17804137 -15169876 -10412697 -7279700 -5438485 -3268354
7346 -3268354 -2469414 -5021672 -8444331 -8781887 -5915934 -2016762 2115291 5106047 3502783
7337 3502783 -2481293 -5655162 -607724 7474595 9420254 4517990 -743870 -3278682
7329 -3278682 -4357872 -2407979 5279612 14109129 15422140 9364606 5270591 7495488
7321G495488K718838j293055j482187J700191R36202l557931m671083j778236
7313F8227q85094k163358Q2891M680933L487355m090370q526560n183063n02406
7304a3031445O95489K887082R187750J3137917Q524328j67550m446525l254555
7296A3532491j169170n8990J071497J551602J71824j509703j279204M26752K169003
7287A4906102L648615L983322J438773k866488m889141l449779j918725k265401
7279H587278k366600j261538j322112k573425j256319K510343K627740k698867
7271B246500n788741j079534M752912K559886m542312n887561J5848L509299j272240
7262e485943q185450q315748j518763M357740K971428l530930o393289j04432
$$ plain form
7321 7495488 10214326 8921271 7439084 9139275 10075477 6517546 1846463 68227
7313 68227 -816867 -2980225 -2897334 1783599 5270954 1180584 -7345976 -12529039 -13031445
7304 -13031445 -12335956 -9448874 -261124 12876793 21401121 21233571 16787046 13532491
7296 13532491 12363321 12304331 13375828 14927430 15099254 13589551 12310347 12737099 14906102
7287 14906102 18554717 22538039 23976812 21110324 16221183 12771404 10852679 8587278
7279 8587278 6220678 4959140 3637028 1063603 -192716 2317627 4945367 2246500
7271 2246500 -3542241 -4621775 131137 2691023 -1851289 -7738850 -7723002 -4213703 -5485943
7262 -5485943 -13671393 -21987141 -23505904 -19148164 -16176736 -19707666 -26100955 -26205387
7254b6205387R430168J0613473J793676m996454n47116P972819P858102j55120
7246E764161m374412r53470J777716j373272m374310j245547M038204M708475
7238C967545J319714j353935k394925l700519m482347k588545P33766K299598
7230f199648K070920K734995M738783N166387J979171k722174m516959j419692
7222A831783L411861M662897J318093j735264o67750J215404j478239o974297
7214A584488q072578k981583K130997K842334K090787L153581L427974l0352l890276
7205B55372l278728K54389J311693r79657k764975k382034j998334k411585j228013
7196a3221872K503352N504052M100795r06751m725131l616504R50883L723727
$$ plain form
7254 -26205387 -16775219 -6161746 -4368070 -9364524 -9911640 -1938821 5919281 5764161
7246 5764161 1389749 436279 2213995 840723 -3533587 -4779134 -740930 3967545
7238 3967545 5287259 3933324 1538399 -2162120 -6644467 -9233012 -8499246 -6199648
7230 -6199648 -4128728 -1393733 3345050 8511437 10490608 7768434 3251475 1831783
7222 1831783 5243644 9906541 11224634 9489370 8821620 10037024 8558785 1584488
7214 1584488 -6488090 -9469673 -7338676 -4496342 -2405555 748026 4176000 4145648 255372
7205 255372 -3023356 -2768967 -1457274 -2436931 -5201906 -7583940 -9582274 -11993859 -13221872
7196 -13221872 -10718520 -5214468 -1113673 -2020424 -6745555 -10362059 -9411176 -5687449
7188e687449J990893p12775K53058L040957J762050l171793l752073L476637J0503856
7179G703361Q693884J201946k698021j728599k302625n997401o957680k765603
7171d850738R19221m26190l567664l871609k173935j017087O89998M247170O488308
7162c562526L948561q98923k660672p01173P88703m70565k218147j674661J164177
7153f285226M513860O558517N989055K700430j768966n370943o595155m169101
7145d427529K029402Q439044R079405K274693n824831p621993k597144L503027
7137D854074O253623N516318K181385l201792q252829r543225o779603l086166
7129a2058215m41996J941368M167701M395736K318930L54991j73024n60334q37993
$$ plain form
7188 -5687449 -3696556 -4409331 -4156273 -1115316 646734 -2525059 -6277132 -2800495 7703361
7179 7703361 16397245 17599191 14901170 13172571 10869946 4872545 -2085135 -4850738
7171 -4850738 -3931517 -4357707 -7925371 -11796980 -13970915 -14988002 -14298004 -10050834 -3562526
7162 -3562526 386035 -512888 -3173560 -3874733 -3086030 -3556595 -5774742 -7449403 -6285226
7153 -6285226 -1771366 4787151 10776206 13476636 11707670 6336727 -258428 -4427529
7145 -4427529 -2398127 6040917 15120322 17395015 11570184 3948191 1351047 4854074
7137 4854074 11107697 16624015 18805400 15603608 7350779 -2192446 -8972049 -12058215
7129 -12058215 -12500211 -10558843 -6391142 -1995406 323524 678515 505491 -54843 -892836
7120h92836J534288O424342Q465786L706588m010193p535904n294618j570441
7112H27012K98145M25695p88289l310142m895315k539980K599282N689142M612660
7103B918210K204656J129435M60392j078052k335193k460941l019518m770621
7095f951632n304284k755649O83561K000679J849259K532342L435426K167028
7087b343270q67564k645231j885796j71336J078746J998843K687602K599500J559194
7078B010688l15675l047228n449619m790034l45800M024504L927906J25179k847125
7069f707204k694819p76510J197354K044157L5911m435787o258316j198383O412905
7060a2380692P866596K190477k833732k765407j691316k803330k466697J404813
$$ plain form
7120 -892836 641452 7065794 15531580 19238168 15227975 7692071 2397453 827012
7112 827012 1125157 1550852 762563 -2547579 -7442894 -9982874 -7383592 -1694450 2918210
7103 2918210 5122866 6252301 6712693 5634641 3299448 838507 -2181011 -6951632
7095 -6951632 -12255916 -15011565 -14328004 -12327325 -10478066 -7945724 -4510298 -2343270
7087 -2343270 -3210834 -5856065 -7741861 -7913197 -6834451 -4835608 -2148006 451494 2010688
7078 2010688 1695013 -1352215 -6801834 -11591868 -11937668 -7913164 -3985258 -3860079 -6707204
7069 -6707204 -9402023 -10178533 -8981179 -6937022 -6901111 -11336898 -17595214 -18793597 -12380692
7060 -12380692 -4514096 -2323619 -5157351 -7922758 -9614074 -12417404 -14884101 -13479288
7052a3479288L279849o40258l983190L14833P591579Q169212K503032q53667O1775
7043B963877o01968l547632k359425L111479L225217o123613j4568791j1111806
7035b9012662M49815Q007676P684151N339895M827345L578736l49843m044873
7027c519760m234804j598932Q83586J216079n88556k853563l562798k453289r11658
7018a7623695P89951L743591O751068N984930Q28916l523268k741423P74800K661689
7009b353441L460880N412824N888623J090388n655662p121762l277862j170569
7001c726581k973783k744752K249622N607428K261975k543626j612118K635815
6993h46020L042049J48993N23854M357584M563635o87284m011825j074583J626759
$$ plain form
7052 -13479288 -10199439 -10839697 -14822887 -14508054 -6916475 1252737 3755769 2902102 2963877
7043 2963877 2361909 -1185723 -3545148 -433669 2791548 -3332065 -17900856 -29012662
7035 -29012662 -28562847 -20555171 -12871020 -7531125 -2703780 874956 525113 -3519760
7027 -3519760 -7754564 -9353496 -8469910 -7253831 -7842387 -10695950 -14258748 -16712037 -17623695
7018 -17623695 -16833744 -13090153 -6339085 -354155 474761 -3048507 -5789930 -5015130 -2353441
7009 -2353441 1107439 6520263 12408886 13499274 7843612 721850 -2556012 -3726581
7001 -3726581 -6700364 -9445116 -7195494 -1588066 673909 -1869717 -3481835 -846020
6993 -846020 2196029 2345022 2868876 7226460 11790095 11102811 7090986 6016403 7643162
6984G643162k605856q918031q134543j716553L28625m213207n727172J877616
6976b1465959J0755630J0318554K503420k050122N45364M316140M554571L401847
6968A2879445L061723J367477k548098m552650j847796J851523J995001J07077
6960A2313702L89927K692653L605031K006481q30360m095670o169325l709841
6952F202598K815992O005950M95405p483739p208415J236337P325670N897840
6944A5287638L302561N349706Q136503N750134k24283m946738q350746j2200659
6936A2104116j3359298p508464K232797P303064M405537j084060l076039j729279
6928g11626j003035k403217l369679j043501L634875O332468M443298Q75545N28427
$$ plain form
6984 7643162 5037306 -3880725 -12015268 -13731821 -13403196 -17616403 -23343575 -21465959
6976 -21465959 -10710329 -391775 2111645 61523 606887 4923027 9477598 12879445
6968 12879445 15941168 17308645 14760547 10207897 8360101 10211624 12206625 12313702
6960 12313702 12703629 15396282 19001313 21007794 20177434 16081764 9912439 6202598
6952 6202598 9018590 15024540 15519945 8036206 827791 2064128 9389798 15287638
6944 15287638 18590199 23939905 32076408 37826542 37602259 32655521 24304775 12104116
6936 12104116 -1255182 -8763646 -6530849 772215 5177752 4093692 1017653 -711626
6928 -711626 -1714661 -4117878 -7487557 -8531058 -4896183 1436285 5879583 6755128 7283555
6919G283555L359977M244389L36933n087023p570038o581498l828047l18593K371743
6910e788602J725890j693831l310970q72326J803661R13106j335826j039420Q87803
6901h710515J480001J409956K284898J715625k307940n161157j525062M435652
6893f378542L693199l276466o161579l52118O461602O593351K627948K91043j287844
6884B210594n206272q372308n671158L86195K184412j513802l765487j45366M924725
6875a4968467N227166J537561n67512Q10917K078448O33426j022966K19836K453208
6866c598383J470502k042142k858484M09985K434331m29134l629948j202600M487886
6857d957987N978183J824752k051981j638524R73362L024585M368544M161358
$$ plain form
6919 7283555 10643532 14887921 15224854 10137831 2567793 -4013705 -7841752 -8160345 -5788602
6910 -5788602 -4062712 -5756543 -9067513 -9939839 -8136178 -7223072 -8558898 -9598318 -8710515
6901 -8710515 -7230514 -5820558 -3535660 -1820035 -4127975 -9289132 -10814194 -6378542
6893 -6378542 -2685343 -5961809 -12123388 -12475506 -6013904 579447 3207395 3498438 2210594
6884 2210594 -2995678 -11367986 -17039144 -16652949 -14468537 -15982339 -19747826 -19893192 -14968467
6875 -14968467 -9741301 -8203740 -8771252 -7960335 -5881887 -5248461 -6271427 -6051591 -3598383
6866 -3598383 -2127881 -4170023 -7028507 -6618522 -4184191 -4613325 -8243273 -9445873 -4957987
6857 -4957987 1020196 2844948 792967 -845557 127805 3152390 7520934 11682292
6849A1682292N27420m515036n677727k321307n3443j786236l202854o43007K526332
6840c463566K115885K72290Q29185K036377K19413k678964j751851K816923O430093
6831F825785P196119O535428M115022j455035p207468p422455j719512L601977
6823A0469861L698566L59385k202592k572409j429546O85667K619962K292520
6815A3921414n81254l114036k368667J201884M490411M837150J644705l781584
6807A6250023q696190r844510n597357J813158O738961M804130j664969m830430
6799a027184m52469N966681O067397K94248l111901q67712R19418k327054n876856
6790d15432m097527p7821L49769q00888K392984Q249750Q999567K970286l192392
$$ plain form
6849 11682292 12209712 7694676 2016949 -304358 -357801 -2144037 -5346891 -5989898 -3463566
6840 -3463566 -1347681 -1075391 -246206 1790171 2009584 -669380 -2421231 395692 6825785
6831 6825785 14021904 20557332 24672354 23217319 16009851 8587396 6867884 10469861
6823 10469861 14168427 14527812 12325220 9752811 8323265 9008932 11628894 13921414
6815 13921414 13340160 10226124 7857457 9059341 13549752 18386902 20031607 16250023
6807 16250023 7553833 -2290677 -7888034 -6074876 664085 5468215 3803246 -1027184
6799 -1027184 -1479653 4487028 10554425 10848673 7736772 6869060 7788478 5461424 -415432
6790 -415432 -4512959 -4590780 -4241011 -5041899 -2648915 5600835 14600402 17570688 14378296
6781A4378296m844976m046369k873750K15276M875822O488900K744198k406867
6773A4530530m442005l780140l113005l055068k754983j660374P96939M173804
6765F95698N297572J602983l737051n023123k537345j790847l689519k889952
6757a2071584J900901M027470n36077o019481n670382j349150J639838L240815
6749a4837650N168865M223581k427925r029537p367753O64879N245815K738785
6741a5620940o17978M39624L585121M825804M080352K394674n63794l673719m117459
6732i268315k303241k050655l524902j464594O049891J2238647R953974J685613
6724A1316418m046218l870306j783555j516949k144377j620113j61171J146008
$$ plain form
6781 14378296 9533320 5486951 2613201 2828477 7704299 14193199 16937397 14530530
6773 14530530 10088525 6308385 3195380 140312 -2614671 -4275045 -3478106 695698
6765 695698 5993270 7596253 3859202 -1163921 -3701266 -5492113 -9181632 -12071584
6757 -12071584 -10170683 -6143213 -6679290 -12698771 -18369153 -19718303 -18078465 -14837650
6749 -14837650 -9668785 -5445204 -7873129 -16902666 -24270419 -23605540 -18359725 -15620940
6741 -15620940 -16238918 -15799294 -12214173 -7388369 -3308017 -913343 -1477137 -5150856 -9268315
6732 -9268315 -11571556 -13622211 -17147113 -18611707 -12561816 -323169 9630805 11316418
6724 11316418 7270200 3399894 1616339 99390 -2044987 -3665100 -3826271 -2680263
6716b680263J887377J445178n69308k136065k03564M300171N998307K016166l305069
6707F752930l938561m42967J460819k52836j413145R52920L539299K138771j416369
6698G380861j954749J168097L360574J654259j747697l378181k459612J00447
6690D123999L339713N158366K695736l507783p878783n598356Q97598M373025
6682C603515J753161k424500k570556P28164K526941R00368j147679j324106j473045
6673E72263k923160k142296L961913J0257880P657051l674591j1965198q268792
6665f524930K186854P917357N836566J844047J59906n84858j813540k506177k498981
6656D016244k661263j698228J972781N530864M640745O93353r94799N7450n91010
$$ plain form
6716 -2680263 -792886 652292 82984 -2053081 -2256645 2043526 8041833 10057999 6752930
6707 6752930 2814369 2371402 3832221 3579385 2166240 3119160 6658459 8797230 7380861
6698 7380861 5426112 6594209 9954783 11609042 9861345 6483164 4023552 4123999
6690 4123999 7463712 12622078 15317814 11810031 3931248 -1667108 -769510 3603515
6682 3603515 5356676 2932176 361620 1089784 3616725 4517093 3369414 2045308 572263
6673 572263 -2350897 -4493193 -531280 9726600 17383651 13709060 1743862 -6524930
6665 -6524930 -4338076 3579281 9415847 11259894 11419800 10834942 9021402 6515225 4016244
6656 4016244 1354981 -343247 1629534 7160398 11801143 12494496 11499697 11557147 10966137
6647A0966137l571078m627517l142322l387362n471223l894136J942679M942008
6639f242814K113916j39953K151173L014269j999433o046720j937845M919348
6631d168059N103722O17530L27450M282726M469816r29427n333075n189659l478205
6622d297181j953284N57686K022675j182974n847798m285631L565795R092919
6614b327793P643239L747600J767561j61188l828852o223523m743297j150818
6606e277071K302282N026407M823426q49011q378626r744476l336479L561074
6598a1872474N453959M768123M606846L024228j366637m874119m465551k400572
6590g126197j205054K77208K149412J055503l204220m858863q17404L682088L139063
$$ plain form
6647 10966137 7395059 2767542 -374780 -3762142 -9233365 -13127501 -11184822 -6242814
6639 -6242814 -4128898 -4268851 -2117678 896591 -1102842 -7149562 -9087407 -4168059
6631 -4168059 935663 1553193 1880643 6163369 10633185 9703758 4370683 -818976 -4297181
6622 -4297181 -6250465 -5692779 -3670104 -4853078 -10700876 -14986507 -11420712 -2327793
6614 -2327793 5315446 9063046 10830607 10669419 6840567 617044 -4126253 -5277071
6606 -5277071 -2974789 2051618 6875044 6026033 -2352593 -12097069 -15433548 -11872474
6598 -11872474 -6418515 -1650392 2956454 5980682 4614045 -260074 -4725625 -7126197
6590 -7126197 -8331251 -8054043 -5904631 -4849128 -8053348 -12912211 -13729615 -10047527 -6908464
6581f908464r8848j130661m81192r74502j501143J14112K244667L054033M690978
6572i91020Q332323R483466M269205l615332q143115q956630q159968m073717
6564a1854788M277435J0680301Q418962Q79738k857313j063200L67548q12726
6556H035957p17998J746271K156556j450585n051989n318446l955544l312014
6548g867792k712352j076058J036848L308259N713465O121170K167858l778819
6540B912579o015243l021831M84857L34104j947654k344053J45790K718338J958481
6531d774632k376447n747723k709549N603774J0575741O142346k964140p383041
6523c633671m900970p15906J678265L248610M214083L109507J340751K321518
$$ plain form
6581 -6908464 -7007312 -8137973 -8619165 -9593667 -11094810 -10980698 -8736031 -5681998 -991020
6572 -991020 7341303 16824769 21093974 17478642 9335527 378897 -7781071 -11854788
6564 -11854788 -7577353 3102948 11521910 12401648 9544335 8481135 8848683 8035957
6556 8035957 7317959 9064230 11220786 9770201 4718212 -600234 -4555778 -7867792
6548 -7867792 -10580144 -11656202 -10619354 -7311095 -1597630 4523540 6691398 2912579
6540 2912579 -3102664 -6124495 -5639638 -5305534 -7253188 -9597241 -9451451 -6733113 -4774632
6531 -4774632 -7151079 -12898802 -15608351 -10004577 571164 6713510 3749370 -3633671
6523 -3633671 -8534641 -9250547 -7572282 -4323672 -109589 2999918 4340669 6662187
6515F662187N246725N375303J211826l905152p487196r326249p408415L95972
6507i234999R439016J0629778K398305o159645p093413k507238J463331L352949
6499B288084M749140N224553L824462K045572J233983k0476k734881n003360n471767
6490F135310n862812p160006o891313l317346J097476L437256M194555M523589
6482c843291L349448M40532j379723p42730q75121m127138o605860l054439M946257
6473a1892065J0169869Q222999J545063m129135m811372r82522K729930J963798
6465B816565k168223m522334l167463j395760j281099k38787L200871N238654
6457a517576K676990j122764r14484K797283N233845L993357L92661l341826m918362
$$ plain form
6515 6662187 11908912 17284215 18496041 14590889 7103693 -2222556 -9630971 -9234999
6507 -9234999 204017 10833795 13232100 7072455 -20958 -2528196 -1064865 2288084
6499 2288084 7037224 12261777 16086239 18131811 19365794 19345318 16610437 11607077 6135310
6490 6135310 272498 -6887508 -13778821 -17096167 -15998691 -12561435 -8366880 -3843291
6482 -3843291 -493843 -53311 -1433034 -2175764 -3050885 -7178023 -13783883 -16838322 -11892065
6473 -11892065 -1722196 6500803 8045866 3916731 -894641 -1877163 852767 2816565
6465 2816565 648342 -3873992 -7041455 -8437215 -9718314 -9957101 -6756230 -1517576
6457 -1517576 1159414 36650 -877834 1919449 7153294 11146651 11539312 8197486 3279124
6448C279124k944351R7555k40276k744938o20464O675793R050793M30725r244207
6439C739754o962253L427927O532791j519076q481694n369432K306944O156567
6431a68472O070739M267404j318521j0056388j3433161n922582M526236N838734
6423a0196011j845684p540363m838724K178885P481223R467756Q019584K518527
6415E245193m497464p203463l459973J706677K699601N42131J39758K434901L328543
6406I35904K56322l750615m185306j180595Q51679o93657l124200k086252K671710
6397a0305010O952946P277260M586089K135238J171637J98269k038360m601828
6389E376241n909450n855206n158653l401896L88578N044664P270562N641316
$$ plain form
6448 3279124 334773 432328 192052 -2552886 -3173350 3502443 12553236 12983961 3739754
6439 3739754 -3222499 205428 6738219 5219143 -3262551 -8631983 -6325039 -168472
6431 -168472 5902267 10169671 8851150 -1205238 -14638399 -20560981 -16034745 -10196011
6423 -10196011 -12041695 -19582058 -24420782 -22241897 -14760674 -5292918 2726666 5245193
6415 5245193 747729 -6455734 -9915707 -8209030 -5509429 -4967298 -4827540 -2392639 935904
6406 935904 1192226 -2558389 -6743695 -7924290 -7072611 -7766268 -10890468 -12976720 -10305010
6397 -10305010 -3352064 3925196 8511285 10646523 11818160 12016429 9978069 5376241
6389 5376241 -533209 -6388415 -11547068 -14948964 -14560386 -9515722 -2245160 3396156
6381C396156K899923K408981L736388M161916L227053K364379O80262m407516
6373A8467542j1372598j3850263q204467J368848P843149Q683267N739486J043227
6365I718191l739226o069878m778122k308916j472055j284345P29355L574159
6357e630837L891346J261644j172864j211190J36774O84385p34106l317727l997705
6348a0090280j64817N375753N587876j314614p474374n492207P63220K121449
6340a0687994j974724l809234n31684K206581R12471k87609K096674M906136M706037
6331b463346L699863M638310N203624K344951k026558m213016m092174l418714
6323c27060k236272o43888o50498k634202l379442j153512Q83932O683j132008
$$ plain form
6381 3396156 6296079 8705060 12441448 16603364 19830417 22194796 22875058 18467542
6373 18467542 7094944 -6755319 -14959786 -13590938 -5747789 2935478 8674964 9718191
6365 9718191 5978965 -90913 -4869035 -7177951 -8650006 -9934351 -9204996 -5630837
6357 -5630837 -1739491 -477847 -1650711 -2861901 -2725127 -2040742 -2774848 -6092575 -10090280
6348 -10090280 -10255097 -4879344 708532 -606082 -8080456 -13572663 -12809443 -10687994
6340 -10687994 -12662718 -16471952 -17003636 -14797055 -13884584 -14172193 -12075519 -7169383 -2463346
6331 -2463346 1236517 5874827 11078451 13423402 11396844 7183828 3091654 -327060
6323 -327060 -2563332 -3207220 -3857718 -6491920 -9871362 -11024874 -10140942 -10134259 -11266267
6314a1266267J004184M887783O700905N797016L374957p02352n417981o697845
6306b319600k876004J451740J912278P90831J686185K327679n10587l308048j253314
6297b098840K155743M25640l510427r83650O898612R035190J606609n558302m062012
6288C908563J510760K781972j64932k438602l368403m628981m547742j349137
6280h296502J899149J978537J412691L430971N002449K058959j751286J33994
6272E868962N585307N935285l22528m953955l071420l86657l162128p730837o170457
6263h408428J501178P162453N426257n35247m422425m213770k600893k239785
6255h330660k622208j476656J906999N548458O940467N602110L039282Q70513
$$ plain form
6314 -11266267 -10262083 -5374300 1326605 7123621 10498578 9796226 4378245 -2319600
6306 -2319600 -5195604 -3743864 -1831586 -1040755 645430 2973109 2462522 -845526 -2098840
6297 -2098840 56903 482543 -3027884 -4011534 2887078 11922268 13528877 7970575 3908563
6288 3908563 5419323 8201295 8036363 5597761 2229358 -2399623 -6947365 -8296502
6280 -8296502 -6397353 -4418816 -3006125 424846 5427295 7486254 5734968 5868962
6272 5868962 11454269 17389554 17067026 12113071 9041651 8654994 5492866 -2237971 -8408428
6263 -8408428 -6907250 255203 5681460 5146213 723788 -3489982 -6090875 -8330660
6255 -8330660 -10952868 -12429524 -10522525 -4974067 1966400 7568510 10607792 11478305
6247A1478305k86525p18943j235717k199103k270814N38228N341036P619433M193113
6238B2459013k411902p120529q390779p804765n126282J080444P854722Q895659
6230I435581L475361j245697n44748M12816m833037j1964111j0362459J046512
6222a4579782J0471729Q284887q40274n019414l28754O027263O003325k70816
6214I748164o040888n775025n96100L259966J382035l499663m583206L72288O094678
6205C62249O920249L882507J744078J497726L11660k075211k140048J147969L430380
6196A5081559R80430l628693n149818k918153r44459j650075l131868l115004
6188d476081k393539k533817k329428O47149N403740P303739L807922j430908
$$ plain form
6247 11478305 11191780 10472837 9237120 7038017 4767203 5305431 10646467 18265900 22459013
6238 22459013 20047111 12926582 4535803 -3268962 -8395244 -7314800 539922 9435581
6230 9435581 12910942 11665245 11120497 11533313 6700276 -5263835 -15626294 -14579782
6222 -14579782 -4108053 4176834 3336560 -1682854 -2011608 4015655 10018980 9748164
6214 9748164 3707276 -2067749 -2663849 596117 1978152 -1521511 -6104717 -5732429 362249
6205 362249 7282498 11165005 12909083 14406809 14718469 12643258 10503210 11651179 15081559
6196 15081559 16061989 12433296 7283478 4365325 3420866 1770791 -1361077 -4476081
6188 -4476081 -6869620 -9403437 -11732865 -11085716 -5681976 1621763 5429685 3998777
6180C998777k483465J571522N863069O296708L829606R54648k640625p685913
6172I704327j1000829q208496n34419N379822N446726K438014J020049J768810
6164F014004K087317M18004k656912n483418n664825j550741M540707O929577
6156D633713L050195k650279m199439j685721J12268o56024r28809J531383M449290
6147C656577M584357K177212m5520o92176p78193j650084l188634m297799m670580
6138d904840n250879o189318n187697j64893O265938Q188903L961968p12716j63289
6129d156823L553341M201692N18671k923878k988168j087316Q79644K625965K756799
6120C379927r13341o422940p632155j970479N196941O790122K025550m107436
$$ plain form
6180 3998777 1515312 3086834 8949903 15246611 19076217 20030865 17390240 9704327
6172 9704327 -1296502 -9504998 -10039417 -4659595 787131 3225145 4245194 6014004
6164 6014004 8101321 8519325 5862413 378995 -5285830 -6836571 -2295864 4633713
6156 4633713 7683908 5033629 834190 -851531 -739263 -1395287 -2324096 -792713 3656577
6147 3656577 8240934 10418146 10372626 9680450 8902257 7252173 4063539 -234260 -4904840
6138 -4904840 -10155719 -16345037 -21532734 -21697627 -15431689 -7242786 -3280818 -3993534 -4156823
6129 -4156823 -603482 3598210 4116881 1193003 -1795165 -2882481 -2002837 623128 3379927
6120 3379927 2466586 -3956354 -11588509 -13558988 -8362047 -1571925 453625 -3653811
6112c653811o829725m776085K66213M368923M246405J054242o24937R74041K478647
6103b496087J068750j152682j259166l32859m98891m04534J872644M040911K684555
6094C522641p27851j948450n93057N16324J338170L966393O502244M257287j854170
6085A4979531m622827p26989M072132L243291j881568n713202o445615n768751
6077b863998l667408J026084O119350P211499L823248N77216J040904K961716
6069A6228611J358499m622732r537383p264744J234044P605870N521454j242377
6061I281242l979040j506179j472122p498277j1932113o892886K687406N119154
6053a6192815j104243n265589l50741P274428Q071234K789304l16972J844146
$$ plain form
6112 -3653811 -10483536 -15259621 -14993408 -10624485 -6378080 -5323838 -5948775 -4974734 -2496087
6103 -2496087 -1427337 -2580019 -3839185 -4172044 -4670935 -5075469 -3202825 838086 3522641
6094 3522641 2794790 846340 253283 769607 2107777 6074170 12576414 16833701 14979531
6085 14979531 10356704 9629715 13701847 16945138 15063570 9350368 2904753 -2863998
6077 -2863998 -6531406 -5505322 614028 7825527 11648775 12225991 13266895 16228611
6069 16228611 17587110 12964378 3426995 -3837749 -2603705 5002165 10523619 9281242
6061 9281242 5302202 3796023 2323901 -5174376 -17106489 -23999375 -21311969 -16192815
6053 -16192815 -17297058 -22562647 -22913388 -15638960 -7567726 -4778422 -5095394 -3251248
6045c251248M037079J731959k507620l595917j020921J692338K681691L333232
6037C100593M090256K243263l628738r194582q393984j859646L002085J919861
6029h720892o11640J184346N384896O058888L027647J292051J871703O22489l111226
6020F998262m319381j373771Q7936l427479o677792m212425M23855J158171J65264
6011a1177360L429628Q641058P479730n12478o175966m416960m67795N04195J092868
6002a603080M036068N001463J8003n893301n418363k44134K302078J101551J352998
5993F53283M112058M391553M75730k842471k532615j767803k996764l106376J54570
5984c458835K533285l47099m999200m648297N79437M217832L163621P92843J95024
$$ plain form
6045 -3251248 785831 2517790 10170 -3585747 -4606668 -2914330 -232639 3100593
6037 3100593 7190849 9434112 5805374 -3389208 -11783192 -13642838 -10640753 -8720892
6029 -8720892 -9332532 -8148186 -2763290 3295598 6323245 7615296 9486999 10109488 6998262
6020 6998262 2678881 1305110 1393046 -2034433 -8712225 -12924650 -12500795 -11342624 -11177360
6011 -11177360 -7747732 893326 8373056 7860578 1684612 -2732348 -3200143 -2695948 -1603080
6002 -1603080 2432988 7434451 7452454 1559153 -3859210 -4103344 -1801266 -699715 653283
5993 653283 4765341 9156894 9632624 6790153 4257538 2489735 -507029 -3613405 -3458835
5984 -3458835 -925550 -1272649 -6271849 -10920146 -10340709 -6122877 -2959256 -2166413 -1971389
5975a971389J21164o67445j08884L088583N724243M031738p14784l750091k875737
5966B877398k48721J258856J085210M96073Q94938K604697M192196L576481Q94572
5957A7631700r99012n79830n03080l506863o850296n176654R57423M275940M49249
5948E698577n715615o868136k375482K873562N911587P029275N762601J534026
5940A3850395k099329j38689N553124O590340m34599q078182p873759j677045
5932E692256K296201J783032K066610N765399P851333L328824m821451r007179
5924A4955025o034639K78201M250234L498516m79423m465427n833179m276638
5916A892670k030978j616066k785770k458354J332410N919517O267473J437869
$$ plain form
5975 -1971389 -1850225 -2517670 -2626554 462029 6186272 10218010 9503226 5753135 2877398
5966 2877398 2628677 3887533 4972743 5468816 6363754 8968451 13160647 16737128 17631700
5957 17631700 16632688 16052858 15549778 12042915 5192619 15965 973388 5249328 5698577
5948 5698577 -17038 -6885174 -9260656 -6387094 -475507 6553768 12316369 13850395
5940 13850395 11751066 11612377 17165501 23755841 23321242 15243060 7369301 5692256
5932 5692256 7988457 9771489 11838099 17603498 25454831 28783655 23962204 14955025
5924 14955025 8920386 9198587 13448821 16947337 16467914 12002487 6169308 1892670
5916 1892670 -138308 -1754374 -4540144 -6998498 -5666088 253429 6520902 7958771
5908G958771l202936k314834K296145M048466N96405l509454l990711k292193
5900d10341j511916j078646O09848J568124p84066m147591m220380j748549r93279
5891a2716796j846617n4893M052120M253325j428429n967967l272490K467337
5883a4514410L027683j989479n638753l794336J038083N018622O642551N403547
5875d806492J816026q78411N34832M230559N166182K425341M40659J898730L848142
5866A4675568K763394m22276k767592l591471l750722l355242k711280l148288
5858b307909m465674l881060o8419M039149N208442M337721L804994K784234p32251
5849H719227m943940n907196l502434j264628n67768L42963J443044L33625k358815
$$ plain form
5908 7958771 4755835 2441001 4737146 8785612 9382017 5872563 1881852 -410341
5900 -410341 -1922257 -3000903 -2391055 -822931 -1606997 -5754588 -9974968 -11723517 -12716796
5891 -12716796 -14563413 -14618306 -10566186 -6312861 -7741290 -13709257 -16981747 -14514410
5883 -14514410 -11486727 -13476206 -19114959 -22909295 -21871212 -16852590 -10210039 -4806492
5875 -4806492 -2990466 -3868877 -3334045 896514 6062696 8488037 8928696 10827426 14675568
5866 14675568 17438962 17016686 14249094 10657623 6906901 3551659 840379 -2307909
5858 -2307909 -6773583 -10654643 -10723062 -6683913 -1475471 2862250 6667244 9451478 8719227
5849 8719227 3775287 -2131909 -5634343 -6898971 -7466739 -7123776 -5680732 -5347107 -7705922
5840g705922k446687P75183K333768l54536k554296L3180L452934J620675l468475
5831h314176n081467l013803l045569n547651l875097L642765Q965653O274348
5823i994997J170051J609017N570035N460284Q21886j920224p04667l05577l082379
5814a376571m940928k712772O64153J296628j62800j131191j181559n81341J702643
5805h423738N420207P325722N051742M43652l342285n526752o192483m251931
5797i495866k03393J944476m03601l649869k592885J604453K955935k23378k990434
5788a3054562j712450O23478j22467k244491q65742M156552P603099O522662M282692
5779E188771M689665N400325J666201m575454n311313J750809P524793K827969
$$ plain form
5840 -7705922 -10152609 -9377426 -7043658 -7398194 -9952490 -9919310 -6466376 -4845701 -8314176
5831 -8314176 -13395643 -16409446 -19455015 -25002666 -28877763 -25234998 -16269345 -9994997
5823 -9994997 -8824946 -7215929 -1645894 3814390 4636276 2716052 2011385 1705808 -1376571
5814 -1376571 -6317499 -9030271 -8366118 -7069490 -7232290 -8363481 -9545040 -10126381 -8423738
5805 -8423738 -3003531 4322191 9373933 9817585 6475300 948548 -5243935 -9495866
5797 -9495866 -9699259 -7754783 -8158384 -11808253 -14401138 -12796685 -9840750 -10064128 -13054562
5788 -13054562 -14767012 -14143534 -14266001 -16510492 -17376234 -13219682 -5616583 906079 5188771
5779 5188771 9878436 15278761 16944962 12369508 7058195 8809004 16333797 19161766
5771A9161766q170105j2535184n447243M677935Q557706O098038J700623k894892
5763A1148644o311784m579452K908755Q909051O650634m99871m291439l440981
5755A0493557k744520k848784M0480M666556M442481j348207m710471r52110L878878
5746A0917860K362412l502533o362361l966438r7921J898426J525357q42739m054374
5737b122311n690157m583295k241998K65116L870948P615163P352706K176621
5729F642793k012604m61583K582041K58307n541089o872882k699834o87527m574238
5720a3366616p610282k576832P327324J2537172Q786086M27620n800975o549580
5712f826083k695657K061898L585568P63966l005912l071566J551542P011175
$$ plain form
5771 19161766 10991661 -1543523 -6990766 -2312831 6244875 12342913 14043536 11148644
5763 11148644 4836860 257408 3166163 12075214 18725848 18225977 13934538 10493557
5755 10493557 7749037 4900253 4940733 9607289 14049770 12701563 7991092 7038982 10917860
5746 10917860 13280272 9777739 3415378 -551060 -648981 1249445 2774802 1932063 -2122311
5737 -2122311 -7812468 -12395763 -14637761 -14372645 -10501697 -2886534 4466172 6642793
5729 6642793 4630189 4168606 6750647 7008954 1467865 -5405017 -8104851 -8792378 -13366616
5720 -13366616 -20976898 -23553730 -16226406 -3689234 5096852 5524472 -276503 -6826083
5712 -6826083 -9521740 -7459842 -3874274 -3110308 -6116220 -9187786 -7636244 -625069
5704f25069Q205142L579633l041120n823240l149257L92818k4804k922808l238330
5695f647035o25117M3606k660032l375036J410895O533675N298583j35022k095382
5686b250865N84122J189708l586271q003340n901193N19144M748890M932865M033640
5677c733300L496806J860770j011239k866969k749301k225760k149196j249576
5669a0627765R33897K432730J704715o675p62119n56890j28953J210036M284649
5660a516375P451401P579398L705936j791518n731115o689641n191899k642302
5652d826115k77447J676062L858512O196967O908594M141621j574946p483502
5644H619746j0915381j0531484o134452O76262N797448N264452k7578m103317
$$ plain form
5704 -625069 7580073 11159706 8118586 2295346 -853911 -461093 -485897 -3408705 -6647035
5695 -6647035 -7272152 -7228546 -9888578 -13263614 -11852719 -5319044 -20461 -155483 -2250865
5686 -2250865 -1666743 -477035 -4063306 -12066646 -17967839 -17448695 -12699805 -7766940 -3733300
5677 -3733300 -236494 1624276 613037 -2253932 -5003233 -7228993 -9378189 -10627765
5669 -10627765 -9693868 -7261138 -5556423 -5563098 -6325217 -6882107 -7011060 -5801024 -1516375
5660 -1516375 5935026 13514424 17220360 15428842 9697727 3008086 -2183813 -4826115
5652 -4826115 -5103562 -3427500 431012 6627979 13536573 17678194 16103248 8619746
5644 8619746 -2295635 -12827119 -18961571 -18285309 -12487861 -7223409 -7250987 -11354304
5636a1354304k294061L212451O129891L702252p28166k867727k560054k202549
5628h962267k104815l57656K941375M476854K257588q59427o75036K439765L946591
5619C102972J304948k967228m839824k871364J818369O832279Q667918M843837
5611A5891907k043779n402802k572349J191396J65699l323529k917286J135547
5603B124804J862950l434271q396126o434204M71338N319551N160989K979797
5595c45172K377377L554498L999779J489240l043994n429363k862959J544286
5587A283692K027075j614567l343485j6689L645435K410302j616171l030867j511140
5578a766415p62638j412005p14717J634941K856013K101672J217565L90491k042430
$$ plain form
5636 -11354304 -13648365 -10435914 -4306023 -603771 -1331937 -4199664 -6759718 -8962267
5628 -8962267 -11067082 -11424738 -8483363 -4006509 -1748921 -2608348 -3283384 -843619 3102972
5619 3102972 4407920 1440692 -3399132 -6270496 -4452127 2380152 11048070 15891907
5611 15891907 13848128 8445326 5872977 7064373 7230072 3906543 989257 2124804
5603 2124804 3987754 553483 -7842643 -14276847 -13805509 -8485958 -3324969 -345172
5595 -345172 2032205 5586703 9586482 11075722 8031728 2602365 -260594 1283692
5587 1283692 3310767 1696200 -1647285 -1663974 1981461 4391763 2775592 -255275 -1766415
5578 -1766415 -2529053 -3941058 -4655775 -3020834 -164821 1936851 3154416 3544907 1502477
5569A502477m846274l967419J055760N191958M621295J620341K63744M83923m92803
5560E433002k945819m136609k249469J483933M498266N363314M516083L128513
5552A5091214J339896j858399o211989q595361n764222J246198P171829P424748
5544I843914K166667m092080o096927k195514L559296N092149J608711j057083
5536H829133J323369M939986L719666j482214n016555n419841n387781m272938
5528b767175R81561P182464O507312q01526m705340n12081L576641K43629m717904
5519D987581k838145J961956R8246o555841o799698J787085Q706660O182299r67965
5510F562178m052346j121277M212848P824989O187820j362366q993881r063926
$$ plain form
5569 1502477 -3343797 -7311216 -6255456 -1063498 3557797 5178138 5441882 5925805 5433002
5560 5433002 2487183 -1649426 -3898895 -2414962 2083304 7446618 11962701 15091214
5552 15091214 16431110 14572711 8360722 -234639 -5998861 -4752663 2419166 9843914
5544 9843914 12010581 7918501 1821574 -373940 3185356 8277505 9886216 8829133
5536 8829133 10152502 15092488 18812154 17329940 12313385 6893544 1505763 -2767175
5528 -2767175 -1785614 5396850 11904162 11102636 6397296 5885215 9461856 9705485 4987581
5519 4987581 2149436 4111392 4209638 -2346203 -9145901 -7358816 1347844 7530143 6562178
5510 6562178 2509832 1388555 5601403 13426392 19614212 18251846 9257965 194039
5502A94039k631467J113021j905193n327963l427353N20941J742107K058583M080479
5493c582806M383798L50253k193110K641967R277555P687085p21971m964090j576576
5484A1302105J066055k655343o963172m945685P95255L434426K030486O02091
5476D666218R86739J760396J830987J121236m46437j860871j171432J032453J197389
5467I116678j720305l642114j148935L372704N619215N107860L293982n97465
5459A9401620o942490j1545932r780779l658045O59411J778190L963121Q863936
5451B739032J2013448R401703L046547k425913n443486p253329q406243p938970
5443d267211n099532p08836K599221K007800j729229l060878K416887J0781429
$$ plain form
5502 194039 -2437428 -1324407 -3229600 -8557563 -11984916 -11463975 -9721868 -7663285 -3582806
5493 -3582806 800992 1151245 -1041865 1600102 10877657 18564742 17842771 12878681 11302105
5484 11302105 12368160 9712817 2749645 -2196040 -1400785 2033641 4064127 4666218
5476 4666218 5652957 7413353 9244340 10365576 9919139 8058268 6886836 7919289 9116678
5467 9116678 7396373 3754259 2605324 5978028 11597243 16705103 19999085 19401620
5459 19401620 12459130 913198 -8867581 -12525626 -11866215 -10088025 -6124904 2739032
5451 2739032 14752480 24154183 27200730 24774817 19331331 12078002 3671759 -4267211
5443 -4267211 -9366743 -10075579 -7476358 -5468558 -7197787 -10258665 -7841778 2939651
5435B939651J2713558N011670m737204p428261l072614J043126L71110k618683
5427D222353l295593m88286L196024M399761J660419l609876q048518q723060
5419a0686776n142378M81951M394518L529003j603752o182227n169642J140776
5411a9238527P147362Q026624M292010k6991j754426m07811K284074L584873K069317
5402E976505m18173o86201J498127L093727K199323J53276j538689l274035m907136
5393B096724m403035j126941K190673L055347K293970J377207m04409l225451
5385A854085m108243q71428L347938L721685Q13836j09479L153353O263553L777108
5376A7842408l881577j0081983q623156q43555M971158L194124j692247j468057
$$ plain form
5435 2939651 15653209 20664879 15927675 8499414 5426800 6469926 6841036 4222353
5427 4222353 926760 438474 3634498 8034259 9694678 6084802 -1963716 -10686776
5419 -10686776 -15829154 -15347203 -10952685 -7423682 -9027434 -15209661 -20379303 -19238527
5411 -19238527 -12091165 -4064541 227469 200478 -1553948 -1961759 322315 3907188 5976505
5402 5976505 5558332 4872131 6370258 9463985 11663308 11816584 10277895 7003860 2096724
5393 2096724 -2306311 -3433252 -1242579 1812768 4106738 5483945 5079536 1854085
5385 1854085 -2254158 -3125586 222352 3944037 4757873 4648394 7801747 14065300 17842408
5376 17842408 13960831 3878848 -4744308 -5587863 -616705 2577419 885172 -582885
5368e82885L163441L343587l355224p899600l911683J881232R49977k804191l56970
5359i572316O326959P524788K396155k52623K293218K691632k407679o029168
5351B970966k929901J923671K176835p59969k422388k037369j32262L661810O530455
5342H981848L700175k445836l080171K653583L794843n264376j3979735j1206069
5334a6845738k244406J016078q35896J048853N933194M769378k611956o050103
5326a5820596j688864K871463K462171J664421M527390P267638N935408K973235
5318A0192266J608612Q50108j49661L31899J301228j388185o671068p232801j144620
5309b302222L468023Q85884l007286j103652K536093l39889p911468j0803143
$$ plain form
5368 -582885 2580556 5924143 2568919 -5330681 -9242364 -7361132 -6411155 -9215346 -9572316
5359 -9572316 -3245357 4279431 6675586 6422963 8716181 11407813 9000134 2970966
5351 2970966 41065 1964736 4141571 3381602 959214 -1078155 -1210417 2451393 8981848
5342 8981848 12682023 10236187 7156016 9809599 13604442 8340066 -5639669 -16845738
5334 -16845738 -19090144 -18074066 -18909962 -17861109 -11927915 -7158537 -9770493 -15820596
5326 -15820596 -17509460 -14637997 -12175826 -10511405 -5984015 1283623 7219031 10192266
5318 10192266 11800878 12650986 12501325 12833224 14134452 12746267 6075199 -1157602 -2302222
5309 -2302222 1165801 2051685 -955601 -2059253 476840 136951 -7774517 -18577660
5301a8577660o204723j72050L109016N520001Q031827P675108L602858k60948
5293B723429j264933j675773l672232m954279k358361L014678O908281O459374
5285E180184K254338k412637l630518m18759L200996K177717k902419o087558
5277b638656l998181n6500J133949J41750K94666J763072K246112J889644K765900
5268C541756L873387J767038k782981l946153N34165M480272J678811m208900
5260D937395m304534K239101O611859L098632l216819m783208j948401n2690l81179
5251B200156j29658R38469K22863j893063j913468M10948Q42356k745144o885074
5242h951615p427751m436901o81791J611862J426224l26053M7832N244266J1373180
$$ plain form
5301 -18577660 -24782383 -24954433 -21845417 -16325416 -8293589 -618481 2984377 2723429
5293 2723429 1458496 -217277 -3889509 -8843788 -11202149 -8187471 -1279190 5180184
5285 5180184 7434522 5021885 1391367 972608 4173604 6351321 3448902 -2638656
5277 -2638656 -6636837 -6693337 -5559388 -5417638 -5122972 -3359900 -1113788 775856 3541756
5268 3541756 7415143 9182181 6399200 2453047 2987212 7467484 9146295 4937395
5260 4937395 632861 2871962 9483821 12582453 9365634 4582426 2634025 2581335 2200156
5251 2200156 2070498 3008967 3231830 1338767 -574701 -163753 678603 -2066541 -8951615
5242 -8951615 -16379366 -20816267 -21498058 -19886196 -18459972 -18786025 -18738193 -13493927 -2120747
5233b120747J0813532K499545n535035o601654l382894j827438k023401n59882
5225h737974J794157J300559j597024k489619l835K644244L175961K656139K024760
5216G67368N74043j344040j868717p93300l2952l64740o63044o08723r92226j130355
5206f456686O23347L413053M297155K499055j33223k905216o376361q507239n861785
5197a9407900K7814K899171P79770n45544L417974Q386991P626738J746835l253205
5188A678644m705625m284858k565933J109686M317615L377051l37204j623694
5180c034318M17836J162465j453600l444648j676235J162993J786678J789181
5172c289648L780123N797629M261176J8899l044290l705198l487826k488556M01699
$$ plain form
5233 -2120747 8692785 11192330 5657295 -944359 -4327253 -6154691 -8178092 -8737974
5225 -8737974 -6943817 -5643258 -7240282 -9729901 -9733736 -7089492 -3913531 -1257392 767368
5216 767368 1341411 -2629 -1871346 -2664646 -2697598 -3062338 -3725382 -4334105 -5326331 -6456686
5206 -6456686 -5833339 -2420286 1876869 4375924 4242701 1337485 -5038876 -13546115 -19407900
5197 -19407900 -19380086 -16480915 -15701145 -16246689 -12828715 -4441724 3185014 4931849 1678644
5188 1678644 -3026981 -7311839 -9877772 -8768086 -4450471 -1073420 -1410624 -3034318
5180 -3034318 -2616482 -1454017 -2907617 -6352265 -8028500 -6865507 -5078829 -3289648
5172 -3289648 490475 6288104 10549280 10568179 7523889 3818691 330865 -2157691 -1755992
5163a755992L715424M218704J784201k49990j62901M906j754958m345389n439971
5154c985966m324341j924495M43746J886825K708586M059412N528254M474615
5146H866636J46130l279931j679735K026600R17216n516775r421591n125844L076520
5137i990774O816904L723484j774306m874653m084642m41316L547634N168405
5129a909264M038521K328626J088944j360485n429837p478517m228300J960221
5121a0990091N541644M350512Q80976j849330k858635k360761r29614O76846K229975
5112e308478L795782M243254K143252j005985j595670N65207J346600q81228k077928
5103A224806L24126J924527j811546p288830p689537l241186K28231J039126K745587
$$ plain form
5163 -1755992 1959432 6178136 7962337 7712347 7549446 7554352 5799394 1454005 -3985966
5154 -3985966 -8310307 -10234802 -9791056 -7904231 -5195645 -1136233 4392021 8866636
5146 8866636 9012766 5732835 4053100 6079700 6996916 1480141 -7941450 -13067294 -9990774
5137 -9990774 -3173870 549614 -1224692 -6099345 -10183987 -10625303 -7077669 -1909264
5129 -1909264 2129257 4457883 5546827 4186342 -1243495 -8722012 -12950312 -10990091
5121 -10990091 -5448447 -1097935 -216959 -2066289 -4924924 -7285685 -8215299 -7538453 -5308478
5112 -5308478 -1512696 2730558 4873810 3867825 2272155 2837362 4183962 3302734 1224806
5103 1224806 1548932 3473459 1661913 -5626917 -13316454 -16557640 -16329409 -15290283 -12544696
5094a2544696O206940P674648N308944J524906j763861m658254n675647k470991
5086f398011K947361N142949K529311r01078j536375P78552N166158R709739R647791
5077B7086397K153862p101559r211210m278751j016074l515344o749377o668752
5069i300808n613854m810127q23569O082478Q829033M214298j173449j431089
5061d027087J9397j500962l070065q67922J440488m72195k522972R82354O609712
5052c409252P188369L643135J884196J539905k047972p082305p037841k171101
5044g492866N70868r94273k303939j740174k662950m448430j159102P744311J3852922
5035A366367J1163193M095241j82099j459126l583349o463702o453624k577621
$$ plain form
5094 -12544696 -6337756 1336892 6645836 8170742 6406881 1748627 -3927020 -6398011
5086 -6398011 -3450650 1692299 4221610 3320532 1784157 2562709 7728867 17438606 27086397
5077 27086397 29240259 22138700 12927490 8648739 7632665 4117321 -2632056 -9300808
5069 -9300808 -14914662 -19724789 -20548358 -14465880 -5636847 -1422549 -2595998 -4027087
5061 -4027087 -4007690 -5508652 -8578717 -9446639 -8006151 -8478346 -11001318 -10018964 -3409252
5052 -3409252 3779117 7422252 9306448 10846353 8798381 1716076 -5321765 -7492866
5044 -7492866 -6921998 -7916271 -10220210 -11960384 -14623334 -19071764 -20230866 -12486555 1366367
5035 1366367 12529560 16624801 16442702 14983576 11400227 4936525 -1517099 -4094720
5027d094720J849403L233551J205279j307897q80579K439089M364695J577198
5019H386019l185841m331878j097610J839826J589529O56583J958097L925992
5011I740717L102680m19494k667732o18208L969185O157177L303949j957487n285666
5002A5325121n831089n324737l543737O25405M254586K918662r69696J20058O359813
4993A3934386Q300794J551230n247607l923619M70434n05598m016214k507995
4985H055811J386553k53177m818843k517971N767415Q157491M24333q144054r934642
4976a877084p798543n393357p33798N755960P541412K311861k865988k303578
4968e363115N72702J477233K811457O664293Q011965K409574n299868p297607
$$ plain form
5027 -4094720 -2245317 988234 2193513 885616 5037 2444126 6808821 8386019
5019 8386019 5200178 868300 -229310 1610516 3200045 3856628 5814725 9740717
5011 9740717 12843397 12423903 9756171 9137963 13107148 19264325 22568274 20610787 15325121
5002 15325121 9494032 4169295 625558 1250963 5505549 8424211 7454515 7574573 13934386
4993 13934386 22235180 23786410 18538803 14615184 15085618 14580020 10563806 8055811
4985 8055811 9442364 9189187 4370344 1852373 7619788 15777279 16201612 8057558 -1877084
4976 -1877084 -9675627 -15068984 -15802782 -10046822 -2505410 -193549 -3059537 -5363115
4968 -5363115 -4790413 -3313180 -501723 6162570 14174535 16584109 11284241 3986634
4960C986634l658104m61912l82634j037527l47787J483430L807429N620879N127807
4951A4138215J818088k190380m259183l356348o7387L416910M102423J707390
4943A5309728j35373O07709M20148l644674p362531n138268P98881M197697M530417
4934I583734M930918M186664L48831j568538L112948P288426J228254r486301
4926A9624936j0381001j268549L709230o6785j711546M097254Q225296M938762
4918B7167597J396658K186108Q12737n343161p490979j754990K210802j641146
4910A7543626m763121l0578N525523M166615M1242j312645k449452m116072m48659
4901A4156479P281961P925381P4105k964073L403631O340741O4044l127832K113743
$$ plain form
4960 3986634 328530 -133382 -516016 -1553543 -1901330 -417900 3389529 9010408 14138215
4951 14138215 15956303 13765923 9506740 6150392 6083005 9499915 13602338 15309728
4943 15309728 15174355 15782064 16202212 12557538 5195007 56739 855620 5053317 9583734
4934 9583734 14514652 18701316 19050147 17481609 20594557 27882983 29111237 19624936
4926 19624936 9243935 7975386 11684616 11617831 9906285 14003539 22228835 27167597
4918 27167597 28564255 30750363 31563100 26219939 18728960 16973970 19184772 17543626
4910 17543626 12780505 12749927 18275450 22442065 22483307 21170662 18721210 14605138 14156479
4901 14156479 21438440 29363821 29437926 26473853 29877484 36218225 36282269 33154437 35268180
4892C5268180K580181o206869p751201L861330R122745o34996m011716R666820
4884D1894474J5408782j778668j3823790Q23322J4287047J704407n646620K2244031
4876G5112985M7340645L0632659K4994964R6693161J74798322J08826878j00725102
4869D57674512k57236429k14477149o1315194K2146018K417345j9528119N198705
4862f5120311K4489186M856406j4952476n429542O776925p26705o597128N931948
4854e0771697J5868910O619494l507506J875113Q286151J850296m170743K787206
4846b1162776R986266M662587k289307J185703N722155O05107m986760n95270
4838f872295M841032L56997n937660k111634N853383N692939k85907k705470k281942
$$ plain form
4892 35268180 37848361 31641492 23890291 27751621 36874366 36239370 32227654 41894474
4884 41894474 57303256 55524588 41700798 42524120 56811167 58515574 52868954 75112985
4876 75112985 122453630 153086289 178081253 274774414 449572736 558399614 457674512
4869 457674512 200438083 -14039066 -75354260 -53208242 -50790897 -70319016 -65120311
4862 -65120311 -40631125 -35774719 -50727195 -56156737 -49379812 -50106517 -56703645 -50771697
4854 -50771697 -34902787 -28283293 -31790799 -29915686 -21629535 -19779239 -23949982 -21162776
4846 -21162776 -11176510 -6513923 -8803230 -7617527 -1895372 -1290265 -6277025 -6872295
4838 -6872295 -2031263 -1674266 -7611926 -9723560 -3870177 1822762 1536855 -1168615 -3450557
4829c450557l948621m115078J443829O260622L508293j068147M69252L563274
4821B662867o9535o821104p534722l059506r00313j564661l2306L259589L592334
4812a0467357J048923n19761p44189j677077k754642k720569k558063j885284
4804b2278019J910547O668110N221213k542195o226186m13799N601371K233926
4796i825032n077509n454854M7471K445447N97376O20158K922663J910400k483089
4787a4296969l769448P9623L430761J987145j850628l657306j863563K349899
4779a7590486O037194N930492K072980j558199k579246l284262n464273o462667
4771b2898467m082290p82245J207141L934816Q223956R688243N914596K027641
$$ plain form
4829 -3450557 -7399178 -11514256 -10070427 -3809805 -301512 -1369659 -900407 2662867
4821 2662867 2593332 -4227772 -11762494 -14822000 -15722313 -17286974 -17319280 -14059691 -10467357
4812 -10467357 -9418434 -9938195 -10682384 -12359461 -15114103 -17834672 -20392735 -22278019
4804 -22278019 -20367472 -13699362 -8478149 -11020344 -17246530 -17660329 -12058958 -9825032
4796 -9825032 -14902541 -20357395 -20309924 -17864477 -17267101 -16646943 -13724280 -11813880 -14296969
4787 -14296969 -18066417 -17986794 -14556033 -12568888 -14419516 -18076822 -19940385 -17590486
4779 -17590486 -11553292 -5622800 -3549820 -5108019 -7687265 -10971527 -16435800 -22898467
4771 -22898467 -26980757 -27763002 -26555861 -22621045 -14397089 -4708846 1205750 3233391
4763C233391K553860L333375p81348n439319l207479L314684M664100j119504
4755F551760o654373o908602l959168k59921M299086P759881O333870J002972
4747H165505k518806j920956p02758j420550k371196k359173k974813m098169
4739a0200916k491625K352051N464064K919585k043841l000050J241293N492627
4731b66812N261527K119399L89408J49418k736662q462584r743407j368056R749908
4722d907861J1563425L412518k960693n50937L950329K453380k295301l434205
4714G230655j352001k09866R41042M750942P686006M433885k844088p713507q871229
4705D051839q452510m657504M463491J2543728J0728533J306024m357947j716192
$$ plain form
4763 3233391 5787251 9120626 8339278 2899959 -307520 3007164 7671264 6551760
4755 6551760 -102613 -7011215 -10970383 -11230304 -6931218 828663 7162533 8165505
4747 8165505 5646699 3725743 3022985 1602435 -768761 -3127934 -6102747 -10200916
4739 -10200916 -12692541 -10340490 -4876426 -1956841 -4000682 -7000732 -5759439 -266812
4731 -266812 4994715 7114114 7503522 7652940 4916278 -3546306 -13289713 -14657769 -4907861
4722 -4907861 6655564 10068082 7107389 6556452 10506781 12960161 10664860 7230655
4714 7230655 5878654 5668788 6609830 11360772 19046778 23480663 20636575 12923068 4051839
4705 4051839 -4400671 -9058175 -4594684 7949044 18677577 19983601 15625654 13909462
4697A3909462K533925K579018N29928m97195j478735k933554k862958j785912
4689I993979k961818n643133n091471r79803J684354J682400L305988O633282
4681H623778N307544j974636o893623m069131J46665j700009o163148n622552
4673a2345112j023818J060763l7088M35635L106506M112103L092419L353348M300427
4664F055183J670248l822472n686033j657035K347221J498766p97829N60738L675660
4655C844447L137865q97591l300043k442635j999781l703916m046223n96044L099170
4646f904751K665778l30902j074426J203323L202026L482949L393225K508520
4638H145742j364051o763083q461118m709341M7633J848787K009242K749470K885021
$$ plain form
4697 13909462 16443387 19022405 19552333 19055138 17576403 14642849 11779891 9993979
4689 9993979 7032161 1389028 -3702443 -4682246 -2997892 -1315492 1990496 8623778
4681 8623778 13931322 11956686 5063063 993932 1140597 -559412 -6722560 -12345112
4673 -12345112 -13368930 -12308167 -12345255 -11909620 -8803114 -4691011 -1598592 1754756 6055183
4664 6055183 7725431 3902959 -1783074 -3440109 -1092888 405878 -391951 168787 3844447
4655 3844447 6982312 6084721 2784678 342043 -1657738 -5361654 -9407877 -10003921 -6904751
4646 -6904751 -4238973 -4569875 -5644301 -4440978 -1238952 2243997 5637222 8145742
4638 8145742 6781691 18608 -8442510 -13151851 -13104218 -11255431 -9246189 -6496719 -3611698
4629c611698J278362J47284J091336J873245R28572O53859K033318J068839m023705
4620A439412p189999k991881L771140M895419J612780J522780N100332N323615
4612A3483598L43032l467882k439737m37538n03312j27536K080846K721991K90691
4603A1944153j288087K36743R41973k371156o061552m999981j01734L483398K828736
4594D612493q93637m372291m417250j068025J260545o29936k878532K17308O197131
4585a972194P207611K708901K72197K162603J407610m937409r033310m976041
4577g160032J095225J350911j398652n00892K384304J696479q87841L653K582953
4568h33892Q65203l912046m851294j254214N68949j725395l480301j636461J553842
$$ plain form
4629 -3611698 -2333336 -2186052 -1094716 778529 1707101 2360960 4394278 5463117 1439412
4620 1439412 -5750587 -8742468 -4971328 -75909 1536871 3059651 8159983 13483598
4612 13483598 13826630 10358748 7919011 7481473 6978161 6850625 8931471 11653462 11944153
4603 11944153 10656066 10892809 11834782 9463626 3402074 -1597907 -1699641 1783757 4612493
4594 4612493 3718856 -653435 -5070685 -6138710 -4878165 -5508101 -8386633 -8169325 -1972194
4585 -1972194 5235417 7944318 8216515 10379118 11786728 6849319 -2183991 -7160032
4577 -7160032 -6064807 -4713896 -6112548 -6613440 -4229136 -2532657 -3420498 -3416845 -833892
4568 -833892 31311 -3880735 -8732029 -9986243 -9417294 -11142689 -14622990 -16259451 -14705609
4559a4705609M325401P443591R276083O192689j18814k514929J680818O321506
4551A7900736M933076j212408o429826q024289p367099o358350n304969k949067
4543a4812196J985174P792547R599903N322984K06425O80854M743031M466119
4535A9984841j746645o236463l490445J925533K582557j672506n250794m932398
4527A163680j977368J428404L598676K745460j169920m658317l972395L7780K830500
4518B6500J883240n55546o37851K605448O257832O292288J482278n012134q390417
4509C951638o854953k858684L46218J993219K935171L148514J983646L04941K10653
4500E160363J894830K331416j241591o888381q988707m678658K144974N064165
$$ plain form
4559 -14705609 -10380208 -2936617 6339466 12532155 12413341 9898412 11579230 17900736
4551 17900736 22833812 21621404 15191578 7167289 -199810 -6558160 -11863129 -14812196
4543 -14812196 -12827022 -5034475 4565428 9888412 10094837 10775691 15518722 19984841
4535 19984841 18238196 12001733 8511288 10436821 13019378 11346872 6096078 1163680
4527 1163680 -813688 614716 4213392 6958852 5788932 1130615 -2841780 -2804000 26500
4518 26500 1909740 1354194 716343 3321791 9579623 15871911 17354189 12342055 3951638
4509 3951638 -2903315 -5761999 -5415781 -3422562 -487391 2661123 4644769 4949710 5160363
4500 5160363 7055193 9386609 8145018 1256637 -7732070 -12410728 -10265754 -5201589
4492e201589K676353l49094K12339L031228L659927J64924n113435q309769p490626
4483a6719742m196205j958989k271879k335944J190950O602512Q547095N470599
4475e671603J727383P29965K99141k146912l761918l09300O285731R501576O828509
4466A3482572K554529J526438L415902M208651J435045l032813m940022k594607
4458A6055695M73504l49595m085554n009173j109950K618024J828800o89818k55450
4449I476483J720395K46308m956422q879319p924814k991981K956097O585801
4441c767452N049805p54176n238668m284336m53716J761754K876095N348461O677023
4432G214790K582532m449594p088774l246488K411647O393987Q543265O834898
$$ plain form
4492 -5201589 -2525236 -2874330 -2661991 369237 4029164 4194088 -919347 -9229116 -16719742
4483 -16719742 -20915947 -22874936 -25146815 -27482759 -26291809 -19689297 -11142202 -5671603
4475 -5671603 -3944220 -3214255 -2915114 -5062026 -8823944 -9133244 -2847513 6654063 13482572
4466 13482572 16037101 17563539 20979441 25188092 26623137 23590324 18650302 16055695
4458 16055695 16529199 16179604 12094050 7084877 5974927 8592951 10421751 9731933 9476483
4449 9476483 11196878 11443186 6486764 -2392555 -10317369 -13309350 -10353253 -3767452
4441 -3767452 1282353 528177 -4710491 -8994827 -9448543 -7686789 -4810694 537767 7214790
4432 7214790 9797322 5347728 -1741046 -4987534 -2575887 3818100 12361365 19196263
4424A9196263j153328j0324318j0791062j844375N100848J996352n025688o058396
4416h903704j883658n41581l834252n367788q23925O338662R942801P638207J862652
4407D427414k974812l937982j739096O25220J662486K296014K855566J886471
4399E101281j033456l950135n180546m821259k912119P87581M350364M605385
4391c052904J722315p93773j715404l178791m671020j621179O526423J2026885
4383E242552P819734k439228q417517n227050K763184Q439901Q083759K391135
4375A8656470m432626p105389m198276k98848n21420l610627l604968J798329
4367c317355P653194P692704K082101k592432j422779K164918N52406o793018
$$ plain form
4424 19196263 18042935 7718617 -3072445 -4916820 184028 2180380 -2845308 -8903704
4416 -8903704 -10787362 -11328943 -15163195 -20530983 -21354908 -15016246 -5073445 2564762 4427414
4407 4427414 1452602 -2485380 -4224476 -3599256 -1936770 359244 3214810 5101281
4399 5101281 4067825 117690 -5062856 -9884115 -12796234 -12008653 -7658289 -3052904
4391 -3052904 -1330589 -2124362 -3839766 -7018557 -11689577 -13310756 -6784333 5242552
4383 5242552 13062286 10623058 2205541 -3021509 -258325 8181576 16265335 18656470
4375 18656470 14223844 7118455 2920179 2621331 2099911 -1510716 -5115684 -3317355
4367 -3317355 4335839 12028543 14110644 11518212 10095433 12260351 12812757 6019739
4359F019739j0577750m035556O079860P848704J306559k036640K612179O112763
4351A3329858P32210o980306o371294J217554N596436K842218j637540l008079
4343E721057j724823Q53225M059294M913635K47455p035559r414021m097110L283080
4334c193767N615087J575299m783138q560462p411070k936658Q43303J965521
4326a6885885K643631N250913Q167401Q325583N840266K879154L0232k550871
4318A3700424k678632O67996L590418J744517k771009m195572j661443O79903
4310I076602J316811K647532M135376J122899p029822j3381871j1616553l909391
4302a7638417K652781M421414K991947J347572J335924L275674N400231M808255
$$ plain form
4359 6019739 -4558011 -8593567 -2513707 5334997 6641556 4604916 7217095 13329858
4351 13329858 14062068 7081762 710468 1928022 7524458 10366676 8729136 5721057
4343 5721057 3996234 4849459 8908753 13822388 14069843 7034284 -2379737 -6476847 -3193767
4334 -3193767 2421320 3996619 -786519 -9346981 -16758051 -19694709 -18851406 -16885885
4326 -16885885 -14242254 -8991341 -823940 7501643 13341909 16221063 16251295 13700424
4318 13700424 11021792 11689788 15280206 17024723 14253714 10058142 8396699 9076602
4310 9076602 10393413 13040945 17176321 18299220 11269398 -2112473 -13729026 -17638417
4302 -17638417 -14985636 -10564222 -7572275 -6224703 -4888779 -1613105 3787126 8595381
4294H595381J009323k486064j879631K429214O546499P483389N346987J714610
4286B8759708k303086n836514p439545o047616k793246l88330J90152J055492
4278E197015L958931O891873O551023L124650m13057k870055m856582m935714
4270A2648084q57627M887841O332160K434158j230469j158604m04890j762000
4262B0888653k929795k228072k501302m616523l959700O67970J872900m786438
4254B407693j0833324o381543L650729O311991L72248l133844O23482L896433
4246c086135O64539l997689l357693R34626L386878K860784J581269O60683L33637
4237a9101J117388K272627K051861N27274p64885j602968j945771K70702N193092
$$ plain form
4294 8595381 9604704 7118640 5239009 7668223 14214722 21698111 27045098 28759708
4286 28759708 26456622 20620108 13180563 7132947 4339701 3951371 4141523 5197015
4278 5197015 9155946 16047819 22598842 25723492 25310435 22440380 17583798 12648084
4270 12648084 11790457 16678298 23010458 25444616 24214147 23055543 22650653 20888653
4262 20888653 17958858 15730786 13229484 8612961 4653261 5321231 7194131 2407693
4254 2407693 -8425631 -14807174 -11156445 -4844454 -4472206 -7606050 -6982568 -3086135
4246 -3086135 -2421596 -6419285 -9776978 -8842352 -5455474 -2594690 -1013421 -352738 -19101
4237 -19101 1098287 3370914 5422775 5950049 5185164 3582196 1636425 1907127 7100219
4228G100219P130961J381898o661672p261075n10500L985118J917191o31317J286104
4219G736927M095029L176058k47275l256951n229257m640267Q74498P992114Q515999
4210A9016875O45617p078093o881860q21575M438528N660061K817066k618405
4202A5178214o060146l108528K576587J921053n796257r800577k976255P472103
4194e93806J0092823L457140n234871j0148915r954188n753489q52043J060997
4186a7926352O92822K220060O105466Q156079O613997L606826q29586p845273
4178G94039j2372090o900858N358970J1938600Q582243M043916M245669M073779
4170A9764268l60631l897299k730463r13440q10883J261142N051749M763890J567494
$$ plain form
4228 7100219 14231180 15613078 8951406 1690331 1179831 5164949 7082140 6450823 7736927
4219 7736927 11831956 15008014 14760739 11503788 6274531 1634264 2508762 10500876 19016875
4210 19016875 19662492 12584399 5702539 4880964 9319492 14979553 17796619 15178214
4202 15178214 9118068 6009540 8586127 10507180 4710923 -5089654 -8065909 -593806
4194 -593806 9499017 12956157 7721286 -2427629 -12381817 -18135306 -18987349 -17926352
4186 -17926352 -17233530 -15013470 -8908004 -751925 5862072 9468898 8639312 794039
4178 794039 -11578051 -18478909 -13119939 -1181339 7400904 11444820 15690489 19764268
4170 19764268 19403637 15506338 12775875 11862435 11051552 12312694 17364443 22128333 23695827
4161B3695827L287163Q030932N400816k160250j44815J0629879J2023548J490333
4153F2253433j689004O356698M538142r822988p932866J6249368K4811738N946985
4145A00711506J3654831P7148640J16101098L4114416j22076625j95450874j22175069
4138i7972077q875507K5780009j717133p335497K0309751K8168433M434607q413498
4130d5620912O217168J6803335M616851r363188p523035j020811j249126j537956
4122c8677674K440643L194468K66667L139121J0023158P989176k025433m685413
4114a8335287J933330K935427m850170o428929L044729Q520680K085239l741861
4106a4836842K18974M568915J180962j794892K779857O696609K322581k956105
$$ plain form
4161 23695827 26982990 35013922 40414738 38254488 38109673 48739552 60763100 62253433
4153 62253433 60564429 66921127 71459269 61636281 53703415 69952783 94764521 100711506
4145 100711506 114366337 191514977 307616075 341730491 219653866 24202992 -97972077
4138 -97972077 -106847584 -81067575 -82784708 -90120205 -69810454 -41642021 -37207414 -45620912
4130 -45620912 -39403744 -22600409 -17983558 -27346746 -34869781 -35890592 -37139718 -38677674
4122 -38677674 -36237031 -33042563 -32775896 -29636775 -19613617 -11624441 -13649874 -18335287
4114 -18335287 -16401957 -13466530 -18316700 -24745629 -21700900 -13180220 -11094981 -14836842
4106 -14836842 -14617868 -10048953 -8867991 -10662883 -7883026 -1186417 1136164 -1819941
4098a819941r78230K746106J125725j351120L17239L01883n723774q986505j705453
4089a6074070P841425P884423J495554j131529l36175k880308o931649n400037
4081a5532366K04527K396992J009336J831493M470572L080265k095505m437522
4073i072208j975577K97881p13992k648625l164843k627758j313934R22106K712743
4064a7584207K909546K633737K306509n9063l831506l688721K168747O517940
4056h627018K489146n542117p804099k886758J903127J920159n09679k089438
4048b1146677k017478J50724M150789O744756M918203Q85837n92879J043498K354364
4039c508863J454563q07599l446952m907009k318079M183249Q825880O880462
$$ plain form
4098 -1819941 -2798171 -52065 1073660 -277460 39779 341662 -5382112 -14368617 -16074070
4089 -16074070 -8232645 -348222 1147332 15803 -320372 -3200680 -10132329 -15532366
4081 -15532366 -15327839 -12930847 -11921511 -10090018 -5619446 -2539181 -4634686 -9072208
4073 -9072208 -11047785 -10749904 -11463896 -14112521 -17277364 -19905122 -21219056 -20296950 -17584207
4064 -17584207 -14674661 -12040924 -9734415 -9793478 -13624984 -17313705 -15144958 -8627018
4056 -8627018 -6137872 -11679989 -19484088 -22370846 -20467719 -18547560 -19057239 -21146677
4048 -21146677 -23164155 -23013431 -18862642 -12117886 -7199683 -6313846 -6906725 -5863227 -3508863
4039 -3508863 -2054300 -2861899 -6308851 -11215860 -13533939 -9350690 -524810 6355652
4031F355652J588009n87558J129097L019134L695337L446730K04985o254226r110647
4022C486513k474177P305414Q227028J36828m938194j314198K579932r79518o709698
4013E319930n726138L94028L107445m1590l560101l137212l52037J157449j70319
4004c008545l150633m472462j185058M923511P340165K333769n227854p159315
3996i606422k126415L147092K796841j602385m514297l697833j649532r02597
3988a8155548n58355J490789M477813N168957K485699m98290n15546J556502K185730
3979b362249K9142k657759k966926j03678M265117P041396N875862J783471j363291
3970I541085j364168l05789r71764k631253l007343k489225k815190k890004j10058
$$ plain form
4031 6355652 7943661 7356103 8485200 11504334 15199671 18646401 18851386 12597160 3486513
4022 3486513 1012336 8317750 16544778 16681606 11743412 10429214 13009146 12029628 5319930
4013 5319930 -406208 -12180 3095265 3053675 -506426 -3643638 -3995675 -2838226 -3008545
4004 -3008545 -6159178 -10631640 -11816698 -6893187 446978 2780747 -2447107 -9606422
3996 -9606422 -11732837 -8585745 -5788904 -7391289 -11905586 -15603419 -17252951 -18155548
3988 -18155548 -18713903 -17223114 -12745301 -7576344 -5090645 -5588935 -6104481 -4547979 -2362249
3979 -2362249 -2333107 -4990866 -7957792 -8061470 -3796353 3245043 9120905 10904376 9541085
3970 9541085 8176917 7871128 6899364 4268111 1260768 -1228457 -4043647 -6933651 -7043709
3961g043709M468641O433532L958053j95224l202657n024622n648484l231239
3953i485709K650433Q220706Q491767K491228n490267r536054p153633j471577
3945a1283106K136137K090847J443096J823552L27647m382230p008469k594801
3937a7447327M139706M106432k210754m659017J161959P065597M987032j153596
3929d009968k563185J163711L380157J664092J36430J488147L335107L080426
3921G674917J247556j004482l473922m876154k883736K117579N966858N142814
3913I911430O08455l866013n748041n083818l110999r74065M63186N87444n40210
3904g752631j686727j097089J344964K888916M69292n026700q629780o487636
$$ plain form
3961 -7043709 -2575068 3858464 7816517 7621293 4418636 -605986 -6254470 -9485709
3953 -9485709 -6835276 1385430 9877197 12368425 6878158 -2657896 -9811529 -11283106
3945 -11283106 -9146969 -7056122 -5613026 -3789474 -3461827 -7844057 -14852526 -17447327
3937 -17447327 -13307621 -9201189 -11411943 -16070960 -14909001 -7843404 -2856372 -4009968
3929 -4009968 -6573153 -5409442 -2029285 -365193 -228763 1259384 4594491 7674917
3921 7674917 8922473 7917991 4444069 -432085 -3315821 -1198242 4768616 9911430
3913 9911430 10519885 6653872 905831 -4177987 -7288986 -8263051 -7799865 -7212421 -7752631
3904 -7752631 -9439358 -10536447 -9191483 -6302567 -5833275 -10859975 -19489755 -25977391
3896b5977391j06598N534195P059967M991336K129929R21624J760563K890625
3888g95750K329386K22267j464315j639013j107126o48033J39494J313976J677224
3879B8110N21394j141041k151613k627805k855332k337205j083841k17911N0698
3870a1814546J376199M471765O805474N253818L40246m103468n237416l635121
3862f543049j527499o0493J186748K612963L372819K392423L87837o21090m54066
3853G46593j343036l682351l800201O96940N615288N061923L65449j753736K99155
3844B206024J149212j602245l064464M4409L383186K772142J353366K621423K358010
3835A1221063m181962j1442411r661429P4228O628658M802358J068651J359812
$$ plain form
3896 -25977391 -26083989 -20549794 -13489827 -8498491 -6368562 -5446938 -3686375 -795750
3888 -795750 1533636 1755903 291588 -1347425 -2454551 -3102584 -2963090 -1649114 28110
3879 28110 549504 -591537 -2743150 -5370955 -8226287 -10563492 -11647333 -11865244 -11814546
3870 -11814546 -10438347 -5966582 838892 6092710 6432956 2329488 -2907928 -6543049
3862 -6543049 -8070548 -8131041 -6944293 -4331330 -958511 1433912 1821749 1200659 746593
3853 746593 -596443 -4278794 -8078995 -7382055 -1766767 3295156 3660605 1906869 2206024
3844 2206024 3355236 1752991 -1311473 -1267064 2116122 4888264 6241630 8863053 11221063
3835 11221063 7039101 -4403310 -14064739 -13990511 -7361853 -2559495 -1490844 -131032
3827a31032K131298j913483q039629r143998l326791M839180J0030189R770925
3819D216659M863854o50979k167821J64851J027808k675073o673771m955170J470377
3810e379265N393327K430012m217935q358507p448253l687505l92892J155243
3802b0505775J757970K545764L862780N422743O488067N744017K331688k277937
3794E369317m852395l957039j487802O28494L213511P078658R537624P144889
3786B2675257J067701l637991l964847j523501L04180p37686m627217p917088
3778A638808n412716L140644R799146O897227k362748p596019m924362l29417
3770H50563R02564L90382L76831q56070l469292l103566J524747M242632L88758
$$ plain form
3827 -131032 2000266 86783 -7952846 -17096844 -20423635 -15584455 -5554266 4216659
3819 4216659 9080513 8429534 6261713 6426564 7454372 4779299 -1894472 -6849642 -5379265
3810 -5379265 14062 2444074 -1773861 -10132368 -17580621 -21268126 -21661018 -20505775
3802 -20505775 -18747805 -16202041 -12339261 -6916518 -428451 5315566 7647254 5369317
3794 5369317 516922 -3440117 -4927919 -4299425 -1085914 5992744 15530368 22675257
3786 22675257 23742958 20104967 16140120 14616619 14920799 14183113 9555896 1638808
3778 1638808 -3773908 -633264 9165882 16063109 13700361 6104342 1179980 850563
3770 850563 1753127 2143509 2520340 1664270 -1805022 -4908588 -3383841 858791 1247549
3761A247549n200731n450065j547071P40302J176477L555236O689903N298611
3753F510211p21361n428473n625868l938047k480589J53238M100471O069882M128961
3744B768425M06407k571018m456121m964491l165021q6379J648124J789090K458258
3735f172726L527269K173628j759325m097938j829575L079157O777402P369446
3727I067338M852234P02760j797842o12677J306717k09431k995316r49912M935502
3718A4299373N690321j920710q527947n105589L622742O531393K135133j722160
3710A5002556j552865j810331m733533n860689k183694K657827M723541N256634
3702A1499446O134518N223009P41098m022107n224248m452887n208063o084706
$$ plain form
3761 1247549 -3953182 -9403247 -10950318 -10210016 -9033539 -5478303 1211600 6510211
3753 6510211 5788850 360377 -5265491 -9203538 -11684127 -11530889 -7430418 -1360536 2768425
3744 2768425 3174832 603814 -3852307 -8816798 -11981819 -12068198 -10420074 -8630984 -6172726
3735 -6172726 -2645457 -471829 -2231154 -6329092 -8158667 -5079510 1697892 9067338
3727 9067338 13919572 14622332 12824490 12211813 13518530 13309099 10313783 9363871 14299373
3718 14299373 19989694 18068984 9541037 4435448 8058190 14589583 16724716 15002556
3710 15002556 13449691 11639360 6905827 1045138 -1138556 1519271 6242812 11499446
3702 11499446 17633964 22856973 23598071 19575964 14351716 9898829 4690766 -1393940
3694a393940l209766J914210L234171p36210m362480l269112k32078J93740j454405
3685i315870k105777k108633l367620l651036Q66698P381472P553281n74302p589121
3676a2910908m291013N854760J1529922Q314192K201610q23872j690575l015931
3668E168185l344177p01614K185303J054652l275810n536059k793884K287340
3660d956064M888778K803035j925309m733017k621881K320968M676443K225411
3652B678364r71602J26557M891390Q143066O621986J654224l695151p214637p679835
3643D554362n218217j799918O02292K169739L841901M745303L518868J284502
3635A3698832J66649n25519k906865n432031l697688K444890O957402N298325
$$ plain form
3694 -1393940 -4603706 -2689496 544675 -191535 -4554015 -7823127 -8055205 -7861465 -9315870
3685 -9315870 -11421647 -13530280 -16897900 -20548936 -19682238 -12300766 -4747485 -5321787 -12910908
3676 -12910908 -17201921 -11347161 182761 8496953 10698563 9874691 8184116 5168185
3668 5168185 1824008 1122394 3307697 4362349 1086539 -4449520 -7243404 -4956064
3660 -4956064 -67286 2735749 810440 -3922577 -6544458 -4223490 452953 2678364
3652 2678364 1706762 1833319 6724709 14867775 21489761 23143985 19448834 12234197 4554362
3643 4554362 -663855 -2463773 -1861481 308258 4150159 8895462 12414330 13698832
3635 13698832 13865481 13339962 10433097 5001066 1303378 3748268 10705670 16003995
3627A6003995M72989j746690p73349n70408k967927n847237p384824p963986p275684
3618a8053121l325412L676424R062556Q219799K524463j744068o97923K939373
3610B602091L925159J194869j636795j976834j687878l517974o229705n887192
3602a3214259j433074L478361M699775K070775p97959k35918L942016P657207
3594F166924O038630q14595o592591n712775n19275J925947k50542j848707L38863
3585a268121K131657q68187n356873m919685K36816M077337M075186L570978M362541
3576F041649L097743k398838q033241q468799m330723o74338J4716j76905J280588
3567a3648148M415269P870684J0268699R964614N687879j400568p546344r503046
$$ plain form
3627 16003995 16476984 14730294 13956945 13386537 10418610 4571373 -2813451 -10777437 -18053121
3618 -18053121 -21378533 -17702109 -8639553 -419754 2104709 360641 -337282 2602091
3610 2602091 6527250 7722119 6085324 4108490 2420612 -1097362 -7327067 -13214259
3602 -13214259 -14647333 -11168972 -6469197 -4398422 -5196381 -5432299 -1490283 6166924
3594 6166924 12205554 11390959 4798368 -914407 -1433682 492265 241723 -1606984 -1268121
3585 -1268121 863536 -4651 -5361524 -10281209 -10044393 -5967056 -1891870 1679108 6041649
3576 6041649 9139392 6740554 -1292687 -9761486 -14092209 -14766547 -14751831 -14928736 -13648148
3567 -13648148 -9232879 -1362195 8906504 18871118 24558997 23158429 15612085 6109039
3559F109039p435129m067546j247381J743448N930586R354347P826931K10075
3551A8424370q330472j0816957o231320k42893K406218L003396M384815M860678
3543G457835J043106m865604o109019o75104N131237M845184M48k984997j422145
3534B420941J726390K808164P08203l775459q086661q237573l056049K249478
3526a3242566J447966l439818l771895K974425Q250859M547793k945055l534487
3518i712778L372961P969210M754258q26890k510290k132038l688291m680963
3510g454821m02859O334692P384203J056485m955943m429163r15042j395846n302200
3501a0080494n273022J636816Q682018P864429M83082m796693l519033l74664
$$ plain form
3559 6109039 -1326090 -5393636 -6641017 -4897569 1033017 10387364 18214295 18424370
3551 18424370 10093898 -723059 -6954379 -7197272 -4791054 -1787658 2597157 7457835
3543 7457835 8500941 3635337 -2473682 -3148786 1982451 6827635 6828083 3843086 2420941
3534 2420941 4147331 6955495 7663698 3888239 -4198422 -12435995 -15492044 -13242566
3526 -13242566 -11794600 -15234418 -19006313 -16031888 -7781029 -3233236 -6178291 -9712778
3518 -9712778 -6339817 1629393 6383651 5556761 3046471 914433 -2773858 -7454821
3510 -7454821 -7857680 -1522988 5861215 6917700 1961757 -2467406 -3382448 -4778294 -10080494
3501 -10080494 -15353516 -13716700 -5034682 2829747 3312829 -1483864 -5002897 -5377561
3493e377561j032414l573225k300004K719605N734697M406054K671074L140663
3485F388889K715785r60754m182099l270991j615450m273947q412297o546707
3477b0157571J370589O656344M149584r20817j286868K641617N365952M453177
3469B272007J673635j206679l357438l292301m23809K630580K786182J006193
3461B088370Q99750L135644M442097K425972j457789m387467n195437m070205
3453b119065j385048J941634M344667M970852M304170L059339J673144J152598
3445A7942291K534258M452803L147296l043639j0194737j2188629p613082j255244
3437f218683J639348N69178j558439k670080k419303m62203L232495O602927O744200
$$ plain form
3493 -5377561 -6409975 -9983200 -12283204 -9563599 -3828902 577152 3248226 6388889
3485 6388889 9104674 8143920 3961821 690830 -924620 -5198567 -13610864 -20157571
3477 -20157571 -18786982 -12130638 -7981054 -8901871 -10188739 -7547122 -2181170 2272007
3469 2272007 3945642 2738963 -618475 -3910776 -4334585 -1704005 1082177 2088370
3461 2088370 2988120 6123764 10565861 12991833 11534044 7146577 1951140 -2119065
3453 -2119065 -3504113 -1562479 2782188 7753040 12057210 15116549 16789693 17942291
3445 17942291 20476549 24929352 28076648 25033009 14838272 2649643 -4963439 -6218683
3437 -6218683 -4579335 -4010157 -5568596 -8238676 -10657979 -11120182 -7887687 -1284760 5459440
3428E459440L489466l81510k894931m418165m924356k950575J011467L234252
3420b374912J592498r36820q69393J07431j799350n561686o503193l696962q22020
3411b0864407O58556L454678P942607R343037M738661j494879l321996r81251
3403e24994P20632l63952k244930k862381j802238Q88317M115911M991924K020447
3394D938736j937571l251566k907851m217529n892957k649030O036300J2571740
3386B690272R848596L95867o490300n561393m67785K095868K11858k763246l758283
3377c798546l285119k813657j575272J639798N040690N556304L680887K872502
3369G317587L568195K074430k740642o059507l804240R12593K269646j33345k337366
$$ plain form
3428 5459440 8948906 8567396 5672465 1254300 -3670056 -6620631 -5609164 -2374912
3420 -2374912 -782414 -1719234 -2588627 -2481196 -4280546 -9842232 -16345425 -20042387 -20864407
3411 -20864407 -20205851 -16751173 -8808566 534471 5273132 3778253 456257 -524994
3403 -524994 195638 -168314 -2413244 -5275625 -7077863 -6189546 -2073635 2918289 4938736
3394 4938736 3001165 -250401 -3158252 -7375781 -13268738 -15917768 -9881468 2690272
3386 2690272 12538868 12934735 6444435 883042 415257 2511125 2722983 -40263 -3798546
3377 -3798546 -7083665 -9897322 -11472594 -9832796 -4792106 764198 4445085 7317587
3369 7317587 10885782 12960212 10219570 4160063 355823 1268416 3538062 3404717 1067351
3360A067351k998365l944093m981343l752735o99289R77395O47774O57242J000017
3351a2026046j075804m966375n664856j075590M448106O580013O530606O835349
3343d14597N913127J249093m881036p545588n693593k751436j442336j171273
3335a6737639k11954J953585M274778M586387J288058m013890o834617m427815
3327b0123107J085760N466123O530053M312816k94129m587303m231089J920193
3319i920683Q416158Q307184J326896o090948q569902o250846j683499L553290
3311a0912350P576389P187401J410110n469243p572661m194606n65256j224694
3303a3764910m622863n714811k426652K644777O198537P046710M876051k14677
$$ plain form
3360 1067351 -1931014 -5875107 -10856450 -14609185 -15308474 -14331079 -13683305 -13026063 -12026046
3351 -12026046 -13101850 -18068225 -23733081 -24808671 -20360565 -13780552 -7249946 -414597
3343 -414597 5498530 6747623 1866587 -5679001 -11372594 -14124030 -15566366 -16737639
3335 -16737639 -16949593 -14996008 -10721230 -6134843 -4846785 -8860675 -15695292 -20123107
3327 -20123107 -19037347 -13571224 -7041171 -2728355 -3022484 -7609787 -11840876 -9920683
3319 -9920683 -1504525 6802659 8129555 2038607 -6531295 -12782141 -14465640 -10912350
3311 -10912350 -3335961 3851440 5261550 -207693 -7780354 -11974960 -12540216 -13764910
3303 -13764910 -18387773 -24102584 -26529236 -23884459 -17685922 -10639212 -5763161 -5977838
3295e977838n274608n173051R72754O671338N464367l84073l234297p89989J992415
3286e732982J404985o39182j816633l034913m542466l681217M66730M608300O207480
3277f759898O545907O254901L105729k110843l188554K670061Q444801O074098
3269B1036202j987470o674870m935740j330745R94365L175551M845148L059884
3261A8182325j642447m352462k856516n44935m99905j290963p29245J02853j025306
3252E343399l887858o068523n364408j661586K145613K217604j104082k305570
3244a0685411J927831O997214O731496K773379J274846K144182m25420o797221
3236C940896r870181o240683j414446m89280p71118J946903N857551O872334N017961
$$ plain form
3295 -5977838 -11252446 -16425497 -15452743 -8781405 -3317038 -3701111 -6935408 -7725397 -5732982
3286 -5732982 -4327997 -4967179 -6783812 -9818725 -14361191 -18042408 -17575678 -12967378 -6759898
3277 -6759898 -213991 6040910 9146639 7035796 3847242 6517303 14962104 21036202
3269 21036202 19048732 12373862 7438122 6107377 7101742 10277293 15122441 18182325
3261 18182325 16539878 12187416 9330900 8785965 8286060 6995097 6265852 6368705 5343399
3252 5343399 1455541 -4612982 -9977390 -11638976 -9493363 -7275759 -8379841 -10685411
3244 -10685411 -8757580 -1760366 4971130 7744509 9019355 11163537 10738117 3940896
3236 3940896 -5929285 -12169968 -13584414 -14073694 -14844812 -12897909 -7040358 -168024 4849937
3227D849937K330323j351154n794222p554303m649791p24246J53655l28992J430395
3218a1638398L983112L222837k56267j785477Q1331J673322k34346m399145o843071
3209a6196102m567000J669951O810812N767652l1244l302132m87375L037686R98906
3200f298846m275339n545011j191849L735923N556095N177486L737929P67237
3192A663625k500135k866606K56739L628138M764737M708895N154774N543767
3184B0353934M277911J034707k838021n108899m235925j519963o21548l050107
3176H292089n414348l429710K590413Q464602J0667321P750652j06258r173211
3168A9641550j2232960n764986L942044O977983J771070m117065m999127l261473
$$ plain form
3227 4849937 7180260 5829106 34884 -7519419 -12169210 -12893456 -12739801 -13068793 -11638398
3218 -11638398 -7655286 -4432449 -4688716 -6474193 -6392862 -4719540 -4953886 -9353031 -16196102
3209 -16196102 -20763102 -19093151 -12282339 -6514687 -6545931 -9848063 -10335438 -7297752 -6298846
3200 -6298846 -10574185 -16119196 -17311045 -13575122 -8019027 -2841541 896388 1663625
3192 1663625 -836510 -3703116 -3446377 181761 4946498 9655393 14810167 20353934
3184 20353934 24631845 25666552 22828531 17719632 13483707 11963744 11342196 8292089
3176 8292089 2877741 -551969 2038444 10503046 21170367 28921019 28814761 19641550
3168 19641550 7408590 1643604 5585648 12563631 14334701 10217636 5218509 1957036
3160A957036l447997n413653n790969k692290L000618Q327958R471737N507145
3152A0919585J251422K306752O775194O893943K63988o168907o156624k688340
3144A3397013k044350l829693k932009R53255K161415k331104q148042r091382
3136a1864897m450485J123577L453786K874575K685596M504838N983351L752699
3128H063040j919442o901148p699347m598617r2593L745942N496036M209300Q28485
3119A131656j514024m75955K730143M806004M123807J981243M93508J52363m92375
3110A2936370k913289o187583o989693l162932K780025N321250J880578l936830
3102b72104o028362k383895K790092L823419J56667k898042r07670L483404L894436
$$ plain form
3160 1957036 -1490961 -6904614 -12695583 -15387873 -12387255 -4059297 5412440 10919585
3152 10919585 12171007 14477759 21252953 28146896 28410884 22241977 16085353 13397013
3144 13397013 11352663 7522970 4590961 5544216 7705631 5374527 -2773515 -11864897
3136 -11864897 -16315382 -15191805 -11738019 -8863444 -6177848 -1673010 4310341 8063040
3128 8063040 6143598 -757550 -8456897 -13055514 -13148107 -9402165 -3906129 303171 1131656
3119 1131656 -382368 -858323 1871820 6677824 10801631 12782874 13276382 13428745 12936370
3110 12936370 10023081 3835498 -3154195 -6317127 -3537102 1784148 3664726 -272104
3102 -272104 -6300466 -8684361 -5894269 -2070850 -1914183 -4812225 -5719895 -2236491 1657945
3093A657945n61204l605455r99140L130414K869215m79245j405791K61847o46145
3084B22441n450867q628322n377517K407624R036623J0243945N138154k961505
3076D630576p323046l866052L157908O010533L764157K048630K587939O41243
3068A1651888n095465q130710m144672J533536J905659j880608m490272n044571
3060a3695215n308550l661589J688853O399275M479406k316611o432748n007995
3052b3855174j949807k089K506377O171722P904780N829631K272883p8869j562906
3043b763452l549196n809705o963478n522014m92701O746116J1700054J0713788
3035D059412N321170J35981k577448l397111k591887n65201m4681k957223n867969
$$ plain form
3093 1657945 1096741 -2508714 -3507854 -377440 2491775 2012530 606739 868586 222441
3084 222441 -5228426 -13856748 -19234265 -16826641 -7790018 2453927 7592081 4630576
3076 4630576 -2692470 -6558522 -3400614 2609919 6374076 8422706 11010645 11651888
3068 11651888 6556423 -1574287 -5718959 -4185423 -2279764 -4160372 -8650644 -13695215
3060 -13695215 -19003765 -22665354 -20976501 -14577226 -10097820 -12414431 -18847179 -23855174
3052 -23855174 -25804981 -25807070 -23300693 -17128971 -9224191 -3394560 -1121677 -1200546 -2763452
3043 -2763452 -6312648 -12122353 -19085831 -24607845 -25100546 -18354430 -6654376 4059412
3035 4059412 9380582 9516563 6939115 3542004 950117 384916 340235 -2616988 -8484957
3026h484957l768009J896255M714981L057796J762639K647235O84050o400488
3018c890498j1235985n920565N790747J2293387Q760135J660201j590793j517771
3010D348858k592617m834919m075694N46482L909903J528120l920668n890964
3002a0981499k898978l56555k514688o251250n673819l80312M529203N511025
2994a9016873M048274L296398M337291N956224N786133J903359m404766q154023
2986f247983n777732r8631L022070K411629K076817M081592N527044L855726R45181
2977I795713k30712K98610R62714J344791J138841r60077m733103o892495m786439
2968d062157k72913K521306K242364Q60306L4726o35359j739181k455945j654050
$$ plain form
3026 -8484957 -12252966 -10356711 -5641730 -2583934 -821295 1825940 2509990 -3890498
3018 -3890498 -15126483 -21047048 -15256301 -2962914 5797221 7457422 5866629 4348858
3010 4348858 1756241 -3078678 -7154372 -6607890 -2697987 -1169867 -5090535 -10981499
3002 -10981499 -13880477 -14237032 -16751720 -23002970 -28676789 -29057101 -24527898 -19016873
2994 -19016873 -14968599 -11672201 -7334910 -1378686 4407447 6310806 1906040 -6247983
2986 -6247983 -12025715 -12124346 -9102276 -6690647 -4613830 -532238 4994806 8850532 9795713
2977 9795713 9565001 9863611 10826325 12171116 13309957 12349880 7616777 724282 -4062157
2968 -4062157 -4335070 -1813764 428600 1288906 1323632 688273 -1050908 -3506853 -5160903
2959e160903L25559J862549K012031J594236J648365J280463j299397n257551
2951b994648o801412l738543J506956N081115N833622M293410K57397n259734
2943a821837q024152m917934J028859M252134M137698M251108N251331M234076
2935H391283R59016j265524j679779l139060n725002n301406p00368L310311L112842
2926b037687J199653J093719K260039L193235M531386N566514K809371l695931
2918A4920299p529311m337014J192570K078335j139773k956888j694138L88891
2910I22971K710150N444861N292625p21087q305862r683656m179212J253027K182288
2901e083895J081757R44835J030093Q57006K560792O257644P598618L332378l676712
$$ plain form
2959 -5160903 -4835344 -2972795 -960764 633472 2281837 3562300 2262903 -2994648
2951 -2994648 -9796060 -13534603 -12027647 -6946532 -1112910 3180500 3437897 -1821837
2943 -1821837 -9845989 -14763923 -13735064 -9482930 -5345232 -1094124 4157207 8391283
2935 8391283 9350299 8084775 6404996 3265936 -2459066 -7760472 -8460840 -5150529 -2037687
2926 -2037687 -838034 255685 2515724 5708959 10240345 15806859 18616230 14920299
2918 14920299 7390988 3053974 4246544 6324879 5185106 2228218 534080 922971
2910 922971 3633121 9077982 14370607 13649520 5343658 -4339998 -8519210 -7266183 -5083895
2901 -5083895 -4002138 -3057303 -2027210 -1170204 1390588 7648232 15246850 18579228 14902516
2892A4902516p773772o766246k971562J6336J48890j720063k324114N38911M820216
2883a128888O618923N499254M402340M342323L101588j3426k417992l111838n072459
2874A2219825r717645j2603147q958877j341351L004559J766890j38159J413871
2866a4354034M014869L592551J485756K256070N749169O437153J886588k729917
2858H338205j868863K066306K410340j698039m725288m012754l254379m810916
2850g555388m709013N89229P086708Q155778L783319j62032l33177J075099R67642
2841H898165j014859l370257m333615k988307p78835n24188k086316j623710K303507
2832e518415N319657L689126O32553J211411M068749M226133J594895L9626k36407
$$ plain form
2892 14902516 7128744 362498 -2609064 -2592728 -2443838 -4163901 -6488015 -5949104 -1128888
2883 -1128888 5490035 10989289 15391629 19733952 22835540 22822114 20404122 17292284 12219825
2874 12219825 2502180 -10100967 -19059844 -20401195 -17396636 -15629746 -15767905 -14354034
2866 -14354034 -10339165 -6746614 -5260858 -3004788 2744381 9181534 11068122 8338205
2858 8338205 6469342 8535648 10945988 9247949 4522661 509907 -2744472 -7555388
2850 -7555388 -12264401 -11675172 -4588464 3567314 7350633 7188601 6855424 7930523 8898165
2841 8898165 7883306 4513049 179434 -2808873 -3587708 -4111896 -6198212 -7821922 -5518415
2832 -5518415 -198758 3490368 4122921 5334332 9403081 13629214 15224109 15263735 15027328
2823A5027328k177024m811619m308187j836428k516314n971837o050157j429692
2815a4073930J711966N9490j949032r35559k17788k093849k097047L220004R110399
2806g265346R427146N262928R00385l433636q149934q890760k593391M758305
2798i984303M938925j45493j278764L809468P356459L569827l585201o767868
2790b086950l975535J346793M861324M242291N73208k206388j680095m08426k041501
2781a375279n137096n061796j313486J972189K830015L597298N442764N935755
2773F890364L768305J240796j05008k080543n573831p573601n471088j168211
2765a0072817K096980M129886N747903N067200l9536p077196j0500532q109899
$$ plain form
2823 15027328 12850304 8038685 3730498 1894070 -622244 -6594081 -12644238 -14073930
2815 -14073930 -12361964 -12302474 -14251506 -15187065 -15404853 -17498702 -19595749 -16375745 -7265346
2806 -7265346 2161800 7424728 8325113 4891477 -3258457 -12149217 -14742608 -9984303
2798 -9984303 -5045378 -5190871 -6469635 -2660167 4696292 8266119 4680918 -2086950
2790 -2086950 -6062485 -4715692 145632 4387923 4961131 2754743 1074648 666222 -1375279
2781 -1375279 -6512375 -11574171 -12887657 -10915468 -8085453 -4488155 954609 6890364
2773 6890364 10658669 11899465 11794457 9713914 4140083 -3433518 -8904606 -10072817
2765 -10072817 -7975837 -3845951 1901952 6969152 6929616 -147580 -10648112 -18758011
2757a8758011k950151J175490L342626M261072M026717K509173N33973p18337
2749f577448r77025p19032j66199P09942J296492M49199j835587l403451j821626
2740a3044735K416589N711282N280581K416711N97900J023568J790465J418042
2732G610403J014295J872310K670438J123404k200263m036499k945253j523306
2724C585529k402946l636881j013499N228772R442436P696382K674755j032868
2716B0541680l414367o653878q616613m846050K784890N861374N57474o225920
2708a1410n918418K81385L761641P1593o562084r463864o395467m87707K795237
2699b1929094J60172n535649o908486m41705Q127238J0223013M987082o71115
$$ plain form
2757 -18758011 -21708162 -20532672 -17190046 -12928974 -8902257 -6393084 -5859111 -6577448
2749 -6577448 -7554473 -8273505 -8439704 -7729762 -6433270 -5984071 -7819658 -11223109 -13044735
2740 -13044735 -10628146 -4916864 363717 2780428 3378328 4401896 6192361 7610403
2732 7610403 8624698 10497008 13167446 14290850 12090587 8054088 5108835 3585529
2724 3585529 1182583 -2454298 -3467797 1760975 11203411 18899793 21574548 20541680
2716 20541680 17127313 10473435 1856822 -2989228 -204338 5657036 6214510 -11410
2708 -11410 -5929828 -5648443 -1886802 -1815209 -8377293 -17841157 -24236624 -24724331 -21929094
2699 -21929094 -21768922 -27304571 -34213057 -34654762 -26527524 -16304511 -11317429 -11988544
2691a1988544j795092k51350O21903J151782K781647M183117L162015N12324q56442
2682b478640P0778J252185M45938j727355k003263J764517O987324Q091886L141929
2673A5545299l174866n427004m310120m213675n678440n255471k488920j208277
2665a6211474k366102j311672M465729R697418Q278169K684535Q50005M798356
2657A0884964P920016M437433k905109o958694n231036j899490j603120l875495
2649G69469m711142k271138Q95111J591358J22424q35392k85057N65129J396020
2640b763218L382269N935921N836074J608308l374655m647055k205406J19559
2632C891797o1191j647474k870352l322657k713746l01467K985368L890383M96437
$$ plain form
2691 -11988544 -13783636 -14034986 -13413083 -12261301 -9479654 -5296537 -2134522 -1622198 -2478640
2682 -2478640 -2407862 -1155677 -709739 -2437094 -4440357 -2675840 4311484 12403370 15545299
2673 15545299 12370433 6943429 2633309 -1580366 -7258806 -12514277 -15003197 -16211474
2665 -16211474 -18577576 -19889248 -15423519 -5726101 2552068 5236603 6086608 10884964
2657 10884964 18804980 23242413 20337304 13378610 8147574 6248084 4644964 769469
2649 769469 -3941673 -6212811 -5317700 -3726342 -3603918 -4439310 -4724367 -4159238 -2763218
2640 -2763218 619051 6554972 12391046 13999354 10624699 5977644 3772238 3891797
2632 3891797 3830606 2183132 -687220 -4009877 -6723623 -7025090 -4039722 -149339 347098
2623C47098m290878n109862j73298O629513J0059658Q565627M355873o768l458862
2614A6918101n590513n882577m271605j521442J261654K977499K774944Q91989
2606G558050j159991k329705l228439m156683l209882Q56081M663036L125029
2598B117496l014073o692699l482586K644812N114633L091462Q25795J196479
2590A801319L315642M822304L680804n51045m820383m385497Q19587M725531L340978
2581A2749240P02632K006065M592830K186116m492007q634874p668634n266792
2573c825424l417449k02015L685385L877574r5692k975969j939287k40102k40549
2564e373528O10550L628821N081772K467423r45721j649733n99034J048910M654277
$$ plain form
2623 347098 -3943780 -9053642 -9226940 -2597427 7462231 16027858 20383731 20376963 16918101
2614 16918101 11327588 5445011 1173406 -348036 913618 3891117 6666061 7558050
2606 7558050 6398059 4068354 839915 -3316768 -6526650 -5670569 -1007533 2117496
2598 2117496 -896577 -7589276 -11071862 -8427050 -3312417 -220955 604840 1801319
2590 1801319 5116961 9939265 13620069 13069024 8248641 3863144 4682731 9408262 12749240
2581 12749240 13451872 15457937 20050767 22236883 17744876 9110002 1441368 -3825424
2573 -3825424 -7242873 -7444888 -3759503 118071 22379 -2953590 -4892877 -5132979 -5373528
2564 -5373528 -4762978 -1134157 3947615 6415038 5469317 3819584 3220550 4269460 8923737
2555H923737Q387519N803881l876906j0570781o015089L546237N835675k43271
2547A1791002n108527l856491j291568j618218k332543o43942J292862P75807
2539i91618r17553j357005q45966j312359l552743o387450o841579k149778N878254
2530a8477797J0471948P642925K084338N34712J792143p8607m491200m813304
2522e334842k40191K114131n12689j393420L738098Q111961M611270j652937p76989
2513H664392N836309P159390k93145p113339n442659L3289R39690j600069m41587
2504G742271M246131M146026l782473j0932984q288256J292175P458038N755828
2496G636756O18463l236574n602408o643191m599704l8419K791345J785857N9615
$$ plain form
2555 8923737 17311256 23115137 19238231 8667450 2652361 6198598 12034273 11791002
2547 11791002 6682475 2825984 1534416 -83802 -2416345 -3060287 -1767425 -991618
2539 -991618 -1909171 -3266176 -4112142 -5424501 -8977244 -15364694 -22206273 -24356051 -18477797
2530 -18477797 -8005849 -362924 1721414 2256126 4048269 3969662 -521538 -5334842
2522 -5334842 -5575033 -3460902 -3973591 -5367011 -1628913 6483048 11094318 9441381 8664392
2513 8664392 14500701 21660091 21366946 14253607 8810948 8844237 9783927 8183858 7742271
2504 7742271 11988402 16134428 12351955 1418971 -6869285 -5577110 1880928 7636756
2496 7636756 8255219 5018645 -583763 -7226954 -11826658 -11865077 -9073732 -7287875 -7228260
2487g228260N99593J969988K003325J414785P56918j593616m986229n059034q47202
2478a2969732K090143O10848J1652M488141P784693K448449o451721p692003j125725
2469a0805255L030848J054159l22926K263359L347931K47818j321236J902094
2461f03208M537352K900329J853155M661376N234272j277683q189444p181609
2453A934540k119626k345927o453720m211816O408252J4688484J1511895N45510
2445A9957592p605634p279734j499819K804656J658295k320559l192212O41737
2437C164322M326311L637626N89745q40262n44434P5327K089607N543721N894829
2428B3936792J98414o235911o209523j294527J104489m80370p41074K185814M062441
$$ plain form
2487 -7228260 -6628667 -4658679 -2655354 -1240569 -483651 -2077267 -7063496 -12122530 -12969732
2478 -12969732 -10879589 -10268741 -10257089 -5768948 2015745 4464194 -1987527 -9679530 -10805255
2469 -10805255 -7774407 -6720248 -7043174 -4779815 -1431884 -1184066 -2505302 -603208
2461 -603208 3934144 6834473 8687628 13349004 18583276 17305593 9116149 1934540
2453 1934540 -185086 -2531013 -8984733 -13196549 -6788297 7900187 19412082 19957592
2445 19957592 12351958 5072224 3572405 6377061 8035356 5714797 2522585 3164322
2437 3164322 7490633 11128259 11718004 10877742 10333308 10408635 12498242 18041963 23936792
2428 23936792 24135206 17899295 11689772 10395245 11499734 11019364 10278290 12464104 16526545
2419A6526545K858702J621081J272845j604626o942623q601798l755183J651880
2411C026823J843653M4365K334439O855858O194294j108361p954107q089273l143511
2402D180J168582K181815J348068L50957j023390l126697m520745l226398M64999
2393f378629L772242M368467K500205j22584k157489k863475k245511j706356
2385d833130k552642l182778p06754L457997L737653j150177m461164p65092N009578
2376e446509M198587k666694o904065m460354J02993K612046M329405O152761
2368b081830N231098P42956l016006k963574j541164j430731j178193L30919M01739
$$ plain form
2419 16526545 19385247 21006328 22279173 20674547 13731924 5130126 1374943 3026823
2411 3026823 4870476 4914841 7249280 14105138 20299432 19191071 11236964 3147691 4180
2402 4180 1172762 3354577 4702645 5053602 4030212 903515 -3617230 -6843628 -6378629
2393 -6378629 -2606387 1762080 4262285 4139701 1982212 -881263 -3126774 -4833130
2385 -4833130 -7385772 -10568550 -11275304 -7817307 -4079654 -5229831 -9690995 -10456087 -5446509
2376 -5446509 -1247922 -3914616 -10818681 -15279035 -15176042 -12563996 -8234591 -2081830
2368 -2081830 3149268 3892224 876218 -2087356 -3628520 -5059251 -6237444 -5906525 -5504786
$$ [...]
##END NTUPLES=NMR SPECTRUM
##END=
