##TITLE=31Pdec_DE-91_4_oil
 CDCl3, 64 sc
 18.4.2025
##JCAMPDX= 6.0         $$ Bruker NMR JCAMP-DX V2.0
##DATA TYPE= NMR SPECTRUM
##DATA CLASS= NTUPLES
##ORIGIN= UXNMR, Bruker Analytische Messtechnik GmbH
##OWNER= root
$$ XWIN-NMR		Version 3.5
$$ Fri Apr 18 15:30:27 2025 Russian Standard Time (UT+4h)  she@DPX200
##.OBSERVE FREQUENCY= 81.013821
##.OBSERVE NUCLEUS= ^31P
##.ACQUISITION MODE= SIMULTANEOUS
##.ACQUISITION SCHEME= undefined
##.AVERAGES= 64
##.DIGITISER RES= 17
##SPECTROMETER/DATA SYSTEM= spect
##.PULSE SEQUENCE= zgpg30
##.SOLVENT NAME= CDCl3
##.SHIFT REFERENCE= (INTERNAL, CDCl3, 0, 198.062)
##AUDIT TRAIL= $$ (NUMBER, WHEN, WHO, WHERE, WHAT)
$$ ##TITLE= Audit trail, XWIN-NMR		Version 3.5
$$ ##JCAMPDX= 5.01
$$ ##ORIGIN= Bruker BioSpin GmbH
$$ ##OWNER= she
$$ F:/spectra/data/she/nmr/P31/2/pdata/1/auditp.txt
$$ ##AUDIT TRAIL=  $$ (NUMBER, WHEN, WHO, WHERE, WHAT)
(   1,<2025-04-18 15:29:31.75 +0400>,<she>,<DPX200>,
      <created by zg, POWCHK disabled, PULCHK disabled
       configuration hash MD5:
       00 E9 B6 7A A2 85 ED C7 34 08 36 98 17 FE 4E 26
       data hash MD5: 32K
       87 85 D4 40 F8 1A 06 40 BC B6 18 28 44 AC 02 BB>)
(   2,<2025-04-18 15:29:33.96 +0400>,<she>,<DPX200>,
      <Start of raw data processing
       efp BC_mod = 2 LB = 1.5 FT_mod = 6 PKNL = 1 PHC0 = 1246.232 PHC1 = 522.2943 SI = 64K 
       data hash MD5: 64K
       3A 7B C3 F8 15 E7 3A 27 E5 76 B2 9B A8 D4 8E CE>)
(   3,<2025-04-18 15:29:52.51 +0400>,<she>,<DPX200>,
      <pk PHC0 = 3.497833 PHC1 = 0 
       data hash MD5: 64K
       29 AB 05 13 52 78 3D EF 2E 36 CA AF 5B 6B AF 3D>)
(   4,<2025-04-18 15:29:57.01 +0400>,<she>,<DPX200>,
      <abs ABSG = 5 
       data hash MD5: 64K
       60 73 41 E9 00 33 16 26 06 9C 7D 04 BD F8 9A 1E>)
$$ ##END=
$$ 
$$ hash MD5
$$ EB 6A AB 34 0A 15 2C 2C 85 86 00 E6 84 6F 5F C9
##$RELAX= 
##$RELAX= 
##$RELAX= 
##$RELAX= 
##$RELAX= 
##$RELAX= 
##$RELAX= 
##$RELAX= 
$$ Bruker specific parameters
$$ --------------------------
##$DU= <F:/spectra>
##$EXPNO= 2
##$NAME= <P31>
##$PROCNO= 1
##$TYPE= <nmr>
##$USER= <she>
##$AMP= (0..31)
100 100 100 100 100 100 100 100 100 100 100 100 100 100 100 100 100 100 
100 100 100 100 100 100 100 100 100 100 100 100 100 100 
##$AQSEQ= 0
##$AQ_mod= 1
##$AUNM= <au_zg>
##$AUTOPOS= <>
##$BF1= 81.014009
##$BF2= 200.13
##$BF3= 200.13
##$BF4= 200.13
##$BF5= 200.13
##$BF6= 200.13
##$BF7= 200.13
##$BF8= 200.13
##$BYTORDA= 1
##$CFDGTYP= 0
##$CFRGTYP= 5
##$CHEMSTR= <none>
##$CNST= (0..31)
1 1 145 1 1 1 1 1 1 1 1 1 1 1 1 1 1 1 1 1 1 1 1 1 1 1 1 1 1 1 1 1 
##$CPDPRG= <waltz16>
##$CPDPRG1= <>
##$CPDPRG2= <waltz16>
##$CPDPRG3= <>
##$CPDPRG4= <mlev>
##$CPDPRG5= <mlev>
##$CPDPRG6= <mlev>
##$CPDPRG7= <mlev>
##$CPDPRG8= <mlev>
##$CPDPRGB= <>
##$CPDPRGT= <>
##$D= (0..31)
0 1 0 0 0 0 0 0 0 0.06 0 0.03 2e-05 3e-06 0 0 0.0002 0 0 0 0 0 0 0 0 0 
0 0 0 0 0 0 
##$DATE= 1744975771
##$DBL= (0..7)
120 120 120 11 120 120 24 19 
##$DBP= (0..7)
150 150 150 150 150 150 150 150 
##$DBP07= 0
##$DBPNAM0= <>
##$DBPNAM1= <>
$$ [...]
##$SUBNAM3= <"">
##$SUBNAM4= <"">
##$SUBNAM5= <"">
##$SUBNAM6= <"">
##$SUBNAM7= <"">
##$SUBNAM8= <"">
##$SUBNAM9= <"">
##$SW= 400.765351723535
##$SWIBOX= (0..15)
0 1 3 0 0 0 0 0 0 0 0 0 0 0 0 0 
##$SW_h= 32467.5324675325
##$TD= 32768
##$TD0= 1
##$TE= 0
##$TE2= 300
##$TE3= 300
##$TEG= 300
##$TL= (0..7)
0 120 53 12 22 120 120 120 
##$TP= (0..7)
150 150 150 150 150 150 150 150 
##$TP07= 0
##$TPNAME0= <>
##$TPNAME1= <>
##$TPNAME2= <>
##$TPNAME3= <>
##$TPNAME4= <>
##$TPNAME5= <>
##$TPNAME6= <>
##$TPNAME7= <>
##$TPOAL= (0..7)
0.5 0.5 0.5 0.5 0.5 0.5 0.5 0.5 
##$TPOFFS= (0..7)
0 0 0 0 0 0 0 0 
##$TUNHIN= 0
##$TUNHOUT= 0
##$TUNXOUT= 0
##$USERA1= <user>
##$USERA2= <user>
##$USERA3= <user>
##$USERA4= <user>
##$USERA5= <user>
##$V9= 5
##$VALIST= <valist>
##$VCLIST= <CCCCCCCCCCCCCCC>
##$VD= 0
##$VDLIST= <DDDDDDDDDDDDDDD>
##$VPLIST= <PPPPPPPPPPPPPPP>
##$VTLIST= <TTTTTTTTTTTTTTT>
##$WBST= 1024
##$WBSW= 4
##$XGAIN= (0..3)
0 0 0 0 
##$XL= 0
##$YL= 0
##$YMAX_a= 14564
##$YMIN_a= -7095
##$ZGOPTNS= <>
##$ZL1= 120
##$ZL2= 120
##$ZL3= 120
##$ZL4= 120
##$ABSF1= 198.0616
##$ABSF2= -202.7028
##$ABSG= 5
##$ABSL= 3
##$ALPHA= 0
##$AQORDER= 0
##$ASSFAC= 0
##$ASSFACI= 0
##$ASSFACX= 0
##$ASSWID= 0
##$AUNMP= <proc_1d>
##$AZFE= 0.1
##$AZFW= 0.5
##$BCFW= 0
##$BC_mod= 2
##$BYTORDP= 0
##$COROFFS= 0
##$CY= -3
##$DATMOD= 1
##$DC= 0
##$DFILT= <>
##$DTYPP= 0
##$F1P= 0
##$F2P= 0
##$FCOR= 1
##$FTSIZE= 65536
##$FT_mod= 6
##$GAMMA= 0
##$GB= 0
##$INTBC= 1
##$INTSCL= 9.790993e-09
##$ISEN= 30
##$LB= 1.5
##$LEV0= 0
##$LPBIN= 0
##$MAXI= 10000
##$MC2= 0
##$MEAN= 0
##$ME_mod= 0
##$MI= 50
##$NCOEF= 0
##$NC_proc= -8
##$NLEV= 6
##$NOISF1= 182.463
##$NOISF2= 159.3651
##$NSP= 0
##$NTH_PI= 0
##$NZP= 0
##$OFFSET= 198.0616
##$PC= 4
##$PHC0= 1249.73
##$PHC1= 522.2943
##$PH_mod= 1
##$PKNL= yes
##$PPARMOD= 0
##$PSCAL= 0
##$PSIGN= 0
##$REVERSE= no
##$SF= 81.0140089999434
##$SI= 65536
##$SIGF1= 159.3651
##$SIGF2= -187.1042
##$SINO= 113.3802
##$SIOLD= 16384
##$SREGLST= <1H.CDCl3>
##$SSB= 0
##$STSI= 65536
##$STSR= 0
##$SW_p= 32467.5324675325
##$SYMM= 0
##$S_DEV= 0
##$TDeff= 32768
##$TDoff= 0
##$TI= <>
##$TILT= no
##$TM1= 0
##$TM2= 0
##$TOPLEV= 0
##$USERP1= <user>
##$USERP2= <user>
##$USERP3= <user>
##$USERP4= <user>
##$USERP5= <user>
##$WDW= 1
##$XDIM= 65536
##$YMAX_p= 128040947
##$YMIN_p= -292833181
$$ End of Bruker specific parameters
$$ ---------------------------------
##NTUPLES= NMR SPECTRUM
##VAR_NAME=  FREQUENCY,     SPECTRUM/REAL,   SPECTRUM/IMAG
##SYMBOL=    X,             R,               I
##VAR_TYPE=  INDEPENDENT,   DEPENDENT,       DEPENDENT
##VAR_FORM=  AFFN,          ASDF,            ASDF
##VAR_DIM=   65536,         65536,           65536
##UNITS=     HZ,            ARBITRARY UNITS, ARBITRARY UNITS
##FACTOR=    0.49542278885378, 1,            1
##FIRST=     16045.7642231865, 0,            0
##LAST=      -16421.768244346, 0,            0
##MIN=       -16421.768244346, -292833181,   0
##MAX=       16045.7642231865, 128040947,    0
$$ Real data points
##PAGE= N=1
##DATA TABLE= (X++(R..R)), XYDATA
$$ [...]
7496c282381M085660K756159K186259K454256K021670K71349j514978j847092
$$ -3282381 803279 3559438 5745697 8199953 10221623 10492972 8977994 7130902
7488G130902p78658L50720L42570r00989k394933k953888k380053j607073j328248
$$ 7130902 6352244 6702964 7045534 6144545 3749612 795724 -1584329 -3191402 -4519650
7479d519650j033581j07652Q30484Q68436M76121O59926Q38051m59551k763623
$$ -4519650 -5553231 -5660883 -4830399 -3961963 -3485842 -2825916 -1987865 -2447416 -5211039
7470e211039l776477k803845j723099j536068m46581K802495N815791N334071
$$ -5211039 -8987516 -11791361 -13514460 -15050528 -15497109 -12694614 -6878823 -1544752
7462a544752J899568q59966j016450j8998J88450n10475j146507r25464M73553
$$ -1544752 354816 -505150 -1521600 -1540598 -1352148 -1862623 -3009130 -3934594 -3461041
7453c461041K418795L200215J822975l45716j310189j298477j790207k222242
$$ -3461041 -1042246 2157969 3980944 3635228 2325039 1026562 -763645 -2985887
7445b985887n98364K349306K898861l76659l904928l732049o08205J842041K178129
$$ -2985887 -3584251 -1234945 1663916 1287257 -2617671 -6349720 -6957925 -5115884 -2937755
7436b937755J677775J073144k23448j871473k241157q14708Q60707J160298J24333
$$ -2937755 -1259980 -186836 -410284 -2281757 -4522914 -5337622 -4476915 -3316617 -3192284
7427c192284j014458j083168K08740J865998K387770J718344J486648K166573
$$ -3192284 -4206742 -5289910 -5081170 -3215172 -827402 890942 2377590 4544163
7419D544163J505927k020855n522235m722046l10430K427590R62691j257517n44215
$$ 4544163 6050090 4029235 -1493000 -6215046 -6525476 -4097886 -3135195 -4392712 -4936927
7410d936927J698272K133455J071986J204654K440598J974786q47538l242705
$$ -4936927 -3238655 -1105200 -33214 1171440 3612038 5586824 4739286 1496581
7402A496581l049649j308861k2905M04897N77521P12422P59280O97233K62688
$$ 1496581 -1553068 -2861929 -2884834 -2479937 -1902416 -1189994 -430714 266519 529207
7393E29207m72118l09062J605184L525199K550931j115335l677739k628340L3197
$$ 529207 57089 -251973 1353211 4878410 7429341 6314006 2636267 7927 41124
7384D1124R84324J4761p41741m89660k74494n41098m90101J86744O92582L93367
$$ 41124 1025448 1040209 298468 -191192 -465686 -1006784 -1496885 -1310141 -617559 -224192
7374b24192n06498j463224j779497p40385J282667K447685J571412J00973L08046
$$ -224192 -730690 -2193914 -3973411 -4713796 -3431129 -983444 587968 688941 996987
7365I96987J909738K381555N59637k028156l616689l973410l221393j005784K039332
$$ 996987 2906725 5288280 5847917 3819761 203072 -3770338 -6991731 -7997515 -5958183
7356e958183L700415K564020l8974j748184k000600j897740j901282j071292J367424
$$ -5958183 -2257768 306252 267278 -1480906 -3481506 -5379246 -7280528 -8351820 -6984396
7347f984396M562643O411811N354128K048704q61899j354153l07629k21853j754077
$$ -6984396 -2421753 3990058 9344186 11392890 10530991 9176838 8869209 8647356 6893279
7338F893279k993780k415831p80389O09347J638723K183902J136942j523252l317039
$$ 6893279 3899499 1483668 703279 1312626 2951349 5135251 6272193 4748941 1431902
7329A431902k226109J20418P38929j81415o113J566834J926242K33899q08523
$$ 1431902 -794207 -673789 65140 -116275 -122388 1444446 3370688 3604587 2796064
7320B796064N97994K194325J282374q43439r72187R47230J894346M65411j434134
$$ 2796064 3394058 5588383 6870757 6027318 5055131 6002361 7896707 8362118 6927984
7311F927984j902045j549073j761294k324695k071218q00065O10075J424797J539264
$$ 6927984 5025939 3476866 1715572 -609123 -2680341 -3480406 -2870331 -1445534 93730
7302I3730J154063O65367O31374J293639K182903K449674J530791m39379k520716
$$ 93730 1247793 1913160 2544534 3838173 6021076 8470750 10001541 9562162 7041446
7293G041446l343971k234944j86563Q54457O5298j248941j122056P82625K665437
$$ 7041446 3697475 1462531 1275968 2130425 2195723 946782 -175274 607351 3272788
7284C272788K414372p8505k499483k409680j55054J210034l99780l236786l830743
$$ 3272788 5687160 5608655 3109172 699492 544438 1754472 1354692 -1882094 -5712837
7275e712837j534335Q20096R51626j77591n29257N8760N66557R32440J604840
$$ -5712837 -7247172 -6427076 -5475450 -5653041 -6182298 -6123538 -5556981 -4624541 -3019701
7266c019701J921135R34973o53296j301873j055659j274544k099524k194363j116865
$$ -3019701 -1098566 -163593 -816889 -2118762 -3174421 -4448965 -6548489 -8742852 -9859717
7257i859717P8314R13549K054606L223913K799176O18563q87450N9525J912994
$$ -9859717 -9781403 -8867854 -6813248 -3589335 -790159 -171596 -1059046 -999521 913473
7248I13473K149932Q52203o8803q3492j92513n36311l08752r53j303707m068837
$$ 913473 3063405 3915608 3846805 3763313 3570800 3034489 2725737 2724784 1421077 -2647760
7238b647760n345717k770977K119627N207346M103374L72370k478581k687503
$$ -2647760 -7993477 -10764454 -8644827 -3437481 665893 1038263 -1440318 -4127821
7230d127821j596863j373491j980643j360132J382449M324454N040778L490087
$$ -4127821 -5724684 -7098175 -9078818 -10438950 -9056501 -4732047 308731 3798818
7222C798818J522362M45989L93521J274620K678586L244791J870134n03830j865552
$$ 3798818 5321180 5767169 6160690 7435310 10113896 13358687 15228821 14724991 12859439
7213A2859439j879482k021290k829613k873528j199490P39714P84342j152032
$$ 12859439 10979957 8958667 6129054 3255526 2056036 2795750 3580092 2428060
7205B428060l062830l239662j914263n88564k06578k65012J56007Q48990Q18130
$$ 2428060 -634770 -3874432 -5788695 -6377259 -6583837 -6848849 -6692842 -5843852 -5025722
7196e025722J39860Q2959Q41772R02535j59707k69088J711830L099966J048013
$$ -5025722 -4885862 -4802903 -3961131 -3058596 -3218303 -3487391 -1775561 1324405 2372418
7187B372418k312534k329289J003532K750894O27143j632734n22469J669415Q45182
$$ 2372418 59884 -2269405 -1265873 1485021 2112164 479430 -43039 1626376 2471558
7178B471558k185854k914172J53705L525405L492625L76928k479372k541176m53925
$$ 2471558 285704 -2628468 -2474763 1050642 4543267 4920195 2440823 -100353 -554278
7169e54278R82652K54419r11407k03572J356750P43012j807015k352397O73341
$$ -554278 428374 682793 -228614 -432186 924564 1667576 -139439 -2491836 -1818495
7160a818495L585683K936210M60520n23709m76063j435499k140246k17560K378543
$$ -1818495 1767188 4703398 5163918 4640209 4164146 2728647 588401 370841 2749384
7151B749384J445850k361949l775249r19578J822032N83282k587156l446501j372485
$$ 2749384 4195234 1833285 -1941964 -2861542 -1039510 -456228 -3043384 -6489885 -7862370
7142g862370J196203K772347L597043L771338K874029R64658j229940k689348
$$ -7862370 -6666167 -3893820 -296777 3474561 6348590 7313248 6083308 3393960
7134C393960k396761l57696J595688J566008K47936o8953P46173M04449j653189
$$ 3393960 997199 639503 2235191 3801199 4049135 3980182 4726355 5130804 3477615
7125C477615k623978m29655K875067L832760K072170o1127j197995k000943k900147
$$ 3477615 853637 423982 3299049 7131809 9203979 9142852 7944857 5943914 3043767
7116C043767k803414o53880K640820M535520L293401L0948k304337k380267j879102
$$ 3043767 240353 -413527 2227293 6762813 10056214 10087162 7782825 5402558 3523456
7107C523456k526018l194318j985071J8431p273k046927l103364j888009m50356
$$ 3523456 997438 -2196880 -4181951 -4163520 -4170793 -6217720 -9321084 -11209093 -11659449
7098a1659449l61199m15836O03039J736821J904636J588441J099519k13366j662167
$$ -11659449 -12020648 -12436484 -11833445 -10096624 -8191988 -6603547 -5504028 -5717394 -7379561
7089g379561j055343J460505K473735L88492j643664n46627J858658K091933N58522
$$ -7379561 -8434904 -6974399 -4500664 -4112172 -5755836 -6302463 -4443805 -2351872 -1793350
7080a793350K13304J548787K553619K310048J328346l15786j955194j143309K794210
$$ -1793350 -1580046 -31259 2522360 4832408 6160754 5844968 3889774 2746465 5540675
7071E540675N667004L248560j966950l673764q81212J132096o22783k807138j973692
$$ 5540675 11207679 14456239 12489289 8815525 7934313 9066409 8443626 5636488 3662796
7062C662796J58909M84892l27079J81367J756236K171201Q35531j012492k496997
$$ 3662796 3821705 4306597 3979518 4160885 5917121 8088322 8923853 7911361 5414364
7053E414364l277987k649120n40557J376554J366967j48287j341471j226875n3430
$$ 5414364 2136377 -512743 -1053300 323254 1690221 1541934 200463 -1026412 -1079842
7044a079842J626175L042081L152056J703721j99234j408302j851693j698230
$$ -1079842 546333 3588414 6740470 8444191 8244957 6836655 4984962 3286732
7036C286732n91592J235759K227021J271779n30129j204933m82799J87937j82715
$$ 3286732 2695140 3930899 6157920 7429699 6899570 5694637 5211838 5399775 5217060
7027E217060j119827j712710j689362j447869j590855k258802k520998r54433
$$ 5217060 4097233 2384523 695161 -752708 -2343563 -4602365 -7123363 -8077796
7019h077796K429815N245883M761476J062568k538232k807397j13087J950005
$$ -8077796 -5647981 -402098 4359378 5421946 2883714 76317 -36770 1913235
7011A913235P41086k216001l159479r88860J360420J020138j106898k196773j524188
$$ 1913235 2654321 438320 -2721159 -3710019 -2349599 -1329461 -2436359 -4633132 -6157320
7002f157320n00765K05758R34285R22853j030183l487272k979564J148886N014194
$$ -6157320 -6658085 -6452327 -5518042 -4595189 -5625372 -9112644 -12092208 -10943322 -5929128
6993e929128M860482J507689j416194j963472q70396N30642J502071J721886J397158
$$ -5929128 -1068646 439043 -977151 -2940623 -3811019 -3280377 -1778306 -56420 1340738
6984A340738J151427R79786Q1831j579718k642268k123848p64033K52313P55642
$$ 1340738 2492165 3471951 3553782 1974064 -668204 -2792052 -3556085 -3303772 -2548130
6975b548130R50871O58336K03573O99626K277609L327167K668622J145823r5523
$$ -2548130 -1597259 -938923 -735350 -35724 2241885 5569052 8237674 9383497 9287974
6966I287974j305606k656043k822227j026653R55062J039982j08816n70660n29999
$$ 9287974 7982368 5326325 2504098 1477445 2432507 3472489 3363673 2793013 2263014
6957B263014j404586k421663j290002J609682K822998N97521k407469k650225
$$ 2263014 858428 -1563235 -2853237 -1243555 1579443 2176964 -230505 -2880730
6949b880730k87353J347453L8920k818036l942313j804820J657269L151405J758254
$$ -2880730 -3168083 -1820630 -1781710 -4599746 -8542059 -10346879 -8689610 -5538205 -3779951
6940c779951k71684o66628L08158J289898K142357L110859L046034Q67100j911437
$$ -3779951 -4051635 -4718263 -4410105 -3120207 -977850 2133009 5179043 6046143 4134706
6931D134706k607349j092662K85213M20059N42537J292074J310490k77714k116262
$$ 4134706 1527357 434695 719908 1139967 1682504 2974578 4285068 4007354 1891092
6922A891092k518470j500740R848J411029J960994P32988j752425l162436j875310
$$ 1891092 -627378 -2128118 -2118270 -707241 1253753 1986741 234316 -2928120 -4803430
6913d803430J008506L050576K987815J264498p89099j587370k92186J966878K934971
$$ -4803430 -3794924 -744348 2243467 3507965 2718866 1131496 839310 2806188 5741159
6904E741159K021814J051208J414179J846864L11041k919067n437682n481402
$$ 5741159 7762973 8814181 10228360 12075224 12386265 9467198 4029516 -1451886
6896a451886l493230j258204j66314m3081M99881J999511K714606O72416k880747
$$ -1451886 -4945116 -6203320 -6369634 -6412715 -5912834 -3913323 -1198717 -526301 -3407048
6887c407048m119187j466654K185484L249570J632984j99106n97420M54400K259928
$$ -3407048 -7526235 -8992889 -6807405 -3557835 -1924851 -2123957 -2721377 -2266977 -7049
6878g049L332181J937714j297890k874270q05094J987656J472009j543134k643242
$$ -7049 3325132 5262846 3964956 1090686 285592 2273248 3745257 2202123 -441119
6869d41119m22606J861860J613324K71599J22171P79394O70217k56096j215340
$$ -441119 -863725 998135 2611459 2883058 3005229 3784623 4454840 4198744 2983404
6860B983404k263382l399578l281474p46876K975640N015497L641366k61955l888201
$$ 2983404 720022 -2679556 -5961030 -6707906 -3732266 1283231 4924597 4662642 774441
6851G74441m439748j514386K009986K744891P95002o32986J3113O33647o13550
$$ 774441 -3665307 -5179693 -3169707 -424816 370186 -262800 -249687 383960 -229590
6842b29590k013335j147173R78338J481385K1045j256530j437767j514817j599479
$$ -229590 -2242925 -3390098 -2411760 -930375 -909330 -2165860 -3603627 -5118444 -6717923
6833f717923m99260J581302K721690K411345K445051L665722M175625K195720
$$ -6717923 -7217183 -5635881 -2914191 -502846 1942205 5607927 9783552 11979272
6825A1979272j262495m064314n497796n557498l546894L08103L115736J970032
$$ 11979272 10716777 6652463 1154667 -4402831 -7949725 -7641622 -4525886 -2555854
6817b555854j810404l566041j023748K789200L455726O57150j796353j028955
$$ -2555854 -4366258 -7932299 -8956047 -6166847 -2711121 -2053971 -3850324 -4879279
6809d879279J395716J769189q56154l476833l024070l5517K556550L200111K653539
$$ -4879279 -3483563 -1714374 -2570528 -6047361 -9071431 -9106948 -6550398 -3350287 -696748
6800f96748J776064N11821p88323j135761o76545q27933j770023j668453M09855
$$ -696748 1079316 1591137 802814 -332947 -1009492 -1837425 -3607448 -5275901 -4866046
6791d866046K616814K895478J803352J000163M53811o96681j738656j339542k06036
$$ -4866046 -2249232 646246 2449598 3449761 3903572 3206891 1468235 128693 -77343
6782g7343l21175j782722k629741j729833J79382K180840L838998M243740K546192
$$ -77343 -398518 -2181240 -4810981 -6540814 -6361432 -4180592 -341594 3902146 6448338
6773F448338l33286k391631l046575l242411l297303k658952j539354n93353O34075
$$ 6448338 6115052 3723421 676846 -2565565 -5862868 -8521820 -10061174 -10654527 -10020452
6764a0020452K415028K652175n72787m502299m013045Q39372M092007K335657
$$ -10020452 -7605424 -4953249 -5526036 -10028335 -14041380 -13202008 -9110001 -6774344
6756f774344o60292l71977J878052K414914J411257J031100M58925j995369l930285
$$ -6774344 -7434636 -7806613 -5928561 -3513647 -2102390 -1071290 -612365 -2607734 -6538019
6747f538019j648535K992828M143140N28004k766380j963917Q19288K214037K313404
$$ -6538019 -8186554 -5193726 -1050586 -522582 -3288962 -5252879 -4433591 -2219554 93850
6738I3850K409512J768147m56716k764529l489187l413863l788929l559823j104588
$$ 93850 2503362 4271509 3814793 1050264 -2438923 -5852786 -9641715 -13201538 -14306126
6729a4306126K553741M683640M252020K467721O14403q37159j430359p76748N82338
$$ -14306126 -11752385 -7068745 -2816725 -349004 265399 -571760 -2002119 -2778867 -2196529
6720b196529J508310J489189R36988N64684Q81462J758638K172795J168955o16165
$$ -2196529 -688219 800970 1737958 2302642 3184104 4942742 7115537 8284492 7668327
6711G668327j449482r36857o47886j549549k190560p30950K115965L584159K054385
$$ 7668327 6218845 5281988 4634102 3084553 893993 163043 2279008 5863167 7917552
6702G917552j168660l219188k423783Q9990J495944L82481j601299k044732j016677
$$ 7917552 6748892 3529704 1105921 1195911 2691855 3074336 1473037 -571695 -1588372
6693a588372l67515l62064N01381K178369K491156Q65811j80317R86302K201272
$$ -1588372 -1955887 -2317951 -1816570 361799 2852955 3718766 3538449 4524751 6726023
6684F726023Q69748j795340k543082o93834J531891K197466Q75333k082079n000637
$$ 6726023 7595771 5800431 3257349 2563515 4095406 6292872 7168205 5086126 85489
6675H5489m870670q57821L054979K240001k134881m310560j753536J830693K229411
$$ 85489 -4785181 -5643002 -2588023 -348022 -2482903 -6793463 -8546999 -6716306 -4486895
6666d486895M0795j458985r17670Q26827K928679M565493M227224J360497k018896
$$ -4486895 -4446100 -5905085 -6822755 -5995928 -3067249 1498244 5725468 7085965 5067069
6657E067069l321654k484502j419581r52071j97973J137394J724957M57585j835357
$$ 5067069 1745415 -739087 -2158668 -3110739 -3308712 -2171318 -446361 11224 -1824133
6648a824133l151554k235166M67414L185363M050246K595511K70214j001612q86495
$$ -1824133 -4975687 -7210853 -6743439 -3558076 492170 3087681 3357895 2356283 1469788
6639A469788p51125j571367k388954j383663J778097N133618N974875L125921
$$ 1469788 718663 -852704 -3241658 -4625321 -2847224 2286394 8261269 11387190
6631A1387190j977832o127406o638263l605182K8417J310197L74198p3091J318452
$$ 11387190 9409358 3281952 -3356311 -6961493 -6933076 -5622879 -5248681 -5321772 -4003320
6622d003320K356868L36371l562569m986164j897268K503790L558480O63053k517432
$$ -4003320 -1646452 -1310081 -4872650 -9858814 -11756082 -9252292 -5693812 -5030759 -7548191
6613g548191k788710p27597R89378J177147J007457J687254K489000J868193K5557
$$ -7548191 -10336901 -11064498 -10075120 -8897973 -7890516 -6203262 -3714262 -1846069 -1820512
6604a820512j044984m96487o5116j175980k031444j10723L079493L154867n69016
$$ -1820512 -2865496 -3361983 -3427099 -4603079 -6634523 -6745246 -3665753 -510886 -1079902
6595a079902l241928j308495K044691J709380j309645j233688L544053P499555
$$ -1079902 -4321830 -5630325 -3585634 -1876254 -3185899 -4419587 -875534 6624021
6587F624021N458084n05292m185050l146710o47504l58879j819965j952414L46955
$$ 6624021 12082105 11576813 7391763 4245053 3597549 3238670 1418705 -533709 -186754
6578a86754K628286K052639r25212l223784l260032k693744l290646l841951k069832
$$ -186754 2441532 4494171 3568959 345175 -2914857 -5608601 -8899247 -12741198 -14811030
6569a4811030J528829M065914M069935K626289Q66556j122576k485928j434131
$$ -14811030 -13282201 -9216287 -5146352 -2520063 -1653507 -2776083 -5262011 -6696142
6561f696142J757807L741603J910601k142478m673293m258447k547231j294512
$$ -6696142 -4938335 -1196732 713869 -1428609 -6101902 -10360349 -12907580 -14202092
6553a4202092m73672O89725K205090L222288K833422R33939j292982k024343n78373
$$ -14202092 -14675764 -13986039 -11780949 -8558661 -5725239 -4791300 -6084282 -8108625 -8686998
6544h686998J524317J885092j78971k663626k863695m75315J680714Q23254j963665
$$ -8686998 -7162681 -5277589 -5456560 -8120186 -10983881 -11459196 -9778482 -8955228 -10918893
6535a0918893k510870J024561N144339N252123J715427r53905n11866O46068J85673
$$ -10918893 -13429763 -12405202 -7260863 -2008740 -293313 -1247218 -1759084 -1113016 -927343
6526i27343l82945J312966M058979M334140J152530k640719l751551j629805J550010
$$ -927343 -1310288 2678 4061657 8395797 9548327 6907608 3156057 1526252 3076262
6517C076262K996991J606362j045260k298731j399313j29168j19895q44197j045614
$$ 3076262 6073253 7679615 6634355 4335624 2936311 2807143 2687248 1843051 797437
6508G97437p07983m34602k22353j74945j025906k388455k016061J095463M185769
$$ 797437 89454 -345148 -567501 -742446 -1768352 -4156807 -6172868 -5077405 -891636
6499h91636L863508Q70361j099635q21281n76492j593404j874521J03197K368623
$$ -891636 2971872 3842233 2742598 1921317 1344825 -248579 -2123100 -2019903 348720
6490C48720K192407k3224j672432j595390r27610j026881k142469l658083m339429
$$ 348720 2541127 2517903 845471 -749919 -1677529 -2704410 -4846879 -8504962 -12844391
6481a2844391k835370P46537M100417M808692L005723R20003N6949M4804R1711
$$ -12844391 -15679761 -14933224 -10832807 -6024115 -3018392 -2098389 -2041440 -1996636 -1904925
6472a904925J19207J22017l09413j129748j385853l83534J236285K206395J987080
$$ -1904925 -1785718 -1663701 -1973114 -3102862 -4488715 -4872249 -3635964 -1429569 557511
6463E57511R34981l28471j119551q47709K07119P27010p6886j094736o48954J082188
$$ 557511 1492492 1164021 44470 -803239 -596120 130890 54004 -1040732 -1689686 -607498
6453f07498K387786K655814K802934K706604N82831l585127o149829l921485R74839
$$ -607498 1780288 4436102 7239036 9945640 10528471 6943344 793515 -3127970 -2153131
6444b153131L289390J405584j037419o87287J315032K003435R64876o5056m61886
$$ -2153131 1136259 2541843 1504424 817137 2132169 4135604 5100480 5035424 4573538
6435D573538j274853k987331m457219m238214k166503K92015J085798l50796j954729
$$ 4573538 3298685 311354 -4145865 -8384079 -10550582 -10258567 -9172769 -9523565 -11478294
6426a1478294j147920J656890L298727K184999L46290O9225P01551O35043L36622
$$ -11478294 -12626214 -10969324 -7670597 -5485598 -5139308 -5070083 -4368532 -3733489 -3396867
6417c396867Q53684J042885n76149k359770j462078J247462J944508j52412j362915
$$ -3396867 -2543183 -1500298 -2076447 -4436217 -5898295 -4650833 -2706325 -2858737 -4221652
6408d221652O21512L009679K192813j004947l040652k724659j739760j186277
$$ -4221652 -3600140 -590461 1602352 597405 -2443247 -5167906 -6907666 -8093943
6400h093943m45136P04094J204952L94323r99410j868453j601610Q0119K830261
$$ -8093943 -8539079 -7834985 -6630033 -6235710 -7235120 -9103573 -10705183 -10625064 -7794803
6391g794803M948299M321024R30944k412933k828831n23302J679686J913586J314744
$$ -7794803 -2846504 1474520 2405464 -7469 -2836300 -3359602 -1679916 233670 1548414
6382A548414J836490K880541J732171k344353o117225n941219k403859M38986
$$ 1548414 3384904 6265445 7997616 5653263 -463962 -6405181 -8809040 -8370054
6374h370054K87922r46766m91362J355095K058250N85766j333886j583991j36569
$$ -8370054 -8082132 -9028898 -9520260 -8165165 -6106915 -5521149 -6855035 -8439026 -8575595
6365h575595J177869Q93125m16188p96067O63739K502672K686100J389797P26973
$$ -8575595 -7397726 -6504601 -6920789 -7716856 -7053117 -4550445 -1864345 -474548 252425
6356B52425J569284K197289R50076j147348j782747n50614P59774P12411l44509
$$ 252425 1821709 4018998 4969074 3821726 2038979 1488365 2248139 2960550 2616041
6347B616041j336325j668980j194477r4452P97837M49980j035656k102698j307780
$$ 2616041 1279716 -389264 -1583741 -1678193 -880356 -430376 -1466032 -3568730 -4876510
6338d876510J029112L086864L359356K063316P75989O53367J081194N27010j129244
$$ -4876510 -3847398 -760534 2598822 4662138 5438127 6091494 7172688 7699698 6570454
6329F570454j961712n47248J525849J219996j840223m503606m129653j968659
$$ 6570454 4608742 4061494 5587343 6807339 4967116 463510 -3666143 -5634802
6321e634802r85433j366413m74254K657367N151733L953120J40911k304879j456483
$$ -5634802 -6620235 -7986648 -8460902 -5803535 -651802 3301318 3442229 1137350 -319133
6312c19133P31902J593475R03407J03971j45155k87844m71467k48497L77788O97216
$$ -319133 412769 2006244 2909651 3013622 2868467 2580623 2109156 1860659 2238447 2935663
6302B935663L16155l23765p35853j043827j357533r57467J031619L910953N107947
$$ 2935663 3251818 2928053 2192200 1148373 -209160 -1166627 -135008 3775945 8883892
6293H883892K665886j885671m369692k591698P82404J444205j022317k861083
$$ 8883892 11549778 9664107 5294415 2702717 3485121 4929326 3907009 1045926
6285A045926j512203J147560K065572J320492J110915J881987J967400O09328
$$ 1045926 -466277 681283 2746855 4067347 5178262 7060249 9027649 9636977
6277I636977r59523j530907j154314j98001J078841J752255Q00443r72860j196826
$$ 9636977 8677454 7146547 5992233 5794232 6873073 8625328 9425771 8452911 7256085
6268G256085R57654L143782K404640j268923m787843n095439k068411J424012
$$ 7256085 8213739 11357521 13762161 12493238 7705395 2609956 541545 1965557
6260A965557K257226J63741k055922j805848L91722K007293J769954N33973n53298
$$ 1965557 4222783 4386524 2330602 524754 916476 2923769 4693723 5227696 4674398
6251D674398j127690j061232m52638j29675o95466j292314r05813l88786j025791
$$ 4674398 3546708 2485476 2032838 1903163 1207697 -84617 -990430 -1379216 -2405007
6242b405007j570639L03168L434625L563990m62078m195670l420303K63484K252266
$$ -2405007 -3975646 -3672478 -237853 3326137 2864059 -1331611 -4751914 -4488430 -2236164
6233b236164J147249p14300j352817q05985L93328J676718J843297K97804j484467
$$ -2236164 -1088915 -1803215 -3156032 -3962017 -3568689 -1891971 -48674 249130 -1235337
6224a235337j684089p90780o21308j359658j665984j177330p20640l95977M38303
$$ -1235337 -2919426 -3710206 -4331514 -5691172 -7357156 -8534486 -9255126 -9651103 -9212800
6215i212800J507191J882686J566030R79918l79863k537787l164162j15888M476289
$$ -9212800 -7705609 -5822923 -4256893 -3276975 -3656838 -6194625 -9358787 -9474675 -4998386
6206d998386N992727L496382P50927L19378K67863j534288l231614j961842J241536
$$ -4998386 994341 4490723 5241650 5561028 5828891 4294603 1062989 -898853 342683
6197C42683K741931J463203j36627o6519O49599N86j984364l168316j873832R96894
$$ 342683 3084614 4547817 4411190 4344671 4994270 4994856 3010492 -157824 -2031656 -1034762
6187a034762K743306J946590J42929m23581K8508m31506j941451k466079j287519
$$ -1034762 1708544 3655134 3798063 3374482 3402990 2971484 1030033 -1436046 -2723565
6178b723565l28187q74656j358796q6322J853976K438187J829695J487149J501906
$$ -2723565 -3051752 -3926408 -5285204 -5371526 -3517550 -1079363 750332 2237481 3739387
6169C739387J108554P39091J142225J299845k19490k359957k679540j182953m03360
$$ 3739387 4847941 5587032 6729257 8029102 7809612 5449655 2770115 1587162 1183802
6160A183802j458481k615113k339072j287760l35186J063501L137512M303915
$$ 1183802 -274679 -2889792 -5228864 -6516624 -6851810 -5788309 -2650797 1653118
6152A653118L115156N74215r67936n63935O79926J090151j05984k105973k934598
$$ 1653118 4768274 5342489 4374553 3810618 4490544 5580695 5474711 3368738 434140
6143D34140j448922Q30911J191263p11012k424118k251806j087850J13534K044236
$$ 434140 -1014782 -183871 1007392 296380 -2127738 -4379544 -5467394 -5353860 -3309624
6134c309624M479746M703523J330996k328806k171285P76171K073543O93460j80435
$$ -3309624 1170122 5873645 7204641 4875835 2704550 3480721 5554264 6247724 6067289
6125F067289P13820M66937k600632n513415n184159k969336j581136k76051L031072
$$ 6067289 6781109 7248046 4647414 -866001 -6050160 -9019496 -10600632 -10876683 -7845611
6116g845611O620931O216371J213765l814691m470533r90376L036437M340160
$$ -7845611 -1224680 4991691 6205456 2390765 -2079768 -3070144 -33707 4306453
6108D306453K064011j839355l856172k152152J198194K636396J535894L41178
$$ 4306453 6370464 4531109 674937 -1477215 -279021 2357375 3893269 4234447
6100D234447N58198J058441P30641K81007L71356J24756j138442k296083j917764
$$ 4234447 4792645 5851086 6581727 6862734 7234090 7358846 6220404 3924321 2006557
6091B006557k23190J423722J892931N69956k247867m477502l458602P84852M843437
$$ 2006557 1783367 3207089 5100020 5669976 3422109 -1055393 -4513995 -3729143 1114294
6082A114294N600927L422337Q23111n58380o64270k76492p26303k805386m917505
$$ 1114294 6715221 10137558 10960669 10402289 9738019 9461527 8735224 5929838 1012333
6073A012333m202907p52825J639291Q29918j13864K395169O359596O653333K533316
$$ 1012333 -3190574 -3943399 -2304108 -1474190 -1588054 807115 7166711 13820044 16353360
6064A6353360j448001k090083j139655j262703j994419j652058o90881p80659
$$ 16353360 14905359 12815276 11675621 10412918 8418499 6766441 6075560 5294901
6056E294901j962597k785609k538225j742285q68051Q3468Q35667P76049r2605
$$ 5294901 3332304 546695 -1991530 -3733815 -4601866 -4518398 -3682731 -2906682 -2999287
6047b999287p78147l63750O56537O59962j004170k613645j850593R95315L020022
$$ -2999287 -3777434 -4141184 -3484647 -2824685 -3828855 -6442500 -8293093 -7297778 -4277756
6038d277756K449120Q33004M13024Q31743K07632j574124k687434k086487o36946
$$ -4277756 -1828636 -995632 -582608 249135 456767 -1117357 -3804791 -5891278 -6528224
6029f528224L69861M48184k24912j070609j388640j083585n93227K46128J917753
$$ -6528224 -6158363 -5710179 -5935091 -7005700 -8394340 -9477925 -10071152 -9825024 -7907271
6020g907271L314372K335269l82634j064757J695092L917811J947433j517498
$$ -7907271 -4592899 -2257630 -2640264 -3705021 -2009929 1907882 3855315 2337817
6012B337817j396774J782421K948065N02270k077760k480175k007928j304845
$$ 2337817 941043 2723464 5671529 6173799 4096039 1615864 -392064 -1696909
6004a696909R19322L669828L460779J60447j916107q28707P0570j486046k591335
$$ -1696909 -777587 2892241 6353020 6513467 4597360 3768653 3839223 2353177 -238158
5995b38158p89371J191449N07232m84713J190302L150582J754330r90849o56668
$$ -238158 -1027529 163920 671152 186439 1376741 4527323 6281653 5290804 4634136
5986D634136J622045P82135l426699n612165l113670L16805N71315j574053l017947
$$ 4634136 6256181 7038316 3611617 -2000548 -5114218 -4797413 -4226098 -5800151 -8818098
5977h818098k581752q68134J439659L425540L920556K845448J335410J45570p69943
$$ -8818098 -11399850 -12267984 -10828325 -7402785 -3482229 -636781 698629 844199 74256
5968G4256j222559r41727n82585r54846j481310r31547P09757K418616L380782
$$ 74256 -1148303 -2090030 -2672615 -3627461 -5108771 -6040318 -5330561 -2911945 468837
5959D68837K887197M95120k191718k045806J082503K878008N76019k245918j009276
$$ 468837 3356034 3851154 1659436 -386370 696133 3574141 4150160 1904242 894966
5950H94966K199773J656015k794877n577004m149867j821705j147321o02098N76992
$$ 894966 3094739 4750754 1955877 -3621127 -7770994 -9592699 -10740020 -11342118 -10765126
5941a0765126J27264k152621k404690J047594M169954L400776J092445R49973
$$ -10765126 -10637862 -12790483 -15195173 -14147579 -9977625 -6576849 -5484404 -4534431
5933d534431J928959J062081q18645r49828J3067p70215l114483m166122l140375
$$ -4534431 -2605472 -1543391 -2362036 -3311864 -3298797 -4069012 -7183495 -11349617 -14489992
5924a4489992j817664r15634L57833J498334J056481j36708N27424L159403M565840
$$ -14489992 -16307656 -17223290 -16865457 -15367123 -14310642 -14447350 -13919926 -10760523 -6194683
5915f194683K708883l64160j317980K38758J537503J08815l207768m846471k410012
$$ -6194683 -3485800 -3849960 -5167940 -4929182 -3391679 -3282864 -6490632 -11337103 -13747115
5906a3747115K229276M851803L912518J815577P90763P3752j422494k283083q39910
$$ -13747115 -11517839 -6666036 -2753518 -937941 -147178 -73426 -1495920 -3779003 -4618913
5897d618913J694462K887623K365710J096188q60246l204327l789331j377073
$$ -4618913 -2924451 -36828 2328882 3425070 2564824 -639503 -4428834 -5805907
5889e805907J428246J460477l1429M94347K770052L148694Q48267r41306p59461
$$ -5805907 -4377661 -2917184 -2948613 -2454266 315786 3464480 4312747 3371441 2611980
5880B611980r70443k740689l432763j341943Q82222N05573p81063N2205K221707
$$ 2611980 1641537 -1099152 -4531915 -5873858 -4991636 -4486063 -5267126 -5214921 -2993214
5871b993214K645244J034219q4469K85883M91534n37935j603646j280922J94096
$$ -2993214 -347970 686249 601780 887663 1379197 841262 -762384 -2043306 -1849210
5862a849210J515558J536793j27230k531944l528290j689908J806865M159520
$$ -1849210 -333652 1203141 1075911 -1456033 -4984323 -6674231 -4867366 -707846
5854g07846L764274J398339r94281j843095p92607R63629J583762P05472M3716
$$ -707846 3056428 4454767 3460486 1617391 824784 1788413 3372175 4077647 4121363
5845D121363Q64188J841594J034105q81032j547479p23810n62579j784641k254145
$$ 4121363 4985551 6827145 7861250 6980218 5432739 4708929 4146350 2361709 107564
5836A07564m82198J860141K640032K424694K716395K655568L69665l100003m317197
$$ 107564 -374634 1485507 4125539 6550233 9266628 11922196 12291861 9191858 4874661
5827D874661k241875J70133N7027j934237l516041l907472l397374j585082J593731
$$ 4874661 2632786 2802919 2859946 925709 -2590332 -6497804 -9895178 -11480260 -9886529
5818i886529M135186L801074J425815J00085R49810J955550J446882M75095N28113
$$ -9886529 -5751343 -1950269 -524454 -424369 525441 2480991 3927873 4402968 4931081
5809D931081Q55094q0579j691838j916011m26794P21085K4357j345688j201080
$$ 4931081 5786175 5705596 4013758 2097747 1670953 2392038 2416395 1070707 -130373
5800a30373O87381K333039K205036J223644J373967K715590L003145P96325k248108
$$ -130373 557008 2890047 5095083 6318727 7692694 10408284 13411429 14207754 11959646
5791A1959646l512708l067138l248307m663352m851473j871711K568641N012704
$$ 11959646 8446938 5379800 2131493 -2531859 -7383332 -9255043 -6686402 -1673698
5783a673698M122209J316435j385712k646820j837672L71195J779773P25935j617094
$$ -1673698 2448511 3764946 2379234 -267586 -2105258 -1734063 45710 771645 -845449
5774h45449k462905r86017P74650Q49366k46101o68936K74417J665495K328482
$$ -845449 -3308354 -4294371 -3519721 -2670355 -2916456 -3585392 -3310975 -1645480 683002
5765F83002J803261K65309j696427l015080k441120K96436L410322M015299J251338
$$ 683002 2486263 2751572 1055145 -1959935 -4401055 -4104619 -694297 3321002 4572340
5756D572340j964729j896091J150349K838243N43270k996495l588531j394730
$$ 4572340 2607611 711520 1861869 4700112 5243382 2246887 -1341644 -2736374
5748b736374j00625j142428j997164o31445J331512J392478M9391r0094J882212
$$ -2736374 -2836999 -3979427 -5976591 -6608036 -5276524 -3884046 -3834655 -3924749 -2042537
5739b042537L969233L709537Q30266k489260l548996j606462J271446K238578
$$ -2042537 1926696 5636233 6466499 3977239 428243 -1178219 93227 2331805
5731B331805P26347j119300j197711K27054J389777J296665L52065o63646j297134
$$ 2331805 3058152 1938852 741141 968195 2357972 3654637 4006702 3343056 2045922
5722B045922j289781n60786M70948R52253L00029j102990k051133j673931n34885
$$ 2045922 756141 195355 666303 1618556 1918585 815595 -1235538 -2909469 -3444354
5713c444354q5848p34125j143712j38206J413521J714813N37125p61988j387392
$$ -3444354 -3530202 -4264327 -5408039 -5546245 -4132724 -2417911 -1880786 -2642774 -4030166
5704d030166j595046j073699J059779L942847M744062K309131n12430j99067K644307
$$ -4030166 -5625212 -6698911 -5639132 -1696285 3047777 5356908 4844478 4645411 7289718
5695G289718L990185J695092k031963l904419l350262j965775p92410P8117j409
$$ 7289718 11279903 12974995 10943032 7038613 3688351 1722576 930166 1008283 1006874
5686A006874j907983m536541m846576j509145K555610L039828n56296m220972
$$ 1006874 -901109 -5437650 -10284226 -11793371 -9237761 -6197933 -6754229 -10975201
5678a0975201m212143j007719K234200L661505L772889L462112K889483K268149
$$ -10975201 -15187344 -16195063 -13960863 -10299358 -6526469 -3064357 -174874 2093275
5670B093275K166628K407428J650909j059928m572717o076260l709755J111585
$$ 2093275 4259903 6667331 8318240 7258312 2685595 -3390665 -7100420 -5988835
5662e988835M366803L197045r54746l817056l006544j46175J941623K476220K263016
$$ -5988835 -1622032 1575013 620267 -3196789 -6203333 -6349508 -4407885 -1931665 331351
5653C31351J762813J216568J310824J871923J106852j758236m205342l326276
$$ 331351 2094164 3310732 4621556 6493479 7600331 5842095 1636753 -1689523
5645a689523k33433J244023q5264j702645j684390r29139n33566m4787O65187
$$ -1689523 -1922956 -678933 -764197 -2466842 -4151232 -5080371 -5613937 -5658724 -4993537
5636d993537O96768N17820K121778N183461N998032K503849k155199l685148k194865
$$ -4993537 -4296769 -3778949 -1657171 3526290 9524322 12028171 9872972 6187824 3992959
5627C992959r23700j147282j450458j024772n94976l90609J94221R77589J153139
$$ 3992959 3069259 1921977 471519 -553253 -1148229 -1538838 -1344617 -367028 786111
5618G86111R38913J168500J505445R33017k78630r70379j154415j766094k618754
$$ 786111 1725024 2893524 4398969 5331986 5053356 4082977 2928562 1162468 -1456286
5609a456286k573808j623128q92492o53282j97777M05501L37405k71682n70765
$$ -1456286 -4030094 -5653222 -6545714 -7198996 -7396773 -6991272 -6653867 -6925549 -7496314
5600g496314p43377j459895j801271j96787K494112L502443K165839P07994L78842
$$ -7496314 -8239691 -9699586 -11500857 -11697644 -9203532 -5701089 -3535250 -2827256 -2448414
5591b448414k14254j798713k552739j356764r7461l70415m04004J834624M496085
$$ -2448414 -2662668 -4461381 -7014120 -8370884 -8468345 -8838760 -9242764 -7408140 -2912055
5582b912055M157999R86222j804536k835846l391176l712220k326960L28668J324695
$$ -2912055 1245944 2232166 427630 -2408216 -5799392 -9511612 -11838572 -11509904 -10185209
5573a0185209k55453j426869O3988K029171J406792o78587o83913J761755L465349
$$ -10185209 -10440662 -11867531 -11803543 -9774372 -8367580 -9046167 -9730080 -7968325 -4502976
5564d502976K592933P30539m24385j355379k484877k351214j03650K016368J164332
$$ -4502976 -1910043 -1179504 -1603889 -2959268 -5444145 -7795359 -7899009 -5882641 -4718309
5555d718309j915859l432313j219323K844622N263504M427661J477868j184060
$$ -4718309 -6634168 -10066481 -11285804 -8441182 -3177678 1249983 2727851 1543791
5547A543791j900345j025105l16740n76187m22228J532310L950108M073150J734714
$$ 1543791 -356554 -1381659 -1698399 -2274586 -2696814 -1164504 2785604 6858754 8593468
5538H593468n4206P36018K369026K078265L6814j269526p88707N70k94797j025658
$$ 8593468 8539262 9275280 11644306 13722571 13759385 12489859 11701152 11701722 11406925 10381267
5528A0381267q32746J47552M02779q75285k657435l414410l107037k923221l007248
$$ 10381267 9548521 9696073 10098852 9223567 6566132 3151722 44685 -2878536 -5885784
5519e885784j899153P73339K542815J148660j551965j574149J310513K941243
$$ -5885784 -7784937 -7011598 -4468783 -3320123 -4872088 -6446237 -5135724 -2194481
5511b194481J000079j491560j024821J050165J189749m81360p96851R60317K090038
$$ -2194481 -1194402 -2685962 -3710783 -2660618 -1470869 -1952229 -2749080 -1788763 301275
5502C01275J060104m29680o90728l59471l57949r9746Q24057J187083l5197j753454
$$ 301275 1361379 931699 240971 -118500 -476449 -576195 247862 1434945 1399748 -353706
5492c53706k126114r13695N96802J265810R08473P9502m48901n62719j139656
$$ -353706 -2479820 -3393515 -2796713 -1530903 -622430 -542928 -991829 -1554548 -2694204
5483b694204k590610l433759j964315P75764J852708O71292k3043J597827L515825
$$ -2694204 -5284814 -8718573 -10682888 -9907124 -8054416 -7383124 -7406167 -5808340 -2292515
5474b292515K918108L34251j350450p94144R02783K337997K905480K297385P29197
$$ -2292515 625593 959844 -390606 -1184750 -281967 2056030 4961510 7258895 7988092
5465G988092n42550l93431O16502R69858J06152j382472k791572l378106k269332
$$ 7988092 7445542 7052111 7668613 8638471 8744623 7362151 4570579 1192473 -1076859
5456a076859J74639J719358Q06137r28532q04770P47590P99547j313002k829283
$$ -1076859 -902220 817138 1623275 694743 -110027 637563 1437110 124108 -2705175
5447b705175k041884r53630j615758k364804m77385L030554M475666K853654R30185
$$ -2705175 -4747059 -5700689 -7316447 -9681251 -10158636 -7128082 -2652416 201238 1131423
5438A131423O39005M95604j010195k113877l70674K911195L693428N14588l627033
$$ 1131423 1770428 2266032 1255837 -858040 -1228714 1682481 5375909 5890497 2263464
5429B263464n193803l936996j937625n39588L65472J085931J694969K402935L212242
$$ 2263464 -2930339 -6867335 -8804960 -9344548 -8979076 -7893145 -6198176 -3795241 -582999
5420e82999L530149K989933K109482J259060j41535k113299k856616j046284J260340
$$ -582999 2947150 5937083 8046565 9305625 9164090 7050791 4194175 3147891 4408231
5411D408231O47822k630170m511575k854446l56455n5535p68868K12670K147351
$$ 4408231 5056053 2425883 -2085692 -4940138 -5296593 -5352128 -6120996 -5908326 -3760975
5402c760975K292830J147838J957345M821222N648752K550308o59211j76153J656937
$$ -3760975 -1468145 -320307 1637038 6458260 12107012 14657320 13998109 13821956 15478893
5393A5478893j47382n295692q231180n953791j612138P97099J503400K543179
$$ 15478893 15331511 10035819 1804639 -4149152 -5761290 -4964191 -3460791 -917612
5385i17612L396139K267470j08168j365490j353483j802500k513979j379481J388199
$$ -917612 2478527 4745997 4637829 3272339 1918856 116356 -2397623 -3777104 -2388905
5376b388905K606461J026968m27615N43465J597405l53714l428434k951900J400710
$$ -2388905 217556 1244524 816909 1360374 2957779 2604065 -824369 -3776269 -2375559
5367b375559M640204L255954l79356j862352m74759R93046O36948n37632p10475
$$ -2375559 2264645 5520599 5141243 3278891 2804132 3797178 4434126 3896494 3186019
5358C186019K46451Q94097K61817r24428j380554j215691j646556k569662k035984
$$ 3186019 3432470 4326567 4588384 3663956 2283402 1067711 -578845 -3148507 -5184491
5349e184491O99921L130238K434280n34910k431703j935768o57908Q7631O70328
$$ -5184491 -4484570 -1354332 1079948 545038 -1886665 -3822433 -4480341 -4392710 -3722382
5340c722382J164935P64151j90625q1626J336879K487323K747332L068936L166531
$$ -3722382 -2557447 -1793296 -1983921 -2065547 -728668 1758655 4505987 7574923 10741454
5331A0741454J223701k305436l891425j973762J85344p86406l476943m386350
$$ 10741454 11965155 9659719 5768294 3794532 3979876 3193470 -283473 -4669823
5323d669823l152375j826055q49759O76570J971278J327477p33912k026634j781039
$$ -4669823 -7822198 -9648253 -10498012 -9821442 -7850164 -6522687 -7256599 -9283233 -11064272
5314a1064272o11681J419587L818337M164895J159865k019159j408584J594764
$$ -11064272 -11675953 -10256366 -6438029 -2273134 -1113269 -3132428 -4541012 -2946248
5306b946248K255593J06890o58494J292792K181784n3369k189147j645182q92791
$$ -2946248 -690655 -583765 -1242259 50533 2232317 2178948 -10199 -1655381 -2548172
5297b548172k311920l178332m63727K854062J722507k765748m606607j705422
$$ -2548172 -4860092 -8038424 -8502151 -5648089 -3925582 -6691330 -11297937 -13003359
5289a3003359J652828J656900j23402j31329K125967M196314L888605J113494
$$ -13003359 -11350531 -9693631 -9817033 -9948362 -7822395 -3626081 262524 1376018
5281A376018k144462l150562j044114J727566K104212M13252k74209J179808K322772
$$ 1376018 -768444 -3919006 -4963120 -3235554 -1131342 -718090 -992299 187509 2510281
5272B510281Q62689k077534l699770k945679q82142J146680K450223K775013K239754
$$ 2510281 3372970 1295436 -2404334 -5350013 -6232155 -5085475 -2635252 139761 2379515
5263B379515J256873J25645q84820j091877r788J439542J475022l63055k589620
$$ 2379515 3636388 3762033 2877213 1785336 1775548 3215090 4690112 4327057 1737437
5254A737437l687416l546299k637268j104117N97468J419481J090984Q00824J491362
$$ 1737437 -1949979 -5496278 -8133546 -9237663 -8640195 -7220714 -6129730 -5328906 -3837544
5245c837544K279648J639789m25072k344687k693733j284332Q35660J851564N13857
$$ -3837544 -1557896 81893 -343179 -2687866 -5381599 -6665931 -5830271 -3978707 -3464850
5236c464850k113678l090547q91708K455461L741250K421208O54291j5142k14027
$$ -3464850 -5578528 -8669075 -9560783 -7105322 -3364072 -942864 -288573 -303715 -517742
5227e17742q36687j296627n29149J264157K813853L333014L142487K753486J875424
$$ -517742 -1354429 -2651056 -3180205 -1916048 897805 4230819 7373306 10126792 12002216
5218A2002216q9220k466544l116671r61499J739692J512104j605555l646253k177650
$$ 12002216 11912996 9446452 6329781 5368282 7107974 8620078 7014523 3368270 1190620
5209A190620J48678l10074k557288k641453P4201K042874J083457p05902n94891
$$ 1190620 1339298 1029224 -1528064 -4169517 -4095316 -2052442 -968985 -1674887 -2269778
5200b269778J173534K818417L565891L201778J263711j586338l144600k272993
$$ -2269778 -1096244 1722173 5288064 8489842 9753553 8167215 5022615 2749622
5192B749622m79382L79611L26213K2033o49613j272352m06583J659254J934204
$$ 2749622 2270240 2649851 2976064 2998097 2348484 1076132 669549 2328803 4263007
5183D263007j044805m073592l295317K92864K495312J800899L21749k05445M5411
$$ 4263007 3218202 -855390 -4150707 -3857843 -1362531 438368 760117 554672 600083
5174F00083Q80218K141217K215292j53328k766344k179605R78927K546795R94736
$$ 600083 1480301 3621518 5836810 5683482 2917138 737533 1716460 4263255 5257991
5165E257991p50651l94966O76611P05051K08802l38640j993244m491272n140824
$$ 5257991 4507340 4112374 4788985 5494036 5702838 5364198 3370954 -1120318 -6261142
5156f261142k854924m10112k85028r29272K70230K768058M295840M350217L605704
$$ -6261142 -9116066 -9526178 -9811206 -10740478 -10470248 -7702190 -3406350 943867 4549571
5147D549571J916755m00554j305332J13764J390945J71061j924804j970508l56128
$$ 4549571 6466326 6065772 4760440 4874204 6265149 6436210 4511406 2540898 2184770
5138B184770O79500J259711K584336K955355j54849m614570n193848j190328K120878
$$ 2184770 2864270 4123981 6708317 9663672 9508823 4894253 -299595 -1489923 630955
5129F30955J024448j801130k037745K19051J850606J620015Q02141L77544J58425
$$ 630955 1655403 -145727 -2183472 -1964421 -113815 1506200 2308341 2685885 2844310
5120B844310L7091J51636J42709l36660o74916p4739Q84694N56488j630001l974508
$$ 2844310 2881401 3033037 3175746 2839086 2164170 2089431 2974125 3530613 1900612 -2073896
5110b073896m010361j244351K051445L286463K432406J454284J095637M3111k125726
$$ -2073896 -6084257 -7328608 -5277163 -1990700 441706 1895990 2991627 3034738 909012
5101I09012l279320j641683J227916K367948J222584m58534j504735j927909j462264
$$ 909012 -2370308 -4011991 -2784075 -416127 806457 347923 -1156812 -3084721 -4546985
5092d546985J16005J611498J562756N11787J23283M63713K70449n44599j010461
$$ -4546985 -4430980 -2819482 -1256726 -744939 -621656 -157943 112506 -432093 -1442554
5083a442554j360415k613845l947789l124357N6658L018613L604333K100888j05631
$$ -1442554 -2802969 -5416814 -9364603 -12488960 -12432302 -9413689 -5809356 -3708468 -3814099
5074c814099j907796k388555j386370k98255m60210r21608Q9651J911233K216583
$$ -3814099 -5721895 -8110450 -9496820 -9795075 -10255285 -11176893 -11087242 -9176009 -6959426
5065f959426P86607l09229k45399j50303j78989Q41430K352526K041713j74355
$$ -6959426 -6172819 -6482048 -6727447 -6877750 -7056739 -6215309 -3862783 -1821070 -1995425
5056a995425j390384j94918J124041L26715j593213k516480j986405m35913J951918
$$ -1995425 -3385809 -3580727 -2456686 -2129971 -3723184 -6239664 -8226069 -8661982 -6710064
5047f710064M148365M287182K145987l06359j602200j785447n07789K668562N477854
$$ -6710064 -2561699 1725483 3871470 3565111 1962911 177464 -330325 2338237 7816091
5038G816091M315873k86992l473851l018086k269718l889466n163134k998570
$$ 7816091 12131964 11844972 8371121 5353035 3083317 -806149 -5969283 -8967853
5030h967853M25547J249723L5580j59057O93254N23621k99461Q3528R15263O2083
$$ -8967853 -8542306 -7292583 -7257003 -7416060 -6722806 -6199185 -6498646 -6415118 -5499855 -5437772
5020e437772j599725j279214Q91839K223337K273843L159870M961959M841898
$$ -5437772 -7037497 -8316711 -7424872 -5201535 -2927692 232178 5194137 10036035
5012A0036035J594575k202694l685211k888196j604266j046245j248520j306924
$$ 10036035 11630610 9427916 5742705 2854509 1250243 203998 -1044522 -2351446
5004b351446j51816J695870J925759l63897k520101j715226P54772J446757N8241
$$ -2351446 -2503262 -807392 1118367 754470 -1765631 -3480857 -2726085 -1279328 -1221087
4995a221087o68830J24051K97032j122208k165502j306324L42367J385914K125593
$$ -1221087 -1889917 -1765866 -1468834 -2591042 -4756544 -6062868 -5720501 -4334587 -2208994
4986b208994K876803K561140M85903k098897l472628l206927j693448N96463K549171
$$ -2208994 667809 3228949 3714852 1615955 -1856673 -5063600 -6757048 -6160585 -3611414
4977c611414K629909P58950j173042j596677j026133o90683n63485N3645Q42172
$$ -3611414 -981505 -222555 -1395597 -2992274 -4018407 -4709090 -5272575 -5218930 -4376758
4968d376758Q52398L22700O19154J943208K390191M50806k276437k589640p66
$$ -4376758 -3524360 -3201660 -2582506 -639298 1750893 2201699 -74738 -2664378 -2665144
4959b665144K343962J904354j9336q32265n25506o64187j062549m69368M27069
$$ -2665144 -321182 1583172 1563836 731571 206065 -458122 -1520671 -1990039 -1562970
4950a562970p5381j399483j633885j104092j327568j208184J204234L682970K031209
$$ -1562970 -1638351 -3037834 -4671719 -5775811 -7103379 -8311563 -7107329 -3424359 -1393150
4941a393150k429553l692665n40040J401939p48364k440179j19051K498155J477473
$$ -1393150 -3822703 -7515368 -8055408 -6653469 -7401833 -9842012 -9961063 -7462908 -5985435
4932e985435k11463J368342L308474P74044m160876n470656k328230R40136J973800
$$ -5985435 -6196898 -4828556 -1520082 -746038 -4906914 -10377570 -12705800 -11765664 -9791864
4923i791864J871341J462725J044852J828707L360447K250382k328674n489575
$$ -9791864 -7920523 -6457798 -5412946 -3584239 -223792 2026590 -302084 -5791659
4915e791659l650321n29371p64754k075463j05115L297298L712571K139795K015870
$$ -5791659 -9441980 -9971351 -10736105 -12811568 -12916683 -9619385 -5906814 -3767019 -1751149
4906a751149J963672r26458m143522l730703j599471j310784q09718K583562M843222
$$ -1751149 212523 -713935 -4857457 -8588160 -10187631 -11498415 -12308133 -9724571 -4881349
4897d881349J869985j759998m41541J788061r30664m125997j157760L016057N01820
$$ -4881349 -3011364 -4771362 -5212903 -3424842 -4355506 -8481503 -9639263 -6623206 -6121386
4888f121386l693078o81204M066685J14192o617133l329433M407887J390393p806729
$$ -6121386 -9814464 -10495668 -6428983 -6314791 -12931924 -16261357 -11853470 -10463077 -18269806
4879a8269806o335048J229079m204307j6691499j3127038n191029l3103789q8129448
$$ -18269806 -24604854 -23375775 -27580082 -44271581 -57398619 -62589648 -95693437 -183822885
4871a83822885r5263134j3747162Q8384088J13449297N9211094P074929L023233
$$ -183822885 -279086019 -292833181 -204449093 -90999796 -31788702 -24713773 -21690540
4864b1690540J4726040O746116o308624j717197P840963K737287p224863m492853
$$ -21690540 -6964500 -218384 -6527008 -8244205 -403242 2334045 -4890818 -9383671
4856i383671L856296K391473l889924j826700M523267L471643j821041j082752
$$ -9383671 -5527375 -3135902 -7025826 -8852526 -4329259 -857616 -2678657 -3761409
4848c761409L190794K432665l63146K635986P380760M635195k842492n227493
$$ -3761409 -570615 1862050 1498904 4134890 11515650 16150845 13308353 8080860
4840H080860k404979j592307l059294j732374J154691O60445j374694n8387K229830
$$ 8080860 5675881 4083574 1024280 -708094 446597 1107042 -267652 -326039 1903791
4831A903791L38120k963094j778834J621791J357928n25381J446082M254931J165389
$$ 1903791 2241911 -721183 -2500017 -878226 479702 -45679 1400403 5655334 6820723
4822F820723m860851n057034J08393K242642j32497n16222K471476L339622J359504
$$ 6820723 1959872 -3097162 -2988769 -746127 -878624 -1394846 1076630 4416252 5775756
4813E775756J823604M583628L207836k451848m449733m57262J819260k084688
$$ 5775756 7599360 12182988 15390824 12938976 8489243 8031981 9851241 7766553
4805G766553o051159m267779j74819J077393R64840K341162K842938r3428l182995
$$ 7766553 1715394 -2552385 -2727204 -1649811 -684971 1656191 4499129 4405701 1222706
4796A222706k362962M68613J199702J41909o4592L21350j59129k70182J460918
$$ 1222706 -1140256 -671643 528059 669968 605376 926726 767597 497415 1958333
4787A958333K925354J470657j358170k227775j290870j004718j265410j168K157617
$$ 1958333 4883687 6354344 4996174 2768399 1477529 472811 -792599 -793767 1363850
4778A363850K040436q81073l004787j478920J933694L442536K108781K86627k34381
$$ 1363850 3404286 2523213 -481574 -1960494 -26800 3415736 5524517 5811144 5576763
4769E576763m39148j649122k642832j378312J149289J690061k45809j358357J36315
$$ 5576763 5137615 3488493 845661 -532651 616638 2306699 2060890 702533 838848
4760H38848J538027L02576j665565j639132r44405j967064k778979M1651M635097
$$ 838848 2376875 2679451 1013886 -625246 -1569651 -3536715 -6315694 -6274043 -1638946
4751a638946N537955J944225j158205p68845M20296m13852j755922j225644K69591
$$ -1638946 3899009 5843234 4685029 3916184 4336480 3922628 2166706 941062 1210653
4742A210653N51197l29170r35056q09037k32915O54985J229544N27737j083580
$$ 1210653 1761850 1432680 497624 -311413 -544328 110657 1340201 1867938 784358
4733G84358k057328j925896j469360n26364J767301M176076L783273K31181l144631
$$ 784358 -1272970 -3198866 -4668226 -5194590 -3427289 748787 4532060 4763241 1618610
4724A618610l628024k177053j057089q24659r15989r94932m26912J540477L911410
$$ 1618610 -2009414 -4186467 -5243556 -6068215 -6984204 -7979136 -8406048 -6865571 -2954161
4715b954161M280062K128469k19056r02088n94450k66195O18128K152387K589439
$$ -2954161 1325901 3454370 3235314 2333226 1738776 1472581 2090709 4243096 6832535
4706F832535Q46693j366143j797150n85314O83819J366425J473375M05766j983159
$$ 6832535 7679228 6313085 4515935 3930621 4614440 5980865 7454240 7860006 5876847
4697E876847l973611l671645j762354q01246j730009k641720j568678N95608J116718
$$ 5876847 1903236 -1768409 -3530763 -4332009 -6062018 -8703738 -10272416 -9676808 -8560090
4688h560090p59065k319250p65521K804124M730675L898347K862961L202989K904724
$$ -8560090 -9319155 -11638405 -12403926 -9599802 -4869127 -970780 1892181 5095170 7999894
4679G999894L24418k284982k208728o94688l26534j81664K004531M448888L197399
$$ 7999894 8324312 6039330 3830602 3135914 2809380 2627716 4632247 9081135 12278534
4670A2278534j155790l781668k863658j463941j436117p35447J563516K591990
$$ 12278534 11122744 7341076 4477418 3013477 1577360 841913 2405429 4997419
4662D997419N70042j861004j975226r79132r01602r29777N1560L70332j534540
$$ 4997419 5567461 3706457 1731231 752099 -149503 -1079280 -1027720 -657388 -2191928
4653b191928l604411l049977q58895m2564q07056p28051J128017L147971L796627
$$ -2191928 -5796339 -8846316 -9705211 -9747775 -10554831 -11282882 -10154865 -7006894 -3210267
4644c210267L022606J435067j19504o53712j68249k99q36501j384556l13029J563622
$$ -3210267 -187661 1247406 1127902 474190 305941 305642 -530859 -1915415 -2228444 -664822
4634f64822K407846J734005M66850m75967p14862n02096r21157k694574m339080
$$ -664822 1743024 3477029 3943879 3467912 2753050 2250954 1329797 -1364777 -5703857
4625e703857l357441K0059K440471J857952J33103j93784N36116O14372L4292
$$ -5703857 -9061298 -9041239 -6600768 -4742816 -4609713 -4803497 -4267381 -3653009 -3618717
4616c618717j46872m2824l69325o16882L35888K377002M206800M628017L137558
$$ -3618717 -3765589 -3808413 -4177738 -4794620 -4458732 -2081730 2125070 6753087 9890645
4607I890645L10527j917924j822907k45682K73156r56037k159838k327691k376566
$$ 9890645 10201172 8283248 6460341 6214659 6487815 5531778 3371940 1044249 -1332317
4598a332317k427376r58081K058405M074007L531474J827265M26849r58341j978646
$$ -1332317 -3759693 -4717774 -2659369 1414638 4946112 6773377 7200226 6241885 4263239
4589D263239r99166J291572J392930j515996l486718k116212q84946l317094o505662
$$ 4263239 3264073 4555645 5948575 4432579 945861 -1170351 -2055297 -5372391 -11878053
4580a1878053n241600N8577M397312N246043L995258K037723n1014p51614N85898
$$ -11878053 -17119653 -17061076 -12663764 -7417721 -3422463 -1384740 -1435754 -2187368 -1601470
4571a601470J311549r52804l608626k398364J732525L843987K311957J14058p40784
$$ -1601470 -289921 -1242725 -4851351 -7249715 -5517190 -1673203 638754 752812 12028
4562A2028j125480j138423N13095K864704K969674O86718q87970n09553k99418
$$ 12028 -1113452 -2251875 -1738780 1125924 4095598 4782316 3894346 3384793 3085375
4553C085375j448081k422698k306004k005962j373212Q10129L177492K549308
$$ 3085375 1637294 -785404 -3091408 -5097370 -6470582 -5660453 -2482961 66347
4545F6347n05654j543128P28494K184659L59156j211293Q39618L619624K514855
$$ 66347 -439307 -1982435 -1253941 930718 1289874 78581 918199 4537823 7052678
4536G052678j418870l392425k171861p28335n95247l0076J967260L364403J931972
$$ 7052678 5633808 2241383 69522 -658813 -1254060 -1284136 683124 4047527 5979499
4527E979499j631328m279187l488777L99005M103924M304774J204409j787479
$$ 5979499 4348171 68984 -3419793 -3020788 1083136 5387910 6592319 4804840
4519D804840k351035j522226r25396j61703J263081J706877k08070k518821k259242
$$ 4804840 2453805 931579 6183 -155520 1107561 2814438 2606368 87547 -2171695
4510b171695K743J022034r5571q89167J09986J130695M32036q04394o94580J13794
$$ -2171695 -2168952 -1146918 -1242489 -2131656 -2021670 -890975 -458939 -1263333 -1957913 -1844119
4500a844119l60322k028021k775210j646772M2499J015379J571258K092587J763036
$$ -1844119 -2204441 -4232462 -7007672 -8654444 -8611945 -7596566 -6025308 -3932721 -2169685
4491b169685J78705j024406k1939K296700L200638J794617m5301n92134j94401
$$ -2169685 -1990980 -3015386 -3037325 -740625 2460013 4254630 4209329 3617195 3422794
4482C422794K23247O15707Q70037K42247j082634j533860n49416J83501p08282
$$ 3422794 3646041 4261748 5131785 5374032 4291398 2757538 2208122 2391623 1683341
4473A683341k097456k299176j548560p67983M07753K229806L113293J859278K20166
$$ 1683341 -414115 -2713291 -4261851 -5029834 -4622081 -2392275 721018 2580296 2800462
4464B800462M72524J566132P21399j900901l281442j994809L36764J855688J975321
$$ 2800462 3272986 4839118 5560517 3659616 378174 -1616635 -1279871 575817 2551138
4455B551138M04785k328422l583423j100038L029115M125876J112905k225442
$$ 2551138 2955923 627501 -2955922 -4055960 -1026845 3099031 4211936 1986494
4447A986494k709204j221971Q6103O88144N46608p22682k049347j225648J400189
$$ 1986494 -722710 -1944681 -1858578 -1170434 -623826 -1346508 -3395855 -4621503 -3221314
4438c221314K492738P44514p51352N79495K480434J502257j413250k551985j199104
$$ -3221314 -728576 15938 -735414 -155919 2324515 3826772 2413522 -138463 -1337567
4429a337567q2690m57749k93005J869299L997162L154110l87355l280722l111969
$$ -1337567 -1420257 -1878006 -2171011 -301712 3695450 6849560 6462205 3181483 69514
4420F9514j059195o9036j108295k334838j979774o23185K16937M77950J132125
$$ 69514 -989681 -1058717 -2167012 -4501850 -6481624 -7104809 -6887872 -6409922 -5277797
4411e277797K230701K883418K640326J629108N4604j256696j002136M74140Q00764
$$ -5277797 -3047096 -163678 2476648 4105756 4160360 2903664 1901528 2375668 3176432
4402C176432q16693j636986L44526K415954J145414j625418j540138P99745P33715
$$ 3176432 2359739 722753 1067279 3483233 4628647 3003229 1463091 2262836 2996551
4393B996551k277051l448192p96412J491162J60224k022326j512440K61517J89723
$$ 2996551 719500 -2728692 -3525104 -2033942 -1873718 -3896044 -5408484 -5146967 -4957244
4384d957244j077531r03198P35335J929041K078630J573058K46876j336876j246915
$$ -4957244 -6034775 -6937973 -6202638 -4273597 -2194967 -621909 -375033 -1711909 -2958824
4375b958824P78965J936443K89748k331747l571982l825364l776920j875611K442413
$$ -2958824 -2179859 -243416 46332 -2285415 -5857397 -9682761 -13459681 -15335292 -12892879
4366a2892879N844578N141462K035702K97569K93761p2965r83825j124942q79671
$$ -12892879 -7048301 -1906839 128863 426432 720193 647228 -336597 -1461539 -2341210
4357b341210j309943j314623M97633K367390J599275p69238j253073P84891K605840
$$ -2341210 -3651153 -4965776 -4468143 -2100753 -501478 -1270716 -2523789 -1738898 866942
4348H66942K349728O39063j473403l104942k785682j56683K251924J882962k0759
$$ 866942 3216670 3855733 2382330 -722612 -3508294 -3664977 -1413053 469909 449150
4339D49150l72482J052821K065602K045168J866051Q60805k093282m973004m287271
$$ 449150 76668 1129489 3195091 5240259 7106310 7967115 5873833 900829 -3386442
4330c386442m39763K463020K398964J266125O50193k30823j472957j215185J035394
$$ -3386442 -3826205 -1363185 1035779 2301904 2952097 2721274 1248317 33132 1068526
4321A068526K861003K254988N8762k011643l351952l537489j972650L29313R86489
$$ 1068526 3929529 6184517 6243279 4231636 879684 -2657805 -4630455 -4301142 -3314653
4312c314653l97079j222344L91305K796414L229564J469194m95034j319983j250173
$$ -3314653 -3711732 -4934076 -4542771 -1746357 1483207 2952401 2457367 1137384 -112789
4303a12789p49675L56972K070469L219229K086628j425704m703426m751767j787591
$$ -112789 -862464 -505492 1564977 4784206 6870834 5445130 741704 -4010063 -5797654
4294e797654R18488J155737P847n98201m20807J03951J127485K155019J783175
$$ -5797654 -4879166 -3723429 -3715582 -4313783 -4734590 -4630639 -3503154 -1348135 435040
4285D35040K99561R6471J612729J685551j503632m659885l775421R8309K919762
$$ 435040 734601 831072 2443801 4129352 2625720 -2034165 -5809586 -5711277 -2791515
4276b791515L319240K586447J136524r69257j726604L49261K765305K121849n83712
$$ -2791515 527725 3114172 4250696 3281439 1554835 1904096 4669401 6791250 6207538
4267F207538j726559p56013J53235P82447K413216L615234J580593k474462m007124
$$ 6207538 4480979 3724966 3878201 4660648 7073864 10689098 12269691 9795229 5788105
4258E788105j579735J506294K205729O63612j662342l190239k057195J508155
$$ 5788105 4208370 5714664 7920393 8584005 6921663 3731424 1674229 3182384
4250C182384L492044P00245m031584n423182l163797j088145n40872M8713L76836
$$ 3182384 6674428 7374673 3343089 -2080093 -5243890 -6332035 -6872907 -6824194 -6447358
4241f447358r75893k047762l9093K543313J023158k879110l039163P11470K258418
$$ -6447358 -7423251 -9471013 -9510106 -6966793 -5943635 -8822745 -11861908 -11150438 -8892020
4232h892020j52522j361417J027070K850248J783961J326771L102640L015089
$$ -8892020 -9044542 -10405959 -9378889 -6528641 -4744680 -3417909 -315269 2699820
4224B699820r29851m165487l215360j164803j221665j290932N44675J428184n84449
$$ 2699820 1769969 -2395518 -5610878 -6775681 -7997346 -9288278 -8743603 -7315419 -7899868
4215g899868k102298m76043J290474L98361o07791O24652J265413j019512k930560
$$ -7899868 -10002166 -10478209 -9187735 -8789374 -9397165 -8772513 -7507100 -8526612 -11457172
4206a1457172j438128N47213r1036o60896J739076L900320K209098k11685J081958
$$ -11457172 -12895300 -12348087 -12439123 -13100019 -11360943 -7460623 -5251525 -5463210 -4381252
4197d381252L595364K196607j846996l297549j730746j052360k159892k316693
$$ -4381252 -785888 1410719 -436277 -3733826 -5464572 -6516932 -8676824 -10993517
4189a0993517n80815J296549K249264K278762J209322L9220P98582K575758J618684
$$ -10993517 -11574332 -10277783 -8028519 -5749757 -4540435 -4501215 -3702633 -1126875 491809
4180D91809k137598l777180j501630J02165j599688k628597m44299Q31979j445041
$$ 491809 -1645789 -5422969 -6924599 -6822434 -8422122 -11050719 -11495018 -10663039 -12108080
4171a2108080k781673n6297K152067K89276j299770P48982J809033j201046k733960
$$ -12108080 -14889753 -14946050 -12793983 -12504707 -13804477 -13055495 -11246462 -12447508 -15181468
4162a5181468M64447J767120k363111l427708L510496P806445R13687o763550
$$ -15181468 -14717021 -12949901 -15313012 -18740720 -15230224 -7423779 -6510092 -13273642
4154a3273642l504990K123096k878448j1045831q547842k221645n708240j0234897
$$ -13273642 -16778632 -14655536 -17533984 -28579815 -37127657 -39349302 -45057542 -55292439
4146e5292439j729005L369022j8599230m2646624j3940283O4507324J13825958
$$ -55292439 -57021444 -53652422 -72251652 -114898276 -128838559 -64331235 49494723
4139D9494723P8171203L75021l8609914k3167750j593430l905950j2234861p940365
$$ 49494723 127665926 128040947 89431033 66263283 64669853 60763903 48529042 40588677
4131D0588677r57756l066832p000310n131809l720594o946387o921277J55016
$$ 40588677 39630921 36564089 29563779 24431970 20711376 13764989 6843712 6998728
4123F998728M926117J167149l623270k222302R15913L3457j934150j060447J99230
$$ 6998728 11924845 13091994 9468724 7246422 8162335 8195792 6261642 5201195 5400425
4114E400425k46818N08208K792557J514815l960209o351000j995301L107551L729319
$$ 5400425 5153607 5661815 8454372 9969187 6008978 -342022 -2337323 770228 4499547
4105D499547K845420L471926K323934k195455m296244j28493M574688L363374
$$ 4499547 7344967 10816893 13140827 10945372 6649128 6520635 11095323 14458697
4097A4458697p96208j446493Q01176R61882j302292k390721j609102j220123j637075
$$ 14458697 13662489 12215996 13017172 13979054 12676762 10286041 8676939 7456816 5819741
4088E819741j427071n23112J32665M20446J11333j474487l108780k176423Q59575
$$ 5819741 4392670 3869558 4002223 4422669 4534002 3059515 -49265 -2225688 -1366113
4079a366113K374227J466721J330970K987941K955309l13804l094584k606583
$$ -1366113 1008114 2474835 3805805 6793746 9749055 9435251 6340667 3734084
4071C734084j299623j559351j484531K49441P29041j554648k593096N91574M070970
$$ 3734084 2434461 875110 -609421 -359980 369061 -1185587 -3778683 -3187109 883861
4062H83861L149401N0387l91506J116959Q11920n81967M86446L088900K707643
$$ 883861 4033262 4083649 3692143 4809102 5621022 5039055 5525501 8614401 11322044
4053A1322044j269252m571332m423974k295045m42404L89518K06235k7375J644818
$$ 11322044 10052792 5481460 1057486 -1237559 -1679963 -1290445 -1084210 -1111585 533233
4044E33233M967737N970895K188745k609123l080613P3261J775629M24021r99504
$$ 533233 5500970 11471865 13660610 11051487 7970874 8044135 9819764 10243785 9244281
4035I244281r22771j028710j912020j782012m34139l36790k464750m408664l877916
$$ 9244281 8321510 7292800 5380780 3598768 3164629 2827839 363089 -4045575 -7923491
4026g923491j432373J102121K568474K343270N50404j228939j419269n24741J22684
$$ -7923491 -9355864 -8253743 -5685269 -3341999 -2791595 -4020534 -5439803 -5964544 -5841860
4017e841860Q67280K504726L540060J880018j243266k427977j046491L18575L65863
$$ -5841860 -4974580 -2469854 1070206 2950224 1706958 -721019 -1767510 -1448935 -1083072
4008a083072M46372J083696P38113j058841k575229k874923k915855k747174q39496
$$ -1083072 -636700 446996 1185109 126268 -2448961 -5323884 -8239739 -10986913 -11826409
3999a1826409K520773M361438L226573J349959Q18629M49311j248698k673383
$$ -11826409 -9305636 -4944198 -1717625 -367666 450963 900274 -348424 -3021807
3991c021807j594740Q87876J912596J220673J017779K046531K594384J514641
$$ -3021807 -4616547 -3728671 -1816075 -595402 422377 2468908 5063292 6577933
3983F577933j40357j075725j496976k030076k198861j084812J037513K674311
$$ 6577933 6437576 5361851 3864875 1834799 -364062 -1448874 -411361 2262950
3975B262950K787108J944909J416979J313120L48095k107477m423389m254280
$$ 2262950 5050058 6994967 8411946 9725066 10073161 7965684 3542295 -711985
3967g11985j601409Q69266J007104l27224p41059L89189J211420L0608k248835
$$ -711985 -2313394 -1444128 -437024 -764248 -1505307 -1116118 95302 125910 -2122925
3958b122925k965875q22009K464953L973802K698570L04856j047688q72725k52397
$$ -2122925 -5088800 -5910809 -3445856 527946 3226516 3531372 2483684 1610959 1358562
3949A358562l56568j362900k196069j193133K051337N262358N183603J458201
$$ 1358562 1001994 -360906 -2556975 -3750108 -1698771 3563587 8747190 10205391
3941A0205391k344859k654945M6829K230317J597115q79062k641823k104559J17253
$$ 10205391 7860532 5205587 5252416 7482733 9079848 8200786 5558963 3454404 3571657
3932C571657J626925M28986k527117l842168j679924J753376K997011J498795
$$ 3571657 5198582 5627568 3100451 -741717 -2421641 -668265 2328746 3827541
3924C827541n69966j542960j324811j42336J451596J875598K65064j366074k89537
$$ 3827541 3257575 1714615 389804 247468 1699064 3574662 3839726 2473652 2184115
3915B184115K650131L721564J641630p88694j324873j426214k942973m463050
$$ 2184115 4834246 8555810 10197440 9408746 8083873 6657659 3714686 -748364
3907g48364l671407j409806k74801k44648R69095L316424L550439K24631l122250
$$ -748364 -4419771 -5829577 -6104378 -6349026 -5379931 -2063507 1486932 1711563 -1410687
3898a410687k125114K351513M945430K629399j583055k949385j158035R1218j111980
$$ -1410687 -3535801 -1184288 3761142 6390541 4807486 1858101 700066 791284 -320696
3889c20696k445819j464498N95678J179550O19343J096756K379280J914212o68059
$$ -320696 -2766515 -4231013 -3635335 -2455785 -1836442 -739686 1639594 3553806 2885747
3880B885747k435063j711653q06736k060375l458779j218477M189682P684337
$$ 2885747 450684 -1260969 -2067705 -4128080 -7586859 -8805336 -4615654 3068683
3872C068683N662610K02059l742355l776134j546912J82658M61987J73591K08598
$$ 3068683 8731293 8933352 5190997 1414863 -132049 50609 512596 686187 894785
3863H94785L54735l7405p86247q78882Q7945J048643P41199m12727o86801M56292
$$ 894785 1249520 1212115 425868 -453014 -365069 683574 1424773 1012046 325245 781537
3853G81537J331659L55082j454749j760393l85116L77119n79698j219722M74422
$$ 781537 2113196 2468278 1013529 -746864 -1131980 -754861 -1334559 -2554281 -2079859
3844b079859L050737L536453J821004L90400P4904p80538k432480k481554j77817
$$ -2079859 970878 4507331 6328335 6718735 6793639 6013101 3580621 1099067 921250
3835I21250J169643j106257m216615l286520J637123N490365M839079J351472
$$ 921250 2090893 984636 -3231979 -6518499 -4881376 608989 5448068 6799540
3827F799540j626950k794647k268354j31756K659602L881131K390149k02564j527908
$$ 6799540 5172590 2377943 109589 -22167 2637435 6518566 8908715 8706151 7178243
3818G178243j211746n89979o11915j120917j535909j317065k77340R23487J201598
$$ 7178243 5966497 5376518 4764603 3643686 2107777 790712 513372 1436859 2638457
3809B638457M62693j62458M3302M66443M99911P12670J700325K631160K133706
$$ 2638457 3101150 2938692 2981994 3448437 3948348 4661018 6361343 8992503 11126209
3800A1126209J72828k021347l580074m516563m766661l815843j663812N04546
$$ 11126209 11299037 9277690 5697616 1181053 -3585608 -7401451 -9065263 -8560717
3792h560717J232668L78773n29682J79233K447409M508417M926022M045875K993846
$$ -8560717 -7328049 -6949276 -7478958 -7299725 -4852316 -343899 4582123 8627998 11621844
3783A1621844J968721M94932j111713j828466j484734j095553j436895k194461
$$ 11621844 13590565 14085497 12973784 11145318 9660584 8565031 7128136 4933675
3775D933675k619757k146124m25882K147728L998539L723929J974933O58299K37680
$$ 4933675 2313918 167794 -258088 1889640 5888179 9612108 11587041 12245340 12483020
3766A2483020n40991k075849l098773l088310l329199m352957m400706k214343
$$ 12483020 11942029 9866180 6767407 3679097 349898 -4003059 -8403765 -10618108
3758a0618108L99860J003712K22590N56594K324769L399882K684960J273176O2207
$$ -10618108 -10218248 -9214536 -8991946 -8435352 -6110583 -2710701 -25741 1247435 1309642
3749A309642j158681j728456P055L515820N250377L063817l59635r56990J025367
$$ 1309642 150961 -1577495 -1570440 1945380 7195757 10259574 9899939 8942949 9968316
3740I968316J630977r06990l870832m263724k593161j096498m55155j95999o05551
$$ 9968316 11599293 10692303 6821471 2557747 -35414 -1131912 -1587067 -1783066 -2388617
3731b388617j877972k499008j030136J140272J441849J33444k21033P79760Q36064
$$ -2388617 -4266589 -6765597 -7795733 -6655461 -5213612 -5080168 -5301201 -4521441 -3685377
3722c685377m89406m94222J643121K375394p28650m258730l612546L6598J889378
$$ -3685377 -4174783 -4669005 -3025884 -650490 -1379140 -5637870 -9250416 -9213818 -7324440
3713g324440J044736Q96331K575952L251624J667102M71949J425087K623117K559000
$$ -7324440 -6279704 -5383373 -2807421 444203 2111305 2583254 4008341 6631458 9190458
3704I190458K843562M240237L818369m50181n288979o237764l993476k599546
$$ 9190458 12034020 16274257 20092626 19642445 14353466 8115702 4122226 1522680
3696A522680k889381k108197N36925K350639J754561O94360J146205K139490J930145
$$ 1522680 -1366701 -3474898 -2937973 -587334 1167227 1861587 3007792 5147282 7077427
3687G077427R76310Q56913J521580J400216k18227k197688k963872k282955j512632
$$ 7077427 8053737 8910650 10432230 11832446 11614219 9416531 6452659 4169704 2657072
3678B657072k099966l717546m227738k068605J537418L552653K424273k34469
$$ 2657072 557106 -3160440 -7388178 -9456783 -7919365 -4366712 -1942439 -2176908
3670b176908j546939n01678J236631J490904M5941j413271j588458r55420n39851
$$ -2176908 -3723847 -4225525 -2988894 -1497990 -1452049 -2865320 -4453778 -5409198 -5949049
3661e949049k66100N34857J659766K259745K073624J298391j32586j779184k067409
$$ -5949049 -6215149 -5680292 -4020526 -1760781 312843 1611234 1478648 -300536 -2367945
3652b367945k96472J593782J584960R42980J916886K964973O37035l702510m295532
$$ -2367945 -2664417 -1070635 514325 1457305 3374191 6339164 6976199 3273689 -1021843
3643a021843K21316L775719J705811k292027k464444l7792l00555l484650m845859
$$ -1021843 -800527 2975192 4681003 2388976 -75468 -113260 -413815 -3898465 -8744324
3634h744324k679162k19352N07975J282678L261175M644907M131088K894531J888073
$$ -8744324 -11423486 -11642838 -11134863 -9852185 -6591010 -1946103 2184985 5079516 6967589
3625F967589M79469j239165j964129j820711k309321k954845j503928J664438
$$ 6967589 7447058 6207893 4243764 2423053 113732 -2841113 -4345041 -2680603
3617b680603L069207J411917l53247N3225Q89695K11125m01723J169328L557317
$$ -2680603 388604 1800521 1447274 1500499 2390194 2601319 2199596 3368924 6926241
3608F926241L981017K452857J088213O50786L33449j49033n12856j067039k058758
$$ 6926241 10907258 13360115 14448328 15099114 15432563 15283530 14770674 13703635 11644877
3599A1644877k690061k291769j541774j254051j063292m63944O3009k27m01653
$$ 11644877 8954816 6663047 5121273 3867222 2803930 2339986 2402995 2402768 2001115
3590B001115r73153j680968j404957R62574L557333K765076j298385l957921k619478
$$ 2001115 1027962 -653006 -2057963 -1095389 2461944 5227020 3928635 -29286 -2648764
3581b648764n68042j269655k637072j094829J777741J828268l91744m89660K314084
$$ -2648764 -3216806 -4486461 -7123533 -8218362 -6440621 -4612353 -5004097 -5493757 -3179673
3572c179673M001908K380682j5541o36654j69137K49209J062305J884060P30493
$$ -3179673 822235 3202917 3187376 2550722 2381585 2630794 3693099 5577159 6307652
3563F307652k307251l840748j870359J098243J917447J171008J085313J364076
$$ 6307652 4000401 159653 -1710706 -612463 1304984 2475992 3561305 4925381
3555D925381K01001k013829l084106k400036j247872j13549J747212L924535M353227
$$ 4925381 5126382 3112553 28447 -2371589 -3619461 -3733010 -1985798 1938737 6291964
3546F291964J961059j644037l858543l611890j876331l84882p7653l19626L11977
$$ 6291964 8253023 6608986 2750443 -861447 -2737778 -3122660 -3200313 -3519939 -3207962
3537c207962K039032L116514J889979p49779k151126j168311N46838Q85552j87133
$$ -3207962 -1168930 1947584 3837563 3087784 936658 -231653 315185 1200737 1013604
3528A013604j188024j382190j387306j706038j706528n09973J591162L146316
$$ 1013604 -174420 -1556610 -2943916 -4649954 -6356482 -6866455 -5275293 -2128977
3520b128977L009502J552849K70316J75498P53141P27801j93141q41421j61706
$$ -2128977 880525 2433374 2703690 2879188 3632329 4360130 4166989 3325568 3163862
3511C163862J225756J729582Q19326n02989j222644j296290r70051l34194k0544
$$ 3163862 4389618 6119200 6938526 6435537 5212893 3916603 2946552 2612358 2591814
3502B591814r61887k570566k589289j17149K561280K942348J805305J417229J402827
$$ 2591814 1629927 -940639 -3529928 -3647077 -1085797 1856551 3661856 5079085 6481912
3493F481912l38671k947666k728336J023055L937546K408452j369727k803154
$$ 6481912 6143241 3195575 467239 1490294 5427840 7836292 6466565 3663411
3485C663411j170105M20175m8629j524699k213056j414610O54471K860009L269653
$$ 3663411 2493306 2913481 2864852 1340153 -872903 -2287513 -1633042 1226967 4496620
3476D496620J093716j765750k691894j476747K3845P31104J096554J464849J457171
$$ 4496620 5590336 3824586 1132692 -344055 -320210 410894 1507448 2972297 4429468
3467D429468Q66935j22849j256457j770474o46620J503541K302070J026267K93419
$$ 4429468 5296403 5173554 3917097 2146623 1500003 3003544 5305614 6331881 6625300
3458F625300J883672K925828o5338m714382n015236q7200M010275K566351j817871
$$ 6625300 8508972 11434800 11369462 6655080 1639844 1552644 5562919 8129270 6311399
3449F311399l767989k251999l00219M8719n78105j190863j758355k257044k007191
$$ 6311399 2543410 291411 -8808 39911 -538194 -1729057 -3487412 -5744456 -7751647
3440g751647l76616K145323L653047K390184n42210j389314J343274L616521Q22265
$$ -7751647 -8128263 -5982940 -2329893 60291 -481919 -1871233 -527959 3088562 3910827
3431C910827m854848o520443k342308J809864J227465j234535q48352J406517
$$ 3910827 -944021 -7464464 -9806772 -7996908 -6769443 -8003978 -8852330 -7445813
3423g445813J486630p39276k173390k053773j834502r06426K369919N908482N429472
$$ -7445813 -5959183 -6698459 -8871849 -10925622 -12760124 -13666550 -11296631 -5388149 41323
3414D1323J196870j666783p08857O57974o94398k671460k011510L00549J224148
$$ 41323 1238193 -428590 -1137447 -479473 -1173871 -3845331 -5856841 -5556292 -4332144
3405d332144P86796J209760K353255J894481k81751j412912j94756J144711L91942
$$ -4332144 -3545348 -2335588 17667 1912148 1630397 217485 22729 1167440 1559382
3396A559382j264058j158948R22509K673753K522272J162471j42531j132735j852636
$$ 1559382 295324 -863624 58885 2732638 5254910 6417381 6274850 5142115 3289479
3387C289479j686175j69209J806817K573139J392401q44900k402630k020726j14014
$$ 3289479 1603304 1434095 3240912 5814051 7206452 6361552 3958922 1938196 1824182
3378A824182J114716j76263k717860l048237k26479K251295J222025j321436j270129
$$ 1824182 2938898 2762635 44775 -3003462 -3229941 -978646 243379 -1078057 -2348186
3369b348186J033779J382159j270607k946035j097670J396483J100374q07667
$$ -2348186 -1314407 67752 -1202855 -4148890 -5246560 -3850077 -2749703 -3557370
3361c557370j303620m37148j4908J96756J226213J782897L12052j322407l50422
$$ -3557370 -4860990 -5298138 -5313046 -5116290 -3890077 -2107180 -1795128 -3117535 -3467957
3352c467957J754103J103912j991962k950615l8225K944293K613051O87627N26158
$$ -3467957 -1713854 -609942 -2601904 -5552519 -5590744 -2646451 -33400 654227 1180385
3343A180385K116921L078759K443403J006673n58150j823472j973512q39402K73890
$$ 1180385 3297306 6376065 8819468 9826141 9267991 7444519 5471007 4631605 4905495
3334D905495J86370n81812j052404j664838l427816n618674n723284k126097L449305
$$ 4905495 5091865 4510053 3457649 1792811 -1635005 -7253679 -12976963 -15103060 -11653755
3325a1653755O666512M588309o92638l676690j705989J965490L019203J928429
$$ -11653755 -4987243 -398934 -1091572 -4768262 -6474251 -4508761 -1489558 438871
3317D38871J842563K351246J19679m379562o017055k461412K177067L541164K616077
$$ 438871 2281434 4632680 4752359 372797 -5644258 -8105670 -5928603 -2387439 228638
3308B28638K145906J582599l61320j539138L98283K940295J997477j236980k009486
$$ 228638 2374544 3957143 3595823 2056685 2454968 5395263 7392740 6155760 4146274
3299D146274O9670M03940k736255n164639l463754r0917R87073J62653L55690
$$ 4146274 4215944 4619884 1883629 -3281010 -6744764 -6835681 -5848608 -5685955 -5330265
3290e330265J759210J950406J25488j823762k226214j355001j59907R91335J964151
$$ -5330265 -3571055 -1620649 -1495161 -3318923 -5545137 -6900138 -7060045 -6068710 -4104559
3281d104559K407253K136847J524020J258035J666788K085759J238424j031857
$$ -4104559 -1697306 439541 1963561 3221596 4888384 6974143 8212567 7180710
3273G180710k750499j786965J183029L193907K716727J134117q3898j587827m106565
$$ 7180710 4430211 2643246 3826275 7020182 9736909 10871026 10787128 9199301 5092736
3264E092736o023450n182162k170280L39955J063711R48305R06622Q75638J153350
$$ 5092736 -930714 -6112876 -8283156 -7943201 -6879490 -5931185 -5024563 -4148925 -2995575
3255b995575K347820L409052K020379j772029m300091k548025J614390L628566
$$ -2995575 -647755 2761297 4781676 3009647 -1290444 -3838469 -2224079 1404487
3247A404487K018706k73625l01460J333204K036524N98838k064476m318555m791439
$$ 1404487 3423193 3149568 2848108 4181312 6217836 6816674 4752198 433643 -4357796
3238d357796k857190N79288L230666L454597J917080M76736j16994m63396r19316
$$ -4357796 -7214986 -6635698 -3405032 49565 1966645 2443381 2326387 1862991 943675
3229I43675j048143o54019k58751l13615o99539j108753j260404q15178J85313
$$ 943675 -104468 -758487 -1017238 -1330853 -2030392 -3139145 -4399549 -5214727 -5029414
3220e029414R52327Q60952N18733R55623J974002K439491K021266J348717N91872
$$ -5029414 -4077087 -3216135 -2697402 -1741779 232223 2671714 4692980 6041697 6633569
3211F633569n98203j749198j848132j114128p36781o81245J94443J537055J518117
$$ 6633569 6035366 4286168 2438036 1323908 587127 -94118 100325 1637380 3155497
3202C155497J88790m0125J362330J440927j309534l412705j215107L081823M324251
$$ 3155497 3344287 3304162 4666492 6107419 4797885 1385180 170073 3251896 7576147
3193G576147J942294K5213L13129L4730k342510l889402k059944Q62166J162581
$$ 7576147 9518441 9543654 9856783 9891513 7549003 3659601 1599657 2461823 3624404
3184C624404q94573k119397j295393m9114L84000N28470Q96801J079443R46171
$$ 3624404 2729831 610434 -684959 -734073 -350073 178397 1075198 2154641 3100812
3175C100812J115328J722947J832391N75803j685546l542250l589355j542943
$$ 3100812 4216140 5939087 7771478 8347281 6661735 3119485 -469870 -2012813
3167b012813J243438K701745K029820M78239k76558q7268n6515p50951j521077
$$ -2012813 -769375 1932370 3962190 4440429 4163871 4076603 4020088 3269137 1748060
3158A748060j461317l51274J317929K659144K736306J215416j073014k572971
$$ 1748060 286743 -64531 1253398 3912542 6648848 7864264 6791250 4218279
3150D218279k357448j049230j95682n86839j345471j026021M77443J763953J799569
$$ 4218279 1860831 811601 615919 29080 -1316391 -2342412 -1864969 -101016 1698553
3141A698553J061037L25497n90701j883801k596148j886079o74903k66606r397
$$ 1698553 2759590 3085087 2494386 610585 -1985563 -3871642 -4546545 -4813151 -4822548
3132d822548J457794L072894K280039o56198k333078j222864P3973o71877j604836
$$ -4822548 -3364754 -291860 1988179 1331981 -1001097 -2223961 -2149988 -2821865 -4426701
3123d426701k78120J703594J186035r19650o38612K697828N003560L190032q57684
$$ -4426701 -4704821 -3001227 -1815192 -2734842 -3373454 -675626 4327934 7517966 6660282
3114F660282l375225l146825j293699J034140K745486K313350m85001l168814
$$ 6660282 3285057 138232 -1155467 -121327 2624159 4937509 4452508 1283694
3106A283694k949582k15329K043106K096088J122471Q43490J100180N70964j078143
$$ 1283694 -1665888 -1881217 161889 2257977 3380448 4223938 5324118 5895082 4816939
3097D816939k735252l232014k513306j446114q65437q71038q80433l44465N52777
$$ 4816939 2081687 -1150327 -3663633 -5109747 -5975184 -6846222 -7726655 -8071120 -7518343
3088g518343J047446P61512K71551L84811J026195J384356J172313J037704J392977
$$ -7518343 -6470897 -5709385 -5437834 -5053023 -4026828 -2642472 -1470159 -432455 960522
3079I60522J546450O67672q58993j799029j464112q4420J705851K887397K232162
$$ 960522 2506972 3174644 2315651 516622 -947490 -1031910 673941 3561338 5793500
3070E793500j73496k070012j456786K82865k12968l467443o070277n267265k327447
$$ 5793500 5620004 3549992 2093206 2376071 2163103 -1304340 -7374617 -12641882 -14969329
3061a4969329P6796J587166L159953M187689L273732R30943q93668j372538q27763
$$ -14969329 -14892533 -13305367 -10145414 -5957725 -2683993 -1753050 -2646718 -4019256 -4847019
3052d847019Q76277L533796M963430L059968o84870k508488j345315K51682L52736
$$ -4847019 -3970742 -436946 4526484 7586452 6901582 4393094 3047779 3299461 3652197
3043C652197j78391l76118r08955j877379j755810j77469P98047K3060n92598
$$ 3652197 3473806 3097688 2188733 311354 -1444456 -1621925 -823878 -800818 -1393416
3034a393416O22113K021881J418651j31437k99527L46478n18970k567563k968021
$$ -1393416 -771303 1250578 2669229 2537792 2238265 2584743 2065773 -501790 -3469811
3025c469811q34375J546421K257132J861403J500313J276594J096671R38663j81154
$$ -3469811 -4304186 -2757765 -500633 1360770 2861083 4137677 5234348 6173011 5991857
3016E991857l193488o357340o253714k514510R48165J041535m83375j98412J817598
$$ 5991857 2798369 -3558971 -9812685 -12327195 -11379030 -10337495 -10820870 -11019282 -9201684
3007i201684K713028J593929N15412R21838J754121J592178N68821o11222j853181
$$ -9201684 -6488656 -4894727 -4379315 -3457477 -1703356 -111178 457643 -153579 -2006760
2998b006760k930739k893156j298830P85655J910393J784959J115028O41255R47730
$$ -2006760 -4937499 -7830655 -9129485 -8343830 -6433437 -4648478 -3533450 -2892195 -1944465
2989a944465K286651L633947K827026q70700m762191n004692j152171L156143
$$ -1944465 342186 3976133 6803159 5932459 1170268 -3834424 -4986595 -1830452
2981a830452M662575M051914L781820L801177J829760k243542m881630l232871
$$ -1830452 2832123 6884037 10665857 14467034 16296794 14053252 9171622 5938751
2973E938751P57818K675716J346957j87168L53737J127311n71562l600039m286005
$$ 5938751 6696569 9372285 10719242 10532074 10885811 12013122 11441560 7841521 3555516
2964C555516j936789k071r04151k429478j266913J824836L191432J728278O3908
$$ 3555516 1618727 1616656 712505 -1716973 -2983886 -1159050 2032382 3760660 3824568
2955C824568J52635O86432m2681j357515j998083k461924l266090k702384P19828
$$ 3824568 3977203 4663635 4620954 3263439 1265356 -1196568 -4462658 -7165042 -6445214
2946f445214M615046M855492J397645j227480j04892K298436K181085j97284j541753
$$ -6445214 -1830168 3025324 4422969 3195489 3090597 5389033 7570118 7372834 5831081
2937E831081n02471R91316J032078Q5983m47622m48232q80907k006253k630206
$$ 5831081 5328610 6319926 7352004 7437987 6990365 6542133 5661226 3654973 1024767
2928A024767j403295J225667K818489J361889k219536m838967m683510k860875
$$ 1024767 -378528 847139 3665628 5027517 2807981 -2030986 -6714496 -9575371
2920i575371j302359l60618N81270J308973J112976M20038N80205J929348L126069
$$ -9575371 -10877730 -11238348 -10657078 -9348105 -8235129 -7815091 -7234886 -5305538 -2179469
2911b179469K700062O76347j462854k099574q70662R93184J900736J473532L66492
$$ -2179469 520593 1196940 -265914 -2365488 -3236150 -2242966 -342230 1131302 1497794
2902A497794j237489l580460n487845m486264j52386M124422M671294K015651
$$ 1497794 260305 -3320155 -8808000 -13294264 -13446650 -9322228 -4650934 -2635283
2894b635283j13687K16533J235140O12654j398984k598949j467007J276343L154511
$$ -2635283 -2748970 -2532437 -1297297 -684643 -2083627 -4682576 -6149583 -4873240 -1718729
2885a718729K232646m28130j489203M04093K408075J439594j031943j101029J449957
$$ -1718729 513917 85787 -1403416 -999323 1408752 2848346 1816403 715374 2165331
2876B165331K860029J469194J22631J128245K515621J630057o26048j956434k540755
$$ 2165331 5025360 6494554 6617185 7745430 10261051 11891108 11265060 9308626 6767871
2867F767871l543434l763514j420024J890406K745527J029652K654J048937J691506
$$ 6767871 3224437 -539077 -1959101 -68695 2676832 3706484 3709138 4758075 6449581
2858F449581k68224l418730m846290l563540p22136J912476K759610J287251r69893
$$ 6449581 6181357 2762627 -2083663 -5647203 -6369339 -4456863 -1697253 -410002 -1379895
2849a379895j603440k62401R97907Q29731K79192N07160P47731n1806j153698
$$ -1379895 -2983335 -3245736 -2247829 -1418098 -1138906 -631746 115985 64179 -1089519
2840a089519j269026o86800m88594n74189j52985M97414M12931l74259r81142
$$ -1089519 -2358545 -3045345 -3533939 -4108128 -4261113 -3763699 -3350768 -3725027 -4706169
2831d706169j061048p26211L07419K002323L027435K225021O18713J39687P00629
$$ -4706169 -5767217 -6493428 -6186009 -4183686 -1156251 1068770 1687483 1827170 2527799
2822B527799N56429o46443j513994j665781k199351k812062j349387K372999M985076
$$ 2527799 3084228 2437785 923791 -741990 -2941341 -5753403 -7102790 -4729791 255285
2813B55285L903395J081349j5336O45952N74424p77640j703003j731960k140825
$$ 255285 4158680 5240029 5224693 5870645 6445069 5667429 3964426 2232466 91641
2804I1641k997422k828183j606514j078916j467165q46249J192079K284591J208883
$$ 91641 -2905781 -5733964 -7340478 -8419394 -9886559 -10732808 -9540729 -7256138 -6047255
2795f047255K07082J448772L654875M380458L416412J752736m93874k630668k334508
$$ -6047255 -5840173 -4391401 -736526 3643932 7060344 8813080 8319206 5688538 3354030
2786C354030Q35381L089898J188617k373157l034672j273784j157350k963507
$$ 3354030 4189411 7279309 8467926 6094769 3060097 1786313 628963 -2334544
2778b334544k988006o68328K68605r91617k39425M083318O997574M649009O88170
$$ -2334544 -5322550 -5990878 -5722273 -6713890 -6953315 -2869997 4127577 8776586 9464756
2769I464756J23205J142738j034657n221724n769962j720956J870629J833517
$$ 9464756 9587961 10730699 9696042 4474318 -1295644 -3016600 -1145971 687546
2761F87546M79684M11505O98773j09794j125349j115297l92026O19680J980379
$$ 687546 1167230 1578735 2277508 2167714 1042365 -72932 -464958 154722 2135101
2752B135101K496266L72980l338416m971193l170397o86143K0007q9293N82781
$$ 2135101 4631367 5004347 1665931 -3305262 -6475659 -7161802 -7141795 -7231088 -6648307
2743f648307J453415J712603K216475L235478L023811J018288k14626J013839
$$ -6648307 -5194892 -3482289 -1265814 1969664 4993475 6011763 5797137 6810976
2735F810976K107056O3746l353959m051096j749296J60541J18661j30720N30522
$$ 6810976 8918032 8981778 5627819 1576723 -172573 -12032 106629 -24091 506431
2726E06431Q71174J12772o55102p33889q79340j220083n36581J277811K175229
$$ 506431 1377605 1490377 835275 101386 -777954 -1998037 -2534618 -1256807 918422
2717I18422P40558j581114k367782j167916N52625J471447J390554P89308K43640
$$ 918422 1658980 77866 -2289916 -3457832 -2905207 -1433760 -43206 746102 989742
2708I89742J9708j33845n66729j129576j346216r31519K09700J842123K750070
$$ 989742 1009450 875605 308876 -820700 -2166916 -3098435 -2888735 -1046612 1703458
2699A703458J424350j499392k910074j148100J099074L74380k174513k389828
$$ 1703458 3127808 1628416 -1281658 -2429758 -1330684 -956304 -3130817 -5520645
2691e520645K81362J809313J07545j540231J82016L236461L381322M90940j730356
$$ -5520645 -5239283 -3429970 -3322425 -4862656 -4680640 -1444179 1937143 2428083 697727
2682F97727j217199M81920J258182O16132j183773l556485m786852l109514N96717
$$ 697727 -519472 -37552 1220630 1836762 652989 -2903496 -7690348 -10799862 -10203145
2673a0203145L007127K225934J23905j79639J849174L894981L756168J546558
$$ -10203145 -7196018 -4970084 -4846179 -5025818 -3176644 718337 4474505 6021063
2665F021063r32044k194067k109818j320908k86988P20820J171914P45235K08492
$$ 6021063 5089019 2894952 785134 -535774 -822762 -101942 1069972 1815207 2023699
2656B023699P09479J867432J853237J34259j228913m31154J019188J10819l123222
$$ 2023699 2733178 4600610 6453847 6588106 5359193 4928039 5947227 6058046 2934824
2647B934824n039040k971257J250943L445285J797626j613031l558381k943074
$$ 2934824 -2104216 -5075473 -3824530 -379245 1418381 -194650 -3753031 -6696105
2639f696105j238028k60984j30938L26499J551121K552564K500956J948417J578300
$$ -6696105 -7934133 -8195117 -8326055 -7999556 -6448435 -3895871 -1394915 553502 2131802
2630B131802O71636j664434m142996m056563q77219K442163K771220M36232j539449
$$ 2131802 2803438 1139004 -3003992 -7060555 -7937774 -5495611 -2724391 -2288159 -3827608
2621c827608j228313L59951J098660K55367j246506k286054k436639j631207Q9440
$$ -3827608 -5055921 -4695970 -3597310 -3341943 -4588449 -6874503 -9311142 -10942349 -10852909
2612a0852909K067384L008130K318003J057246N51049L64499r05082k808305k942239
$$ -10852909 -8785525 -5777395 -3459392 -2402146 -1851097 -1486598 -2391680 -5199985 -8142224
2603h142224m78544K086312K176685N37417m68383m88466o60682n86284J075206
$$ -8142224 -8620768 -6534456 -4357771 -3820354 -4288737 -4777203 -5437885 -6024169 -4948963
2594d948963L321620L468127J549855P26058K161665K864110O25427j993533j608450
$$ -4948963 -1627343 1840784 3390639 4116697 6278362 9142472 9767899 7774366 6165916
2585F165916M20276R2055k772923m132654j850585J287696J671237o90136l062825
$$ 6165916 6586192 6678247 3905324 -227330 -2077915 -790219 881018 190882 -2871943
2576b871943l309214j120851K327713M717935M058564J077372j098352p58197
$$ -2871943 -6181157 -7302008 -4974295 -256360 3802204 4879576 3781224 3023027
2568C023027K91582k31122j503391j103105R73963K323668J904633J260980J514977
$$ 3023027 3314609 3083487 1580096 476991 1450954 3774622 5679255 6940235 8455212
2559H455212J511953J35469j452582j560824o48579l92323q68856o62430M69913
$$ 8455212 9967165 10102634 8650052 7089228 6440649 6048326 5179470 4517040 4986953
2550D986953J033178K16338q47131r23892l73515j28801j49152P3053K93244j79210
$$ 4986953 6020131 6236469 5389338 4465446 4091931 3963130 3813978 3887031 4180275 4001065
2540D001065j458048l029021m124353l766364j528357J178169K055426J104163
$$ 4001065 2543017 -486004 -4610357 -8376721 -9905078 -8726909 -6671483 -5567320
2532e567320J037644K991146L996404J398678k115805j764789J977237L796265
$$ -5567320 -4529676 -1538530 2457874 3856552 1740747 -24042 1953195 5749460
2524E749460J561978q68065l48349Q15680l82579k396989k453786j657787k209898
$$ 5749460 7311438 6443373 6095024 6910704 6528125 4131136 1677350 19563 -2190335
2515b190335k304981P63786M159053K369305l637008o434755k734693J941823
$$ -2190335 -4495316 -3731530 427523 2796828 -840180 -7274935 -10009628 -8067805
2507h067805J939866m88681q0823K551887K457026j107451l243519q38017L051133
$$ -8067805 -6127939 -6616620 -6697443 -4145556 -1688530 -2795981 -6039500 -6877517 -3826384
2498c826384L833075J412297n58183O9814J569098J209200q79130j841398j72743
$$ -3826384 6691 1418988 860805 930619 2499717 3708917 2829787 988389 815646
2489H15646J714611O05498k521296l267024j13907L040174K464925j8981k11935
$$ 815646 2530257 3135755 614459 -2652565 -2766472 273702 2738627 2719646 2507711
2480B507711J869356K390327N05k210511j609791N09348J568598J058894k26836
$$ 2507711 4377067 6767394 6767899 4557388 2947597 3456945 5025543 6084437 5857601
2471E857601j959352l503694l279689q54670J659163K119421J147254O29231N63453
$$ 5857601 3898249 394555 -2885134 -3739804 -2080641 38780 1186034 1815265 2378718
2462B378718l56796j671718j316431Q12065J867947j15100l092157l440349p24295
$$ 2378718 2021922 350204 -966227 -154162 1713785 1598685 -1493472 -4933821 -5658116
2453e658116J784654J370358r35609k090013q07287J495562K881004K748829J661681
$$ -5658116 -3873462 -2503104 -3438713 -5528726 -6336013 -4840451 -1959447 789382 2451063
2444B451063N39201K05615O80003P51329n29224j777615n03922K797102L928338
$$ 2451063 2990264 3195879 3875882 4627211 4097987 2320372 1816450 4613552 8541890
2435H541890L00665m672797n218154n55934M227735M697063J639719j543386l260829
$$ 8541890 8842555 4169758 -1048396 -1604330 2623405 7320468 8960187 7416801 4155972
2426D155972l932196l755030k380125j24052J894747K619823J678012j14046q08072
$$ 4155972 223776 -3531254 -5911379 -6035431 -4140684 -1520861 157151 43105 -764967
2417g64967P20670K682304K113207p88946k429110j058320L95315j093971l584787
$$ -764967 -44297 2638007 4751214 3962268 1533158 474838 870153 -223818 -3808605
2408c808605k860246J125256L965236K763870o91457l067804l109286j438407
$$ -3808605 -6668851 -5543595 -1578359 1185511 494054 -2573750 -5683036 -7121443
2400g121443Q70166K428805K061534L07831q68882n99125n2179k95306o83369
$$ -7121443 -6251277 -3822472 -1760938 -1453107 -2321989 -2921114 -2973293 -3268599 -3951968
2391c951968j97292R34980J857532K202921J792537L82526j409401k057950j040224
$$ -3951968 -4149260 -3214280 -1356748 846173 2638710 3021236 1611835 -446115 -1486339
2382a486339J85403J69184m68893j54875J201403K200902J987157J072431L11307
$$ -1486339 -1300936 -1131752 -1600645 -1755520 -554117 1646785 3633942 4706373 5017680
2373E017680J01171N40899J414835J904876J146398o08695j916910j623867k14934
$$ 5017680 5118851 5659750 7074585 8979461 10125859 9517164 7600254 5976387 5761453
2364E761453O50474J0501j269584j600647p39344K3113p8634k05094K77911K09494
$$ 5761453 6411927 6422428 5152844 3552197 2812853 2835966 2757332 2552238 2830149 3039643
2354C039643j477676l243829k654659k66091R02830Q5386m43K238677M350099
$$ 3039643 1561967 -1681862 -4336521 -4602612 -3699782 -3614396 -3614839 -1376162 2973937
2345B973937L551716R77946l16608K16253R03078J107496J238759N55719j808714
$$ 2973937 6525653 7503599 7186991 7403244 8306322 9413818 10652577 11208296 9399582
2336I399582m129444l687407j082236K88010o17277j195239J16825J311394N14449
$$ 9399582 5270138 1582731 500495 788505 171228 -1024011 -907186 404208 918657
2327I18657r34027j190878r02384j038769l93697J660581K276956r67991m727856
$$ 918657 -15370 -1206248 -2108632 -3147401 -3541098 -1880517 396439 -571552 -5299408
2318e299408l244870K887677O223557K428868l526104m225181L20353L792683
$$ -5299408 -8544278 -5656601 566956 2995824 -530280 -4755461 -4435108 -642425
2310f42425K876548O50413L80119N71890j326563l583043k440329J453909K962835
$$ -642425 2234123 2884536 3264655 3836545 2509982 -1073061 -3513390 -2059481 903354
2301I03354m12618m654717m523810m43287K687136K342667P92781O22186J115549
$$ 903354 490736 -4163981 -8687791 -9131078 -6443942 -4101275 -3308494 -2686308 -1570759
2292a570759O02040j25117P66742K557153K496654j23787k647429k446637r9562
$$ -1570759 -968719 -1093836 -327094 2230059 4726713 4602926 1955497 -491140 -590702
2283e90702J659153J107123j151078l240487l558468j791438Q17563K446401K421742
$$ -590702 1068451 2175574 1024496 -2215991 -5774459 -7565897 -6748334 -4301933 -1880191
2274a880191J671474J160733N88345o45974j891737j913405q74658k66951o25373
$$ -1880191 -208717 952016 1540361 894387 -997350 -2910755 -3785413 -4052364 -4677737
2265d677737o89610N08134K004057K432692K128044K218229K373586J325266o03599
$$ -4677737 -5367347 -4859213 -2855156 -422464 1705580 3923809 6297395 7622661 7019062
2256G019062j537990r31404l59184p36459r20472l37722o93754k902453m325658
$$ 7019062 5481072 4549668 4190484 3454025 2533553 2195831 1502077 -1400376 -5726034
2247e726034k176547J560123K343311k6242q16458K321826N440715M010741o63304
$$ -5726034 -7902581 -6342458 -3999147 -4025389 -4841847 -2520021 2920694 6931435 6268131
$$ [...]
##END NTUPLES=NMR SPECTRUM
##END=
