##TITLE=31Pdec_DE-91_3_oil_TFA
 CDCl3, 64 sc
 18.4.2025
##JCAMPDX= 6.0         $$ Bruker NMR JCAMP-DX V2.0
##DATA TYPE= NMR SPECTRUM
##DATA CLASS= NTUPLES
##ORIGIN= UXNMR, Bruker Analytische Messtechnik GmbH
##OWNER= root
$$ XWIN-NMR		Version 3.5
$$ Fri Apr 18 16:26:51 2025 Russian Standard Time (UT+4h)  she@DPX200
##.OBSERVE FREQUENCY= 81.013821
##.OBSERVE NUCLEUS= ^31P
##.ACQUISITION MODE= SIMULTANEOUS
##.ACQUISITION SCHEME= undefined
##.AVERAGES= 64
##.DIGITISER RES= 17
##SPECTROMETER/DATA SYSTEM= spect
##.PULSE SEQUENCE= zgpg30
##.SOLVENT NAME= CDCl3
##.SHIFT REFERENCE= (INTERNAL, CDCl3, 0, 198.062)
##AUDIT TRAIL= $$ (NUMBER, WHEN, WHO, WHERE, WHAT)
$$ ##TITLE= Audit trail, XWIN-NMR		Version 3.5
$$ ##JCAMPDX= 5.01
$$ ##ORIGIN= Bruker BioSpin GmbH
$$ ##OWNER= she
$$ F:/spectra/data/she/nmr/P31/2/pdata/1/auditp.txt
$$ ##AUDIT TRAIL=  $$ (NUMBER, WHEN, WHO, WHERE, WHAT)
(   1,<2025-04-18 16:25:05.95 +0400>,<she>,<DPX200>,
      <created by zg, POWCHK disabled, PULCHK disabled
       configuration hash MD5:
       00 E9 B6 7A A2 85 ED C7 34 08 36 98 17 FE 4E 26
       data hash MD5: 32K
       61 01 30 98 35 F6 2F A6 70 0B 97 C1 D6 1C 08 C8>)
(   2,<2025-04-18 16:25:08.37 +0400>,<she>,<DPX200>,
      <Start of raw data processing
       efp BC_mod = 2 LB = 1.5 FT_mod = 6 PKNL = 1 PHC0 = 1440.714 PHC1 = -53.30493 SI = 64K 
       data hash MD5: 64K
       F6 8A 37 C6 8D 95 BC 41 E0 64 F1 B6 1B AD 16 3F>)
(   3,<2025-04-18 16:26:02.59 +0400>,<she>,<DPX200>,
      <pk PHC0 = -80.86341 PHC1 = 262.1982 
       data hash MD5: 64K
       DA 28 DC 99 5A C7 2A BC B4 AA AB 0A F4 A3 85 68>)
(   4,<2025-04-18 16:26:15.70 +0400>,<she>,<DPX200>,
      <abs ABSG = 5 
       data hash MD5: 64K
       F6 EF 77 DD F1 B3 4C 8C F0 EB 98 4A DE B4 5F 7F>)
$$ ##END=
$$ 
$$ hash MD5
$$ 65 52 33 8D E0 B0 FC 0B FD A9 01 31 C5 F8 9E 3E
##$RELAX= 
##$RELAX= 
##$RELAX= 
##$RELAX= 
##$RELAX= 
##$RELAX= 
##$RELAX= 
##$RELAX= 
$$ Bruker specific parameters
$$ --------------------------
##$DU= <F:/spectra>
##$EXPNO= 2
##$NAME= <P31>
##$PROCNO= 1
##$TYPE= <nmr>
##$USER= <she>
##$AMP= (0..31)
100 100 100 100 100 100 100 100 100 100 100 100 100 100 100 100 100 100 
100 100 100 100 100 100 100 100 100 100 100 100 100 100 
##$AQSEQ= 0
##$AQ_mod= 1
##$AUNM= <au_zg>
##$AUTOPOS= <>
##$BF1= 81.014009
##$BF2= 200.13
##$BF3= 200.13
##$BF4= 200.13
##$BF5= 200.13
##$BF6= 200.13
##$BF7= 200.13
##$BF8= 200.13
##$BYTORDA= 1
##$CFDGTYP= 0
##$CFRGTYP= 5
##$CHEMSTR= <none>
##$CNST= (0..31)
1 1 145 1 1 1 1 1 1 1 1 1 1 1 1 1 1 1 1 1 1 1 1 1 1 1 1 1 1 1 1 1 
##$CPDPRG= <waltz16>
##$CPDPRG1= <>
##$CPDPRG2= <waltz16>
##$CPDPRG3= <>
##$CPDPRG4= <mlev>
##$CPDPRG5= <mlev>
##$CPDPRG6= <mlev>
##$CPDPRG7= <mlev>
##$CPDPRG8= <mlev>
##$CPDPRGB= <>
##$CPDPRGT= <>
##$D= (0..31)
0 1 0 0 0 0 0 0 0 0.06 0 0.03 2e-05 3e-06 0 0 0.0002 0 0 0 0 0 0 0 0 0 
0 0 0 0 0 0 
##$DATE= 1744979105
##$DBL= (0..7)
120 120 120 11 120 120 24 19 
##$DBP= (0..7)
150 150 150 150 150 150 150 150 
##$DBP07= 0
##$DBPNAM0= <>
$$ [...]
##$SUBNAM3= <"">
##$SUBNAM4= <"">
##$SUBNAM5= <"">
##$SUBNAM6= <"">
##$SUBNAM7= <"">
##$SUBNAM8= <"">
##$SUBNAM9= <"">
##$SW= 400.765351723535
##$SWIBOX= (0..15)
0 1 3 0 0 0 0 0 0 0 0 0 0 0 0 0 
##$SW_h= 32467.5324675325
##$TD= 32768
##$TD0= 1
##$TE= 0
##$TE2= 300
##$TE3= 300
##$TEG= 300
##$TL= (0..7)
0 120 53 12 22 120 120 120 
##$TP= (0..7)
150 150 150 150 150 150 150 150 
##$TP07= 0
##$TPNAME0= <>
##$TPNAME1= <>
##$TPNAME2= <>
##$TPNAME3= <>
##$TPNAME4= <>
##$TPNAME5= <>
##$TPNAME6= <>
##$TPNAME7= <>
##$TPOAL= (0..7)
0.5 0.5 0.5 0.5 0.5 0.5 0.5 0.5 
##$TPOFFS= (0..7)
0 0 0 0 0 0 0 0 
##$TUNHIN= 0
##$TUNHOUT= 0
##$TUNXOUT= 0
##$USERA1= <user>
##$USERA2= <user>
##$USERA3= <user>
##$USERA4= <user>
##$USERA5= <user>
##$V9= 5
##$VALIST= <valist>
##$VCLIST= <CCCCCCCCCCCCCCC>
##$VD= 0
##$VDLIST= <DDDDDDDDDDDDDDD>
##$VPLIST= <PPPPPPPPPPPPPPP>
##$VTLIST= <TTTTTTTTTTTTTTT>
##$WBST= 1024
##$WBSW= 4
##$XGAIN= (0..3)
0 0 0 0 
##$XL= 0
##$YL= 0
##$YMAX_a= 6708
##$YMIN_a= -19156
##$ZGOPTNS= <>
##$ZL1= 120
##$ZL2= 120
##$ZL3= 120
##$ZL4= 120
##$ABSF1= 198.0616
##$ABSF2= -202.7028
##$ABSG= 5
##$ABSL= 3
##$ALPHA= 0
##$AQORDER= 0
##$ASSFAC= 0
##$ASSFACI= 0
##$ASSFACX= 0
##$ASSWID= 0
##$AUNMP= <proc_1d>
##$AZFE= 0.1
##$AZFW= 0.5
##$BCFW= 0
##$BC_mod= 2
##$BYTORDP= 0
##$COROFFS= 0
##$CY= -3
##$DATMOD= 1
##$DC= 0
##$DFILT= <>
##$DTYPP= 0
##$F1P= 0
##$F2P= 0
##$FCOR= 1
##$FTSIZE= 65536
##$FT_mod= 6
##$GAMMA= 0
##$GB= 0
##$INTBC= 1
##$INTSCL= 9.790993e-09
##$ISEN= 30
##$LB= 1.5
##$LEV0= 0
##$LPBIN= 0
##$MAXI= 10000
##$MC2= 0
##$MEAN= 0
##$ME_mod= 0
##$MI= 50
##$NCOEF= 0
##$NC_proc= -9
##$NLEV= 6
##$NOISF1= 182.463
##$NOISF2= 159.3651
##$NSP= 0
##$NTH_PI= 0
##$NZP= 0
##$OFFSET= 198.0616
##$PC= 4
##$PHC0= 1359.851
##$PHC1= 208.8933
##$PH_mod= 1
##$PKNL= yes
##$PPARMOD= 0
##$PSCAL= 0
##$PSIGN= 0
##$REVERSE= no
##$SF= 81.0140089999434
##$SI= 65536
##$SIGF1= 159.3651
##$SIGF2= -187.1042
##$SINO= 113.3802
##$SIOLD= 16384
##$SREGLST= <1H.CDCl3>
##$SSB= 0
##$STSI= 65536
##$STSR= 0
##$SW_p= 32467.5324675325
##$SYMM= 0
##$S_DEV= 0
##$TDeff= 32768
##$TDoff= 0
##$TI= <>
##$TILT= no
##$TM1= 0
##$TM2= 0
##$TOPLEV= 0
##$USERP1= <user>
##$USERP2= <user>
##$USERP3= <user>
##$USERP4= <user>
##$USERP5= <user>
##$WDW= 1
##$XDIM= 65536
##$YMAX_p= 557091123
##$YMIN_p= -190997616
$$ End of Bruker specific parameters
$$ ---------------------------------
##NTUPLES= NMR SPECTRUM
##VAR_NAME=  FREQUENCY,     SPECTRUM/REAL,   SPECTRUM/IMAG
##SYMBOL=    X,             R,               I
##VAR_TYPE=  INDEPENDENT,   DEPENDENT,       DEPENDENT
##VAR_FORM=  AFFN,          ASDF,            ASDF
##VAR_DIM=   65536,         65536,           65536
##UNITS=     HZ,            ARBITRARY UNITS, ARBITRARY UNITS
##FACTOR=    0.49542278885378, 1,            1
##FIRST=     16045.7642231865, 0,            0
##LAST=      -16421.768244346, 0,            0
##MIN=       -16421.768244346, -190997616,   0
##MAX=       16045.7642231865, 557091123,    0
$$ Real data points
##PAGE= N=1
##DATA TABLE= (X++(R..R)), XYDATA
$$ [...]
8658 -3684597 -1234010 -2535851 -4954830 -3694284 1637609 7018589 8959089 7783197
8650 7783197 6757454 8728707 13106752 16178755 14876573 9478873 2152207 -5141415
8642 -5141415 -9944182 -9511613 -4790700 -1483779 -2949959 -4481569 -105170 6934951
8634 6934951 7839423 2154486 -560604 4611562 10177741 8349803 3694739 6121760
8626 6121760 15911869 24123617 25703465 23910284 21872157 17615596 9592523 1074972
8618 1074972 -4007224 -5468207 -4495196 -439544 7083609 15290254 20106773 19760433 15274535
8609 15274535 9215943 5026248 5231470 8510617 10245821 7505794 1949871 -3204536
8601 -3204536 -6807664 -8889372 -8824405 -6964656 -6083110 -8100291 -10530829 -9231702 -4081158
8592 -4081158 1024332 3657407 5408509 8439386 11989394 13418373 11279659 6697747
8584 6697747 2688069 1994744 4242948 5661848 3523467 364518 1135137 6191091 10477347
8575 10477347 10621814 9210049 9761304 10737678 8184411 2359720 -2430188 -4053971 -4628841
8566 -4628841 -5867951 -5996093 -2906334 2324769 7117109 10648697 13190720 13516874 9695967
8557 9695967 2481751 -4215098 -7010903 -6108709 -4284958 -3960733 -5802046 -8905899 -11162660
8548 -11162660 -10380041 -6732914 -3592211 -3747012 -4754092 -992018 8182495 15328611
8540 15328611 13164198 3972076 -3368346 -4844454 -4757450 -7070082 -8929844 -5930583
8532 -5930583 487179 5177199 6100744 4806947 2250992 -1340209 -3750068 -2509243
8524 -2509243 1098933 3711378 4903025 6448261 7492064 5569595 2359527 2832707
8516 2832707 7652461 11822862 12464925 12408936 13817307 14141333 12023455 11519461 15198349
8507 15198349 17585953 11917806 782334 -6353013 -5001834 721834 5525922 7880616
8499 7880616 7063905 1335044 -8272372 -16264238 -17837996 -13889186 -9006151 -5885174
8491 -5885174 -3338465 717329 5366085 6486083 1462251 -6042010 -8541221 -3347283
8483 -3347283 3842688 6183960 3815292 1667847 1801411 2141241 1027665 -1566538 -6160749
8474 -6160749 -12486602 -17088344 -17007752 -14866267 -15022645 -15902570 -12784941 -7612750 -7729802
8465 -7729802 -13444728 -15719068 -9886559 -3124757 -2622965 -4194630 -461848 6034048
8457 6034048 7561969 4935856 5816540 10705162 11585429 5956991 1846553 4571441 7248595
8448 7248595 1156569 -10410027 -16366096 -12916239 -6889286 -4584809 -4193368 -1127716
8440 -1127716 4537379 9638755 13834255 19511628 26345304 29902742 27239813 21389106
8432 21389106 17736199 16987214 14640981 7738304 -619092 -4879679 -3007925 3087334
8424 3087334 11157934 19639758 25813790 26404669 21160172 13854356 8605401 6451705
8416 6451705 6201748 7039182 8922159 11278348 12721483 12126833 9488749 5757536 1863760
8407 1863760 -2332335 -7707747 -13738037 -17377563 -15929307 -11178261 -8404187 -10033319
8399 -10033319 -12272793 -10249887 -5162653 -3293334 -7872312 -14826740 -17725503 -14632698
8391 -14632698 -8526736 -3152181 -890809 -3019525 -8611782 -13541192 -14028656 -11625570
8383 -11625570 -11229436 -13251968 -12038343 -4780720 2046216 -12059 -9808118 -17716054
8375 -17716054 -17736508 -13020770 -8812828 -5817326 -3132372 -2498389 -5183977 -8033109 -7508929
8366 -7508929 -5758514 -7743759 -13113137 -15858687 -12628313 -6924039 -3314275 -1175563
8358 -1175563 2992285 9350395 14076967 14225140 10524186 5217337 -501689 -5737406
8350 -5737406 -8203409 -5464157 1825482 9258272 12276004 10205285 6280145 4115777
8342 4115777 4696837 6176294 5572897 1007137 -6457612 -13070381 -15499051 -13900575 -11306891
8333 -11306891 -10296735 -11061483 -11960349 -10640187 -5577425 1592637 6508591 7699992
8325 7699992 10498876 20779978 34774508 40855018 33820365 22158783 17240131 19885510
8317 19885510 22808644 22339029 20522804 17550652 10576040 1378894 -2469987 1974768
8309 1974768 7020378 3835837 -5542508 -11194671 -8592639 -3256229 -1862225 -3893529
8301 -3893529 -4545605 -2261573 405047 1765911 2645843 2866220 213756 -4907177 -7064467
8292 -7064467 -1892826 6899480 10963929 7800935 3614927 4559316 9114653 11394283
8284 11394283 8745918 3340411 -1132173 -1450883 4050247 13021015 19275818 18466758
8276 18466758 12463840 6021209 1333017 -1496109 -1612211 810587 2312955 421830
8268 421830 -1574257 835139 5613413 6815655 4244116 3935586 8420012 12942864 13125455
8259 13125455 10452162 7765664 4929146 2088201 2142178 6115297 10115686 10631983 9336375
8250 9336375 9177600 9337950 7865242 5868863 4985430 3900250 1821622 2184879 7459621
8241 7459621 12665257 10304911 993250 -6731840 -7452287 -4267577 -2184531 -1475657 -84504
8232 -84504 1609635 2036233 2183724 4644357 9423396 13100783 12515259 8063742 2929450
8223 2929450 -338621 -1837434 -2877310 -3441928 -2322482 364451 2548739 2961941 3213463
8214 3213463 5908476 11339612 16825992 18894346 16121611 10850495 7724197 8645860
8206 8645860 9528939 4880107 -4219604 -10315911 -8795389 -2901064 2312234 6422164
8198 6422164 10503870 11867468 7461169 298622 -3154856 -1399568 988037 252388
8190 252388 -3028910 -7116202 -11015203 -12533394 -8921912 -1146501 5738120 8039372
8182 8039372 6885156 5522334 5769586 7760306 10436110 11505980 9493038 6453044
8174 6453044 6047530 8511435 10591517 11058772 12630233 16881502 20687174 20155380 15694618
8165 15694618 10820631 7720767 6027423 4407631 1500779 -3270649 -8030074 -9005575
8157 -9005575 -4868640 256862 125148 -7134243 -16737762 -21513279 -18350475 -10912309
8149 -10912309 -5909343 -6155335 -7924108 -6124239 -861963 3113052 2401770 -2302297
8141 -2302297 -8573616 -13839134 -14915507 -10253932 -3586592 -1249796 -4262135 -6961866
8133 -6961866 -5531041 -3663965 -6533258 -12870038 -17507631 -19385508 -22019189 -26647792
8125 -26647792 -29339662 -25738592 -16065556 -4970908 1772721 835961 -6114190 -13355620
8117 -13355620 -16311860 -15586769 -14430469 -13384668 -10135452 -4348391 451340 961993
8109 961993 -1849492 -4115455 -3514397 -1248677 162008 286069 1365308 5174764 9970013
8100 9970013 11930408 9648724 5629177 3081055 3012016 4739895 6723760 6022305 139844
8091 139844 -8411373 -12319530 -7502431 982660 4414542 411145 -5833802 -8919178
8083 -8919178 -7907022 -4389054 -299743 1821807 140794 -3901497 -7201386 -9483746
8075 -9483746 -12778960 -16134168 -15409773 -10149112 -6134743 -7701800 -10983590 -9168677
8067 -9168677 -2278699 3268550 4196370 4215316 6844516 8809994 4270794 -6205573 -14739861
8058 -14739861 -14635161 -7117003 1594791 7771799 12444334 17388913 22128194 25546282
8050 25546282 27482777 26930359 21361909 10969402 1753075 157072 4751427 7400185
8042 7400185 3656340 -2088641 -3845482 -2406745 -2807282 -6209965 -9047144 -9133698 -7707709
8033 -7707709 -5047489 982855 9853431 15887045 14456039 8334699 4070463 3294220
8025 3294220 1778674 -2886811 -7061760 -6391387 -2225377 116824 -2142558 -7093024
8017 -7093024 -11582364 -14240386 -15177246 -14731117 -12874016 -8838388 -1912118 6031182 9965510
8008 9965510 6314974 -2036293 -7906525 -7288586 -2412547 2593368 6016462 7837870
8000 7837870 8032775 7350445 7195290 6966574 3986961 -2099949 -7509653 -9102311 -8346432
7991 -8346432 -7957282 -7423775 -5253032 -3040936 -3012034 -3367066 -917381 2596904 1943912
7982 1943912 -3664063 -8890740 -9617661 -7835467 -7677728 -9983854 -12449801 -12541320 -9076372
7973 -9076372 -3274715 1212683 1903183 1100405 2595952 5014701 3136555 -3459702 -8538291
7964 -8538291 -8133779 -6010935 -6878107 -8968656 -7686461 -2718799 3119606 8756177 13614285
7955 13614285 14494525 9306182 1920949 -2144942 -3172494 -4753817 -5748470 -1849884
7947 -1849884 5126394 7295124 2020306 -3629853 -3015248 1233423 2685349 846432
7939 846432 475282 3976760 9140109 13021183 14409257 13515276 12172995 13132182 16374836
7930 16374836 17506971 12821303 4781263 -707995 -1513500 -230221 1516811 5483310
7922 5483310 12423888 18847581 20473445 16976222 11093311 4219193 -4556325 -14747269
7914 -14747269 -21940946 -21053411 -12290724 -2183270 2793423 2760934 2697232 4935257 6741716
7905 6741716 6069128 5711697 8797953 13091263 13915698 11284161 9734932 11382264 13354977
7896 13354977 12696065 9933476 6778481 4066303 3530673 7805621 16092533 22902458
7888 22902458 24084326 21666762 19719136 17989254 13788597 8512896 7090978 10424962
7880 10424962 12849000 9114814 942913 -5634585 -7457394 -6372583 -5304957 -4721512
7872 -4721512 -3283325 -363008 3003380 5041083 4295512 115372 -6560451 -12311220
7864 -12311220 -12799820 -7457555 -1916583 -2681552 -8870010 -12645657 -9348800 -3361557
7856 -3361557 -935092 -1084443 1307196 5989598 7634209 5176949 3961122 7040340
7848 7040340 10754564 11795641 12639257 15656015 17104164 12768504 5810926 2516844
7840 2516844 2602163 768328 -3000252 -2312085 4917516 11412190 9906139 2960956 -886682
7831 -886682 1912058 6871312 8044576 4053311 -2221935 -7058674 -8192852 -5329679
7823 -5329679 423485 7457810 13959607 17784865 17269575 12772881 6820524 2286104
7815 2286104 636739 1578740 3530790 4727956 4983397 6105093 9299746 12603119 12768247
7806 12768247 9712755 7015325 7483306 10129474 12246264 12600399 11560049 9768218
7798 9768218 8059933 7499201 8131849 8303414 6050820 741176 -6742463 -14351449 -19285713
7789 -19285713 -19614491 -16220164 -12162579 -9800849 -9421237 -10240003 -10970789 -9706838 -5652224
7780 -5652224 -1200049 128326 -1868724 -4200600 -5290157 -6058859 -5988396 -2508926 3846261
7771 3846261 8015351 7068059 4469094 4212435 4378807 993799 -4719831 -8206288 -8720642
7762 -8720642 -9080117 -9328817 -6437439 -580332 3605046 3222819 144850 -3506795 -8627631
7753 -8627631 -15639567 -20912393 -19318487 -9179273 6092826 19801640 25752102 22949440
7745 22949440 16785124 13199204 12168528 9996838 6849687 6906807 10681086 12845563
7737 12845563 9749206 4127571 -304579 -4169834 -8855207 -11966078 -10840926 -7540449
7729 -7540449 -5836405 -5444131 -3469214 237307 3304083 4971989 6046150 5933779 3607710
7720 3607710 556965 -951942 -1654784 -3651820 -6006678 -6035424 -4250605 -3645719 -4268843
7711 -4268843 -2941038 1388144 6400593 10995576 16416224 21632935 22476009 17767014
7703 17767014 12209838 10138338 9564317 5641565 -2387573 -10899276 -16754639 -19428093
7695 -19428093 -19517814 -17990191 -16339421 -15296799 -13792043 -10755026 -7127172 -4504704
7687 -4504704 -2761512 -832476 946611 1290076 446400 365714 2052385 3902189 3281090
7678 3281090 -317882 -3820935 -3045988 2427442 7774466 8196878 4832235 2479740 1970908
7669 1970908 -832916 -7546213 -13758444 -15635370 -15226157 -15129745 -12302790 -3103950 8330766
7660 8330766 13648052 11497809 8831930 10680633 14620479 16466321 15594674 12577616
7652 12577616 6905205 -90427 -4572251 -5489139 -6586551 -10295657 -13748566 -14144474
7644 -14144474 -13735677 -15161049 -15771507 -12042991 -6797840 -5975995 -9623200 -11975447 -10110398
7635 -10110398 -6946823 -5268817 -4067021 -2111746 -581128 -266668 196000 1414915
7627 1414915 1486502 -1118335 -5107684 -7802967 -6953570 -1088737 8862817 18031846 21328855
7618 21328855 19558300 18274354 19798201 20509325 17152010 10969984 3632504 -5549010
7610 -5549010 -15038300 -19092963 -15332143 -10063897 -10410739 -14400526 -14954906 -11092142 -8298544
7601 -8298544 -9088263 -10212055 -9196700 -7079029 -4075520 1077956 6428655 7829071
7593 7829071 6127752 6718632 9959617 9669853 4947525 5416033 17810155 33434312
7585 33434312 37598177 28142364 15962256 8969749 4633443 -1287646 -7644428 -12344715
7577 -12344715 -16468490 -19884658 -18692149 -11777918 -5233619 -4969827 -8418952 -9116707
7569 -9116707 -6890801 -7170281 -11171418 -13381076 -9963931 -4094285 -525545 637881
7561 637881 1524900 1423491 -1613614 -5791925 -6414280 -1797401 4508452 7803452 6584663
7552 6584663 2817730 -149233 194286 3604548 7231247 9027219 10283958 12723995
7544 12723995 14425929 12534068 9548582 11415529 17668568 19436250 11546369 1538130
7536 1538130 184225 6344871 9090344 3763458 -2573219 -2855408 1310810 5958944
7528 5958944 11535612 17607484 17851180 8616054 -1934573 -2561989 5046378 8546446
7520 8546446 3492194 -181090 6519683 18526710 24750388 22833049 18700974 15513154
7512 15513154 11189170 5860810 4152458 8206491 13610759 14840091 11721637 8541545
7504 8541545 8769434 11905693 13979963 10872307 3128512 -2754483 -832627 6399544
7496 6399544 10474892 8197840 5753915 9096889 15057779 16680087 13751625 11744602
7488 11744602 11908266 9348694 1651903 -6917084 -12058116 -14865965 -17427039 -17619017
7480 -17619017 -12572237 -4255242 2473680 5168156 3806552 -1536322 -8720758 -12008252
7472 -12008252 -7995444 -1515728 32883 -2813533 -2991800 1559383 4986229 3462933
7464 3462933 731993 614419 695198 -2015571 -4893908 -4726823 -4303449 -7802779 -13081655
7455 -13081655 -15067470 -14287224 -15104769 -16870569 -13993083 -4989633 4991670 11683392
7447 11683392 16022020 19594241 21061357 19172325 15165752 10525833 6078321 4201048
7439 4201048 7498173 14040465 18445180 18948559 18484835 17466286 11738421 718632
7431 718632 -8545214 -9999508 -6399514 -3879093 -3437859 -3076208 -3721408 -6398356 -7110747
7422 -7110747 -2036609 4381987 4319253 -1377293 -3825511 807021 6491637 7385844 5624049
7413 5624049 5850421 7707463 7869806 5702231 3107874 1141612 -606846 -3155717 -7837181
7404 -7837181 -14145047 -17288908 -12063459 -712561 7610495 7794305 4859838 5922170
7396 5922170 10334216 12127183 8810694 2752152 -3867787 -10252318 -14267773 -13474213
7388 -13474213 -9071231 -5256949 -4452196 -5663338 -6944767 -6948045 -5085961 -2872707 -3715277
7379 -3715277 -8349812 -12232144 -11145784 -7451643 -6022320 -5773148 -1666731 5196941
7371 5196941 7123562 1795512 -2394661 2198100 10762095 11784071 1841201 -11185070
7363 -11185070 -18738039 -20052593 -19335690 -19003641 -18132930 -15378351 -10858944 -5333875 917034
7354 917034 7392210 11850635 11151772 5035497 -2067529 -5436107 -5888477 -8292470 -14201886
7345 -14201886 -19826602 -22529695 -24779207 -28355242 -28623811 -20017559 -5622660 4341027
7337 4341027 4142158 -1828643 -6153684 -6924149 -6877819 -7320887 -6558068 -3440299 544166
7328 544166 3295434 4528760 5170438 5074155 2782299 -1792850 -5590241 -5268145 -1932940
7319 -1932940 -678193 -4186916 -8922208 -9747120 -6646289 -4194811 -5411433 -9079153
7311 -9079153 -12697537 -15001981 -15293957 -13142033 -9693675 -7281453 -6991549 -8036069 -9356698
7302 -9356698 -9916817 -7969261 -2926707 2130045 3141197 642900 -984339 -565237 -1986155
7293 -1986155 -6977981 -10618586 -7852507 -1185207 2663170 1836015 616309 2641677
7285 2641677 6951854 10323606 9816809 3481517 -7365411 -16379976 -16838981 -9158367
7277 -9158367 -515866 3736858 4627724 4648803 2996125 -1382962 -5763150 -6726644 -5076182
7268 -5076182 -3706716 -2110448 2662355 10007599 15095601 15058054 12292543 10222149 8801535
7259 8801535 6072631 1697980 -3163112 -7501625 -9832986 -7896651 -1807383 3750350
7251 3750350 3566470 -2188444 -8539894 -11534983 -10746504 -6869000 -803612 4687291 6821059
7242 6821059 7548088 11954392 19664250 22605514 15348248 3704745 -2271478 -1112802
7234 -1112802 317750 -1634004 -3124481 -801839 2321096 1575045 -3292348 -9248027
7226 -9248027 -13568429 -14243528 -10332569 -4058632 660450 3475302 7711503 13448795
7218 13448795 15063876 8746096 -1671604 -10001128 -14993569 -18387691 -19591951 -17473857
7210 -17473857 -14653213 -14635535 -16413315 -16579514 -14855183 -12855346 -9803943 -5066402 -2706843
7201 -2706843 -6777236 -13129601 -13035393 -5203839 2417938 3503949 -392506 -5173224 -8830275
7192 -8830275 -9108112 -3639055 4701274 8855454 7018433 4924254 5858703 5603206 1660290
7183 1660290 -191806 4612532 9850576 7072979 -623923 -2844855 2337471 6561321
7175 6561321 4918077 1785479 600241 -3220818 -13753970 -25085520 -27272426 -19534644
7167 -19534644 -11573234 -11470342 -16594755 -18416466 -13776567 -8108329 -7321529 -9762382
7159 -9762382 -9225025 -4297872 103159 1312586 3643762 10928347 18572454 18755468 11750863
7150 11750863 6166329 7729178 12948633 15205421 12817620 8858865 6105059 4899054
7142 4899054 4619052 5080883 6388257 7845064 7313261 3076596 -2651440 -4158617 1272754
7133 1272754 8824755 11362704 8263766 5411829 6906012 10960908 14400406 16735349
7125 16735349 18072229 16814952 12141929 6290075 1755579 -2273364 -8478022 -17180365
7117 -17180365 -25118477 -28260964 -25468765 -19890429 -16426877 -16827405 -18048918 -16850442
7109 -16850442 -14455705 -13962526 -14620574 -12819866 -8397389 -5308137 -5249227 -5174733 -2699461
7100 -2699461 379200 2016493 3083930 3937402 2105008 -2916278 -6248420 -3559575
7092 -3559575 2188649 4646280 2949209 1784616 3485667 5199533 4561040 3740318 5877041
7083 5877041 10222743 12915452 11487758 7482346 4973764 6483249 9923731 10461927
7075 10461927 6295509 1158470 -542527 502681 172988 -2748947 -5227543 -4987082
7067 -4987082 -3589112 -3400841 -4135511 -4204415 -3777309 -4396505 -6225461 -7633278 -7816825
7058 -7816825 -8377767 -11100556 -14677601 -15388997 -11895371 -7854913 -7711443 -10412530 -9832804
7049 -9832804 -2001483 10117166 19702262 22041255 17119664 9052848 4120404 6482467
7041 6482467 13729310 18718561 17492599 13012063 9564918 7178959 4676208 4477555
7033 4477555 9200010 15522539 17096409 13185418 9354286 9295965 10799468 10804830 9946570
7024 9946570 10225133 11606657 12735670 12410163 9352978 3469068 -1805034 -1883190 2778925
7015 2778925 6153901 3963771 -1638044 -6349691 -9026481 -10190452 -8749686 -3862347
7007 -3862347 2060139 5644440 6639580 7296290 9222267 12892644 17911635 21117907 17257178
6998 17257178 5471965 -7034774 -12416143 -11871781 -12905201 -17670099 -20075202 -15643910
6990 -15643910 -8362508 -4471696 -3860882 -2020391 2020947 4447448 2845830 -235428
6982 -235428 -853673 1476659 3591573 2198853 -3136138 -9893466 -14867605 -16467760 -14939340
6973 -14939340 -11141808 -6343713 -2937385 -3142103 -5795795 -6183263 -1125994 6470823
6965 6470823 10110301 6635352 -806579 -6475695 -7086218 -3377791 1096084 1995316 -2941410
6956 -2941410 -11283228 -16999068 -15794382 -9369559 -3544939 -2416562 -5225681 -8663086
6948 -8663086 -10816674 -12131635 -13338790 -13809486 -12445166 -9548783 -6999224 -6625609 -9001982
6939 -9001982 -13522312 -18340764 -20160164 -16298264 -8561415 -3268560 -4846104 -10379506
6931 -10379506 -13352980 -11939451 -9770780 -8651677 -5629943 751996 6301622 7236324
6923 7236324 6699774 10222289 16908661 20511976 18411048 14333976 11999103 10781590
6915 10781590 8556858 4804199 -113094 -5227186 -7876169 -5998090 -2094108 -1043900
6907 -1043900 -3509254 -5873446 -7091998 -9919726 -13853596 -13353575 -6507581 383030
6899 383030 1355703 -1137861 -1625660 -196776 251712 1100497 5293179 10335776 11242877
6890 11242877 8895449 8513049 10676849 10708418 6875535 2771946 1124354 1088159 2032033
6881 2032033 4289219 5954274 4824128 3552549 6372673 10582991 8911874 1447584
6873 1447584 -3181071 -1107898 909798 -2750149 -7192492 -5585981 -257369 2217270
6865 2217270 1936304 3833570 8169811 10383118 8699353 5425348 1914039 -1927296
6857 -1927296 -4143308 -2319333 1805211 4062952 3602362 2662092 1775633 -99735 -1556964
6848 -1556964 301061 5138820 9777795 12699907 14196682 13366236 9869141 7629060
6840 7629060 11057810 17560610 19431176 14069323 7234821 5063347 7651311 11734510
6832 11734510 14846684 15143299 11728153 7235900 5915440 7065148 4565781 -4522778
6824 -4522778 -14824849 -19115686 -16612313 -11658467 -7095287 -2664884 1814084 5322047
6816 5322047 7193908 7416183 5791642 2477227 -1122342 -3210867 -3045922 -1315829 -83082
6807 -83082 -2181444 -8712346 -16720441 -21261866 -20373399 -16448353 -12751228 -10715835 -10637788
6798 -10637788 -12299080 -14212091 -14353418 -12015801 -7321159 17653 8610188 13583787
6790 13583787 11307356 5208420 1879483 1865590 367206 -2812056 -1583760 6157934
6782 6157934 14310315 18205378 20987754 25436847 26774513 20465721 11173420 6146971
6774 6146971 4372381 394955 -5047120 -7013489 -6013362 -6390437 -6993821 -3199899 2537447
6765 2537447 2411815 -3637572 -6763041 -3492571 -1189556 -5178288 -9716024 -7712791
6757 -7712791 -1865798 634067 -1357500 -4364605 -7305070 -10093245 -9024201 -686806
6749 -686806 11750886 22201421 29331863 34713034 36020075 29564680 18746029 12347044
6741 12347044 13229445 15148881 12821701 9386992 10547384 15577782 18382784 15626274
6733 15626274 10301181 7325130 7580110 7081329 1908333 -6641200 -13233827 -15130160
6725 -15130160 -15192974 -16701890 -18162409 -16589949 -13407740 -12301179 -12542475 -9871140 -3864152
6716 -3864152 1202679 3637082 6562481 10869191 11951272 7233453 1807401 1440332
6708 1440332 3642229 1523388 -5424610 -10162779 -7316537 1221569 9989651 15035137
6700 15035137 14925639 10725075 6100786 4478105 5337557 5953480 6682969 10676292 17604607
6691 17604607 22052610 20411898 15778314 13004823 11724603 7978247 1238340 -3881778
6683 -3881778 -2875036 4065961 12624455 17937135 18194558 16257648 16971796 21473286 25333822
6674 25333822 23907640 17768754 10643515 4167549 -1808466 -5742515 -6373436 -7391253
6666 -7391253 -13809148 -22398819 -22481480 -10158835 3942055 7075018 707719 -2590326
6658 -2590326 3268226 11240899 12822962 8908319 5738702 5759283 7136989 8685909 10456144
6649 10456144 11477231 11096942 11178884 13383089 15835717 16376170 17444452 22720423 29477949
6640 29477949 29894772 21092384 9006834 651963 -2788989 -3175587 -1001594 2555056
6632 2555056 3700840 940334 -1403193 502430 3264449 1526601 -2807488 -3636588
6624 -3636588 -1251142 -1555439 -4610896 -3154534 4813179 10951585 9071678 4649665
6616 4649665 4942637 6540020 1821098 -7008154 -10801930 -8194245 -6633706 -8631864
6608 -8631864 -7957948 -2261646 999854 -3176734 -7827275 -4420581 3304858 4476448
6600 4476448 -3309800 -11870229 -14644161 -13248365 -11240715 -8214225 -2751964 3281732
6592 3281732 6633037 6863886 6618037 8404379 11776845 13526460 11494824 8473032 9822437
6583 9822437 15689504 18920260 13935533 4485345 -1929030 -4351836 -6955255 -9444816
6575 -9444816 -6833568 909170 7169587 9041767 11647417 17969015 21404822 14664114
6567 14664114 1139247 -9309819 -12651829 -12290312 -11031054 -8666449 -6545735 -7277724
6559 -7277724 -9117129 -7075186 -1412110 749637 -4773789 -12457266 -13881566 -8272090
6551 -8272090 -2393872 -1627840 -4739412 -7169988 -6743902 -5370762 -6249802 -9926436 -13073613
6542 -13073613 -11499291 -4336852 5259682 13156486 16924218 16104521 11796355 6337113
6534 6337113 1806963 -1657478 -4960078 -7718744 -8762131 -8975307 -11078437 -15476863
6526 -15476863 -18530994 -16796132 -11793538 -8814282 -11229351 -16863176 -19904139 -16308093
6518 -16308093 -7693867 423849 4613455 6346687 7780446 7500697 4129425 2034909
6510 2034909 7327964 17655743 22468876 16397340 6837394 3952628 7779769 10744298
6502 10744298 9479413 7533694 7811201 8844921 8928385 8567088 7763161 5182044 1152261
6493 1152261 -2032438 -3510926 -4213650 -3564632 356374 6752711 12007329 14403895 15294277
6484 15294277 15092225 12371716 7776955 4182565 1689220 -2595938 -8102572 -9632737
6476 -9632737 -5326108 -230857 1558165 2587833 5368424 6049665 1234154 -4057689
6468 -4057689 -3332468 76222 -2288776 -10025141 -14439045 -12962577 -12598465 -16623513 -18081054
6459 -18081054 -11789475 -4199427 -3701078 -7099388 -4494042 5260716 12521642 10279775
6451 10279775 2670833 -1729599 -193534 3235572 4336991 3466129 3951386 6877720
6443 6877720 8663430 5427959 -615485 -2484640 2370895 7798852 6944988 1315909
6435 1315909 -2559748 -3127171 -4718440 -9036298 -11742397 -9067232 -2947662 2834030
6427 2834030 7754448 12838211 16694084 16603910 12367204 6806810 3243757 3515937 6763319
6418 6763319 9000771 6270072 58745 -3006537 431088 4899098 2946065 -4038967
6410 -4038967 -6963547 -1354773 6476127 7946721 3146182 -183863 3404214 11563133
6402 11563133 17794047 17615007 11320651 3425933 -102336 3579235 11254961 16657747
6394 16657747 16888602 14170511 10951105 6194660 -1449950 -9330880 -13276832 -13647201
6386 -13647201 -15092816 -19476316 -22345555 -18552386 -9284717 -981537 1915627 994530
6378 994530 863801 3798811 7674389 8436545 4731010 417482 1415547 8962276 17169227
6369 17169227 19062229 14182432 7977992 4415381 2510782 639015 389531 3552053
6361 3552053 7881532 9332380 7339279 4506554 1659205 -2835881 -8173236 -9787497
6353 -9787497 -5631083 -789677 -1953403 -8444302 -12653560 -9669430 -3011905 516699
6345 516699 -1109264 -4352240 -5550507 -4470841 -2688708 -507737 3467359 9840252
6337 9840252 15953060 17101487 11650201 4214003 1213516 3173208 4715718 3273673
6329 3273673 3626613 10495784 20064114 23843971 19342735 11727292 5639722 1107167
6321 1107167 -1882643 -1083510 2794363 3670418 -2680683 -11975411 -16224685 -13422759 -8702311
6312 -8702311 -7041312 -8474381 -10182556 -10051115 -7531253 -3079477 2355120 7841169
6304 7841169 12347818 14178699 12015493 7103714 2641283 276436 -672571 87463 4600378
6295 4600378 12341554 18551437 19688789 17569091 15061024 11099788 4256341 -1796935
6287 -1796935 -2035904 2200899 4808529 3509091 1358228 -46466 -2848494 -7358928
6279 -7358928 -9762847 -7562887 -3003437 907255 3793968 5385700 3750287 -1039144
6271 -1039144 -4575744 -2503822 4517019 12051588 16183599 15316923 10211328 4143954
6263 4143954 1404567 4155992 11376697 20171558 26272300 25272629 17688354 11410304
6255 11410304 13173968 17904209 13915876 137535 -10182588 -6995087 3059272 6728982
6247 6728982 1252541 -6108270 -10668097 -13703782 -15733055 -14907110 -11774100 -8853004
6239 -8853004 -5704375 -632014 3129988 -305590 -10210787 -18296937 -18451473 -12444549
6231 -12444549 -5055585 1213139 5267552 6504394 6765979 8869239 11564143 10300513
6223 10300513 4490070 -798713 -2355358 -2964925 -5199723 -6100642 -2269893 3563599
6215 3563599 5883978 3967211 1707750 1353444 1440812 258459 -1956775 -3871037 -3565451
6206 -3565451 889976 8569900 14140827 12322375 4091058 -3980138 -6712805 -4431717
6198 -4431717 -127182 4502559 8793987 11271834 10751945 8897348 9336812 13249640 17161212
6189 17161212 16601837 11335541 5202453 961086 -2314646 -5937655 -8467084 -8074228
6181 -8074228 -6001541 -4790649 -4490123 -3919924 -4711060 -10013425 -18877294 -25687111 -26273975
6172 -26273975 -21562600 -14407154 -6501523 -71334 1231440 -3503618 -9458176 -10521229
6164 -10521229 -5939422 -301031 2296713 1863457 679165 -67997 -1177244 -3806367
6156 -3806367 -7638665 -11149589 -13783127 -16604466 -19618142 -20027765 -15733734 -9558580
6148 -9558580 -6589200 -7518333 -8387551 -7323318 -7223774 -10258690 -13920749 -15086257 -14439950
6139 -14439950 -13880573 -12629474 -9374018 -5868081 -4734546 -5275317 -4857667 -3380042 -3332514
6130 -3332514 -6128865 -10767590 -15290010 -17636184 -16427701 -12988740 -11083613 -12539258
6122 -12539258 -14811464 -14938321 -13650728 -13016153 -12588442 -11237204 -10329779 -11046061 -10718133
6113 -10718133 -6685287 -2294139 -3560890 -10139231 -15032200 -14025666 -10409666 -8860486
6105 -8860486 -9191349 -8514242 -6103670 -3429732 -1458848 60917 1866377 4483137 6839029
6096 6839029 5850073 -115045 -7540290 -10732075 -8826689 -6479871 -6949612 -8145508 -6744331
6087 -6744331 -2572155 2843428 8642251 13416292 14754208 12458363 9678927 8724759
6079 8724759 8445894 7872808 9056811 12957368 15384528 11393093 2369849 -5203782 -7443154
6070 -7443154 -6163238 -4868453 -5044243 -6357473 -7349934 -5566092 232573 7446752 11619384
6061 11619384 11446568 9484435 7691741 5408959 2960470 3983239 11227290 21608208
6053 21608208 28487779 28684994 24936359 21415257 19324070 17816674 16876553 17020165 17291862
6044 17291862 16148091 14268280 14022348 15541934 15761368 12678039 8237959 4929391
6036 4929391 1661617 -3859939 -9946614 -11883983 -8195431 -2717029 209467 -116363
6028 -116363 -1866260 -2891656 -1023571 4481941 10284844 11005928 6042252 1264929 1274650
6019 1274650 3041498 1021303 -3755149 -4613501 1217275 8614171 11203080 8540294
6011 8540294 4974349 3716052 3959906 2739294 -1789363 -8470233 -13893267 -15364792
6003 -15364792 -13329523 -10586248 -9533328 -10724722 -13177419 -14756609 -13042001 -7806829
5995 -7806829 -2633385 -2201314 -7378810 -14141119 -17611620 -16120458 -11330238 -5913542
5987 -5913542 -1682060 1101899 3272675 5242045 6025883 4430904 763650 -3651516
5979 -3651516 -7981696 -11352011 -11556343 -6904728 367071 5271425 5899583 5808916 8930388
5970 8930388 14192479 17575852 17918422 17567603 17792895 16913300 13715816 9744026 6463452
5961 6463452 2504777 -3751868 -10313169 -13313212 -12199514 -10094165 -8641208 -5917136
5953 -5917136 -1115521 1936939 -866187 -8011746 -14411714 -18145192 -21140356 -23728411
5945 -23728411 -23531639 -20874585 -20232633 -23403310 -25422175 -21326503 -13949352 -10283337
5937 -10283337 -11926979 -14079397 -13287059 -11253427 -10563465 -11027759 -11320797 -10562461 -7351756
5928 -7351756 -1041324 4846114 4651778 -1854185 -7829435 -8064533 -5677154 -6456005 -9764073
5919 -9764073 -10076257 -5883554 -1499354 311002 2436613 8055480 14674801 16531678
5911 16531678 11525748 3432951 -2371632 -3826185 -2849972 -2338469 -3286686 -4820798 -6232091
5902 -6232091 -7803967 -9549011 -10647107 -11077578 -12452742 -15686989 -18761984 -18612965 -14834356
5893 -14834356 -9950359 -6409208 -4865509 -4972434 -6088091 -7399197 -8863246 -11415273
5885 -11415273 -14449253 -14258998 -8063387 847130 5756288 5027583 4269856 8508223 15797016
5876 15797016 20979971 22454598 21815515 19325001 13958543 6911126 1100339 -2837651
5868 -2837651 -6872950 -11605744 -14705703 -13960980 -9917891 -5203468 -2897070 -5190054
5860 -5190054 -11233539 -16169807 -14783884 -6977946 1903600 6445813 5456896 1397014
5852 1397014 -2262156 -3235138 -2249308 -2648151 -6123162 -9588982 -9174066 -6338582 -5844101
5843 -5844101 -7989258 -8200467 -5356141 -4621886 -9251650 -15141441 -17676053 -18973730 -22790742
5834 -22790742 -26216456 -23319127 -15096419 -8867759 -8035990 -8771358 -7645169 -6738506 -9197078
5825 -9197078 -14281476 -19132102 -22000284 -21759062 -17352274 -10016981 -3888464 -2411805
5817 -2411805 -5254757 -9371290 -11686090 -10886657 -8669784 -8932571 -13319624 -18200877 -19013208
5808 -19013208 -16586229 -15126690 -14809217 -11829215 -6163124 -3122298 -5135624 -7629618
5800 -7629618 -6077326 -2137062 657312 2642836 5508676 8227293 9785047 12204758
5792 12204758 16336397 18176104 14333346 8058257 4562906 3137789 -220634 -4470811
5784 -4470811 -4385026 722371 5002716 3460322 -2923730 -9524784 -11815049 -7446641 1374872
5775 1374872 8259870 9167414 7351182 7928350 9938754 9281614 7138937 8124827 11091139
5766 11091139 10022813 4636239 1657435 3630393 4829800 1557390 -1641920 -717211
5758 -717211 447392 -2545360 -5891372 -3309971 3895335 9361431 11024069 11461422 11418762
5749 11418762 9285637 5306374 732750 -5444386 -13510165 -18840624 -16783806 -10284878
5741 -10284878 -6420853 -6350003 -5220217 -1558341 376983 -1592247 -4241879 -5209014 -6277727
5732 -6277727 -8047064 -7388467 -3555622 -1452365 -4668669 -9558434 -10601603 -8126768
5724 -8126768 -6189369 -5761176 -5051129 -4574445 -6480126 -9387667 -9065560 -5202521 -3291084
5715 -3291084 -7722917 -15768445 -20787818 -19939570 -16331338 -13851193 -12212731 -8515317
5707 -8515317 -2543754 2024151 2497649 978553 1079098 2380984 1294992 -3155752 -7936756
5698 -7936756 -10513334 -10975519 -9050666 -3579628 3084362 4997897 644684 -3022986
5690 -3022986 624687 8223977 11246857 8260054 5568002 6269284 6201425 2454584 -1229591
5681 -1229591 -1402274 -1427513 -5632098 -10767247 -9469014 -768360 8311627 11495078 8982999
5672 8982999 4093674 -1253993 -5894876 -7732175 -5549266 -1109428 2596951 4485092
5664 4485092 5294232 5016109 2226212 -3426306 -9155587 -10990953 -8274890 -5028312 -5410588
5655 -5410588 -8510948 -9749736 -7242377 -3827981 -1899857 511707 6287032 14466829
5647 14466829 21503619 24841339 22623587 13137745 -1067823 -11269210 -10692481 -3490665
5639 -3490665 202463 -2568880 -5936170 -6408875 -7333472 -9995399 -9054043 -2086110 3461498
5630 3461498 -247189 -9978963 -16381795 -16389216 -13486730 -9046324 -1764263 5809143 8492848
5621 8492848 6348615 4125887 2645515 -1793284 -8445403 -10507076 -5332627 624326
5613 624326 944780 -2403909 -4181321 -4472476 -6975712 -11667203 -14092936 -11002304 -3751433
5604 -3751433 3028730 4792960 984747 -3445553 -2930555 1693136 4421944 2762270
5596 2762270 314451 -658640 -3198642 -8765096 -12047451 -7799471 1246579 8570108
5588 8570108 12579881 15737974 18003445 17304272 14829755 13886426 14110134 11904190 6205604
5579 6205604 -603539 -6659555 -10934895 -10732186 -4333414 3823784 5765239 -1283519
5571 -1283519 -12515731 -21825913 -26385821 -25357474 -19212553 -11309364 -5748306 -2452726
5563 -2452726 1954244 7861787 11464242 10660047 7798418 5194514 2021835 -2627526
5555 -2627526 -7272363 -10420914 -12284669 -12822777 -11319134 -8967741 -8309552 -8957030 -7685736
5546 -7685736 -4035323 -1663492 -2497063 -3945856 -4155700 -5606303 -10561755 -16950942 -21971691
5537 -21971691 -25967565 -29131817 -28056218 -20082968 -8668385 -220292 2715497 1842650
5529 1842650 -942521 -4187783 -5577214 -4225319 -3027416 -5014473 -8589582 -9892111
5521 -9892111 -8435484 -6558338 -4665585 -1434786 1951011 2399606 -1086 -1590418
5513 -1590418 -597585 517653 -804989 -3717033 -5713585 -5571936 -3578468 -665142 1936291
5504 1936291 3423473 3867185 2984309 -387549 -5783309 -9553591 -8551161 -4278568 -342246
5495 -342246 3101393 8603808 15750184 20492025 20466980 17068011 11865149 5351734 209284
5486 209284 928441 7627100 14078702 14842591 11369173 8250028 6412304 3556188 -751141
5477 -751141 -4119682 -4562289 -1976714 2588020 6814456 7612055 4321985 247466 -1515611
5468 -1515611 -2249658 -4517958 -6445941 -3476531 4194986 10236510 9495954 3425325 -3150203
5459 -3150203 -7594168 -9988159 -10865268 -10855863 -10826470 -10261077 -7038923 -773923 5247665
5450 5247665 7610757 6624393 4266958 306664 -5940703 -11466622 -12032229 -8879558 -7901289
5441 -7901289 -10622841 -11172476 -5437832 1406728 1596889 -3960571 -7049580 -3595512 2256585
5432 2256585 5697432 6761548 6470419 3236427 -3262132 -8919283 -10202528 -9224188 -9406506
5423 -9406506 -8756936 -2949435 6066014 10511073 6789610 80647 -3062896 -2590141 -2597875
5414 -2597875 -4284150 -4985233 -2836491 984302 4387901 6151345 5683160 3646751 3258236
5405 3258236 8078826 16648543 21482602 16620204 5776590 -446140 3272731 10585393
5397 10585393 11812649 6234612 1877822 3900634 8419959 9483346 7407230 6553076
5389 6553076 8020407 9017435 7860653 5199828 1023910 -5120446 -10854454 -12317491
5381 -12317491 -9746636 -7622084 -7728065 -6172468 122425 7675704 10972003 10221275
5373 10221275 10231019 12703010 14240156 12419903 9743670 9779072 12281497 14370822 14537665
5364 14537665 13050554 9920580 5663356 3764007 8708230 19819909 29605836 31005719
5356 31005719 25184082 19392250 17648249 16737765 11943856 3475173 -4437472 -8218488
5348 -8218488 -6778773 -1251068 4470480 5252361 289208 -4345904 -2457029 4038511
5340 4038511 7814898 6458138 4980733 7195939 9848299 8021811 2317816 -2773466
5332 -2773466 -4737915 -3777356 33641 6425838 12745950 15455017 13752502 9673051
5324 9673051 5256725 1540057 -650970 -1097031 -640433 516648 3678517 8739430 12040952
5315 12040952 10088130 4369925 -510540 -2639803 -3625232 -4603144 -5258722 -6484199 -9757941
5306 -9757941 -13303099 -13065564 -8939155 -6239731 -8974268 -14771024 -18589801 -18640711 -16422684
5297 -16422684 -13597588 -11426280 -11100162 -11921234 -10737074 -5429123 2543867 10694710
5289 10694710 18196544 24017248 25542168 22402810 18855236 18118443 16754784 9925699
5281 9925699 629744 -2685372 2072910 7698219 8426779 7483984 10068295 13623576 10759624
5272 10759624 193786 -10123624 -11413550 -3084851 7171181 11149112 7931028 4122446
5264 4122446 5730275 10738376 12240875 8357245 4712062 5827077 8773148 8483205
5256 8483205 5323097 2996804 1839829 -748207 -4742389 -7251864 -7225236 -6145184 -4547666
5247 -4547666 -2018441 -250220 -1739713 -5397129 -7617651 -7749087 -8180327 -9149578 -8763430
5238 -8763430 -8798925 -14332186 -25124387 -32937808 -31218848 -23312972 -17334875 -16553027 -18651269
5229 -18651269 -20826540 -20946169 -16589522 -8219333 -1605649 -2100224 -7554500 -11563662
5221 -11563662 -12635238 -14825883 -19599541 -23040120 -22637945 -21425885 -22416903 -23173365 -19868295
5212 -19868295 -14101693 -11361062 -13597934 -17141173 -18257181 -17588176 -17841308 -19488651
5204 -19488651 -20759688 -20519659 -18874733 -15518917 -10092833 -4542427 -2400566 -4308446
5196 -4308446 -6631340 -6547705 -6130411 -8335145 -10984061 -9024431 -1982076 5377364 9876233
5187 9876233 12725234 14802784 14270008 10974178 8657336 9854867 12134762 12061810 9576674
5178 9576674 6148103 2427147 244643 2413679 7193129 7805836 1971962 -2820400
5170 -2820400 698774 8424063 10449411 4724057 -2178791 -5797758 -7357068 -7442986 -4368458
5161 -4368458 108762 863592 -2475213 -3444521 2582516 12244581 18820955 19110246 14311661
5152 14311661 7946135 4033482 3709007 3216595 -932715 -5436003 -4187446 1491708
5144 1491708 3397885 -1464802 -6244273 -4448337 1421352 5028146 4657780 2539801
5136 2539801 80822 -2331700 -4205077 -6668638 -11865538 -18193464 -20285477 -16415201
5128 -16415201 -11489548 -9594836 -8181325 -3434275 2896040 6426368 6459446 5171843
5120 5171843 3400627 1034135 -1075540 -2833657 -5610276 -8370781 -6768840 523284
5112 523284 8277347 11136546 9971038 8246759 6128435 2481965 -1027388 -2413867
5104 -2413867 -2648577 -2405933 537655 6257690 9475435 6707308 2384925 2043450 3707361
5095 3707361 2699833 807593 2606247 5672341 3202712 -4932175 -11848376 -13609234
5087 -13609234 -11960920 -8056749 -1636539 3740297 3168209 -1024756 -1398721 2478644
5079 2478644 2493100 -4860913 -12219435 -12624213 -9782114 -11206921 -16312066 -17734372 -11913405
5070 -11913405 -3023067 2647879 2513049 -1665180 -6380974 -9398296 -10862134 -11335607
5062 -11335607 -9949993 -6465047 -3864384 -5553793 -10358020 -13667703 -13396407 -11457087
5054 -11457087 -9630356 -7696212 -5638087 -3961843 -1740707 2081705 5664758 6314123
5046 6314123 5068088 5107141 6282132 6026921 5108415 6839352 10523215 11705227 9726866
5037 9726866 8966782 11233572 13000146 12122100 11383546 12887449 14383759 13761435 12026913
5028 12026913 9499258 4679470 -399213 196858 7550123 14436800 15001031 12719976
5020 12719976 13938464 18246798 20612306 18965489 14192337 6478884 -2197144 -5344510
5012 -5344510 914317 9553250 8968866 -1903439 -11360509 -9741149 -968862 4024151
5004 4024151 1410580 -2798835 -2898568 -1189748 -3209842 -8602805 -11536481 -9890773 -8544317
4995 -8544317 -11112372 -13668828 -11454009 -7391841 -7081124 -8339507 -4348984 3584310
4987 3584310 5790204 -1551832 -10703442 -14047494 -13306146 -12699275 -10671101 -4687959 1727009
4978 1727009 3749864 3064686 4495644 7712482 8096301 3809025 -2852911 -9127321 -12564942
4969 -12564942 -10627846 -4133417 875101 -870580 -7483279 -13206721 -16058120 -18148325
4961 -18148325 -20154091 -19992497 -16650324 -12030828 -8939329 -8874210 -10911185 -11879182 -9670031
4952 -9670031 -7013796 -8589189 -13210577 -13431730 -5660319 3658250 5889649 1061180
4944 1061180 -3190169 -1320439 5121813 10688056 11144493 6148024 -1255711 -7909302
4936 -7909302 -12865616 -15254963 -12439043 -4444973 2200321 1451358 -2806756 -1784696
4928 -1784696 4506048 7437519 3889733 101255 -291227 -1208983 -3800244 -2282484 4764004
4919 4764004 9352496 6301347 835870 -1760413 -3859096 -6602627 -4466691 3320277
4911 3320277 6699092 -682539 -10615474 -13140484 -10436882 -8719702 -6813027 -3122296
4903 -3122296 -3360364 -9883108 -13538801 -8041213 -2301059 -6232015 -14799192 -18777251
4895 -18777251 -19929022 -21892734 -18418681 -6013121 4281206 3961542 2453580 8363815
4887 8363815 11267602 2369749 -4256250 4544926 14011573 6501418 -5295536 -3035048
4879 -3035048 -127348 -14422040 -25262727 -8614514 7174040 -8929516 3192551
4872 3192551 144621679 389095835 557091123 516154618 339538410 198942264 156213301
4865 156213301 142608471 103993494 66297092 58102764 57098126 39783705 22735401
4858 22735401 24659218 31505248 25859686 16598072 16370186 18593891 17012401 21998116
4850 21998116 38008725 47866875 38242096 21142412 13249225 12042694 8323637 5215790
4842 5215790 8391782 12090224 10157636 8273919 11726103 13372123 6465288 -2380089
4834 -2380089 -4941746 -4449475 -5670287 -4102084 3203865 8045923 4659337 1407384
4826 1407384 6093534 10869689 5859311 -2419648 -1674325 5321894 6522729 1529929
4818 1529929 912939 7617125 13500805 13688252 12307583 13600477 16756735 19720719 20901755
4809 20901755 18201210 12401798 8868313 9863524 9044248 480214 -10842343 -15062131
4801 -15062131 -10520829 -3354181 2617422 7851986 11769220 13237572 14430386 17284788
4793 17284788 18097344 12257249 2545945 -3482445 -2812133 1537693 5829690 7117378
4785 7117378 2451486 -7401863 -15709175 -16623987 -11998901 -6895237 -2061363 3765990
4777 3765990 8311752 9173338 9319480 12214999 14307155 9521916 -731995 -8679812
4769 -8679812 -9724655 -5210845 1990796 8660885 10418033 6137709 1515374 2660036
4761 2660036 8172353 12558342 14231033 14475816 12462061 8147422 6323424 10076107
4753 10076107 13702370 10426802 3823552 2276605 4914991 3625785 -2285079 -4548833
4745 -4548833 490192 7252130 11308825 14302527 16169521 12289330 2188215 -7254124
4737 -7254124 -11282748 -12768568 -14904477 -15877127 -14770597 -15559642 -20283296 -24121982 -22052653
4728 -22052653 -15470665 -8202869 -1097257 5346692 8309642 7464194 7802108 12466334
4720 12466334 16561336 13374170 3940842 -4411780 -6807493 -3794035 2233986 8972709
4712 8972709 13547394 13753772 10096175 5001425 1076868 921643 5855030 13011146 16614212
4703 16614212 14549674 11163047 11345512 14601166 17270961 17445534 14688252 8052406
4695 8052406 -1682045 -9983908 -12791903 -11517202 -10577625 -11299073 -11471968 -9710397 -7041680
4686 -7041680 -5119192 -5556509 -9506561 -14858141 -15790253 -9229606 -431417 2489582 -1143544
4677 -1143544 -4797656 -4924613 -4529269 -4951903 -1222405 9264510 18534219 15867780 2403505
4668 2403505 -8917110 -8784037 -1233306 3827884 2484758 -2127379 -6301779 -8444915
4660 -8444915 -7520289 -3782851 -686869 -2111155 -7375622 -11844992 -12335623 -9326644 -4590403
4651 -4590403 164387 3101507 4397060 7631200 14568407 19600540 15524544 4961965
4643 4961965 -1239774 1238183 4840145 3086577 620796 3948344 9188144 7831794
4635 7831794 328632 -5482730 -7397991 -10900153 -17976145 -22301086 -17899083 -6840597
4627 -6840597 3630699 7460768 2811648 -6726900 -13698765 -14046123 -12523102 -15930363
4619 -15930363 -21985107 -21911551 -14593945 -10096388 -15719626 -25107144 -26117493 -15366048
4611 -15366048 -413092 9692878 12034849 9797672 8139924 9847164 13532083 16134823
4603 16134823 16438781 14518448 9347206 515847 -8552681 -13223215 -12946901 -9713416
4595 -9713416 -2582788 9948678 22412924 25113784 16829320 7741260 6157873 8781943
4587 8781943 8608812 6173541 6472438 8959045 7812492 654246 -8758826 -15937586 -19063502
4578 -19063502 -17270525 -10044992 290670 8123691 8623456 2538835 -3346291 -1837676
4570 -1837676 7201120 16304152 19360434 18859667 20425489 22896021 20606089 14547543
4562 14547543 12699629 17425488 20965657 17346949 11060338 8496680 7553878 2664941
4554 2664941 -4760003 -8187251 -5377678 85768 4380300 5579363 2791739 -2247738
4546 -2247738 -5444541 -6065978 -8340142 -13319511 -14640426 -8406364 -1721309 -3278939
4538 -3278939 -9866418 -11648620 -7913367 -7106326 -12069298 -15806051 -13260206 -7783841
4530 -7783841 -3365253 967122 5496802 6251268 1569698 -3798473 -5606856 -6106110 -8849156
4521 -8849156 -12002449 -11535032 -7778895 -4347484 -2910816 -3119890 -5854707 -12247728 -19818737
4512 -19818737 -23053279 -18883264 -10143371 -2792692 -122232 -371692 -463922 -959526 -4740380
4503 -4740380 -10755313 -13378629 -10444422 -7482063 -9348777 -11472547 -6084075 4970797
4495 4970797 11470836 8948028 3869233 2904257 4298782 3548971 1739250 3367758 9442531
4486 9442531 16890487 22423861 23922505 20417931 13740530 8434892 7669598 10492875
4478 10492875 14051972 16153595 14974890 9956678 4689554 4875386 10488852 13491914
4470 13491914 7241830 -4182533 -10180224 -6046973 2548363 7297085 6031867 2637328
4462 2637328 489710 -1480788 -5718641 -10971054 -13215161 -12035216 -12434819 -17656255
4454 -17656255 -23408627 -23485195 -18736293 -15138402 -14470832 -13145244 -9856696 -7481116 -6381113
4445 -6381113 -2776115 3932971 8587393 7918877 4929778 2692219 -107190 -3940290
4437 -3940290 -5278330 -3365349 -3889455 -10031392 -15470091 -13156331 -6348694 -3363912
4429 -3363912 -5092333 -5938263 -4613040 -5209504 -8306797 -9488028 -7616066 -7206165 -10694113
4420 -10694113 -14438661 -14650154 -12390971 -10475495 -9201571 -6952888 -2321318 4841875
4412 4841875 11792613 13194667 6909703 -1615116 -5559890 -6224228 -10205345 -17518837
4404 -17518837 -20149509 -14304450 -6728926 -5014144 -7704256 -8792215 -7213653 -6413513
4396 -6413513 -7554632 -8313922 -6849894 -3155891 1965239 6097282 5297176 -1657085 -10612348
4387 -10612348 -16505486 -18704461 -19128551 -17568130 -12960229 -7670953 -5841542 -7637306
4379 -7637306 -9017407 -7474646 -4665237 -2941066 -2378943 -2028185 -1547773 -796891 115860
4370 115860 -113924 -2733258 -6231428 -7187781 -4700111 -1829076 -1364925 -1992745 -442891
4361 -442891 3512745 5939457 2677536 -6235491 -15954096 -20508208 -17717539 -10815844
4353 -10815844 -4861932 -1660907 940348 4810685 8134687 7361588 1795386 -5279893
4345 -5279893 -10401613 -13673650 -17434722 -21551206 -22208377 -16991155 -9695738 -7048252
4337 -7048252 -10468129 -14321702 -13752737 -10924398 -10511792 -11689866 -9220116 -1769419 5644836
4328 5644836 8496873 8038151 7948089 9056106 9842098 9605187 8331022 5252379 540013
4319 540013 -2635878 -752399 5394635 10914848 12001857 9398364 6642118 6128732 7062878
4310 7062878 6637772 3418285 -443434 -1722905 -1162332 -3464379 -10546396 -17461324 -18257085
4301 -18257085 -14098856 -11429536 -12598198 -12849931 -7766759 166623 4891293 4432889
4293 4432889 2560837 3231416 5094773 2521315 -7249357 -18404786 -20611836 -10544920
4285 -10544920 3173571 9618870 7695009 4175528 1914736 -2998568 -11923997 -18944024
4277 -18944024 -18773751 -13880887 -9865546 -8264731 -8016287 -9918997 -14709259 -19608674
4269 -19608674 -21662895 -22575673 -25876093 -30913934 -33826727 -33295241 -31610078 -30842411 -30842822
4260 -30842822 -29972598 -25838394 -17582401 -9425146 -8200538 -14169533 -18448111 -13871738
4252 -13871738 -4191315 2618839 5375262 7117551 6184171 -725917 -8921982 -9343014
4244 -9343014 -1870742 4288307 4303462 2542273 2198532 -80951 -5804034 -10008716 -9894356
4235 -9894356 -10213405 -14499632 -17729856 -13938124 -5875490 -1168467 -2988987 -9372447
4227 -9372447 -17280366 -22366533 -19335427 -8176547 3710168 10700786 16066865 24310829
4219 24310829 30929220 27421249 14176936 929456 -5046197 -4943258 -2907444 -631767
4211 -631767 1356774 1766391 59324 -2358784 -3587634 -2917908 -1365774 -1153797 -3408997
4202 -3408997 -6074349 -6498266 -6301848 -9671716 -15621001 -17042576 -10567257 -2799006 -2418062
4193 -2418062 -9246580 -15311555 -14516082 -7898046 -1320767 -469471 -5969636 -11902063 -11918013
4184 -11918013 -7296308 -4713631 -6152456 -7417395 -7092889 -8629171 -11767684 -11546784
4176 -11546784 -9016002 -12139940 -21163935 -24838236 -18193715 -11850271 -14446603 -18254805
4168 -18254805 -14091358 -8653170 -12567626 -21453321 -24909290 -25631058 -32491043 -42004363
4160 -42004363 -44495003 -42365124 -44254905 -47538927 -45556758 -44961058 -54695466 -65495643
4152 -65495643 -64561433 -62203371 -75146275 -92661183 -96391890 -105558815 -149775357 -190997616
4144 -190997616 -136562840 35426679 215494520 277724782 221484078 146725787 116108961
4137 116108961 105802021 83085892 61887348 62211899 68186153 57825946 40897199
4130 40897199 38139779 46052158 48066741 43620819 42839364 44691651 41164328 34535534
4122 34535534 32884182 34879450 33725957 30400978 29898938 29548846 23114217 12334701
4114 12334701 4008268 -336032 -2697402 -1311420 5405803 11719504 10803063 5206014
4106 5206014 2858754 5407607 8113829 8509640 7718723 5770577 2869537 3120020 9967350
4097 9967350 19529876 24695971 24210511 21919268 19012630 13381119 5651101 -71136
4089 -71136 -1508418 -37736 2263360 4002910 4200042 3813028 5807829 10718540 14408962
4080 14408962 13341483 9563000 7460055 8512162 12280372 18908582 26779946 31147955
4072 31147955 29280373 24098301 19440994 15568928 12657262 13486761 17885522 19864962
4064 19864962 16195241 12650236 14909871 18427632 15659056 9007153 6960932 10223777
4056 10223777 11863424 9835015 8924135 10193813 8947463 4944320 4863593 11288422 17408923
4047 17408923 16313486 8692381 -1571881 -12198574 -19437775 -17649482 -7042410 3790991
4039 3790991 7847440 7448497 7963327 9156300 7902540 5027674 3793855 4647428 6390934
4030 6390934 9732821 14843540 17900563 15036546 8083836 2146465 -853864 -2175173
4022 -2175173 -1757003 1601657 6639859 10600218 13223440 15889726 17476929 15254349
4014 15254349 9774290 4828009 2187634 245544 -1357220 323765 6957931 14975143
4006 14975143 18497151 15129727 7688986 1403307 342846 5175002 12801162 18465683
3998 18465683 19233832 15757771 10883523 6985182 4411767 1631836 -3296842 -10599497
3990 -10599497 -17580426 -19945236 -15068282 -4409774 7296833 15662379 19823615 21958219
3982 21958219 23797344 24629054 23219768 20176009 16877827 13451243 10098421 9168305
3974 9168305 12378692 16284458 14840480 7702784 1819096 2454035 6510485 8113332
3966 8113332 7344908 8657761 12583954 14368677 10844928 4264148 -1502191 -5117220
3958 -5117220 -7267211 -8940816 -11100574 -13599973 -13961039 -9950435 -3893561 -1390401
3950 -1390401 -4725725 -10393602 -14180590 -15506283 -15222353 -12690620 -7800912 -3034505
3942 -3034505 -229498 2544662 7393181 11773357 11569870 8106968 7217512 10541904 12307963
3933 12307963 7176111 -2041029 -7790685 -7090762 -3983009 -3238736 -5107071 -7325345
3925 -7325345 -9327569 -11550751 -11685761 -5514387 6632888 16780422 16375128 6446284
3917 6446284 -2688121 -3139506 2265980 5766618 5566523 6427090 10689973 14411272 14050086
3908 14050086 12367643 14286282 19628970 23609159 23075031 18876038 12952725 6807224
3900 6807224 3032202 4638658 11122093 17516591 19287577 16834063 13639288 11344981
3892 11344981 8746702 5067714 1922414 1399796 3621958 7079811 10522638 13543793
3884 13543793 15719630 16195628 14277496 9907221 3666430 -2914576 -7127282 -6571255
3876 -6571255 -1824792 3235082 5005933 3675740 2199485 2419192 3601742 4235794 3287065
3867 3287065 -226988 -6555157 -13436839 -17139323 -16362187 -13430801 -10829179 -8675045
3859 -8675045 -6643277 -5610965 -5299783 -2897509 2911761 8439499 9028809 5440639 2556761
3850 2556761 2320671 1841858 -1316209 -5786740 -9321444 -11762486 -13608571 -14164028 -12677293
3841 -12677293 -9621168 -6031959 -3265811 -3413984 -7219350 -11125381 -9698437 -2450512
3833 -2450512 4530348 5358822 236770 -6858236 -13311559 -18368202 -21123408 -21071046 -19353502
3824 -19353502 -17204766 -14273942 -10075421 -5456036 -1009044 3979916 9185535 12169888
3816 12169888 12068731 12120481 15467857 20023639 20653863 15482862 7262253 -576464 -6429669
3807 -6429669 -9662306 -9756488 -6348429 760893 10122991 16491514 13872491 3684627
3799 3684627 -3690357 -159139 9682828 14497060 10634583 4640386 2326949 2456891
3791 2456891 2655089 4909681 11411846 19142346 22665051 20414608 15580185 12013745
3783 12013745 10874669 10420223 8629622 6793470 9032280 15775701 19901659 14306369
3775 14306369 2471763 -4523796 -2127427 2921320 3619345 1472240 536934 -627048
3767 -627048 -5063710 -10132078 -10810197 -7662140 -5407834 -5387204 -5338029 -5334434 -7716574 -11297038
3757 -11297038 -11693358 -8417811 -6269376 -7956137 -10087490 -8904526 -5931264 -4772303
3749 -4772303 -5232100 -4158189 -560462 3382488 5893307 7392836 8459239 8205906 5765840
3740 5765840 2205609 -269273 -674709 110731 829941 752886 -980897 -5018582 -9498992
3731 -9498992 -9918245 -3881397 4806367 9690164 9103392 6917651 5731410 3326251 -2433236
3722 -2433236 -8859677 -11523262 -9727329 -6178074 -3043657 -960550 -424463 -1548835
3714 -1548835 -3305823 -4730246 -5680120 -5327321 -2221262 2561692 5181605 4141420 2557691
3705 2557691 2643178 1476600 -3795006 -9650029 -9901143 -3636723 5002716 12707742 17808998
3696 17808998 17759834 11941089 5423317 3566005 3981084 630918 -5050549 -5232044 1660052
3687 1660052 8012260 8967651 8858436 11978773 14940701 13704991 11646354 14164360 19943178
3678 19943178 23561242 22926514 18721554 10620459 72285 -7003083 -7091644 -5746665
3670 -5746665 -10427256 -19039695 -23090091 -20767555 -18780235 -21081673 -23851013 -23541710
3662 -23541710 -22687162 -24356080 -26412896 -25142720 -20683542 -15440980 -10112101 -4349718
3654 -4349718 883481 4281665 6067739 7237841 8199465 8806904 8143293 4558170 -1411719
3645 -1411719 -4812610 -1203624 5978814 8171244 3258355 -1249516 420118 3474054
3637 3474054 109343 -8558755 -14489522 -14060454 -10783977 -7794519 -4454957 -1139640
3629 -1139640 -1009824 -4531887 -7142076 -5553734 -2679449 -2770368 -4520032 -3202572 1589826
3620 1589826 4480909 1091226 -6549229 -12543990 -13556140 -11667616 -11583801 -15770661 -22254017
3611 -22254017 -26967430 -27966574 -26694176 -25138127 -23233028 -20197498 -17155368 -16258808
3603 -16258808 -17357154 -17606494 -14861916 -9689862 -3497913 3109661 8766544 10410349
3595 10410349 6538723 266947 -3616306 -4141148 -3942831 -3901633 -1562199 4160760 10090486
3586 10090486 12582513 11621495 9061258 5387735 996673 -1580128 -281336 2925156
3578 2925156 4493691 4291618 4537867 4601576 1215263 -5846271 -12447557 -15313898 -14697545
3569 -14697545 -10935644 -2984921 7311944 13826209 12755602 7944567 6106791 8802727
3561 8802727 12412953 14029510 13581911 11445122 7956651 5107054 5368709 8470031 11557459
3552 11557459 12461183 11063803 8349125 6162668 6605716 9095340 9457220 5037055 -725230
3543 -725230 -2567902 -1029341 -1304706 -5063351 -8451792 -8676505 -7551097 -7332154 -7867438
3534 -7867438 -9463331 -13654284 -18899307 -20398550 -17049855 -13798214 -13623647 -12186619
3526 -12186619 -5189566 3410605 6552717 4203501 1835601 1020126 -1311665 -4977750
3518 -4977750 -5233114 -405777 5314581 8181607 8345904 5603868 -1816816 -11116392 -13718636
3509 -13718636 -5340414 6811717 12210648 9528539 5702957 4729037 3693369 -72056
3501 -72056 -3873209 -3910747 -661004 2753537 5082121 6985310 7853262 5579549 5713
3492 5713 -5338559 -6505309 -3910685 -2519519 -6397909 -13709538 -18324952 -16224331 -9030306
3483 -9030306 -1382914 3226847 3594585 327967 -3915802 -5508288 -3656095 -2348925
3475 -2348925 -6148015 -14268881 -21025549 -22216983 -18923880 -14554602 -10464361 -6012416
3467 -6012416 -1475438 1237115 907455 -1141061 -2141598 -661340 1932634 2843500 697003
3458 697003 -3019394 -5336997 -4427868 -821971 3654358 7798993 11699601 15361776 17160616
3449 17160616 15099499 10351142 7758507 10449453 14901731 14695329 9382058 5748444
3441 5748444 8611157 14228963 16070136 13945997 12865166 14667624 16133073 15288916
3433 15288916 14362323 14992288 14852349 11367176 5535276 -308717 -5748614 -10840833 -13961039
3424 -13961039 -13903359 -12088485 -9898288 -5920763 723249 6122468 5123681 -1254497 -6461895
3415 -6461895 -7292864 -7916014 -12996218 -20211312 -22759254 -17601781 -8431326 -1330915 195220
3406 195220 -3472446 -9291250 -13851430 -15971841 -17071687 -18036777 -16815302 -11398900 -4638123
3397 -4638123 -2755024 -7755173 -13878868 -13787387 -6787191 1280037 5194256 4770956 2540454
3388 2540454 100671 -2033411 -3103885 -2701719 -2135887 -3683293 -8139396 -13572476 -16682941
3379 -16682941 -15540673 -11334725 -7349067 -5805250 -5937921 -5667889 -4519533 -3707986 -3784158
3370 -3784158 -3799919 -2746943 -128635 4867862 12546334 20546996 24978367 24873739 23213049
3361 23213049 22071999 19392463 12956528 5208778 810089 789269 2487288 4252255
3353 4252255 6316700 7274621 3942738 -3982891 -12202786 -16113879 -14543567 -8587772
3345 -8587772 164298 8847708 13858893 14563417 14455844 16522151 19253259 19325339 16386986
3336 16386986 12696743 9490333 6522705 4321582 3929012 4490234 3736302 1338156 -352544
3327 -352544 326248 1884414 1543422 -1536174 -5839602 -9608602 -12236394 -13417086 -11808930
3318 -11808930 -5879353 3253722 10869951 12298663 7592847 1110610 -3478507 -5781078
3310 -5781078 -6278114 -4561977 -1602553 -692825 -3024474 -4326432 277143 8798524 13646114
3301 13646114 10814512 4490961 1294881 2609026 4331226 2352265 -3541962 -10021776
3293 -10021776 -12731106 -9170103 -924498 6582153 7660047 904055 -9207877 -15670280
3285 -15670280 -15119840 -11068735 -9835128 -12801516 -14684438 -10963517 -4733431 -3096436
3277 -3096436 -8086587 -14979099 -19154690 -20186887 -18421961 -12660360 -4271278 495024
3269 495024 -3004474 -10941325 -15185891 -13552145 -11384774 -12732970 -14706077 -12737476
3261 -12737476 -7769294 -4710318 -5527356 -7384418 -7229648 -4974872 -1417071 4051583
3253 4051583 11462091 17482275 17279346 9443641 -2461944 -13406576 -20425348 -22578395
3245 -22578395 -19848993 -13814689 -7838114 -4258381 -1957999 1252162 4423690 4271620
3237 4271620 304218 -3712155 -4520180 -3143952 -2264535 -1939602 -158626 3666974 7933212
3228 7933212 10672732 10320583 5844697 -1493084 -7356751 -8170316 -5687706 -5137157 -8626463
3219 -8626463 -13028922 -14839690 -14155450 -12640892 -10440154 -7203979 -4002852 -1776478
3211 -1776478 645632 4599972 8757540 10513745 9301252 6291867 1822530 -4150417
3203 -4150417 -9695224 -12155089 -11825398 -11408584 -11566037 -10336520 -7783357 -7540097 -11760330
3194 -11760330 -17644682 -21441572 -23104102 -24071168 -23156660 -18630179 -12603483 -8854318
3186 -8854318 -6978755 -3151755 3316610 8695389 10706794 11021004 10525921 7173819 1520713
3177 1520713 -104978 7473749 20931023 32472028 39103983 43114702 45028069 42181443
3169 42181443 34771933 27588321 23599290 20397340 15711153 12250942 13112733 15351230
3161 15351230 13004582 5515173 -1319086 -3081959 -1707291 -1621180 -3882924 -5966220
3153 -5966220 -5630121 -3298055 -1291789 -1572515 -3715633 -5031312 -3654865 -1209158 -697125
3144 -697125 -2077685 -2649985 -2119012 -3490052 -6952958 -6740199 1912326 15007103 23490125
3135 23490125 23449269 18165211 11333167 4209391 -448835 1184072 6742905 7111967 -2257420
3126 -2257420 -14186351 -18826707 -15495768 -9734533 -3017063 6399840 14707910 14341811
3118 14341811 5721710 -1273175 -486662 3041687 2441544 -947301 -2152435 -1714381 -3692464
3109 -3692464 -7673271 -9145730 -6602802 -3082507 -1217264 -1035349 -2259265 -4875033
3101 -4875033 -7299828 -6942946 -2687860 4868113 14199078 21700616 22206185 14490872 4799456
3092 4799456 837327 3014872 5342012 4000166 755774 -1594292 -2474922 -1792270 787698
3083 787698 3850004 5105199 5072390 6495550 9491467 11035378 10214969 9965585 11780671
3074 11780671 12337114 7955879 -110591 -7274392 -10778532 -11399783 -11369648 -12040503 -12664489
3065 -12664489 -10953220 -6018237 -444897 2620794 3982454 7032471 12021043 15408884
3057 15408884 15667009 15782171 18232381 20910814 20421450 16880358 13159758 11206002 10836544
3048 10836544 10633081 9050323 6378173 5745930 9470511 14411865 14767014 10004673 5521412
3039 5521412 4370059 3770206 2052512 2935174 8598275 13926411 13498817 10359827 11425228
3030 11425228 16921524 21121761 21917856 22597013 24268516 23353629 18041406 11659214 7677383
3021 7677383 6019714 6365577 10609796 18886663 26211945 26461492 18506003 6622150
3013 6622150 -3700349 -8919981 -8347663 -4224471 -281765 1409924 2029274 3714859
3005 3714859 6299450 7349630 5298941 1595947 -838400 -1054860 -1033239 -2475807 -3545717
2996 -3545717 -683593 6245552 12712797 14328562 11248281 6942915 4344102 4232039
2988 4232039 5615311 6437948 5453295 4164422 4826283 6045161 3788619 -1725792 -4258099
2979 -4258099 220073 7095281 9043534 5657071 2537611 2732229 3963139 3363665 367140
2970 367140 -4575376 -9976665 -12644691 -11187367 -9306037 -10866887 -12479849 -6854229
2962 -6854229 5903459 16493619 18170224 14980001 14900194 18871852 20840342 16375047
2954 16375047 7308919 -1346482 -6056197 -6384882 -4240059 -2361246 -2770530 -5725286
2946 -5725286 -9422837 -10851794 -8317087 -3679303 -461990 990718 4019814 9838815
2938 9838815 14310425 13344804 8695307 4782665 2365304 -250056 -2002585 -417316
2930 -417316 3125361 4847231 4627210 5315066 6492730 4583230 -541819 -4414177 -4060227
2921 -4060227 -590233 4133325 8169547 7276817 -1496638 -13230467 -18384050 -13865669
2913 -13865669 -5264348 2156580 7762465 10407269 7535709 1798070 311022 4091635
2905 4091635 6309153 4556056 5736686 13414218 19490044 16186625 8668412 6728923
2897 6728923 9640665 8681411 918905 -8419667 -14828724 -17849159 -17459680 -14238329 -11521114
2888 -11521114 -11415761 -10773961 -6334377 -386036 4262979 10028055 17982800 20925082
2880 20925082 12707481 545813 -2882907 2769449 6964564 6016942 6843448 12313818
2872 12313818 15727322 13239766 10140711 9875599 7255478 -1340181 -10000961 -12194537
2864 -12194537 -10042986 -8124523 -5224032 305547 3252009 -1819171 -10747322 -14717288
2856 -14717288 -12302132 -9206585 -8165601 -6548112 -3091384 52766 2383221 6082084
2848 6082084 10759893 12179538 8124128 1945109 -1627009 -1771975 -1211722 -2352297 -5041524
2839 -5041524 -7077309 -6142968 -1942704 3102481 5706050 4647683 2016607 1520404 4861380
2830 4861380 9186711 9159583 2958827 -4667496 -7114318 -2815195 4545835 11227785 15545097
2821 15545097 15828022 10827222 2920458 -2946552 -4928484 -6049973 -9514076 -15091887
2813 -15091887 -20595655 -23799371 -22713506 -17511006 -12197444 -10325257 -9414023 -4834680
2805 -4834680 1078662 842295 -6068326 -10943018 -8894846 -6197284 -9519785 -15308214
2797 -15308214 -16652093 -14329694 -12960248 -11244647 -5140673 2524335 4926055 1981929
2789 1981929 -765545 -2992066 -9763205 -20168234 -25381110 -21190348 -14517916 -13187198
2781 -13187198 -15456346 -14502676 -8699453 -2631192 -785388 -4072003 -10428522 -15784534
2773 -15784534 -16160560 -11249605 -4654377 542013 4281946 6750506 6327348 2430843
2765 2430843 -2097012 -3765715 -2029640 1277153 4185465 5032894 2769116 -1813624
2757 -1813624 -6809610 -11539824 -15714347 -16447964 -10456698 -414085 5927065 5814538
2749 5814538 5864592 12061576 19664568 19095356 9486049 -94383 -2331476 1364253 5933075
2740 5933075 8951844 10178041 9708961 9110545 10711966 13389868 12353316 5729056 -1534358
2731 -1534358 -3202895 1050383 6492025 8873673 6314304 -1460713 -11485764 -16961754
2723 -16961754 -13192661 -3824164 2996028 4336118 3874759 3930187 2141175 -2204414 -4667201
2714 -4667201 -2365414 675074 -136086 -1922433 1504744 9644168 15617718 15788655 13220240
2705 13220240 11355474 10116472 9676036 12485170 18575552 23022801 21586246 16296088
2697 16296088 12605529 13024698 15810292 17829690 16465130 10703363 2775970 -2728112
2689 -2728112 -3319148 -825700 2001250 4711090 7234390 7571787 4373795 55298 -1426271
2680 -1426271 1432302 7983255 17519803 28083993 35109345 34975533 29170613 21949320
2672 21949320 14890890 6955131 -1223394 -7202569 -10900945 -15041005 -20536960 -24589386
2664 -24589386 -24708237 -22327161 -21002186 -22273320 -23934447 -21509747 -11982686 2082055
2656 2082055 12583579 12668355 4031232 -4601704 -6814482 -4309065 -2714492 -3977427
2648 -3977427 -5004198 -2969829 314972 354303 -4518673 -11104865 -15281146 -16301000 -15433476
2639 -15433476 -11970539 -4182029 5903450 12881968 14502055 14088217 14853483 15962701
2631 15962701 16472726 18241165 21157493 20465399 14269393 9317109 12250115 18220498
2623 18220498 16552095 6514920 -1374752 -631445 3215037 2850676 34455 1588413
2615 1588413 9372631 18586632 23096136 19860425 11309789 5239922 8384338 17901144
2607 17901144 23401453 19789282 13424452 12352645 15250865 14785393 8363022 216559
2599 216559 -5274129 -7519282 -7792944 -7196278 -6354803 -4786546 -1342471 3106596 5258722
2590 5258722 3689306 1533984 2564087 6537044 10691015 13693907 15650506 16356958
2582 16356958 16142329 16348667 16482685 13321682 5739365 -1977019 -4869785 -3385511 -1823240
2573 -1823240 -3058731 -7730960 -15535151 -23254711 -24520169 -16816592 -6865761 -3622951
2565 -3622951 -7099118 -9539906 -6785642 -2401741 -308661 552710 2499863 5103111
2557 5103111 7118585 8523233 8706022 6163511 1891064 -73438 2689650 8436059
2549 8436059 14484743 19738019 22667040 20652364 13930603 7182432 4241952 3400865
2541 3400865 731062 -3850513 -6923803 -6838694 -5587136 -5511222 -6524159 -7109007 -6503651
2532 -6503651 -5027045 -2870780 416118 4614434 7510106 6655163 3214758 1878584
2524 1878584 4784101 7463972 4225928 -3607728 -9016336 -8568785 -5682860 -3877416
2516 -3877416 -2072279 872700 1819370 -2129353 -7787932 -8989066 -3879334 4448513
2508 4448513 12752983 19118845 21283367 18286665 13455179 11296459 11291787 9210854 4969477
2499 4969477 3760974 7188300 8580950 1655216 -9512424 -14484759 -9082018 1001217
2491 1001217 8797857 12904257 14488557 12936930 8343142 4893880 6812052 11973108
2483 11973108 13975346 10673722 6611933 5982160 7060715 5900959 2461505 -197275
2475 -197275 -1065588 -2046888 -4134866 -5821776 -5849370 -5374288 -6607339 -10494266 -15813066
2466 -15813066 -19275321 -16911590 -7537473 4633182 12674985 13207581 8913943 4572020
2458 4572020 2260127 1228723 736848 1336468 3809283 7668306 10459345 8906480 2466126
2449 2466126 -3991660 -3548859 5022354 14733633 17663180 13196599 6618749 1370202
2441 1370202 -3201138 -6868723 -6514600 -1280879 4322758 6021475 5786702 8113824 12063103
2432 12063103 12051250 6514192 650461 -1133752 -1095804 -3657034 -8524320 -11952513 -12615909
2423 -12615909 -12418806 -12682201 -12993725 -13112809 -12868515 -10807942 -6103041 -1346291 -369396
2414 -369396 -3715071 -9211022 -15884561 -23209839 -27377260 -23862747 -14544304 -6898217
2406 -6898217 -4336906 -2538042 2138781 6084023 4504702 -384062 -2639612 -1442249
2398 -1442249 -1246844 -4196674 -7308412 -7518328 -5873103 -5585232 -7634650 -8921384 -4760873
2389 -4760873 5648897 16495404 20746648 18408243 15591308 14897904 12366834 6220192
2381 6220192 2087114 4689201 9919079 11338449 9944824 10592149 12732056 12679861 12178578
2372 12178578 16020117 22579321 25270008 22846023 19860593 17138673 10840737 1885583
2364 1885583 -3005179 -2079867 -1781711 -6035809 -10336724 -10266351 -8282165 -7573815 -6122903
2355 -6122903 -1785732 2875537 5657049 8730746 12844270 13594734 8959698 4820011
2347 4820011 6859530 11881568 13297181 10616424 7169077 2907865 -3445650 -8709595
2339 -8709595 -8973797 -6455584 -5966577 -6918972 -5332967 -1531783 731904 926253 1246279
2330 1246279 1453877 407711 405109 3302127 4804649 308442 -5554870 -3726652 5916844
2321 5916844 14800748 18937688 22492239 26987584 26829871 19061140 9305689 3731355
2313 3731355 1727408 323073 -546235 -1053424 -3457106 -6759644 -5276867 2839545 11152195
2304 11152195 13777052 13163658 13683426 13039130 7021469 -1378411 -5296165 -3958960 -2006381
2295 -2006381 -554956 3410334 9000180 10398832 5549551 -393223 -2805092 -3693843
2287 -3693843 -7032734 -12023680 -14504863 -12453200 -7010725 -161351 5469514 6222658
2279 6222658 751897 -6273670 -7354785 -484383 7947982 10225180 5567067 -707068
2271 -707068 -4784751 -7863032 -12047568 -16280714 -17990067 -16129682 -10614096 -1443723
2263 -1443723 8770020 14103409 11531122 6447100 7049793 13476010 17750370 15298257
2255 15298257 10783368 10035372 11707305 11424352 9935107 10973433 12968037 9661994
2247 9661994 -2879 -8174429 -7316679 158639 5028603 2426033 -3789645 -7679364
2239 -7679364 -8316339 -8105028 -7016228 -2867148 3094584 5766692 3388953 1107711 3837651
2230 3837651 8786448 9864002 7312444 6841674 9567115 9508825 3129802 -4405098 -6092644
2221 -6092644 -2091449 2022535 2938196 1476896 -1199584 -5148856 -10015817 -14823704
2213 -14823704 -19174345 -22763690 -24386096 -23078911 -19528193 -15167314 -10959957 -7824597
2205 -7824597 -6360168 -5110598 -1497617 3957831 6838670 4246660 -1288993 -5293907
2197 -5293907 -6198542 -4564556 -607502 4233637 5977845 2485311 -2414704 -3042650 940439
2188 940439 4872463 5430897 3060203 -920016 -5777464 -10174391 -12695318 -13388370 -12437538
2179 -12437538 -8568021 -1689582 4498718 6254552 4885190 4315278 5089084 5260321 5703410
2170 5703410 8824905 12506229 11674740 6796667 4605776 8252388 12233190 10062228
2162 10062228 2580052 -4180026 -5502282 -25147 10254096 18936436 18568349 9082215
2154 9082215 -419399 -2138467 1289740 1995439 -2259341 -7460518 -10946806 -13578332
2146 -13578332 -15074672 -13003481 -7500923 -2792920 -2447508 -5641637 -8800735 -8724404 -4067329
2137 -4067329 3655095 10190139 11987744 9836644 7194727 5321542 2645386 -1273362
2129 -1273362 -4329141 -5105689 -4757013 -4591754 -4084178 -2476097 -432748 1163187 2695658
2120 2695658 5149351 8917343 13415021 16628108 15627653 9967645 4324787 4339079 8994642
2111 8994642 10852355 5865902 -639610 -1123269 3832550 6775908 3692978 -1716297
2103 -1716297 -4453801 -4627649 -5703842 -9438882 -14686712 -19122798 -20123014 -15774146
2095 -15774146 -7443079 -193011 1852583 64731 -951218 357126 1156102 -688579
2087 -688579 -3249014 -3623413 -1857467 326251 2784544 6237098 9484311 10502648 10161750
2078 10161750 11725238 15895729 19087499 17957604 13446465 8868304 6015361 4670879
2070 4670879 3767985 1125534 -5434142 -13890433 -17519605 -12802317 -6057901 -6674377 -13926594
2061 -13926594 -16756655 -8527681 3996027 10055598 7994231 3603664 -435862 -6115126
2053 -6115126 -12559407 -14672886 -10836543 -5899131 -4029202 -3669249 -2633187 -3363291 -8405992
2044 -8405992 -13871156 -12989340 -5365803 2041097 3574394 756605 -1461252 -1241635 -890492
2035 -890492 -3088666 -7771019 -12235680 -13597272 -11397392 -7880640 -5383272 -3868677
2027 -3868677 -1637524 2175478 6691073 10169598 10843090 7854716 2843578 -238936
2019 -238936 1226064 5320820 7584043 5948909 2377983 189025 1232978 4851671
2011 4851671 7834136 6546610 1550373 -1024178 3997120 13427809 18511658 15247174
2003 15247174 8133979 3183916 1633542 2061124 3964127 5991979 4276715 -3341809
1995 -3341809 -13255891 -19463806 -19565927 -15155515 -8667719 -2754038 -206936 -787240 -290706
1986 -290706 3269746 4980197 -301449 -8494491 -10228454 -4183772 698723 -1598511
1978 -1598511 -5655791 -3480756 3751523 8802515 9690817 10985181 14614881 15934649
1970 15934649 10666987 1125517 -7052851 -11289630 -12461884 -11184547 -7196525 -2160974
1962 -2160974 -154583 -4016385 -12144885 -19738395 -22944292 -21714309 -19287891 -19254388 -22490004
1953 -22490004 -26285385 -26654251 -21945837 -14097094 -6290212 -103812 4580151 7965586
1945 7965586 10053469 11430540 12650036 12827312 10529202 6336035 2804268 1362023
1937 1362023 997593 701108 1105330 2341888 2204954 -1572602 -8430134 -15995945 -22534384
1928 -22534384 -26511813 -25541840 -18820388 -9852935 -3680212 -1477291 -670647 -227810 -2232248
1919 -2232248 -7062552 -10366830 -7523507 376610 7317382 8646127 5138767 1294793
1911 1294793 927896 4294697 8504216 10475250 9783744 8516195 8289270 8081872 5633679
1902 5633679 604533 -4629384 -7636138 -8464276 -8325343 -6192219 790493 11926273
1894 11926273 20310739 19283868 11179868 5546347 7553721 12207811 12312606 8131844
1886 8131844 5187163 5365261 5267867 2443275 -1322499 -3103817 -1756194 2267917 6915368
1877 6915368 8661084 5990249 2542342 3304536 7751502 10313300 7523290 843031
1869 843031 -7319518 -15445538 -20131740 -17120165 -7616741 940719 3432817 2705474 3769604
1860 3769604 5988033 4680701 -2133956 -12086515 -21442059 -26650937 -25143956 -18143424
1852 -18143424 -11258512 -9050433 -9995431 -9462680 -6359968 -3965602 -5212233 -9935422
1844 -9935422 -16004795 -20560708 -20758642 -15847917 -8439450 -2055715 2101176 4800439
1836 4800439 6632680 7959389 9623603 11700390 12639370 11426924 9431902 8615243 9528694
1827 9528694 12500654 18248778 24906150 27074708 21358826 11180762 2725969 -2321331
1819 -2321331 -6398778 -10082915 -11170178 -9495380 -8178336 -9026170 -9956093 -8214808 -4045674
1810 -4045674 -534785 -1243767 -7388468 -15425772 -18639921 -13940055 -6098423 -2174296
1802 -2174296 -2955499 -3739125 -2280376 -613029 1004681 5677424 13149670 17037725 12841661
1793 12841661 5026168 1615640 3926409 6200789 4602957 2088868 3192715 7012834
1785 7012834 7738131 1560666 -8486674 -15212889 -14363109 -8213132 -2101701 1101651
1777 1101651 1960110 1503819 -117352 -2222035 -3386905 -3460401 -4099774 -6547846 -10161119
1768 -10161119 -13568394 -15833131 -15987839 -13158390 -8365419 -5022474 -5953758 -9808646
1760 -9808646 -11471500 -6947513 1997264 8903196 9203615 4848799 574275 -3297326
1752 -3297326 -10338219 -19619429 -22973654 -14554126 162762 9739784 9452433 4110992
1744 4110992 -257543 -2108899 -1902553 447137 3819201 5552389 4861295 3887513 4079299
1735 4079299 4026943 1872014 -2404530 -7630041 -12133824 -13843525 -12330688 -10382510 -10341208
1726 -10341208 -9512235 -3487565 5993546 11488097 9264776 3584062 5542 -914453
1718 -914453 -1085670 -617546 747977 1261451 -836317 -5243628 -11073239 -17451061 -21697237
1709 -21697237 -21057803 -17632394 -16669687 -17977985 -14835992 -4834572 4243833 4597340
1701 4597340 -529979 -2129124 1976746 6337030 6976303 4663717 818408 -3290858
1693 -3290858 -4040900 1601935 10441808 15566914 14686853 11443352 8937669 7094815 6202739
1684 6202739 7321794 8353532 5141875 -1875838 -6760626 -5611633 -1022379 2530095
1676 2530095 3755556 3338353 1714729 406120 2188150 7348010 12198330 13267595
1668 13267595 10785841 6837769 2986178 1137319 3293079 8089766 10645714 8689747
1660 8689747 6351194 8898680 15829013 22221582 24942551 23911980 18804189 9143589
1652 9143589 -1955157 -8175982 -5971740 2024166 10728127 17498617 21739237 22036060
1644 22036060 17023588 8793287 2313675 150991 -311329 -2881183 -7451879 -11079310
1636 -11079310 -13087636 -15939631 -20696650 -24322672 -22968970 -16328368 -7609723 -604836
1628 -604836 2398358 1589469 -218906 29639 1922020 1809325 -2150424 -7040849 -8611918
1619 -8611918 -5778858 -418731 5009055 7987583 6742353 2898007 987230 2802003
1611 2802003 4688918 3235207 823618 1909234 6432069 11327208 16259403 22491482
1603 22491482 27315306 25436366 16315961 5531832 -1641877 -4168452 -3052304 428812
1595 428812 4237743 7349126 11600903 17634960 20443936 14923586 5108644 664817
1587 664817 3561085 5845890 2362512 -2535021 -4230853 -5432032 -9097697 -11104252
1579 -11104252 -6939720 -143680 3225526 3913812 5535701 5433278 -1277030 -10538738
1571 -10538738 -12092910 -4205016 2973321 1245014 -5624643 -9168864 -7459194 -4529185
1563 -4529185 -2748347 -879777 1976554 4612621 5697084 5071557 3077238 183889
1555 183889 -2546829 -3554458 -1900925 1360804 3118666 929545 -3268471 -3901601 1722210
1546 1722210 8998237 10984022 7115806 3641102 5017720 8179982 6842418 -831474
1538 -831474 -10545464 -16281190 -14932848 -7850127 486363 5557800 5627199 2008331 -2696096
1529 -2696096 -5814588 -5127693 -537562 4448537 5219688 1446293 -1513768 1750533 10425830
1520 10425830 18430540 21376446 20884578 21331430 23603105 23753256 17991365 7579254
1512 7579254 -2148097 -6636983 -4890082 1191385 7790144 10193580 6346032 293458
1504 293458 -1182852 2898314 5717848 1736199 -5397544 -7938041 -4696170 -1500230
1496 -1500230 -1768773 -2142179 1264243 6965214 10951751 12063133 11718925 10648797 8758868
1487 8758868 6862407 6000036 5708347 4766308 2935521 444270 -3276576 -8471440 -13212753
1478 -13212753 -14483722 -11147059 -4832958 1680605 5979761 6834853 5265375 4480308
1470 4480308 7049411 11972503 15701327 15804628 12329229 6273506 -897496 -6236716
1462 -6236716 -6800815 -3418043 -464621 -153330 467181 4377933 9074891 10181428 8938994
1453 8938994 10805788 16351075 19206853 15403796 9718264 8774016 11636102 12192672 8411302
1444 8411302 3792912 751657 -1932022 -4869505 -6287660 -5538807 -4229301 -2802170
1436 -2802170 66258 3623079 4719735 2773325 1059268 1569080 2856885 4711856
1428 4711856 9933365 18505276 24895651 25159320 22445606 21001539 18968366 12724081
1420 12724081 4754152 467990 -557020 -3068806 -7053130 -7591666 -4012545 -1709953
1412 -1709953 -3044101 -3358371 794722 5591938 6529089 6197325 9919145 16503491 19217109
1403 19217109 15326460 9583964 7152947 6912457 4253931 -1401960 -5017481 -2490759
1395 -2490759 3306177 5303198 716877 -5709626 -7692097 -4110366 1758718 6819583
1387 6819583 9063959 6374824 -1224524 -8944443 -11101725 -7877562 -4730628 -4854012
1379 -4854012 -5697725 -3469569 2282204 9257953 14457491 15133082 10924547 5565032 3172451
1370 3172451 2547241 -1013780 -7865626 -12706721 -12438974 -10407099 -10452547 -11372447 -10413465
1361 -10413465 -8145625 -6203866 -3716079 66223 2519651 1047906 -2703945 -5789884
1353 -5789884 -8549701 -12159312 -14192488 -11650504 -6726192 -4201145 -3896952 -1227368
1345 -1227368 4516753 8014995 5819854 1803501 1838891 6099516 9804531 10048954 8895336
1336 8895336 9634576 11962480 12149080 7950520 2229669 130663 2647606 5192325 3753251
1327 3753251 340845 71465 4234463 8817112 9319472 4909224 -1612947 -5901574 -4707012
1318 -4707012 1297547 7390228 9180123 6881148 4038883 3087896 3853463 5134738 5553946
1309 5553946 4020442 1737822 2357549 7166420 11440547 9368136 2023348 -3585766
1301 -3585766 -3481828 -615767 846802 804975 902593 502671 -2263056 -7310139 -12415835
1292 -12415835 -14964671 -13161804 -7516388 -1804861 -154198 -2323166 -4393388 -4676837
1284 -4676837 -5380768 -7119981 -6083419 373234 8890268 14494940 16794007 17737379 16344444
1275 16344444 11351642 7203293 10273698 18398028 21002837 12687500 1226043 -2300218
1267 -2300218 2671100 7458354 6698918 3514629 2370345 2758207 2216727 1306181 2149183
1258 2149183 4339011 5521657 4863414 3238433 858127 -2547977 -5648230 -6433347 -5365449
1249 -5365449 -4981709 -5921344 -5977033 -3895691 -1401208 -91213 1005632 2828683 3717059
1240 3717059 2001868 -878390 -2774280 -4477879 -7375877 -8934156 -5277257 1671102
1232 1671102 4524275 -460051 -8674990 -13747964 -14973640 -15045942 -13889673 -9509566 -3346078
1223 -3346078 252627 92977 -538362 482305 1014511 -950748 -3035274 -1458444 3538736
1214 3538736 7982861 9009092 7266322 5215282 4972329 7076686 9332756 7684250
1206 7684250 757190 -7043359 -10021818 -8654397 -8827977 -12774424 -15113741 -10686034
1198 -10686034 -2619759 1760246 937769 156433 2928241 6630071 7676260 6678754 5945173
1189 5945173 4902416 1256214 -4553229 -8883916 -9054065 -6505875 -5367252 -8193601
1181 -8193601 -13283406 -16561042 -16240311 -14503432 -13847403 -13692358 -12645359 -12151819 -14396787
1172 -14396787 -17605495 -17537245 -13570535 -9242489 -6603738 -4541329 -3167531 -4495038
1164 -4495038 -7150289 -6032733 29619 5684507 7455594 9045902 13696246 17025293
1156 17025293 13970091 8260092 7234325 10212012 10250568 5884544 2548851 2344462 909217
1147 909217 -3812824 -7386134 -6402818 -3705470 -2634905 -1593808 1753766 5341697 5791095
1138 5791095 3343578 331633 -2319719 -4066370 -3184818 569945 4106829 4604306 2866784
1129 2866784 865314 -1425380 -4177807 -5420900 -3710260 -909137 841297 2972997
1121 2972997 7800340 13314740 14585815 10549960 6338990 7600557 13961584 19384436
1113 19384436 18872718 13912548 10138819 9874297 9607565 6269169 2529560 2055597 2487950
1104 2487950 -950171 -6355712 -6796548 -1287950 3492111 4171138 5315018 9560853 11214186
1095 11214186 5659576 -1420929 -1484159 4958791 11129796 14801028 18697159 23040854
1087 23040854 25676054 27827209 31834806 34194598 28985588 18346659 11553727 12362469
1079 12362469 14631717 12530729 8076700 5589671 5037431 4796846 5873054 9161905
1071 9161905 12489554 14253816 16476042 20341079 22033042 17740017 10832385 9181335
1063 9181335 15384391 23139397 23981985 15623008 3305932 -5551064 -7531398 -4893033
1055 -4893033 -2021335 -1208028 -2366423 -5215736 -9369740 -12813557 -13010074 -9855424 -5407953
1046 -5407953 -799404 3903129 6791007 4685207 -2044791 -8265771 -9637590 -7283356
1038 -7283356 -5307787 -5680338 -7348972 -8801685 -9638510 -10322563 -11275484 -11621385 -9266656
1029 -9266656 -4095672 -460217 -3204853 -10873404 -16601229 -16903244 -15505357 -16339207 -17109088
1020 -17109088 -13713940 -7705338 -4189085 -3799243 -2050200 3012997 7113077 5434052
1012 5434052 -1099166 -7437022 -10485051 -11342153 -12142769 -12752163 -11397613 -7724974 -3905182
1003 -3905182 -2183216 -2193201 -1842738 -369218 1118881 2155525 3924450 6773231 8373154
994 8373154 6025801 208602 -5448634 -7586622 -5840757 -2392288 605204 2994680
986 2994680 5897823 9128312 10358667 7706347 2142785 -3914557 -9224993 -13188002
978 -13188002 -14198411 -11513138 -7959609 -7236238 -8548208 -7677671 -3867272 -1437181 -3070648
969 -3070648 -5667936 -5403616 -3201449 -1856167 -832587 1824066 4264954 2233037 -4214254
960 -4214254 -9019710 -6492948 2265426 10076943 10215463 2355391 -7494884 -13225442 -14399342
951 -14399342 -14547165 -14627046 -11586003 -4246997 3093998 5462607 3083698 -75941 -1567490
942 -1567490 -1690037 -1201827 -396762 655910 2688345 6473486 10180616 10119322 6099182
933 6099182 3090006 4911026 9236160 11901175 12907175 14229664 14783419 12436532 8669311
924 8669311 6069422 3128566 -2924365 -9566764 -11237346 -7514257 -3222284 -742443
916 -742443 1760399 4496836 4976271 3508582 3174634 3007727 -1843679 -10973024 -16984701
907 -16984701 -16340088 -14753561 -16879346 -17471815 -9733767 2741951 10526901 11873112
899 11873112 13437390 18641072 23360158 23957201 22302151 20466997 16609775 9794570
891 9794570 4223878 4057922 6771788 6465636 2785141 1851669 7406472 14997219 17714376
882 17714376 15244070 13181110 13820893 12398923 4673355 -5705703 -11525078 -11337883
874 -11337883 -9579431 -8669871 -6884839 -4433432 -5263388 -10334413 -14673150 -14767092 -14066689
865 -14066689 -16636283 -19582284 -17503756 -11613246 -8190579 -9204421 -10335865 -8115473
857 -8115473 -3685470 993774 5831947 10451854 13396358 14661709 15750114 16529264 15233891
848 15233891 11909889 8480220 5390562 2147135 1059483 5220637 11711582 12484612
840 12484612 4637468 -5076901 -9018568 -7172014 -3306666 2183040 9950078 16024889
832 16024889 15486132 10418195 7654398 8650598 7866120 2436792 -2527088 -1364341 3893079
823 3893079 6859759 5939787 5806358 10080190 16038676 18081982 14902019 11314231 12615351
814 12615351 18283379 22662863 21590642 16351787 10556832 5720323 1959729 820104
806 820104 4009739 10024820 15063326 17150496 16938735 15161708 12385425 10656857 11589951
797 11589951 12848170 10663498 6221753 4847292 7773347 9999285 8453312 6526620
789 6526620 6801479 5120370 -2196611 -9841466 -9786117 -3521772 2411 -2133651 -3695202
780 -3695202 -719930 2103492 -170419 -4711295 -5994473 -4119723 -3152182 -4397107 -5707091
771 -5707091 -5112919 -1581505 5317603 13017786 15939825 11801317 5612082 3489979 5046292
762 5046292 6333860 7471061 11157754 15161028 13550667 6280228 949871 2517214
754 2517214 6520295 5851492 330924 -4098048 -3159296 2031353 7470783 9985967 9474457
745 9474457 8979216 11386730 15359428 16585357 13770715 10482664 9566012 8914658 5277013
736 5277013 -472916 -5000753 -7476609 -9560976 -11616276 -12054367 -9979315 -6134898 -1816992
727 -1816992 1345257 1854039 792454 2181773 8029259 14483424 16355840 14371255 13948788
718 13948788 17269488 20964930 22070701 21677133 21178539 19236666 15060864 11160146 9566972
709 9566972 7931014 2960456 -3913548 -7907819 -7055163 -3594891 436193 5400866 11078698
700 11078698 14597405 13268543 7994288 2364121 -851559 -1536323 -1575412 -3152124 -6671418
691 -6671418 -9554235 -8214890 -2326444 4003737 6782164 6755203 7297551 8414591 6269998
682 6269998 -209385 -5602568 -3942576 3389797 9437138 10811412 10841946 12506945 12656823
673 12656823 6912422 -2218394 -6795644 -2887392 5276382 11323207 13417492 13312580
665 13312580 11964115 9186186 6088773 4625775 4926127 5531025 6229720 8130383 10466391
656 10466391 10120462 6104597 2581117 4755773 12065461 17740440 16015547 8601496
648 8601496 2897042 3977650 9172267 11200653 6680303 464823 130370 6482736 11924133
639 11924133 9419224 764341 -6475557 -8293772 -6656300 -3510968 2249918 10047513
631 10047513 14690416 12227670 5930702 2200487 2332390 2842175 2778156 5255699 11020411
622 11020411 15569109 14997126 11037852 7718455 5950396 4265166 2636054 2468394 4021032
613 4021032 6323959 8681801 10285285 9650445 6651205 3835544 3263435 3134792 312660
604 312660 -4574907 -7667382 -7466047 -6810527 -8430065 -11045881 -11365901 -8432362 -4586051
595 -4586051 -2815851 -4062099 -6828134 -8978449 -9849211 -10269212 -10474208 -9184323 -5671118
586 -5671118 -1590767 805173 1594030 2621610 4389136 5236363 3686981 219072 -3451207
577 -3451207 -5847137 -6537737 -6264080 -6072239 -6005135 -5579152 -5738565 -8164346 -11533800
568 -11533800 -11356903 -6150294 -1182212 -2325432 -8075047 -12065901 -12087229 -11216341 -10481200
559 -10481200 -6903917 -572709 2497541 -1639883 -8374832 -10304036 -6479211 -1727154
551 -1727154 1011146 3123245 5857927 7413818 5302826 -316935 -6196076 -8536071
543 -8536071 -6877643 -5461683 -8519510 -14017782 -15668637 -12284446 -10333206 -14086193
535 -14086193 -18140568 -15165726 -7594629 -4861029 -10524875 -18950624 -24496275 -26950603
527 -26950603 -26656442 -21465325 -12193565 -5664607 -7594869 -15572398 -22865777 -26401750
519 -26401750 -27294576 -26298049 -23510160 -21290834 -22748700 -27052462 -29679247 -27718767 -22165229
510 -22165229 -14933700 -6900229 297249 3847601 3248263 2016457 3548420 6590463
502 6590463 7300625 5126708 3763902 5686917 8349383 7734956 4160318 2027969 4112884
493 4112884 8523623 11779712 12483062 10700587 6084122 -941347 -7473259 -10385576 -9830887
484 -9830887 -8048813 -5243617 130521 6745156 9929212 7823357 4918742 6332235
476 6332235 10408831 10715990 5030540 -1307610 -2275783 1181999 2638751 -1672849 -8476039
467 -8476039 -11618014 -8977997 -3880611 -453009 328527 -460749 -2385073 -5219063 -7395522
458 -7395522 -7835668 -8731459 -12977892 -18404466 -18599066 -11496954 -3462940 -1459452 -4075643
449 -4075643 -4833193 -2520177 -2534883 -7741795 -13708794 -15363128 -13792286 -12856755 -12365188
440 -12365188 -9145000 -3420785 353847 -740267 -4799027 -8148482 -8990055 -7323157
432 -7323157 -3830223 -62181 2314630 3786465 6773024 11792200 15589354 14877931 10500212
423 10500212 5730854 1587021 -3416300 -9063613 -11946333 -9352591 -2850834 3331272
415 3331272 6529862 7340358 7936403 9547184 11164295 10507917 7000853 3640499 4365639
406 4365639 9223803 14014250 15535616 15049539 15036096 14792067 11919604 6738599 2151278
397 2151278 -183334 -534640 1388708 5844488 9754551 8257308 1276667 -5053407 -5803380
388 -5803380 -2784828 87056 3389737 9654803 16628938 18788137 15345835 11405463
380 11405463 10134688 8826599 4886456 1035680 897022 2775786 2175170 -1487204 -4965557
371 -4965557 -6730405 -7877986 -7802378 -3762178 4027148 10936041 13562402 13583074 13780094
362 13780094 13400856 10651943 7456021 7789594 12101351 16772194 18862633 18421441 16307956
353 16307956 12966656 9702997 7961656 6526736 2635018 -2868459 -4891674 -870018
345 -870018 4840022 6499315 4617162 4152551 6397823 7207188 3768569 -931028 -2248417
336 -2248417 305630 3609958 5452423 6161610 6657361 7136651 7722927 8739611 9773010
327 9773010 9451440 6932445 3317455 917859 899155 2105557 2768114 3013213 4520692
318 4520692 7511254 9609469 8800324 6351828 5313534 6922515 10053774 13354070 15806908
309 15806908 15682686 11529139 4652020 -1479252 -4850378 -6137059 -6142981 -4385190 -957697
300 -957697 2580545 5292789 7657619 9234637 8176694 4744041 2564602 3851810 5648653
291 5648653 3911834 -405745 -2818050 -1749218 148942 700817 518317 310034 -578038
282 -578038 -1929720 -2017340 -554425 276800 -819540 -2268669 -2635364 -3240595 -5428758
273 -5428758 -6990121 -4259756 2638821 9130115 11204117 9536838 8059153 9405178
265 9405178 12344995 13266004 9784997 3009457 -3488010 -6658290 -5997048 -3348489 -1390285
256 -1390285 -1795689 -3900659 -5369602 -4940334 -3960498 -4143089 -4668218 -3368571 -264195
247 -264195 2395283 3482191 3778795 3289066 1026356 -1502694 -186794 5953931 11803737
238 11803737 11891186 6880259 1224306 -3399537 -8080161 -11407255 -9399557 -1613583 6761632
229 6761632 10723329 10593656 9862935 10502437 12150812 13677037 13482316 9955022 3775997
220 3775997 -1349420 -2268180 -108369 1111495 -859241 -4503496 -6826070 -6615588 -5573563
211 -5573563 -6507050 -9796666 -11883313 -9050299 -3023157 -175319 -3615167 -8679395 -8978217
202 -8978217 -4783449 -1702791 -2234552 -3199365 -1923402 -297671 -503321 -472037 2800441
193 2800441 7440005 8106703 2989632 -3704508 -6816686 -5418239 -2033259 1216140 3898503
184 3898503 5700532 5641502 3409363 496448 -857319 230256 2705152 5094927 6978035
175 6978035 8527287 9258110 8448717 6951896 7257453 10658239 14964878 16368885 13696468
166 13696468 9751292 7977240 8652606 9224169 7893612 5640062 4428500 4538159 4685395
157 4685395 4252620 3951900 3981710 2901442 -541925 -5148005 -8065423 -7717601 -4970697
148 -4970697 -1552392 1600825 4357830 6808286 8909358 9929038 8339460 3474781
140 3474781 -2568102 -6064631 -5191634 -1324959 3299106 7487077 10224609 10282014 8228361
131 8228361 6839541 7353780 6888102 2190518 -5014732 -9241347 -7461167 -1565343 4994880
122 4994880 9967687 11553789 8511155 2721041 -905674 767744 5780178 9970816
114 9970816 11652426 11875566 11591192 10607022 8690448 6107963 3380479 1304023 339429
105 339429 -764240 -4307462 -10315298 -15260434 -15808841 -12798707 -9753898 -8377716 -7431596
96 -7431596 -5374084 -2082966 1673201 4557839 4648686 926698 -5124786 -10740910 -14413548
87 -14413548 -15912756 -14658139 -10349289 -5028387 -2021513 -2096016 -2408282 12641 5020068
78 5020068 9959226 12207330 10775494 6681657 2239155 -786067 -2299131 -2621234 -1210910
69 -1210910 1780745 3802269 2256382 -1853639 -5159842 -6507561 -7483229 -8568233 -8240344
60 -8240344 -6483659 -5599090 -6198579 -5706881 -2523517 1461742 4358591 7002338 9827653
51 9827653 10317185 6804151 2204416 446294 1213290 1668122 1407249 1825745 2174258
42 2174258 573267 -1929090 -2670013 -2414061 -4662716 -9503369 -12358439 -10104178 -4994003
33 -4994003 -1098148 235679 -19411 -880728 -1699245 -2100823 -2657659 -3939760 -4485636
24 -4485636 -1903170 3504387 8483695 10631694 10101859 7526204 3554846 991682 3342394
15 3342394 9383493 12757255 9525858 3310218 444746 2742526 7677294 12795993 16388347
6 16388347 16052511 10826482 3888589 -389698 -1567965 -2326924
0 -2326924
$$ Imaginary data points
##PAGE= N=2
##DATA TABLE= (X++(I..I)), XYDATA
65535 840007 1094175 -1358906 -4663846 -6501725 -6895319 -6900692 -6533941 -5539347 -4671586
65526 -4671586 -4664939 -4827207 -3840795 -1547690 606538 652178 -2148376 -5980357 -7518067
65517 -7518067 -5386119 -1967546 -582198 -1850858 -4414914 -7780390 -11764935 -14178756
65509 -14178756 -12592612 -8434375 -5920731 -6378750 -6930560 -5681433 -4749072 -6454364
65501 -6454364 -9449072 -10732826 -9366984 -6424832 -3239999 -1223261 -1352732 -2438795
65493 -2438795 -2167798 -1198561 -3296011 -9374272 -14566618 -14298567 -10679623 -9161360 -10708536
65484 -10708536 -11349964 -8546209 -3995017 -236776 1973374 2617126 1876239 1187878 2133651
65475 2133651 3694476 3055175 -260674 -3336781 -3584466 -1488520 772610 1241258 -1658359
65466 -1658359 -8072611 -14565194 -15655907 -9841541 -2621996 -1115285 -6090029 -11321625
65458 -11321625 -10967383 -5830522 -1401807 -896272 -2147322 -1703412 66644 1901 -2861810
65449 -2861810 -6461326 -9958358 -14996985 -21009039 -23135957 -18350066 -10875705 -7242862
65441 -7242862 -7864731 -8277134 -7251525 -7684248 -9337816 -7243066 330354 7752503 9283054
65432 9283054 6246267 3413765 2005654 493889 -698527 -234325 99402 -2825022
65424 -2825022 -8194750 -11795902 -11693168 -9912033 -8591462 -7808842 -7333739 -7405341 -7498598
65415 -7498598 -7111490 -7691375 -10626775 -13454409 -12044382 -7308558 -5454801 -9626115
65407 -9626115 -15214038 -16402577 -14024686 -13026496 -14470666 -14791294 -12369584 -10214762
65399 -10214762 -11040535 -13229098 -13551096 -11466584 -8708456 -6351515 -4578161 -4398554
65391 -4398554 -7160362 -12121578 -16206492 -16887519 -14565368 -11813374 -10875017 -11913339
65383 -11913339 -12950556 -11559210 -7591960 -4223426 -4852638 -8547929 -10330025 -7249304
65375 -7249304 -2641971 -2350509 -7664663 -14349234 -18150459 -18383112 -15793093 -10336613
65367 -10336613 -3159857 1756514 1131970 -3192249 -6079117 -5313261 -3680801 -4519351
65359 -4519351 -7507049 -10040140 -10999165 -11213926 -10846932 -8349968 -2691530 4443142 9667622
65350 9667622 10900565 8724865 4948797 759676 -3379492 -6964164 -9552900 -11295909
65342 -11295909 -12528681 -13039634 -12435287 -10908528 -8929457 -6758846 -5232522 -6062469
65334 -6062469 -9491029 -12213447 -10185845 -3910653 1418804 1886972 -1161804 -4073717
65326 -4073717 -5489025 -6365547 -7358048 -8253294 -8899834 -9115301 -8695230 -8581274 -10356224
65317 -10356224 -13231118 -13585033 -9495145 -3854978 -689926 -124431 437851 1871572
65309 1871572 3080647 3731366 3957973 2518689 -1333037 -5253869 -6860488 -8278504
65301 -8278504 -13078615 -19235112 -20565596 -15891606 -11156113 -10440353 -10340472 -6717268 -2304843
65292 -2304843 -2677454 -7511431 -11001401 -9800457 -6068115 -2968551 -1272682 -1057675
65284 -1057675 -3194838 -7313252 -10381394 -9540089 -6043695 -4884633 -9583094 -17502077
65276 -17502077 -21501474 -17270982 -8329197 -2375121 -3354558 -8970455 -15115401 -19535387
65268 -19535387 -20904623 -18020106 -11709362 -4881040 1003064 7029828 12944524 15318664
65260 15318664 12137558 6567090 3146445 2217899 1021713 -1583035 -4653975 -7897498
65252 -7897498 -11692896 -15506347 -19013542 -23283671 -27864931 -28607768 -22448948 -13210372
65244 -13210372 -8161663 -8961740 -10168244 -7076752 -1150219 3087383 3118633 -417629
65236 -417629 -4575183 -5527419 -2195421 1260777 61025 -3765563 -2829776 5551678 15183601
65227 15183601 19050379 17351020 14455270 11654618 7193316 1146645 -4228607 -8113974
65219 -8113974 -11276886 -12877023 -10620390 -4738207 761533 1925819 -1280335 -5350406
65211 -5350406 -6622006 -4412959 -1671404 -2194517 -6355437 -10129898 -9325041 -4136226
65203 -4136226 1610226 5045681 6576180 7852583 8993834 8396352 4636204 -1868445
65195 -1868445 -8967736 -14422946 -17198572 -17028907 -13774202 -8639499 -5267262 -6940438
65187 -6940438 -11959949 -14203824 -9855618 -1878742 3732483 4482461 2380703 135307
65179 135307 -1155049 -1452629 -1469447 -2589849 -4977823 -6137270 -3653986 763427 2512653
65170 2512653 -99170 -3489649 -3159550 1285391 6294507 7938912 4537963 -2351874
65162 -2351874 -8182639 -8454817 -3661637 -42323 -2794955 -8910414 -9791846 -1955646
65154 -1955646 7610437 8989670 552430 -10106245 -15566676 -15464613 -13433197 -10931378
65146 -10931378 -6940923 -1718626 2773075 5993902 9355097 12882708 13781995 9842631
$$ [...]
##END NTUPLES=NMR SPECTRUM
##END=
