##TITLE=31Pdec_DE-91_3_
 CDCl3, 64 sc
 18.4.2025
##JCAMPDX= 6.0         $$ Bruker NMR JCAMP-DX V2.0
##DATA TYPE= NMR SPECTRUM
##DATA CLASS= NTUPLES
##ORIGIN= UXNMR, Bruker Analytische Messtechnik GmbH
##OWNER= root
$$ XWIN-NMR		Version 3.5
$$ Fri Apr 18 14:55:28 2025 Russian Standard Time (UT+4h)  she@DPX200
##.OBSERVE FREQUENCY= 81.013821
##.OBSERVE NUCLEUS= ^31P
##.ACQUISITION MODE= SIMULTANEOUS
##.ACQUISITION SCHEME= undefined
##.AVERAGES= 64
##.DIGITISER RES= 17
##SPECTROMETER/DATA SYSTEM= spect
##.PULSE SEQUENCE= zgpg30
##.SOLVENT NAME= CDCl3
##.SHIFT REFERENCE= (INTERNAL, CDCl3, 0, 198.062)
##AUDIT TRAIL= $$ (NUMBER, WHEN, WHO, WHERE, WHAT)
$$ ##TITLE= Audit trail, XWIN-NMR		Version 3.5
$$ ##JCAMPDX= 5.01
$$ ##ORIGIN= Bruker BioSpin GmbH
$$ ##OWNER= she
$$ F:/spectra/data/she/nmr/P31/2/pdata/1/auditp.txt
$$ ##AUDIT TRAIL=  $$ (NUMBER, WHEN, WHO, WHERE, WHAT)
(   1,<2025-04-18 14:54:00.59 +0400>,<she>,<DPX200>,
      <created by zg, POWCHK disabled, PULCHK disabled
       configuration hash MD5:
       00 E9 B6 7A A2 85 ED C7 34 08 36 98 17 FE 4E 26
       data hash MD5: 32K
       83 6B 8F 07 93 31 DB 27 22 6D 8E 2D 06 84 2E FB>)
(   2,<2025-04-18 14:54:03.10 +0400>,<she>,<DPX200>,
      <Start of raw data processing
       efp BC_mod = 2 LB = 1.5 FT_mod = 6 PKNL = 1 PHC0 = 1259.905 PHC1 = 522.2943 SI = 64K 
       data hash MD5: 64K
       3E DE 18 CE 01 73 88 69 BB BC AB 70 B4 F5 1C 3D>)
(   3,<2025-04-18 14:54:18.75 +0400>,<she>,<DPX200>,
      <pk PHC0 = -3.466265 PHC1 = 0 
       data hash MD5: 64K
       60 45 59 A2 37 87 03 E4 9C 7C 9F 58 B4 9A A6 40>)
(   4,<2025-04-18 14:54:25.96 +0400>,<she>,<DPX200>,
      <abs ABSG = 5 
       data hash MD5: 64K
       79 70 0E 2B F8 68 FA C6 37 AB E4 4E D9 E3 ED 79>)
(   5,<2025-04-18 14:54:45.46 +0400>,<she>,<DPX200>,
      <pk PHC0 = -10.20711 PHC1 = 0 
       data hash MD5: 64K
       4A 53 5C FA 5C 09 D4 41 C1 34 6A 41 C7 D9 E7 EE>)
$$ ##END=
$$ 
$$ hash MD5
$$ C7 99 0F 04 91 9C D9 95 1D B0 A7 8A 55 2C BA D2
##$RELAX= 
##$RELAX= 
##$RELAX= 
##$RELAX= 
##$RELAX= 
##$RELAX= 
##$RELAX= 
##$RELAX= 
$$ Bruker specific parameters
$$ --------------------------
##$DU= <F:/spectra>
##$EXPNO= 2
##$NAME= <P31>
##$PROCNO= 1
##$TYPE= <nmr>
##$USER= <she>
##$AMP= (0..31)
100 100 100 100 100 100 100 100 100 100 100 100 100 100 100 100 100 100 
100 100 100 100 100 100 100 100 100 100 100 100 100 100 
##$AQSEQ= 0
##$AQ_mod= 1
##$AUNM= <au_zg>
##$AUTOPOS= <>
##$BF1= 81.014009
##$BF2= 200.13
##$BF3= 200.13
##$BF4= 200.13
##$BF5= 200.13
##$BF6= 200.13
##$BF7= 200.13
##$BF8= 200.13
##$BYTORDA= 1
##$CFDGTYP= 0
##$CFRGTYP= 5
##$CHEMSTR= <none>
##$CNST= (0..31)
1 1 145 1 1 1 1 1 1 1 1 1 1 1 1 1 1 1 1 1 1 1 1 1 1 1 1 1 1 1 1 1 
##$CPDPRG= <waltz16>
##$CPDPRG1= <>
##$CPDPRG2= <waltz16>
##$CPDPRG3= <>
##$CPDPRG4= <mlev>
##$CPDPRG5= <mlev>
##$CPDPRG6= <mlev>
##$CPDPRG7= <mlev>
##$CPDPRG8= <mlev>
##$CPDPRGB= <>
##$CPDPRGT= <>
##$D= (0..31)
0 1 0 0 0 0 0 0 0 0.06 0 0.03 2e-05 3e-06 0 0 0.0002 0 0 0 0 0 0 0 0 0 
$$ [...]
##$SUBNAM3= <"">
##$SUBNAM4= <"">
##$SUBNAM5= <"">
##$SUBNAM6= <"">
##$SUBNAM7= <"">
##$SUBNAM8= <"">
##$SUBNAM9= <"">
##$SW= 400.765351723535
##$SWIBOX= (0..15)
0 1 3 0 0 0 0 0 0 0 0 0 0 0 0 0 
##$SW_h= 32467.5324675325
##$TD= 32768
##$TD0= 1
##$TE= 0
##$TE2= 300
##$TE3= 300
##$TEG= 300
##$TL= (0..7)
0 120 53 12 22 120 120 120 
##$TP= (0..7)
150 150 150 150 150 150 150 150 
##$TP07= 0
##$TPNAME0= <>
##$TPNAME1= <>
##$TPNAME2= <>
##$TPNAME3= <>
##$TPNAME4= <>
##$TPNAME5= <>
##$TPNAME6= <>
##$TPNAME7= <>
##$TPOAL= (0..7)
0.5 0.5 0.5 0.5 0.5 0.5 0.5 0.5 
##$TPOFFS= (0..7)
0 0 0 0 0 0 0 0 
##$TUNHIN= 0
##$TUNHOUT= 0
##$TUNXOUT= 0
##$USERA1= <user>
##$USERA2= <user>
##$USERA3= <user>
##$USERA4= <user>
##$USERA5= <user>
##$V9= 5
##$VALIST= <valist>
##$VCLIST= <CCCCCCCCCCCCCCC>
##$VD= 0
##$VDLIST= <DDDDDDDDDDDDDDD>
##$VPLIST= <PPPPPPPPPPPPPPP>
##$VTLIST= <TTTTTTTTTTTTTTT>
##$WBST= 1024
##$WBSW= 4
##$XGAIN= (0..3)
0 0 0 0 
##$XL= 0
##$YL= 0
##$YMAX_a= 5564
##$YMIN_a= -22445
##$ZGOPTNS= <>
##$ZL1= 120
##$ZL2= 120
##$ZL3= 120
##$ZL4= 120
##$ABSF1= 198.0616
##$ABSF2= -202.7028
##$ABSG= 5
##$ABSL= 3
##$ALPHA= 0
##$AQORDER= 0
##$ASSFAC= 0
##$ASSFACI= 0
##$ASSFACX= 0
##$ASSWID= 0
##$AUNMP= <proc_1d>
##$AZFE= 0.1
##$AZFW= 0.5
##$BCFW= 0
##$BC_mod= 2
##$BYTORDP= 0
##$COROFFS= 0
##$CY= -3
##$DATMOD= 1
##$DC= 0
##$DFILT= <>
##$DTYPP= 0
##$F1P= 0
##$F2P= 0
##$FCOR= 1
##$FTSIZE= 65536
##$FT_mod= 6
##$GAMMA= 0
##$GB= 0
##$INTBC= 1
##$INTSCL= 9.790993e-09
##$ISEN= 30
##$LB= 1.5
##$LEV0= 0
##$LPBIN= 0
##$MAXI= 10000
##$MC2= 0
##$MEAN= 0
##$ME_mod= 0
##$MI= 50
##$NCOEF= 0
##$NC_proc= -8
##$NLEV= 6
##$NOISF1= 182.463
##$NOISF2= 159.3651
##$NSP= 0
##$NTH_PI= 0
##$NZP= 0
##$OFFSET= 198.0616
##$PC= 4
##$PHC0= 1246.232
##$PHC1= 522.2943
##$PH_mod= 1
##$PKNL= yes
##$PPARMOD= 0
##$PSCAL= 0
##$PSIGN= 0
##$REVERSE= no
##$SF= 81.0140089999434
##$SI= 65536
##$SIGF1= 159.3651
##$SIGF2= -187.1042
##$SINO= 113.3802
##$SIOLD= 16384
##$SREGLST= <1H.CDCl3>
##$SSB= 0
##$STSI= 65536
##$STSR= 0
##$SW_p= 32467.5324675325
##$SYMM= 0
##$S_DEV= 0
##$TDeff= 32768
##$TDoff= 0
##$TI= <>
##$TILT= no
##$TM1= 0
##$TM2= 0
##$TOPLEV= 0
##$USERP1= <user>
##$USERP2= <user>
##$USERP3= <user>
##$USERP4= <user>
##$USERP5= <user>
##$WDW= 1
##$XDIM= 65536
##$YMAX_p= 135940350
##$YMIN_p= -282929119
$$ End of Bruker specific parameters
$$ ---------------------------------
##NTUPLES= NMR SPECTRUM
##VAR_NAME=  FREQUENCY,     SPECTRUM/REAL,   SPECTRUM/IMAG
##SYMBOL=    X,             R,               I
##VAR_TYPE=  INDEPENDENT,   DEPENDENT,       DEPENDENT
##VAR_FORM=  AFFN,          ASDF,            ASDF
##VAR_DIM=   65536,         65536,           65536
##UNITS=     HZ,            ARBITRARY UNITS, ARBITRARY UNITS
##FACTOR=    0.49542278885378, 1,            1
##FIRST=     16045.7642231865, 0,            0
##LAST=      -16421.768244346, 0,            0
##MIN=       -16421.768244346, -282929119,   0
##MAX=       16045.7642231865, 135940350,    0
$$ Real data points
##PAGE= N=1
##DATA TABLE= (X++(R..R)), XYDATA
$$ [...]
$$ plain form
7502 -432892 863187 3174481 4711463 3789522 1158565 157698 2857238 6732385 7471254
7493 7471254 4739968 2256776 1873681 1109283 -1888963 -4337538 -2662484 2013553 5630121
7484 5630121 7025994 8419537 10530598 10823095 7346010 1669739 -3003528 -4776982
7476 -4776982 -3477117 -119665 3055583 3647690 1460005 -1032697 -1321343 726298 3364264
7467 3364264 4872541 4632599 3377945 2817707 4042306 5912831 6023869 3664773 776583
7458 776583 -543296 -397998 -157652 -79006 922741 3209724 5059271 4022853 -247790
7449 -247790 -4972835 -6751050 -5080489 -2474835 -986275 -69514 1495110 3411794 5029387
7440 5029387 6884851 8932945 8791666 4655862 -947322 -3584958 -2850874 -2467765 -4188384
$$ packed form
7502d32892J296079K311294J536982r21941k630957j000867K699540L875147P38869
7493G471254k731286k483192l83095p64398k998246k448575J675054M676037L616568
7484E630121J395873J393543K111061K92497l477085n676271m673267j773454
7476d776982J299865L357452L175248N92107k187685k492702k88646K047641K637966
7467C364264J508277k39942j254654n60238J224599J870525J11038k359096k888190
7458G76583j319879J45298K40346P8646J001747K286983J849547j036418m270643
7449b47790m725045j778215J670561K605654J488560R16761J564624J916684J617593
7440E029387J855464K048094j41279m135804n603184k637636P34084L83109j720619
$$ plain form
7431 -4188384 -5305625 -3519437 -814423 -216183 -1252286 -1279017 273398 1449456 703032
7422 703032 -1632843 -4242974 -5825929 -5789144 -4906414 -4472335 -4144907 -1956449 2626902
7413 2626902 7182204 9144195 8828082 8291955 8349857 8099941 6490505 3175367 -1318735
7404 -1318735 -5398507 -7427631 -7600341 -7433682 -6975336 -4677481 -921516 1057951 -421849
7395 -421849 -2707105 -2797996 -1790361 -2396257 -3977597 -3574201 -818815 1632365 2167010
7386 2167010 1635419 870241 -349133 -1713841 -2187037 -1561534 -357510 1417847 3434798
7377 3434798 3828580 1350622 -1992232 -3169820 -2218006 -1031932 959286 5760374 11521107
7368 11521107 12946425 8356177 2365471 -322113 -270928 -358698 -899963 -664984 -211179
$$ packed form
7431d188384j117241J786188K705014N98240j036103k6731J552415J176058p46424
7422G03032k335875k610131j582955L6785Q82730M34079L27428K188458M583351
7413B626902M555302J961991l16113n36127N7902k49916j609436l315138m494102
7404a318735m079772k029124j72710J66659M58346K297855L755965J979467j479800
7395d21849k285256r0891J007635o05896j581340M03396K755386K451180N34645
7386B167010n31591p65178j219374j364708m73196O25503J204024J775357K016951
7377C434798L93782k477958l342854j177588R51814J186074J991218M801088N760733
7368A1521107J425318m590248n990706k687584N1185q7770n41265K34979M53805
$$ plain form
7359 -211179 -934706 -2245270 -2454628 -1494144 -477864 450908 1634678 2123462 650498
7350 650498 -2004509 -3578459 -3117835 -1699678 -597850 -147183 -266026 -723026 -715765
7341 -715765 795384 3910210 7227859 8602875 6780208 2859376 -221792 -778590 -684211
7332 -684211 -2923313 -6835661 -8088451 -4300614 1466875 4398273 3416734 1212442 101756
7323 101756 -144220 -1041379 -3690937 -7939879 -11943001 -13061019 -10369487 -5769840 -1671230
7314 -1671230 1574677 4757831 7282601 7232707 3756119 -1757919 -6696474 -8722305 -6907044
7305 -6907044 -2348605 2660729 6574015 9187307 10450072 10323883 10178854 12042210 15228036
7296 15228036 16036130 12714426 8525018 7321917 8007616 6651847 2842149 121325
$$ packed form
7359b11179p23527j310564k09358R60484J016280R28772J183770M88784j472964
7350F50498k655007j573950M60624J418157J101828M50667j18843m57000P261
7341g15765J511149L114826L317649J375016j822667l920832l081168n56798R4379
7332f84211k239102l912348j252790L787837N767489K931398r81539k204292j110686
7323A01756k45976q97159k649558m248942m003122j118018K691532M599647M098610
7314a671230L245907L183154K524770m9894l476588n514038m938555k025831J815261
7305f907044M558439N009334L913286K613292J262765j26189j45029J863356L185826
7296A5228036Q08094l321704m189408j203101O85699j355769l809698k720824
$$ plain form
7288 121325 278768 840858 -982363 -4731145 -8089359 -9563936 -8848643 -6526177 -4344421
7279 -4344421 -4073550 -5245770 -5489565 -3648530 -1024827 876079 2045198 2825910 2883375
7270 2883375 2167907 1408461 937375 430566 253588 1338265 3124474 3442468 1207846
7261 1207846 -2451844 -6211183 -9455932 -10572118 -7399296 -1249851 2340868 -225195
7253 -225195 -5524509 -7204525 -3878875 269719 2024418 2671290 4527926 7045648 7851054
7244 7851054 5861572 2059418 -1768993 -4208630 -4910752 -4611943 -3933759 -2381830 428747
7235 428747 2955283 2871676 192257 -2512952 -3502022 -3659868 -4090539 -3786582 -1290856
7226 -1290856 2532419 5227808 5840870 5805800 6789033 8719100 10064160 9446723 7041329
$$ packed form
7288A21325J57443N62090j823221l748782l358214j474577P15293K322466K181756
7279d344421K70871j172220k43795J841035K623703J900906J169119P80712N7465
7270B883375p15468p59446m71086n06809j76978J084677J786209L17994k234622
7261A207846l659690l759339l244749j116186L172822O149445L590719k566063
7253b25195n299314j680016L325650M148594J754699O46872J856636K517722Q05406
7244G851054j989482l802154l828411k439637p02122K98809O78184J551929K810577
7235D28747K526536q3607k679419k705209r89070j57846m30671L03957K495726
7226a290856L823275K695389O13062l5070R83233J930067J345060o17437k405394
$$ plain form
7217 7041329 4680765 4104871 4743799 4062590 747816 -3472568 -6198806 -7379038 -8315061
7208 -8315061 -8631287 -6678001 -2901375 -272886 -530357 -2054183 -2586243 -2164539 -1887875
7199 -1887875 -1499840 -249199 954769 456349 -1560440 -3356771 -4181355 -4574028 -4362170
7190 -4362170 -2631917 -10391 1361498 1146988 2090424 6360176 11914949 14333006 11792207
7181 11792207 6783238 2957729 1399978 305531 -2213851 -5461794 -6657660 -4391647
7173 -4391647 -931953 128245 -1688950 -3350809 -2715054 -1377969 -1961265 -4230315 -5679799
7164 -5679799 -4935949 -2721932 -54066 2667160 4938907 6137073 6317900 5931651 4945504
7155 4945504 3335061 1926103 1290655 284985 -2488790 -5970484 -7469973 -6405085
$$ packed form
7217G041329k360564n75894O38928o81209l314774m220384k726238j180232r36023
7208h315061l16226J953286L776626K628489k57471j523826n32060M21704K76664
7199a887875L88035J250641J203968m98420k016789j796331q24584l92673K11858
7190d362170J730253K621526J371889k14510R43436M269752N554773K418057k540799
7181A1792207n008969l825509j557751j094447k519382l247943j195866K266013
7173d391647L459694J060198j817195j661859O35755J337085n83296k269050j449484
7164e679799P43850K214017K667866K721226K271747J198166J80827l86249r86147
7155D945504j610443j408958o35448j005670k773775l481694j499489J064888
$$ plain form
7147 -6405085 -4999608 -4546885 -3230661 853609 6265102 9785168 10471528 10202623 10529582
7138 10529582 10792196 9619795 6950679 3967978 1776900 654126 225952 34803 36180
7129 36180 584307 1835797 3375936 4734966 6033461 7563359 8762874 8314558 5689533
7120 5689533 2185306 -138621 -392988 852014 3029027 6231883 9907677 12022373
7112 12022373 10915461 7589708 4648407 2917603 711930 -3134552 -7235443 -9650528
7104 -9650528 -10418365 -10706485 -10663813 -9815921 -8698680 -8164760 -7539325 -5462320 -2484671
7095 -2484671 -859985 -1425193 -2436891 -2101217 -789516 -25283 -484145 -1757489 -3124865
7086 -3124865 -3822261 -3301802 -1906023 -804948 -860764 -1941384 -3413873 -4731613 -5549962
$$ packed form
7147f405085J405477M52723J316224M084270N411493L520066O86360k68905L26959
7138A0529582K62614j172401k669116k982701k191078j122774m28174j91149J377
7129C6180N48127J251490J540139J359030J298495J529898J199515m48316k625025
7120E689533l504227k323927k54367J245002K177013L202856L675794K114696
7112A2022373j106912l325753k941301j730804k205673l846482m100891k415085
7104i650528p67837k88120M2672Q47892J117241N33920O25435K077005K977649
7095b484671J624686n65208j011698L35674J311701P64233m58862j273344j367376
7086c124865o97396N20459J395779J101075n5816j080620j472489j317740q18349
$$ plain form
7077 -5549962 -5934712 -6398722 -7103199 -7342469 -6604362 -5561219 -4892901 -3897106 -1935772
7068 -1935772 -564007 -1911465 -5127074 -7008758 -6472001 -5680185 -6008613 -5861989 -4037527
7059 -4037527 -2413418 -2846181 -3487276 -1076596 4200603 8770862 10021564 8408611 5741081
7050 5741081 3551300 2953731 4038982 5223017 4816565 3362835 2970652 4250694 5369882
7041 5369882 4453352 1742391 -1005584 -2387199 -2302988 -1608769 -1025320 -300080 1160650
7032 1160650 2801898 3156461 2044456 1086387 989212 -54926 -3471070 -7184584 -7906369
7023 -7906369 -5898791 -4709876 -5957087 -6995378 -4832090 -438022 2312200 1057143
7015 1057143 -2827744 -6012545 -6526216 -5352824 -4832955 -5586149 -5849328 -4389539 -2783120
$$ packed form
7077e549962l84750m64010p04477k39270P38107J043143O68318R95795J961334
7068a935772J371765j347458l215609j881684N36757P91816l28428J46624J824462
7059d037527J624109m32763o41095K410680N277199M570259J250702j612953k667530
7050E741081k189781n97569J085251J184035m06452j453730l92183J280042J119188
7041E369882r16530k710961k747975j381615Q4211O94219N83449P25240J460730
7032A160650J641248L54563j112005r58069r7175j044138l416144l713514p21785
7023g906369K007578J188915j247211j038291K163288M394068K750222j255057
7015A057143l884887l184801n13671J173392N19869p53194k63179J459789J606419
$$ plain form
7006 -2783120 -3275522 -5294965 -6177494 -5036134 -3688494 -3568079 -3920664 -3695964 -3192876
6997 -3192876 -2832161 -2073038 -853132 -721353 -3026234 -6722004 -9212291 -9021985 -6935886
6988 -6935886 -4957782 -4577927 -5398515 -5124643 -1798997 3549350 7474394 7773370 5478795
6979 5478795 2797109 655399 -699828 -319791 2372656 5966800 8341111 9172829 9573718
6970 9573718 9586946 7922565 4323191 388021 -2503897 -4445012 -5352963 -3815934 719917
6961 719917 5686443 7555611 6282952 5578681 8030891 11634570 12414889 9263952 4617511
6952 4617511 1195772 -93356 488277 2039071 2689710 813529 -2760614 -5467231 -6467009
6943 -6467009 -7315798 -8386977 -7335951 -3128236 765426 191129 -3976955 -6996029 -6441286
$$ packed form
7006b783120m92402k019443q82529J141360J347640J20415l52585K24700N03088
6997c192876L60715P59123J219906J31779k304881l695770k490287J90306K086099
6988f935886J978104L79855q20588K73872L325646N348347L925044K98976k294575
6979E478795k681686k141710j355227L80037K692447L594144K374311Q31718M00889
6970I573718J3228j664381l599374l935170k891918j941115r07951J537029M535851
6961G19917M966526J869168j272659p04271K452210L603679P80319l150937m646441
6952D617511l421739j289128N81633J550794O50639j876181l574143k706617r99778
6943f467009q48789j071179J051026M207715L893662n74297m168084l019074N54743
$$ plain form
6934 -6441286 -4210338 -2591537 -1471924 -3108 1614977 2894139 3568151 2797463 -52311
6925 -52311 -3335360 -4091532 -1856087 623480 1234867 826518 836564 1112149 1442715 2826772
6915 2826772 5381831 7079666 6580100 5483582 5580477 5525930 2811575 -2040010 -5793805
6906 -5793805 -6466043 -4828212 -2478512 -545585 8766 -1046193 -2159399 -1174434 2135380
6897 2135380 5758646 7578609 6960157 4796885 3096729 3798048 6604957 8608024 7462830
6888 7462830 4282468 1903100 1132168 578913 -521685 -1518211 -1995664 -2004347 -873743
6879 -873743 1863098 4447600 4401419 2343923 1559657 3038698 3857230 1892497 -727966
6870 -727966 -1186377 -623167 -2097311 -5201462 -6193850 -3516484 -76647 933850 24581
$$ packed form
6934f441286K230948J618801J119613J468816J618085J279162O74012p70688k849774
6925e2311l283049p56172K235445K479567O11387m08349J0046K75585L30566J384057
6915B826772K555059J697835m99566j096518R6895n4547k714355m851585l753795
6906e793805o72238J637831K349700J932927N54351j054959j113206R84965L309814
6897B135380L623266J819963o18452k163272j700156P01319K806909K003067j145194
6888G462830l180362k379368p70932n53255j100598r96526m77453q683J130604
6879h73743K736841K584502m6181k057496p84266J479041Q18532j964733k620463
6870g27966m58411N63210j474144l104151r92388K677366L439837J010497r09269
$$ plain form
6861 24581 -345172 347926 717032 477849 1002583 2579684 3208944 1360379 -1368523
6852 -1368523 -1985008 37418 2278318 2773995 2301326 2690343 4174015 5372168 5107021
6843 5107021 3402744 1349260 687233 2704895 6558266 9336858 8916504 6355891 4449182
6834 4449182 4291034 4398855 3014082 88032 -3100777 -5318165 -6115600 -5895383 -5509733
6825 -5509733 -5478719 -5588166 -5375113 -4644848 -3345850 -1606793 -245723 -397573 -2065097
6816 -2065097 -3862557 -4743411 -4981367 -4908374 -4124430 -2836128 -2237260 -2233784 -816665 2276153
6806 2276153 3452053 -27763 -4804899 -4885511 165713 4732154 5273496 4610371 6533175
6797 6533175 10107117 11977034 11321396 9452805 6661741 2730736 -702378 -1509920 -408743
$$ packed form
6861B4581l69753O93098L69106k39183N24734J577101O29260j848565k728902
6852a368523o16485K022426K240900M95677m72669L89017J483672J198153k65147
6843E107021j704277k053484o62027K017662L853371K778592m20354k560613j906709
6834D449182j58148J07821j384773k926050l188809k217388p97435K20217L85650
6825e509733L1014j09447K13053P30265J298998J739057J361070j51850j667524
6816b065097j797460q80854k37956P2993P83944J288302N98868L476J417119L092818
6806B276153J175900l479816m777136q0612N051224M566441N41342o63125J922804
6797F533175L573942J869917o55638j868591k791064l931005l433114q07542J101177
$$ plain form
6788 -408743 -275233 -2135492 -4067347 -4354495 -3832644 -4452334 -6729504 -9274327 -10346064
6779 -10346064 -9706056 -9118751 -10551420 -13487129 -14830331 -12296374 -7243320 -3253683
6771 -3253683 -2465631 -4130392 -6109363 -6732439 -5639323 -3832385 -2725485 -2575587 -2375162
6762 -2375162 -1737536 -1796385 -3278086 -4818722 -4643850 -3088368 -1815672 -1146936 -51710
6753 -51710 1380973 1439044 -748481 -3701398 -5204508 -4444381 -2048490 1033907 3943349
6744 3943349 5745012 5657286 3655104 765189 -1487551 -2421535 -3031774 -4763597 -7266053
6735 -7266053 -8454760 -7404933 -5859781 -5620857 -5600810 -3307102 1345834 5711050 7796874
6726 7796874 8044476 7508606 6290006 4631554 3887077 5000314 6863516 7378493 5756536
$$ packed form
6788d08743J33510j860259j931855k87148N21851o19690k277170k544823j071737
6779a0346064O40008N87305j432669k935709j343202K533957N053054L989637
6771c253683P88052j664761j978971o23076J093116J806938J106900J49898K00425
6762b375162O37626n8849j481701j540636J74872J555482J272696O68736J095226
6753e1710J432683N8071k187525k952917j503110P60127K395891L082397K909442
6744C943349J801663q7726k002182k889915k252740r33984o10239j731823k502456
6735g266053j188707J049827J545152K38924K0047K293708M652936M365216K085824
6726G796874K47602n35870j218600j658452p44477J113237J863202N14977j621957
$$ plain form
6717 5756536 2974820 387693 -1284557 -1833003 -1306350 -125520 948388 1264326 724276
6708 724276 -247220 -1143457 -1665700 -1539642 -464649 1177002 1833852 49066 -3555596
6699 -3555596 -6528842 -7118371 -5419717 -1781145 3917605 10113434 12831133 9782221
6691 9782221 4159182 1387857 2366786 3015334 889151 -1226320 -19374 2987816 3630773
6682 3630773 1069919 -1446352 -1282198 940664 3694958 6856869 10221008 11577716
6674 11577716 8618712 2491588 -2544929 -3695959 -2489273 -2066537 -2908832 -3128011 -2355681
6665 -2355681 -2638646 -4728370 -6088193 -4553806 -2072396 -2112249 -4373954 -5074789 -2370918
6656 -2370918 1412333 3503209 3940824 4014540 3832499 3096530 2557274 2891877 3248936
$$ packed form
6717E756536k781716k587127j672250n48446N26653J180830J073908L15938n40050
6708G24276r71496q96237n22243J26058J074993J641651O56850j784786l604662
6699c555596k973246n89529J698654L638572N698750O195829K717699l048912
6691I782221n623039k771325R78929O48548k126183k115471J206946L007190O42957
6682C630773k560854k516271J64154K222862K754294L161911L364139J356708
6674A1577716k959004o127124n036517j151030J206686M22736q42295k19179P72330
6665b355681k82965k089724j359823J534387K481410l9853k261705p00835K703871
6656b370918L783251K090876M37615P3716j82041p35969n39256L34603L57059
$$ plain form
6647 3248936 2491591 1060920 233590 233854 340977 303943 545657 1409762 2998658 5146909
6637 5146909 6926925 7123352 5957040 5176987 5439845 4934013 2085086 -1562376 -3082986
6628 -3082986 -2053849 -650629 -175613 377759 1993655 3731169 4009736 2669484 908862
6619 908862 -285723 -1076032 -2282684 -4120926 -5561123 -5460516 -4376263 -4220926 -5601268
6610 -5601268 -6739611 -6045700 -4499732 -3956141 -4128285 -3243838 -1158003 300399 101417
6601 101417 -705942 -719682 320484 1909132 3236898 3271447 1884030 880633 2256889
6592 2256889 5334448 7332787 6916622 5383862 4222116 3599575 3656537 4945303 6730397
6583 6730397 7115540 6031656 5939923 8136737 10457925 10432293 8797388 7779994 7571904
$$ packed form
6647C248936p57345j430671q27330K64J07123l7034K41714Q64105J588896K148251
6637E146909J780016J96427j166312p80053K62858n05832k848927l647462j520610
6628c082986J029137J403220M75016N53372J615896J737514K78567j340252j760622
6619I08862j194585p90309j206652j838242j440197J00607J084253J55337j380342
6610e601268j138343O93911J545968N43591j72144Q84447K085835J458402j98982
6601A01417q07359j3740J040166J588648J327766L4549j387417j003397J376256
6592B256889L077559J998339m16165j532760j161746o22541N6962J288766J785094
6583F730397L85143j083884r1733K196814K321188k5632j634905j017394k08090
$$ plain form
6574 7571904 6998878 6429359 7187527 8550589 8016652 4802648 1033730 -926472 -796343
6565 -796343 186400 818641 735080 612210 1404361 2633213 2356648 157867 -1061307
6556 -1061307 1473282 5889811 7340615 4235116 114471 -1233021 93013 1853590
6548 1853590 2995373 3475051 2701262 390858 -1894609 -2008525 76413 1968037 1343952
6539 1343952 -1585556 -3818752 -1951805 4176380 10327305 11765795 8361475 4097446
6531 4097446 1604524 -76932 -1593158 -692345 3886166 8642777 9043513 5647038 2889943
6522 2889943 2389231 1290828 -2252869 -5536797 -4859710 -279628 4849087 7550409 7105010
6513 7105010 4533469 1551093 -584729 -1906582 -2955356 -3336108 -2359866 -1032472 -1452966
$$ packed form
6574G571904n73026n69519P58168J363062n33937l214004l768918j960202J30129
6565g96343R82743O32241q3561j22870P92151J228852k76565k198781j219174
6556a061307K534589M416529J450804l105499m120645j347492J326034J760577
6548A853590J141783M79678p73789k310404k285467j13916K084938J891624o24085
6539A343952k929508k233196J866947O128185O150925J438490l404320m264029
6531D097446k492922j681456j516226R00813M578511M756611M00736l396475k757095
6522B889943n00712j098403l543697l283928O77087M580082N128715K701322m45399
6513G105010k571541k982376k135822j321853j048774l80752R76242J327394m20494
$$ plain form
6504 -1452966 -3734790 -5534571 -5494743 -5059046 -5567730 -5688884 -3798884 -1324084 -1210639
6495 -1210639 -3775956 -6307159 -6492173 -4376014 -1198581 1742542 2977742 1413002
6487 1413002 -2428287 -6639224 -9444953 -9780222 -7152025 -2492372 1367491 1991434 60516
6478 60516 -1852432 -2852534 -3878952 -4599794 -3286082 -609958 -322502 -4063431 -8021488
6469 -8021488 -7497391 -3077606 735086 1939714 2666544 4456472 5383009 3280916 -510478
6460 -510478 -2545498 -1320271 1561133 3673532 4039721 3349918 2809364 2951150 3412330
6451 3412330 3821139 4405856 5048817 4306998 935640 -3422447 -4838704 -1485083 3779659
6442 3779659 6528075 5666288 3840415 3540776 4473043 4846892 3783130 1902399 475303
$$ packed form
6504a452966k281824j799781L9828M35697n08684j21154J890000K474800J13445
6495a210639k565317k531203j85014K116159L177433K941123J235200j564740
6487A413002l841289m210937k805729l35269K628197M659653L859863O23943j930918
6478F0516j912948j000102j026418p20842J313712K676124K87456l740929l958057
6469h021488N24097M419785L812692J204628P26830J789928R26537k102093l791394
6460e10478k035020J225227K881404K112399L66189o89803n40554J41786M61180
6451C412330M08809N84717O42961p41819l371358m358087j416257L353621N264742
6442C779659K748416q61787j825873k99639R32267L73849j063762j880731j427096
$$ plain form
6433 475303 457602 1625180 2302720 731281 -2776090 -5648032 -5562517 -2739079 574716
6424 574716 2251496 1427803 -1692631 -6086755 -10118952 -12402926 -12604757 -10967595 -7435527
6415 -7435527 -2267513 2600146 4310781 2026102 -1902741 -4754003 -6597880 -9175869
6407 -9175869 -12127343 -12472986 -8543295 -2646174 1544856 3023745 3249924 2975297 1632980
6398 1632980 -303131 -981172 -48595 395663 -826256 -1608932 357250 3587933 4431466
6389 4431466 1984071 -1232370 -3228722 -4304077 -4461119 -2190561 2571780 6695021
6381 6695021 7242659 5108086 3254178 2621003 2023274 1179219 1256625 2498948 3552630
6372 3552630 3516127 2931916 2439613 2053635 2118113 3369076 5473221 6875376 6691115
$$ packed form
6433D75303j7701J167578O77540j571439l507371k871942Q5515K823438L313795
6424E74716J676780q23693l120434m394124m032197k283974k01831J637162L532068
6415g435527N168014M867659J710635k284679l928843k851262j843877k577989
6407i175869k951474l45643L929691N897121M191030J478889K26179k74627j342317
6398A632980j936111o78041R32577M44258j221919p82676J966182L230683Q43533
6389D431466k447395l216441j996352j075355j57042K270558M762341M123241
6381F695021N47638k134573j853908o33175n97729q44055P7406J242323J053682
6372C552630l6503n84211m92303l85978O4478J250963K104145J402155j84261
$$ plain form
6363 6691115 5563235 4221994 2581969 870979 197693 1025383 2245602 2824780 3458988
6354 3458988 5555979 9229146 13076057 15234408 14107084 9269666 2814026 -1205025
6346 -1205025 -228399 4110440 7693873 7927698 5251737 1472207 -1954652 -4167263 -4793795
6337 -4793795 -4062276 -2630779 -1384076 -1437649 -3366190 -5759724 -5691497 -1947578 2921478
6328 2921478 5139214 3776307 1056937 -627203 -388521 1706107 4616119 5881316
6320 5881316 3527806 -1043440 -3967135 -3295191 -737668 1395155 2835724 4036694
6312 4036694 4483152 4002738 3993121 5347858 6395266 4907934 1238227 -2517614 -5600526
6303 -5600526 -8551837 -10715856 -10565794 -8784837 -8304650 -10155734 -11471473 -9242938 -4510738
$$ packed form
6363F691115j127880j341241j640025j710990o73286Q27690J220219N79178O34208
6354C458988K096991L673167L846911K158351j127324m837418o455640m019051
6346a205025R76626M338839L583433K33825k675961l779530l426859k212611o26532
6337d793795P31519J431497J246703n3573j928541k393534O8227L743919M869056
6328B921478K217736j362907k719370j684140K38682K094628K910012J265197
6320E881316k353510m571246k923695O71944K557523K132823J440569J200970
6312D036694M46458m80414r617J354737J047408j487332l669707l755841l082912
6303e600526k951311k164019J50062J780957M80187j851084j315739K228535M732200
$$ plain form
6294 -4510738 -1018813 -679682 -2157861 -3335843 -3311371 -2080155 -101646 1313253 616046
6285 616046 -2152857 -5014441 -6192000 -5922901 -5620523 -6023150 -6900060 -7918895 -8864024
6276 -8864024 -9310791 -8907847 -7886150 -6788302 -5964505 -5725513 -6384039 -7500282 -7803485
6267 -7803485 -6764319 -5492532 -4944022 -4164288 -2031348 37723 -453106 -3010876 -4232286
6258 -4232286 -2578560 -435581 -206327 -909282 -552744 288499 -291860 -2194318 -3650372
6249 -3650372 -3868090 -3089249 -1024166 2293855 4853229 4532681 2349830 1387591 2616342
6240 2616342 4124887 4321832 3344286 1262984 -2323001 -6323888 -8313356 -7522843 -5711302
6231 -5711302 -4562081 -4273719 -4938921 -6691991 -7943007 -6380778 -2765341 -804430 -1887745
$$ packed form
6294d510738L491925L39131j478179j177982K4472J231216J978509J414899o97207
6285F16046k768903k861584j177559K69099L02378m02627q76910j018835r45129
6276h864024m46767M02944J021697J097848Q23797K38992o58526j116243l03203
6267g803485J039166J271787N48510P79734K132940K069071m90829k557770j221410
6258d232286J653726K142979K29254p02955L56538Q41243n80359j902458j456054
6249c650372k17718P78841K065083L318021K559374l20548k182851r62239J228751
6240B616342J508545J96945r77546k081302l585985m000887j989468P90513J811541
6231e711302J149221K88362o65202j753070j251016J562229L615437J960911j083315
$$ plain form
6222 -1887745 -2985701 -1723913 -516782 -2813609 -7534703 -10513630 -10140207 -8490004
6214 -8490004 -7523192 -6901677 -5492550 -3046703 -362495 1140852 704254 -97947 1436777
6205 1436777 4963082 6234842 2564053 -2938138 -5441385 -4945457 -5166547 -6978276 -7181919
6196 -7181919 -4110604 -628413 -135495 -2249495 -4038826 -3905253 -3031139 -3860182 -7481966
6187 -7481966 -11717004 -12355563 -7805450 -1829405 372983 -1720975 -4067458 -3776296 -1864201
6178 -1864201 -310795 434883 175024 -1884680 -5199077 -7211852 -6092545 -2732976 782250
6169 782250 3134632 3719584 2637449 1513880 2398390 4982477 6699057 6262100 5156790
6160 5156790 4994915 5621650 6584924 7945596 8559704 6293385 1535187 -2096632 -2408323
$$ packed form
6222a887745j097956J261788J207131k296827m721094k978927L73423J650203
6214h490004R66812O21515J409127K445847K684208J503347m36598q02201J534724
6205A436777L526305J271760l670789n502191k503247M95928k21090j811729k03643
6196g181919L071315L482191M92918k114000j789331J33573Q74114q29043l621784
6187g481966m235038o38559M550113N976045K202388k093958k346483K91162J912095
6178a864201J553406P45678k59859k059704l314397k012775J119307L359569L515226
6169G82250K352382N84952j082135j123569Q84510K584087J716580m36957j105310
6160E156790j61875O26735R63274J360672O14108k266319m758198l631819l11691
$$ plain form
6151 -2408323 -1453035 -1585846 -1415926 1325974 5079312 6229482 4400971 2471360 1886567
6142 1886567 1395658 485754 736632 2811511 4724379 4576262 3358584 3505536 5383303
6133 5383303 6464248 4192156 -696146 -4246311 -3288879 920477 4216842 4553836 3673161
6124 3673161 3417877 2972081 1364728 364134 2245862 5978302 8195357 7253467 4208701
6115 4208701 667035 -2020515 -2251269 458392 3777093 4504975 2165883 -1067819 -3335279
6106 -3335279 -3921629 -2200417 1393917 3945711 2759315 -674945 -2506171 -2123395 -2352483
6097 -2352483 -3901512 -3860630 -1056364 1186604 -45011 -2913051 -4062521 -3433354 -2993075
6088 -2993075 -2991917 -2544022 -2176541 -2775263 -3331199 -2556505 -1474074 -1532215 -1414567 964561
$$ packed form
6151b408323R55288j32811J69920K741900L753338J150170j828511j929611n84793
6142A886567m90909r09904K50878K074879J912868j48117j217678J46952J877767
6133E383303J080945k272092m888302l550165R57432M209356L296365L36994q80675
6124C673161k55284m45796j607353j000594J881728L732440K217055r41890l044766
6115D208701l541666k687550k30754K709661L318701P27882k339092l233702k267460
6106c335279n86350J721212L594334K551794j186396l434260j831226L82776k29088
6097b352483j549029M0882K804266K242968j231615k868040j149470O29167M40279
6088b993075J158M47895L67481n98722n55936P74694J082431n8141J17648K379128
$$ plain form
6078 964561 4112575 4211397 643219 -3143621 -4668256 -5053861 -5834994 -6325039 -5715041
6069 -5715041 -5217839 -6147606 -7520121 -7260926 -4685711 -701639 3174519 5160685 4258864
6060 4258864 2055715 1685187 3656685 4631737 2085961 -1826466 -3479669 -3085217 -3638052
6051 -3638052 -5618340 -6426320 -5111150 -4001066 -4591379 -4996770 -3237360 -567949 520690
6042 520690 -195964 -1161080 -1558758 -1423229 -512354 957331 1583324 811524 582126 2599488
6032 2599488 4877072 3802603 -661654 -4740923 -6069225 -6277716 -7488220 -8913798
6024 -8913798 -8607170 -6669888 -4816280 -3809252 -2910854 -1295864 1092076 3659913 5505769
6015 5505769 6148629 6102389 5878747 4606592 1277237 -2566493 -3670647 -1434905 863280
$$ packed form
6078I64561L148014R8822l568178l786840j524635l85605p81133m90045O09998
6069e715041M97202r29767j372515K59195K575215L984072L876158J986166r01821
6060D258864k203149l70528J971498R75052k545776l912427j653203L94452n52835
6051c638052j980288q07980J315170J110084n90313m05391J759410K669411J088639
6042E20690p16654r65116l97678J35529R10875J469685O25993p71800k29398K017362
6032B599488K277584j074469m464257m079269j328302k08491j210504j425578
6024h913798L06628J937282J853608J007028Q98398J614990K387940K567837J845856
6015E505769O42860m6240k23642j272155l329355l843730j104154K235742K298185
$$ plain form
6006 863280 555777 -989379 -1287486 -792938 -1295022 -1946784 -305871 3212754 5252728
5997 5252728 4284552 2670848 3010061 4581875 4760814 2634501 -45860 -965671 426733
5988 426733 2477690 3068644 1944133 844153 893021 751105 -1555981 -5630506 -8857609
5979 -8857609 -9300905 -7374330 -4934655 -3650071 -3851612 -4180496 -3011295 -926070 -613187
5970 -613187 -3285800 -6671530 -8021524 -7537068 -6973776 -6552153 -5581057 -4450370 -3224808
5961 -3224808 2946 5924183 10771194 10432669 6678157 4553245 4350574 1841529 -3322932
5952 -3322932 -5896285 -3479127 -313057 445512 2098190 7450118 11871193 9485203
5944 9485203 2738788 -757095 1018160 3176778 2425384 783049 570161 1112552 1416556
$$ packed form
6006H63280l07503j545156k98107M94548n02084o51762J640913L518625K039974
5997E252728r68176j613704L39213J571814J78939k126313k680361r19811J392404
5988D26733K050957N90954j124511j099980M8868j41916k307086m074525l227103
5979h857609m43296J926575K439675J284584k01541l28884J169201K085225L12883
5970f13187k672613l385730j349994M84456N63292M21623R71096J130687J225562
5961c224808L227754N921237M847011l38525l754512k124912k02671k509045n164461
5952c322932k573353K417158L166070P58569J652678N351928M421075k385990
5944I485203o746415l495883J775255K158618p51394j642335k12888N42391L04004
$$ plain form
5935 1416556 1556072 347104 -4042605 -9789000 -11761425 -8027963 -2604095 120672
5927 120672 466652 960065 1938272 2386527 2737658 3859357 4798479 4254126 3209850
5918 3209850 3520272 4503611 3386523 -818028 -5698525 -7981826 -6557327 -2985511 13525
5909 13525 559073 -1164537 -3591103 -5747402 -7868824 -9862730 -10546279 -9506841 -8598416
5900 -8598416 -9948570 -12951633 -14841171 -14160504 -12186791 -10763956 -10184939 -9736305 -9013762
5891 -9013762 -7754333 -5340880 -1776893 1218530 1441504 -1193842 -4263686 -5544343
5883 -5544343 -5337367 -5396893 -6207785 -6438254 -4933654 -2118449 790594 2892867 3436248
5874 3436248 1618312 -2358923 -6463702 -8156832 -6781538 -4241196 -3255565 -5077902
$$ packed form
5935A416556J39516j208968m389709n746395j972425L733462N423868K724767
5927A20672L45980M93413R78207M48255L51131J121699R39122n44353j044276
5918C209850L10422R83339j117088m204551m880497k283301J424499L571816K999036
5909A3525N45548j723610k426566k156299k121422j993906o83549J039438R08425
5900h598416j350154l003063j889538O80667J973713J422835N79017M48634P22543
5891i013762J259429K413453L563987K995423K22974k635346l069844j280657
5883e544343K06976n9526q10892k30469J504600K815205K909043K102273N43381
5874C436248j817936l977235m104779j693130J375294K540342R85631j822337
$$ plain form
5866 -5077902 -8628577 -11513726 -12037858 -10462232 -8261697 -6346763 -4487926 -2273853
5858 -2273853 256005 2993412 5748470 7581859 7240336 4771599 1801228 -121773
5850 -121773 -372189 1613462 6070336 10931424 12315200 8843999 3963618 1956731 2832933
5841 2832933 3234709 1310053 -1681403 -3838964 -4223664 -2485001 610470 2537161 1420420
5832 1420420 -960486 -1062358 1540763 3837518 4083037 3794341 4333105 4565113 3320810
5823 3320810 1540047 306333 -937483 -2446642 -2644677 -624407 1616429 1616588 -299950
5814 -299950 -2267965 -3954976 -6085228 -8011132 -8264602 -6945948 -5240161 -2928655 1220139
5805 1220139 6452587 9667222 8870856 5614478 3212130 3274218 4403491 3888271 658277
$$ packed form
5866e077902l550675k885149n24132J575626K200535J914934J858837K214073
5858b273853K529858K737407K755058J833389l41523k468737k970371j923001
5850a21773k50416J985651M456874M861088J383776l471201m880381k006887Q76202
5841B832933M01776j924656k991456k157561l84700J738663L095471J926691j116741
5832A420420k380906j01872K603121K296755K45519k88696N38764K32008j244303
5823C320810j780763j233714j243816j509159j98035K020270K240836J59j916538
5814b99950j968015j687011k130252j925904k53470J318654J705787K311506M148794
5805A220139N232448L214635p96366l256378k402348O2088J129273n15220l229994
$$ plain form
5796 658277 -3209843 -4438586 -2370418 65533 -110614 -2564844 -4821283 -5404426 -4246010
5787 -4246010 -1439662 1953776 2820050 -1114759 -7142817 -9401894 -5862088 -849257
5779 -849257 844218 -160020 -103541 1710584 2212339 -346240 -3631712 -4535659 -3276580
5770 -3276580 -2752880 -4714123 -7862631 -9504925 -8156322 -4502846 -540218 1919853
5762 1919853 2343571 1648942 1394788 2475335 4258738 4995138 3423180 220194 -2423677
5753 -2423677 -3084986 -2656560 -2818308 -3102702 -983994 4230722 9043401 9260890 5270077
5744 5270077 1512323 629720 807232 -192031 -1400017 -1322116 -1649011 -4755278 -8846332
5735 -8846332 -9572206 -6280602 -2764630 -1290709 12747 2310326 2768006 -835040 -5293243
$$ packed form
5796F58277l868120j228743K068168K435951j76147k454230k256439n83143J158416
5787d246010K806348L393438Q66274l934809o028058k259077L539806N012831
5779h49257J693475j004238N6479J814125N01755k558579l285472r03947J259079
5770c276580N23700j961243l148508j642294J348603L653476L962628K460071
5762A919853M23718o94629k54154J080547J783403P36400j571958l202986k643871
5753b423677o61309M28426j61748k84394K118708N214716M812679K17489l990813
5744E270077l757754q82603J77512r99263j207986P7901l26895l106267m091054
5735h846332p25874L291604L515972J473921J303456K297579M57680l603046m458203
$$ plain form
5726 -5293243 -5696564 -2320312 70120 -935276 -3053741 -3978039 -4698204 -6759498 -8914104
5717 -8914104 -8600633 -5519841 -2126578 -1091883 -3180401 -7061484 -10385083 -11380057 -10076401
5708 -10076401 -8028392 -6818467 -7008363 -8210567 -9429468 -9370348 -7338785 -4268508 -2271148
5699 -2271148 -2597353 -4212919 -4820332 -3384778 -1361375 -998422 -2448517 -3417560 -2344767
5690 -2344767 -958805 -2069756 -5294700 -7238511 -6261711 -4553074 -4275574 -4174029 -2183268
5681 -2183268 590223 1347062 -91914 -1410051 -1699220 -2279170 -3617667 -4355633 -4029653
5672 -4029653 -4184235 -5713850 -7185830 -7037262 -5848328 -5260956 -5814719 -6757792 -7032475
5663 -7032475 -5885553 -3485148 -1178267 34357 1217022 3989697 7293154 7991397
$$ packed form
5726e293243m03321L376252K390432j005396k118465r24298p20165k061294k154606
5717h914104L13471L080792L393263J034695k088518l881083l323599r94974J303656
5708a0076401K048009J209925j89896j202204j218901N9120K031563L070277J997360
5699b271148l26205j615566o07413J435554K023403L62953j450095r69043J072793
5690b344767J385962j110951l224944j943811R76800J708637K77500J01545J990761
5681b183268K773491P56839j438976j318137k89169n79950j338497p37966L25980
5672d029653j54582j529615j471980J48568J188934N87372n53763r43073k74683
5663g032475J146922K400405K306881J212624J182665K772675L303457O98243
$$ plain form
5655 7991397 5350821 2459398 1873392 2078737 73731 -4332770 -8799918 -11626874 -12630357
5646 -12630357 -11984029 -10258481 -8860772 -8527858 -7957644 -5614643 -2221639 236712 1198307
5637 1198307 1285432 185617 -2782476 -6213520 -7310023 -5595470 -3904129 -4889140 -8049050
5628 -8049050 -10800151 -11109439 -8594415 -4460568 -979035 173631 -458199 -1188392 -1859536
5619 -1859536 -3738062 -6579408 -8083877 -7244255 -6038421 -6231893 -6426385 -4342073 -564000
5610 -564000 2300501 3174967 2809009 1288154 -1944554 -5588155 -6731800 -4333694 -426450
5601 -426450 2670629 4256911 3928181 1104806 -2695215 -3680294 -188767 4518767 6341214
5592 6341214 5772161 6400469 8941578 10193008 8154244 4974520 3587008 3831868 3506678
$$ packed form
5655G991397k640576k891423n86006K05345k005006m406501m467148k826956j003483
5646a2630357O46328J725548J397709L32914N70214K343001L393004K458351R61595
5637A198307Q7125j099815k968093l431044j096503J714553J691341r85011l159910
5628h049050k751101l09288K515024M133847L481533J152666o31830p30193o71144
5619a859536j878526k841346j504469Q39622J205834j93472j94492K084312L778073
5610e64000K864501Q74466l65958j520855l232708l643601j143645K398106L907244
5601d26450L097079J586282l28730k823375l800021r85079L491527M707534J822447
5592F341214n69053O28308K541109J251430k038764l179724j387512K44860l25190
$$ plain form
5583 3506678 1585077 -1152584 -3471472 -4260988 -2736245 561684 3543952 4408174 3288908
5574 3288908 1528666 128019 -448757 31295 1147842 1974499 2482740 3802133 6150514
5565 6150514 7640814 6428104 3185037 236347 -912359 -56407 2494055 5560433
5557 5560433 6972116 5736510 3722349 3338234 4137454 3751138 1687599 -163015 -722448
5548 -722448 -904474 -1121741 -46393 2919136 5697375 5629710 2797923 214628 880170
5539 880170 4859254 8969514 9649086 6673978 3421779 2762605 3894144 4537787 4605415
5530 4605415 5260033 5726125 4481810 3105529 4981368 9611037 12045171 9304723 3890330
5521 3890330 -718735 -4414700 -7815275 -8646386 -4503561 2528971 7439997 7732713 4900033
$$ packed form
5583C506678j921601k737661k318888p89516J524743L297929K982268Q64222j119266
5574C288908j760242j400647n76776M80052J116547Q26657N08241J319393K348381
5565F150514J490300j212710l243067k948690j148706Q55952K550462L066378
5557E560433J411683j235606k014161l84115P99220l86316k063539j850614n59433
5548g22448j82026k17267J075348K965529K778239o7665k831787k583295O65542
5539H80170L979084M110260O79572k975108l252199o59174J131539O43643O7628
5530D605415O54618M66092j244315j376281J875839M629669K434134k740448n414393
5521C890330m609065l695965l400575q31111M142825P032532M911026K92716k832680
$$ plain form
5512 4900033 1470817 -1011763 -1829094 -1122496 263162 2198963 5349955 8708427 9255597
5503 9255597 6171566 3136600 3629938 5952047 6256456 4718324 4613359 6412617 7381137
5494 7381137 6895479 7552250 10155944 11760122 10206389 7206181 5305892 4719912 4650576
5485 4650576 4889810 4546971 2021010 -1964371 -4012050 -2741174 -1199142 -2272889 -4234197
5476 -4234197 -3770007 -1387453 -357557 -1414196 -1949381 -221643 2671212 5248972 7363597
5467 7363597 8691348 7753173 3847926 -1140973 -4054469 -3328748 -178628 2779311 3845977
5458 3845977 3281902 2146721 599764 -1794782 -4306606 -5166337 -4041299 -2830255 -2902505
5449 -2902505 -3003629 -1476839 631444 713163 -1735635 -4578618 -5948875 -5754703 -4249402
$$ packed form
5512D900033l429216k482580q17331P06598J385658J935801L150992L358472N47170
5503I255597l084031l034966M93338K322109L04409j538132j04965J799258R68520
5494G381137m85658O56771K603694J604178j553733l000208j900289n85980o9336
5485D650576K39234l42839k525961l985381k047679J270876J542032j073747j961308
5476d234197M64190K382554J029896j056639n35185J727738K892855K577760K114625
5467G363597J327751r38175l905247m988899k913496P25721L150120K957939J066666
5458C845977n64075j135181j546957k394546k511824q59731J125038J211044p2250
5449b902505j01124J526790K108283Q1719k448798k842983j370257J94172J505301
$$ plain form
5440 -4249402 -1239366 2464350 4524842 3467740 876852 -96212 1605906 3694766
5432 3694766 3400736 1090291 -742 1925670 4338230 3437492 -330228 -2289359 145492
5423 145492 3723647 3912112 1088411 -776120 -367903 -289309 -1945300 -2782346 -151343
5414 -151343 4659284 8248592 9368162 9448281 9772512 9860044 8539861 5742889 3205110
5405 3205110 3219348 5816916 7579966 5174483 265615 -1581765 2033459 7018804 8448203
5396 8448203 6994486 6718257 8403811 9089354 7532224 5827983 4937017 2661718 -2054434
5387 -2054434 -6133336 -6391292 -4334778 -3938825 -5881968 -6942049 -4741704 -441245 3555634
5378 3555634 6342866 8169109 8979772 8419257 6563668 3922923 1107667 -1124337 -1870581
$$ packed form
5440d249402L010036L703716K060492j057102k590888r73064J702118K088860
5432C694766k94030k310445j091033J926412K412560r00738l767720j959131K434851
5423A45492L578155J88465k823701j864531M08217P8594j655991q37046K631003
5414a51343M810627L589308J119570Q0119L24231Q7532j320183k796972k537779
5405C205110J4238K597568J763050k405483m908868j847380L615224M985345J429399
5396H448203j453717k76229J685554O85543j557130j704241q90966k275299m716152
5387b054434m078902k57956K056514L95953j943143j060081K200345M300459L996879
5378C555634K787232J826243Q10663n60515j855589k640745k815256k232004p46244
$$ plain form
5369 -1870581 -549704 2560963 6153052 8343381 7951858 5749647 3923624 3833399 4814030
5360 4814030 5534981 5598159 5116295 3909181 2397191 2261791 4469618 7228514 7750846
5351 7750846 5755161 3422258 2193995 1718265 1801012 2756578 3259050 626398 -5231155
5342 -5231155 -10330075 -11033080 -8469181 -6625341 -7159298 -8130757 -7249240 -4376503 -764934
5333 -764934 2694837 6028021 9592283 13077038 15095939 14411614 11639356 8663199 6163287
5324 6163287 3225402 -130178 -2005263 -1365279 150459 719057 860187 1576334 1730649
5315 1730649 -170252 -2773505 -3241511 -1274272 721312 1107989 353696 -653604 -1187398
5306 -1187398 6092 3282889 6131215 5454380 2038606 -617 1395541 4136850
$$ packed form
5369a870581J320877L110667L592089K190329l91523k202211j826023r0225R80631
5360D814030P20951O3178m81864j207114j511990j35400K207827K758896N22332
5351G750846j995685k332903j228263m75730Q2747R55566N02472k632652n857553
5342e231155n098920p03005K563899J843840n33957r71459Q81517K872737L611569
5333g64934L459771L333184L564262L484755K018901o84325k772258k976157k499912
5324F163287k937885l355580j875085O39984J515738N68598J41130P16147J54315
5315A730649j900901k603253m68006J967239J995584L86677p54293j007300n33794
5306a187398J193490L276797K848326o76835l415774k039223J396158K741309
$$ plain form
5298 4136850 5700391 5904562 5132774 3018316 491966 209484 2735580 4567871 2318335
5289 2318335 -2811629 -6918934 -8303213 -8230068 -7875784 -6836884 -4374883 -524119 3817705
5280 3817705 6926946 7063341 4249782 581421 -1942857 -2958482 -2660754 -863076 1833758
5271 1833758 3577359 3351658 2223345 1433670 888674 637979 1635178 3322390 2886658
5262 2886658 -563325 -3280240 -1566700 2463251 3539646 776453 -1380869 246524
5254 246524 3753175 5647339 4921721 2528922 -420339 -2563713 -2628433 -1248930 -758814
5245 -758814 -2193658 -4131696 -5169028 -5556783 -5554058 -4403141 -2310081 -1405832 -2927547
5236 -2927547 -4903384 -4395555 -972367 3469249 7045927 8386541 6125494 314455
$$ packed form
5298D136850J563541K04171p71788k114458k526350k82482K526096J832291k249536
5289B318335n129964m107305j384279P3145L54284J038900K462001L850764M341824
5280C817705L109241J36395k813559l668361k524278j015625K97728J797678K696834
5271A833758J743601k25701j128313p89675n44996k50695R97199J687212m35732
5262B886658l449983k716915J713540M029951J076395k763193k157322J627393
5254B46524L506651J894164p25618k392799k949261k143374o4720J379503M90116
5245g58814j434844j938038j037332l87755K725J150917K093060R04249j521715
5236b927547j975837N07829L423188M441616L576678J340614k261047n811039
$$ plain form
5228 314455 -5966857 -8574210 -6351568 -2010766 1157075 2259244 2364226 2454657 2594702
5219 2594702 2427471 1676669 275016 -1497925 -2913915 -3164785 -2162338 -889632 -469077
5210 -469077 -691141 -82447 1998547 3926719 3486580 788171 -1585311 -1486713 647203
5201 647203 2714550 3100311 1658142 -568914 -2181503 -2546989 -2278040 -2152756 -1931399
5192 -1931399 -1232270 -1117201 -3109332 -6587162 -9098484 -9795629 -10499197 -12292714 -13161128
5183 -13161128 -10855844 -6528127 -3246157 -1798472 -282386 2484140 5340287 6690145
5175 6690145 6181247 4223509 1530815 -444428 -198248 2028327 4290519 5211441 5049121
5166 5049121 4249977 2562200 341273 -861980 -269520 782323 821184 448652 897885
$$ packed form
5228C14455o281312k607353K222642M340802L167841J102169J04982R0431J40045
5219B594702j67231p50802j401653j772941j415990k50870J002447J272706M20555
5210d69077k22064O08694K080994J928172m40139k698409k373482R8598K133916
5201F47203K067347L85761j442169k227056j612589l65486K68949J25284K21357
5192a931399O99129J15069j992131l477830k511322o97145p03568j793517q68414
5183a3161128K305284M327717L281970J447685J516086K766526K856147J349858
5175F690145n08898j957738k692694j975243K46180K226575K262192R20922j62320
5166E049121p99144j687777k220927j203253N92460J051843L8861l72532M49233
$$ plain form
5157 897885 1277314 -494490 -4014257 -5859269 -3609239 1074440 4431947 4688663 3219060
5148 3219060 2471853 3793080 6738168 9418895 9753868 7353623 4171530 2614052 3133794
5139 3133794 4319327 5024399 5424091 6044938 6834405 7471032 7770755 7523733 6687779
5130 6687779 5938359 6124590 6833139 6434821 4102879 934701 -1520608 -2910583 -3459777
5121 -3459777 -2762605 -618853 1451426 1197346 -1585456 -4450300 -4930384 -2952306 -248262
5112 -248262 1801721 3119741 4353257 6173053 8884256 11891547 13494043 12089747
5104 12089747 8147235 4404518 3253440 4153550 4599956 3524557 2271516 1770032 634669
5095 634669 -2330391 -5198698 -4935180 -1811958 754977 863697 13545 -217525 -612137
$$ packed form
5157H97885L79429j771804l519767j845012K250030M683679L357507K56716j469603
5148C219060p47207J321227K945088K680727L34973k400245l182093j557478N19742
5139C133794J185533P05072L99692O20847P89467O36627K99723k47022q35954
5130F687779p49420J86231P08549l98318k331942l168178k455309j389975n49194
5121c459777O97172K143752K070279k54080k782802k864844m80084J978078K704044
5112b48262K049983J318020J233516J819796K711203L007291J602496j404296
5104A2089747l942512l742717j151078R00110M46406j075399j253041n01484j135363
5095F34669k965060k868307K63518L123222K566935J08720q50152k31070l94612
$$ plain form
5086 -612137 -2103502 -3635055 -4141486 -4617909 -6014002 -6790051 -5108298 -2220490 -985810
5077 -985810 -1745813 -2282819 -1462036 -342914 190110 337979 -250940 -2507741 -5685477
5068 -5685477 -7241546 -5884858 -3082895 -790672 759190 2209611 3443882 3774438
5060 3774438 2888245 959662 -1541987 -3924262 -5742121 -6992901 -7187699 -5122346 -980508
5051 -980508 2344734 2249842 148970 -413586 887147 831526 -1906387 -4442152 -4252183
5042 -4252183 -2960293 -3330652 -4893593 -5182848 -3693846 -2021558 -1132017 -906595 -1644332
5033 -1644332 -3637231 -5544153 -5353621 -3123768 -1134202 -1159108 -2914871 -5215422 -7246669
5024 -7246669 -8416366 -8181703 -6622910 -4529889 -2593979 -1041265 -199448 -704628 -2645565
$$ packed form
5086f12137j491365j531553n06431m76423j396093p76049J681753K887808J234680
5077i85810p60003n37006Q20783J119122N33024J47869n88919k256801l177736
5068e685477j556069J356688K801963K292223J549862J450421J234271L30556
5060C774438q86193j928583k501649k382275j817859j250780j94798K065353M141838
5051i80508L325242r4892k100872n62556J300733n5621k737913k535765J89969
5042d252183J291890l70359j562941k89255J489002J672288Q89541K25422p37737
5033a644332j992899j906922J90532K229853J989566k4906j755763k300551k031247
5024g246669j169697K34663J558793K093021J935910J552714Q41817n05180j940937
$$ plain form
5015 -2645565 -4920390 -6138892 -6219804 -6422965 -7323171 -7454517 -5196701 -1731989 -182295
5006 -182295 -1135861 -1199286 2262303 6845070 8231712 6342974 5006754 5764345 5669299
4997 5669299 2202337 -2858975 -6272933 -7574499 -8301719 -8619714 -7068930 -3227250 957102
4988 957102 2606563 340788 -4228927 -7323883 -6159857 -1442326 3827507 7295817
4980 7295817 7846586 4665895 -1566349 -7046101 -7562003 -3356345 1223931 3129104 2943544
4971 2943544 1822195 -353326 -2870549 -3610909 -1922148 688309 3444543 6637526
4963 6637526 8576430 6514787 1967200 449974 3669653 6478586 4396736 -302349
4955 -302349 -3307278 -4523346 -5517478 -5040123 -2153780 -331098 -2949415 -7330986 -8664196
$$ packed form
5015b645565k274825j218502q0912k03161r00206j31346K257816L464712J549694
5006a82295r53566o3425L461589M582767J386642j888738j336220P57591r5046
4997E669299l466962n061312l413958j301566p27220l17995J550784L841680M184352
4988I57102J649461k265775m569715l094956J164026M717531N269833L468310
4980G295817N50769l180691o232244n479752n15902M205658M580276J905173j85560
4971B943544j121349k175521k517223p40360J688761K610457K756234L192983
4963F637526J938904k061643m547587j517226L219679K808933k081850m699085
4955c02349l004929j216068r94132M77355K886343J822682k618317m381571j333210
$$ plain form
4946 -8664196 -7558408 -8091005 -10237354 -10240482 -7452892 -4878309 -3262391 -398974 3295709
4937 3295709 3828995 -607537 -7025005 -11596833 -12803832 -10609240 -6289535 -3195431
4929 -3195431 -3927001 -6568599 -7165056 -5589137 -5032816 -5985993 -5251207 -1511566 2277048
4920 2277048 3123130 1339260 -1109762 -2725614 -2574425 -932395 110342 -994094 -2958184
4911 -2958184 -4030433 -5061137 -7223797 -8732936 -7650846 -6009685 -6884610 -9244157
4903 -9244157 -10192017 -10270505 -11615301 -12921724 -11543889 -8638831 -7024508 -6384176 -5913546
4894 -5913546 -8208118 -14202082 -18469388 -17158260 -15932083 -21070124 -27881337 -28725371
4886 -28725371 -26892471 -29325451 -31329811 -24938795 -17588900 -22749092 -35352171 -39671060
$$ packed form
4946h664196J105788n32597k146349l128K787590K574583J615918K863417L694683
4937C295709N33286m436532o417468m571828j206999K194592M319705L094104
4929c195431p31570k641598n96457J575919N56321r53177P34786L739641L788614
4920B277048Q46082j783870k449022j615852J51189J642030J042737j104436j964090
4911b958184j072249j030704k162660j509139J082090J641161q74925k359547
4903i244157r47860p8488j344796j306423J377835K905058J614323O40332M70630
4894e913546k294572n993964m267306J311128J226177n138041o811213q44034
4886b8725371J832900k432980k004360O391016P349895n160192j2603079m318889
$$ plain form
4878 -39671060 -39776030 -54014028 -78100960 -89446806 -97319338 -144752244 -232761070 -282929119
4870 -282929119 -222554314 -85571877 21395507 45197225 28909189 28682989 42505091
4863 42505091 41701455 27833818 22931195 28560062 28781360 21441310 18601219 22408253
4855 22408253 23495733 19951616 18938051 21370598 20963629 17330637 16231120 17652469
4847 17652469 15994045 11519424 10254715 12613710 12647821 9098165 7576338 10602238
4839 10602238 13913987 14185257 13164315 12623070 11462148 9320791 7826926 7177614 5962458
4830 5962458 4828397 6011721 9003389 10696582 9861862 7852673 5395744 2475615
4822 2475615 799866 2503720 6726271 10703089 13396579 14985204 14429055 11310041
$$ packed form
4878c9671060j04970j4237998k4086932j1345846p872532m7432906q8008826n0168049
4870b82929119O0374805J36982437J06967384K3801718j6288036k26200J3822102
4863D2505091q03636j3867637m902623N628867K21298p340050k840091L807034
4855B2408253J087480l544117j013565K432547m06969l632992j099517J421349
4847A7652469j658424m474621j264709K358995L4111l549656j521827L025900
4839A0602238L311749K71270j020942n41245j160922k141357j493865o49312j215156
4830E962458j134061J183324K991668J693193q34720k009189k456929k920129
4822B475615j675749J703854M222551L976818K693490J588625n56149l119014
$$ plain form
4814 11310041 8436615 8447073 9317377 7641455 4872570 5265104 8481651 9566696 6375579
4805 6375579 2200132 435543 894429 2112051 3424650 3894887 2583545 807024 1311759
4796 1311759 4537166 8013758 9599407 9147856 7425754 5805172 6336165 9437105 12212666
4787 12212666 11744393 9111713 7329282 6611980 5153542 3475787 3996960 6687506 8922086
4778 8922086 9534260 9654052 9814762 9528835 9269835 9516578 8492879 4474661 -367533
4769 -367533 -2343703 -1817354 -2237657 -4191665 -5032977 -4193306 -3860243 -3984822 -1723817
4760 -1723817 3010408 6188374 5439930 3077093 1869636 1691697 1736830 2166107 2106524
4751 2106524 -183006 -3746419 -5324248 -4519674 -4383126 -5493307 -4277026 491007 4261668
$$ packed form
4814A1310041k873426J0458Q70304j675922k768885L92534L216547J085045l191117
4805F375579m175447j764589M58886J217622J312599M70237j311342j776521N04735
4796A311759L225407L476592J585649m51551j722102j620582N30993L100940K775561
4787A2212666m68273k632680j782431p17302j458438j677755N21173K690546K234580
4778H922086O12174J19792J60710k85927k59000K46743j023699m018218m842194
4769c67533j976170N26349m20303j954008q41312Q39671L33063j24579K261005
4760a723817M734225L177966p48444k362837j207457j77939M5133M29277n9583
4751B106524k289530l563413j577829Q04574J36548j110181J216281M768033L770661
$$ plain form
4742 4261668 3007992 -990383 -3059005 -2399065 -965843 851956 3668875 6468531
4734 6468531 7920933 8578278 9153540 8780389 7492575 7792458 10733076 13009090 11403625
4725 11403625 7886339 6581585 7597115 7879027 6772457 6465409 7499468 7881706 6784640
4716 6784640 5683912 5404954 4956012 3769631 2537840 1321411 -814262 -3630883 -5254819
4707 -5254819 -4697985 -3211920 -2331004 -1885660 -832059 833388 1892893 1402422 -170232
4698 -170232 -1497348 -1999026 -2438306 -3543119 -4719337 -5065666 -4936500 -5017688 -4518826
4689 -4518826 -2312218 601188 2271292 3214817 5634409 9056053 10280560 8536496
4681 8536496 6883501 6891645 5838230 1715604 -2574349 -3318455 -1372792 124367 1038602
$$ packed form
4742D261668j253676l998375k068622O59940J433222J817799K816919K799656
4734F468531J452402O57345N75262l73151j287814K99883K940618K276014j605465
4725A1403625l517286j304754J015530K81912j106570l07048J034059L82238j097066
4716F784640j100728k78958m48942j186381j231791j216429k135673k816621j623936
4707e254819N56834J486065Q80916M45344J053601J665447J059505m90471j572654
4698a70232j327116n01678m39280j104813j176218l46329J29166q1188M98862
4689d518826K206608K913406J670104R43525K419592L421644J224507j744064
4681H536496j652995Q144j053415m122626m289953p44106J945663J497159R14235
$$ plain form
4672 1038602 3427889 7166659 10130408 11625660 12306967 11690811 8911542 5119463 2352522
4663 2352522 1019019 894320 2760581 5991205 6666746 2227393 -3541208 -4728808 -1517887
4654 -1517887 678497 -158254 -257643 2954485 6635040 7287805 5675757 4568221 4592407
4645 4592407 4636384 4262760 3882630 3977900 5025326 6652270 6821312 4145415 916255
4636 916255 797129 3285394 4045805 1578207 -311355 1625338 5364881 7102203 6341216
4627 6341216 4759495 2586469 -713335 -3776517 -4364576 -2330727 529060 2842510
4619 2842510 4278787 4792987 4785707 5118292 5822696 5951295 5591153 6254063 8025130 8371042
4609 8371042 5585512 1599583 -603268 -592747 650661 3539670 8533138 13184866 13858745
$$ packed form
4672A038602K389287L738770K963749J495252O81307o16156k779269l792079k766941
4663B352522j333503j24699J866261L230624O75541m439353n768601j187600L210921
4654a517887K196384q36751r9389L212128L680555O52765j612048j107536K4186
4645D592407M3977l73624l80130R5270J047426J626944J69042k675897l229160
4636I16255j19126K488265P60411k467598j889562J936693L739543J737322p60987
4627F341216j581721k173026l299804l063182n88059K033849K859787K313450
4619B842510J436277N14200p280L32585P04404J28599l60142O62910J771067L45912
4609H371042k785530l985929k202851J0521J243408K889009M993468M651728O73879
$$ plain form
4600 13858745 10250843 5518499 1923221 -1078804 -4159120 -6183018 -6079632 -4898394
4592 -4898394 -4715320 -6240057 -8160402 -8395187 -5941049 -2121048 174216 -680033 -3179292
4583 -3179292 -4536057 -3990929 -3064544 -2821835 -2572209 -1668615 -1049413 -1941455 -3824286
4574 -3824286 -4743799 -3497076 -867871 1295682 1817186 975635 -53000 -236853 681569
4565 681569 2155016 3273016 3582663 3641333 4260897 4958033 4015845 854785 -2497666
4556 -2497666 -3545467 -2362902 -1036817 -478810 411349 2374158 4433708 5379289 5084544
4547 5084544 3937252 2422682 1579782 2213787 3242804 2568414 50594 -2256152 -3292589
4538 -3292589 -4219322 -5779209 -6962497 -7404609 -8390331 -9829842 -9048352 -4960219 -933650
$$ packed form
4600A3858745l607902m732344l595278l002025l080316k023898J03386J181238
4592d898394J83074j524737j920345k34785K454138L820001K295264q54249k499259
4583c179292j356765N45128R26385K42709K49626R03594O19202q92042j882831
4574c824286r19513J246723K629205K163553N21504q41551j028635j83853R18422
4565F81569J473447J118000L09647N8670O19564O97136r42188l161060l352451
4556b497666j047801J182565J326085N58007Q90159J962809K059550R45581k94745
4547E084544j147292j514570q42900O34005J029017o74390k517820k306746j036437
4538c292589r26733j559887j183288m42112r85722j439511P81490M088133M026569
$$ plain form
4529 -933650 -547324 -2478238 -2825285 -942701 537674 416562 -77249 -622729 -2461419
4520 -2461419 -5337064 -6939340 -6144223 -4298709 -2744472 -1432615 -424607 -325624 -673235
4511 -673235 -295662 118084 -1689573 -5795787 -9078847 -9143639 -7071459 -4953718 -2857741
4502 -2857741 19424 2965690 4576065 4892996 4914877 4662277 3341509 1075229 -884593
4493 -884593 -1669708 -1685682 -1950925 -2941520 -4037532 -4083607 -2722487 -881092 552115
4484 552115 1961791 4036386 6251513 7638826 8458319 9501376 10338989 10219628 10053454
4475 10053454 10906770 10929209 7177111 970244 -2307347 -337312 2669271 2061764 -732786
4466 -732786 -1067390 1684868 3563168 1928505 -1425122 -3185393 -2083542 641404 2447021
$$ packed form
4529i33650L86326j930914l47047J882584J480375j21112m93811n45480j838690
4520b461419k875645j602276P95117J845514J554237J311857J008008R8983l47611
4511f73235L77573M13746j807657m106214l283060o4792K072180K117741K095977
4502b857741K877165K946266J610375L16931K1881k52600j320768k266280j959822
4493h84593p85115j5974k65243r90595j096012m6075J361120J841395J433207
4484E52115J409676K074595K215127J387313Q19493J043057Q37613j19361j66174
4475A0053454Q53316K2439l752098o206867l277591J970035L006583o07507k794550
4466g32786l34604K752258J878300j634663l353627j760271J101851K724946J805617
$$ plain form
4457 2447021 1182398 -2727244 -5920401 -5422062 -1962235 1449677 3395387 4447424
4449 4447424 4485566 2417164 -1205346 -3789162 -3680603 -1711993 691375 3015377 4701525
4440 4701525 4772934 3476421 2576478 2845523 2787136 1139831 -771848 -815939 801897
4431 801897 1967807 1873962 2164311 4604016 8642110 11764421 11947229 9645001 7386981
4422 7386981 7155381 8241340 8406511 7191286 6713820 8314005 9716919 7373086 1255023
4413 1255023 -4622100 -6880835 -6288138 -5665045 -5823956 -5327481 -3585776 -2104117 -2257635
4404 -2257635 -3446176 -4321099 -4628630 -4730770 -4260532 -2701358 -821808 -44965 -516813
4395 -516813 -1186262 -1716689 -2687995 -3736126 -3486414 -2197524 -2482838 -5695507 -9051343
$$ packed form
4457B447021j264623l909642l193157M98339L459827L411912J945710J052037
4449D447424L8142k068402l622510k583816J08559J968610K403368K324002J686148
4440D701525P1409j296513q99943K69045n8387j647305j911679m4091J617836
4431H01897J165910r3845K90349K439705M038094L122311J82808k302228k258020
4422G386981k31600J085959J65171j215225m77466J600185J402914k343833o118063
4413A255023n877123k258735N92697O23093j58911M96475J741705J481659j53518
4404b257635j188541q74923l07531j02140M70238J559174J879550P76843m71848
4395e16813o69449n30427r71306j048131K49712J288890k85314l212669l355836
$$ plain form
4386 -9051343 -8644196 -4746170 -1712114 -2347279 -4548711 -4559139 -1821482 1168257 3013884
4377 3013884 5197497 9039507 12515720 11967685 6852521 998193 -1721730 -1527138 -1107244
4368 -1107244 -1168300 -123366 2121188 3200585 2190821 1655708 3637100 5679897 3740800
4359 3740800 -1932177 -6781952 -7738084 -6399813 -5840891 -6426381 -6032012 -3219415 915626
4350 915626 3687685 3273166 547660 -1705292 -1918555 -1498619 -2593028 -4908694 -6260954
4341 -6260954 -5823880 -5046392 -5305795 -6257813 -6748182 -6055637 -4159582 -1982504 -1112779
4332 -1112779 -1880917 -2292989 -845099 284725 -2218431 -7093974 -8944341 -5635822 -1832140
4323 -1832140 -2789958 -7329673 -9961355 -8168626 -4337009 -1415671 76930 763490 942048
$$ packed form
4386i051343M07147L898026L034056o35165k201432j0428K737657K989739J845627
4377C013884K183613L842010L476213n48035n115164n854328k719923J94592M19894
4368a107244o1056J044934K244554J079397j009764n35113J981392K042797j939097
4359C740800n672977m849775r56132J338271N58922n85490L94369K812597M135041
4350I15626K772059m14519k725506k252952k13263M19936j094409k315666j352260
4341f260954M37074P77488k59403r52018m90369O92545J896055K177078Q69725
4332a112779p68138m12072J447890J129824k503156m875543j850367L308519L803682
4323a832140r57818m539715k631682J792729L831617K921338J492601O86560J78558
$$ plain form
4314 942048 1077683 1855586 3103553 3914227 3994218 3622752 2370290 -500799 -4136148
4305 -4136148 -6248626 -5777882 -4024150 -2483338 -956083 1136454 2781145 2435328 741885
4296 741885 400832 2636389 5045965 4365427 956190 -1151413 822246 5003361 7559947
4287 7559947 7450872 6592593 6210397 5648120 4805791 4901979 5822247 5264524 2141159 -1302724
4277 -1302724 -2693770 -2931262 -4028464 -5205455 -4164628 -1467220 -392199 -2187939
4269 -2187939 -4251392 -3848615 -1387728 1123279 3050756 5082757 7215636 8196153 6883001
4260 6883001 3657728 521709 -421497 902552 2247586 1634343 -239692 -1276384 -1165558
4251 -1165558 -1629029 -3419811 -4863480 -4169027 -1948587 -461665 -976036 -2574909 -3273482
$$ packed form
4314I42048J35635P77903J247967Q10674P9991l71466j252462k871089l635349
4305d136148k112478M70744J753732J540812J527255K092537J644691l45817j693443
4296G41885l41053K235557K409576o80538l409237k107603J973659M181115K556586
4287G559947j09075q58279l82196n62277q42329R6188R20268n57723l123365l443883
4277a302724j391046k37492j097202j176991J040827K697408J075021j795740
4269b187939k063453M02777K460887K511007J927477K032001K132879R80517j313152
4260F883001l225273l136019r43206J324049J345034o13243j874035j036692J10826
4251a165558m63471j790782j443669O94453K220440J486922n14371j598873o98573
$$ plain form
4242 -3273482 -1997411 356484 1934498 2252053 2888247 5138296 7821902 8817145 8144564
4233 8144564 7624946 7619888 6307579 2782286 -1073566 -2832679 -2174633 -380413 1330572
4224 1330572 1836625 -729 -3800883 -6943468 -7191117 -5714316 -5921735 -9225774 -13257837
4215 -13257837 -14546695 -11967531 -7250082 -3031556 -980553 -1121507 -2108295 -2274958 -1121269
4206 -1121269 92360 -235391 -1819914 -2356597 -245760 3069249 4495423 2899218 280460
4197 280460 -757285 336917 2128302 2774901 1175675 -2309931 -5825547 -7745279 -8617515
4188 -8617515 -9985786 -11313580 -10431081 -7631429 -6370053 -8213822 -9926355 -8043343
4180 -8043343 -3840936 -766942 753500 2232308 2645860 -523272 -6371582 -10825757
$$ packed form
4242c273482J276071K353895J578014L17555O36194K250049K683606R95243o72581
4233H144564n19618n058j312309l525293l855852j759113O58046J794220J710985
4224A330572N06053j837354l800154l142585k47649J476801k07419l304039m032063
4215a3257837j288858K579164M717449M218526K051003j40954r86788j66663J153689
4206a121269J213629l27751j584523n36683K110837L315009J426174j596205k618758
4197B80460j037745J094202J791385O46599j599226l485606l515616j919732q72236
4188h617515j368271j327794Q82499K799652J261376j843769j712533J883012
4180h043343M202407L073994J520442J478808M13552l169132n848310m454175
$$ plain form
4172 -10825757 -11882021 -11156779 -10359913 -9691437 -9578927 -10397354 -10517484 -8286279 -5854572
4163 -5854572 -7173738 -12218575 -17178061 -20154042 -22205891 -23070617 -21235319 -18548077
4155 -18548077 -18974189 -21985905 -23149556 -22082837 -23097795 -26868655 -29319502 -30587195
4147 -30587195 -36014805 -45520162 -53005522 -61086282 -82446054 -115647221 -132372264 -106327840
4139 -106327840 -49082732 515492 20782231 23892022 28017486 32559615 28879389 19613125
4131 19613125 14435524 15221269 16812194 17501131 19280902 21029705 19635619 15967508
4123 15967508 13295986 11484474 8129048 3728862 921586 251305 872618 3448898
4115 3448898 8202578 12111098 12244028 10192957 9436264 10262764 11024549 12087344 14196851
$$ packed form
4172a0825757j056264P25242P96866O68476J12510q18427j20130K231205K431707
4163e854572j319166n044837m959486k975981k051849q64726J835298K687242
4155a8548077m26112l011716j163651J066719j014958l770860k450847j267693
4147c0587195n427610r505357p485360q080760k1359772l3201167j6725043K6044424
4139a06327840N7245108M9598224K0266739L109791M125464M542129l680226r266264
4131A9613125n177601P85745J590925O88937J779771J748803j394086l668111
4123A5967508k671522j811512l355426m400186k807276o70281O21313K576280
4115C448898M753680L908520J32930k051071p56693Q26500P61785J062795K109507
$$ plain form
4106 14196851 14917221 11452448 5844011 2945093 3977607 5997677 6906237 7206125 7628027
4097 7628027 8689756 11695404 16465417 19082216 15878537 8916951 3528103 1144006
4089 1144006 -1172547 -4650730 -7068137 -7380000 -7436170 -7968480 -6909409 -3224870 910657
4080 910657 3298579 4315844 5011088 5070380 3965284 2171842 355100 -1026168 -1119838
4071 -1119838 365155 1717514 1053266 -578657 -559576 925899 879675 -1822464 -4654728
4062 -4654728 -4929989 -2491469 1347715 4804925 5437485 2107101 -2431102 -4028503 -2602915
4053 -2602915 -1776987 -2905634 -3672427 -3402652 -4863684 -8717978 -10930460 -8849002 -5723994
4044 -5723994 -5280989 -5288927 -1234579 5895208 10460162 9864310 6990861 5080397 4068862
$$ packed form
4106A4196851P20370l464773n608437k898918J032514K020070R08560K99888M21902
4097G628027J061729L005648M770013K616799l203679o961586n388848k384097
4089A144006k316553l478183k417407l11863n6170n32310J059071L684539M135527
4080I10657K387922J017265O95244N9292j105096j793442j816742j381268r3670
4071a119838J484993J352359o64248j631923J9081J485475m6224k702139k832264
4062d654728k75261K438520L839184L457210O32560l330384m538203j597401J425588
4053b602915Q25928j128647p66793K69775j461032l854294k212482K081458L125008
4044e723994M43005p938M054348P129787M564954n95852k873449j910464j011535
$$ plain form
4035 4068862 2607343 630616 -1080137 -1896687 -1354284 287741 1451256 829132 -504247
4026 -504247 -259577 1859342 3889295 4611819 4917424 5666279 5971999 4786198 3170670
4017 3170670 3573301 6752359 10260572 10720481 7623729 4049157 2963755 3677290 3358870
4008 3358870 1426438 199610 983646 1961518 1087096 -997376 -2400925 -2578599 -1862106
3999 -1862106 -25374 2743961 4720436 4563433 3504935 3712849 5208037 6247135 6072078
3990 6072078 5356880 4460860 3198987 2021566 1525835 978408 -835429 -3339940 -4535171
3981 -4535171 -3769322 -2512869 -2098907 -2094708 -1207414 1300786 5074036 8377329 8745754
3972 8745754 5705427 2760332 4387085 10257849 14544754 12545009 6570102 3285675
$$ packed form
4035D068862j461519j976727j710753q16550N42403J642025J163515o22124j333379
4026e04247K44670K118919K029953P22524L05605P48855L05720j185801j615528
4017C170670M02631L179058L508213M59909l096752l574572j085402P13535l18420
4008C358870j932432j226828P84036R77872q74422k084472j403549j77674P16493
3999a862106J836732K769335J976475j57003j058498K07914J495188J039098j75057
3990F072078p15198q96020j261873j177421m95731n47427j813837k504511j195231
3981d535171P65849J256453M13962M199Q87294K508200L773250L303293L68425
3972H745754l040327k945095J626753N870764M286905j999745n974907l284427
$$ plain form
3964 3285675 5880173 11004556 13589901 12458803 9872896 7309658 4316236 1304000
3956 1304000 518592 2763192 5291738 5183041 3418573 3039383 4195936 4096913 1639654
3947 1639654 -1164800 -2722723 -3432723 -2924759 522723 5977184 8804670 6393230 2155465
3938 2155465 843054 2259831 2838117 1285631 -1021314 -3575366 -6595220 -8294208
3930 -8294208 -6394137 -2188360 582904 976590 1480011 3145234 3575929 618834 -4758318
3921 -4758318 -10007668 -12981524 -12140193 -7634753 -2700777 -1171204 -2885810 -4045709
3913 -4045709 -2451632 402953 2667268 4173799 4502820 2707646 283642 794948 4683492
3904 4683492 7763361 6974861 4411336 3217070 2755588 1020412 -942488 -808943 675474
$$ packed form
3964C285675K594498N124383K585345j131098k585907k563238k993422l012236
3956A304000p85408K244600K528546j08697j764468l79190J156553r9023k457259
3947A639654k804454j557923p10000N07964L447482N454461K827486k411440m237765
3938B155465j312411J416777N78286j552486k306945k554052l019854j698988
3930h294208J900071M205777K771264L93686N03421J665223M30695k957095n377152
3921d758318n249350k973856Q41331M505440M933976J529573j714606j159899
3913d045709J594077K854585K264315J506531L29021j795174k424004N11306L888544
3904D683492L079869p88500k563525j194266m61482j735176j962900J33545J484417
$$ plain form
3895 675474 889888 -240684 -539672 401205 912274 781436 1864016 4632468 6714936
3886 6714936 5854702 2761267 340107 961619 4482266 8179547 9113479 7380855 6144858
3877 6144858 7453336 9415457 9116745 6827059 4960880 3980291 2273524 -207156 -1260548
3868 -1260548 -47811 1112599 -238687 -3554280 -6295814 -6994178 -6328715 -5809401 -6078222
3859 -6078222 -6301112 -5156632 -2650467 -543754 -471458 -2176160 -4193249 -5479509 -5574325
3850 -5574325 -4225696 -2094719 -836512 -1029900 -990603 757497 2944845 3508865 2986860
3841 2986860 3357362 4247590 3448345 1186008 529680 2692742 5013202 5105324 4363011
3832 4363011 5334212 7678276 9042515 8619173 7551496 6555350 5309999 4097411 4220343
$$ packed form
3895F75474K14414j130572k98988R40877N11069j30838J082580K768452K082468
3886F714936q60234l093435k421160O21512L520647L697281R33932j732624j235997
3877F144858J308478J962121k98712k289686j866179r80589j706767k480680j053392
3868a260548J212737J160410j351286l315593k741534o98364O65463N19314k68821
3859f078222k22890J144480K506165K106713P2296j704702k017089j286260r4816
3850e574325J348629K130977J258207j93388L9297J748100K187348N64020n22005
3841B986860L70502Q90228p99245k262337o56328K163062K320460R2122p42313
3832D363011R71201K344064J364239m23342j067677r96146j245351j212588J22932
$$ plain form
3823 4220343 6279222 9006941 10297000 9074359 6084808 3045580 1036549 -177738
3815 -177738 -1149601 -1711895 -1693389 -1976827 -3336167 -4418537 -2759341 1710313 5923869
3806 5923869 7364036 6977387 7189231 8254570 8213819 6013980 3262186 2613090 4840372
3797 4840372 7542958 7041295 2321108 -3174349 -5010574 -2940193 -788781 -967429 -1695896
3788 -1695896 -945512 -331000 -2323737 -5466071 -5914660 -3193300 -854046 -926480 -1048680
3779 -1048680 1340137 4671082 5552138 3839133 2670557 3802388 5430256 5351332 4358459
3770 4358459 4904724 7199042 8442641 6383785 2440428 271243 1669269 4884397
3762 4884397 7000947 6956854 5760282 4525962 3211521 1255961 -1107579 -2560571 -1955305
$$ packed form
3823D220343K058879K727719J290059j222641k989551l039228k009031j214287
3815a77738r71863n62294J8506k83438j359340j082370J659196M469654M213556
3806E923869J440167l86649K11844J065339m0751k199839k751794o49096K227282
3797D840372K702586n01663m720187n495457j836225K070381K151412j78648p28467
3788a695896P50384O14512j992737l142334m48589K721360K339254p2434j22200
3779a048680K388817L330945Q81056j713005j168576J131831J627868p8924r92873
3770D358459N46265K294318J243599k058856l943357k169185J398026L215128
3762D884397K116550m4093j196572j234320j314441j955560k363540j452992O05266
$$ plain form
3753 -1955305 70164 1261514 195122 -1825090 -2369415 -1233125 -750817 -2406515 -4680141
3744 -4680141 -5220079 -3840817 -2024953 -446351 1361163 3311596 4317294 3588448 1395858
3735 1395858 -1256012 -2848452 -1887860 1346730 3968498 3042050 -1005394 -5012401 -7052715
3726 -7052715 -7978755 -8831077 -8962966 -7853395 -6882616 -7517305 -8825064 -8619130 -6561229
3717 -6561229 -4456033 -3609045 -3482993 -3306907 -3662229 -5519131 -8205860 -9322443 -7153064
3708 -7153064 -3014426 -528662 -1870638 -4970467 -5421454 -1309197 4890144 9458586
3700 9458586 11027539 10241490 7548357 3218361 -1318348 -4268804 -5409045 -5436405 -3825386
3691 -3825386 182406 4274221 3841407 -2248576 -8941409 -10368386 -6502337 -2110190
$$ packed form
3753a955305K025469J191350j066392k020212n44325J136290M82308j655698k273626
3744d680141n39938J379262J815864J578602J807514J950433J005698p28846k192590
3735A395858k651870j592440R60592L234590K621768r26448m047444m007007k040314
3726g052715r26040q52322j31889J109571R70779o34689j307759K05934K057901
3717f561229K105196Q46988J26052J76086l55322j856902k686729j116583K169379
3708g153064M138638K485764j341976l099829m50987M112257O199341M568442
3700I458586J568953p86049k693133m329996m536709k950456j140241k7360J611019
3691c825386M007792M091815m32814o089983o692833j426977L866049M392147
$$ plain form
3683 -2110190 -191998 690170 2816560 6006493 8709344 10144937 10209322 8899789 6959802
3674 6959802 5735040 5314125 4086368 1282930 -1287953 -1392546 781814 3330625 5177193
3665 5177193 6292300 6305340 5006075 3880189 4950685 7839509 9882269 9616598 8336900
3656 8336900 7500242 6502724 4403792 2388720 2566870 4771977 6286842 5041664 1975012
3647 1975012 -307705 -610419 -269001 -1299161 -3932300 -6400315 -7047862 -6013625 -4506637
3638 -4506637 -3105903 -1544179 255073 1887478 3105330 3960415 4464965 4849529 5803489
3629 5803489 7499914 8784661 8542205 7505754 7288420 7932677 8063253 7152655 5654241
3620 5654241 3239499 -393963 -2876337 -778118 4915846 8376873 6178878 1956502
$$ packed form
3683b110190J918192Q82168K126390L189933K702851J435593O4385j309533j939987
3674F959802j224762m20915j227757k803438k570883j04593K174360K548811J846568
3665E177193J115107J3040j299265j125886J070496K888824K042760k65671j279698
3656H336900q36658r97518k098932k015072J78150K205107J514865j245178l066652
3647A975012k282717l02714L41418j030160k633139k468015o47547J034237J506988
3638d506637J400734J561724J799252J632405J217852Q55085N04550L84564R53960
3629E803489J696425J284747k42456j036451k17334O44257J30576r10598j498414
3620E654241k414742l633462k482374K098219N693964L461027k197995m222376
$$ plain form
3612 1956502 991501 2871430 3238568 870868 -1383559 -2011997 -2775536 -4733872 -6011765
3603 -6011765 -4760913 -1803078 650364 1006611 -1226966 -4856660 -6983155 -6056790 -4691846
3594 -4691846 -6329656 -9316576 -8450887 -3120080 911367 8549 -1731700 906333 5867172
3585 5867172 7027484 3555990 636424 1334800 2845287 1831141 -688941 -1777873
3577 -1777873 -961970 179364 1100470 2699668 5191504 7193107 7106088 4760198 1611251
3568 1611251 -433635 -339714 1780001 5208332 8706526 10352713 8841787 5533922 3722286
3559 3722286 4800251 6447300 5793461 2942089 -164967 -2748059 -4779023 -4914520 -1948328
3550 -1948328 1905919 2252705 -2159085 -7544495 -9405946 -7081933 -3296201 -798243
$$ packed form
3612A956502r65001J879929L67138k367700k254427o28438p63539j958336j277893
3603f011765J250852K957835K453442L56247k233577l629694k126495R26365J364944
3594d691846j637810k986920Q65689N330807M031447r02818j740249K638033M960839
3585E867172J160312l471494k919566O98376J510487j014146k520082j088932
3577a777873Q15903J141334R21106J599198K491836K001603q7019k345890l148947
3568A611251k044886R3921K119715L428331L498194J646187j510926l307865j811636
3559C722286J077965J647049o53839k851372l107056k583092k030964j35497K966192
3550a948328L854247L46786m411790n385410j861451K324013L785732K497958
$$ plain form
3542 -798243 -393025 -1181955 -1865083 -2176358 -2974815 -4379419 -4684843 -2561286 490753
3533 490753 1901230 1650672 1669803 1943294 270690 -3554403 -6371668 -5763329 -3021836
3524 -3021836 -538940 1458964 3780267 5806007 6160180 4586840 1649500 -2126836
3516 -2126836 -5437197 -6013497 -2946250 1830714 5639787 7542920 7856118 6927756 5672985
3507 5672985 5466883 5934121 4710837 1172233 -1595109 -705651 2532413 4957756 5977467
3498 5977467 6740874 6649009 4295586 951006 -512102 202273 1055364 1724716 3748308
3489 3748308 6510068 6920559 4023590 556800 -1230210 -2169624 -3257262 -3308629 -1509216
3480 -1509216 322860 344091 -347819 440717 2629773 4383099 4915511 4935775 4997079 4891873
$$ packed form
3542g98243M05218p88930o83128l11275p98457j404604l05424K123557L052039
3533D90753J410477k50558J9131K73491j672604l825093k817265O08339K741493
3524c021836K482896J997904K321303K025740L54173j573340k937340l776336
3516b126836l310361n76300L067247M776964L809073J903133L13198r28362j254771
3507E672985k06102M67238j223284l538604k767342Q89458L238064K425343J019711
3498E977467P63407r1865k353423l344580j463108P14375Q53091O69352K023592
3489C748308K761760M10491k896969l466790j787010r39414j087638n1367J799413
3480a509216J832076K1231o91910P88536K189056J753326N32412K0264O1304j05206
$$ plain form
3470 4891873 4243794 2838455 1032242 269679 1971718 5362231 7907896 8615651 9128925
3461 9128925 10571206 11292230 9370883 5768144 3143629 2602016 3188568 3630106 3146772
3452 3146772 1528591 -252883 -549576 629517 1099234 -329423 -1711716 -766718 1730973
3443 1730973 3562313 4738620 6894508 9742054 10920410 9380190 6592820 4216932
3435 4216932 2592826 1769368 2089569 3277918 4437227 5307374 6349254 7601360 8719061
3426 8719061 9911664 11292926 11464271 8557392 2994730 -2263994 -4595230 -3764339 -1208370
3417 -1208370 1375427 2716657 2588918 1878497 1142997 -364415 -2983680 -4918070 -4295020
3408 -4295020 -2323840 -1848797 -2915882 -2583103 483640 4087460 6033232 6750837 6967514
$$ packed form
3470D891873o48079j405339j806213p62563J702039L390513K545665P07755N13274
3461I128925J442281P21024j921347l602739k624515n41613N86552M41538m83334
3452C146772j618181j781474k96693J179093M69717j428657j382293R44998K497691
3443A730973J831340J176307K155888K847546J178356j540220k787370k375888
3435D216932j624106q23458L20201J188349J159309Q70147J041880J252106J117701
3426H719061J192603J381262J71345k906879n562662n258724k331236Q30891K555969
3417a208370K583797J341230j27739p10421p35500j507412k619265j934390O23050
3408d295020J971180M75043j067085L32779L066743L603820J945772P17605K16677
$$ plain form
3399 6967514 5442025 1235721 -3586646 -5872297 -5021356 -2926862 -1217835 -273355 -164865
3390 -164865 -761914 -1207167 -692527 403367 1082532 991963 274223 -1160479 -3128902
3381 -3128902 -4497661 -4218412 -2859576 -2187837 -3247633 -5307510 -6447626 -5007307 -1169767
3372 -1169767 2558762 3374990 1208490 -1193923 -1651942 -721603 261550 1665028 4432082
3363 4432082 7519018 8503800 6676458 3980388 2594691 2585892 2288908 451340 -2300467
3354 -2300467 -4132135 -4226549 -3891928 -4587085 -5298720 -3671384 11316 2182421 515821
3345 515821 -2823998 -4152663 -2911051 -1339744 -794701 -725018 -560473 -243750 776428
3336 776428 2831707 4443874 3678164 1198690 -250824 171126 139315 -2276360 -5726417
$$ packed form
3399F967514j525489m206304m822367k285651Q50941K094494J709027R44480J08490
3390a64865n97049m45253N14640J095894O79165r0569p17740j434702j968423
3381c128902j368759K79249J358836O71739j059796k059877j140116J440319L837540
3372a169767L728529Q16228k166500k402413m58019R30339R83153J403478K767054
3363D432082L086936R84782j827342k696070j385697q799k96984j837568k751807
3354b300467j831668r4414L34621o95157p11635J627336L682700K171105j666600
3345E15821l339819j328665J241612J571307N45043O9683J64545L16723J020178
3336G76428K055279J612167p65710k479474j449514M21950l1811k415675l450057
$$ plain form
3327 -5726417 -7470744 -6669715 -4489083 -2078302 116181 1733395 2642650 3507266 5025172
3318 5025172 6566017 6669759 5371817 5083584 7937905 12352758 13757618 9831757 3996803
3309 3996803 1827151 4242117 6571565 5029849 1655924 1025953 3944500 6952107
3301 6952107 7195369 5182695 2852182 1284476 801708 1511955 3038293 4744292 6362938
3292 6362938 7398212 6345356 2264386 -2894005 -5528202 -4562222 -2770868 -3159227 -5380754
3283 -5380754 -6714340 -5632981 -3385741 -2396826 -3668690 -5714527 -6106714 -4173861 -1516788
3274 -1516788 504802 2445892 4690247 5182730 1679289 -4267668 -8141810 -7494147 -4078068
3265 -4078068 -946343 283209 -814191 -3634056 -5664647 -4128449 170889 2919672
$$ packed form
3327e726417j744327Q01029K180632K410781K194483J617214R09255Q64616J517906
3318E025172J540845J03742j297942k88233K854321M414853J404860l925861n834954
3309C996803k169652K414966K329448j541716l373925o29971K918547L007607
3301F952107K43262k012674k330513j567706m82768P10247J526338J705999J618646
3292F362938J035274j052856m080970n158391k634197R65980J791354l88359k221527
3283e380754j333586J081359K247240R88915j271864k045837l92187J932853K657073
3274a516788K021590J941090K244355M92483l503441n946957l874142O47663L416079
3265d078068L131725J229552j097400k819865k030591J536198M299338K748783
$$ plain form
3257 2919672 1652217 -1074608 -1456319 633840 2420018 2256039 798893 -633306 -934538
3248 -934538 545884 2774409 2900942 -809926 -6467871 -10479927 -11375892 -10391297 -9096582
3239 -9096582 -8046290 -7166132 -5949033 -3745547 -1143715 -313070 -2471953 -5703688 -6934949
3230 -6934949 -5520717 -3167682 -886956 1823034 4744463 6058067 4531775 1265285
3222 1265285 -1551557 -2810940 -2902223 -2715330 -2890469 -3689803 -4913732 -5660966 -4487294
3213 -4487294 -687330 3975682 5676062 2163178 -4158386 -8342803 -8165396 -5657080
3205 -5657080 -3514836 -2447537 -2643867 -4930578 -8730781 -11258590 -10886434 -9422765 -8985254
3196 -8985254 -8628633 -6562650 -3865070 -3063315 -4380709 -6254864 -8261267 -10422105 -10859330
$$ packed form
3257B919672j267455k726825l81711K090159J786178j63979j457146j432199l01232
3248i34538J480422K228525J26533l710868n657945m012056q95965R84595J294715
3239i096582J050292Q80158J217099K203486K601832Q30645k158883l231735j231261
3230f934949J414232K353035K280726K709990K921429J313604j526292l266490
3222A265285k816842j259383r1283J86893j75139p99334j223929p47234J173672
3213d487294L799964M663012J700380l512884o321564m184417J77407K508316
3205e657080K142244J067299j96330k286711l800203k527809L72156J463669M37511
3196h985254L56621K065983K697580Q01755j317394j874155k006403k160838m37225
$$ plain form
3187 -10859330 -7731468 -2816801 415887 1803599 3773115 5974037 5059919 509830
3179 509830 -3634422 -4383408 -3437192 -3392836 -3777411 -3207334 -2622312 -3675048 -5869057
3170 -5869057 -7620952 -8608565 -9224888 -9342929 -9284474 -10155831 -11417402 -10110492 -4748146
3161 -4748146 1685366 5028236 4939974 4248363 4481481 4740224 4478656 4732684 6222995
3152 6222995 8029841 8619868 7208302 4147165 842398 -898036 -141918 2736076 6970242
3143 6970242 11668526 14871060 14158964 9512263 4256412 1736630 1994011 2809218 2731986
3134 2731986 1728796 150164 -1314525 -1662391 -946094 -457069 -277144 1636424 6048717
3125 6048717 9876749 9593236 6035637 3163659 2881647 3833485 4689981 5591601 6344872
$$ packed form
3187a0859330L127862M914667L232688J387712J969516K200922r14118m550089
3179E09830m144252p48986R46216M4356l84575N70077N85022j052736k194009
3170e869057j751895r87613o16323j18041N8455q71357j261571J306910N362346
3161d748146O433512L342870q8262o91611K33118K58743k61568K54028J490311
3152F222995J806846N90027j411566l061137l304767j740434P56118K877994M234166
3143F970242M698284L202534p12096m646701n255851k519782K57381Q15207p7232
3134B731986j003190j578632j464689l47866P16297M89025J79925J913568M412293
3125F048717L828032k83513l557599k871978k82012R51838Q56496R01620P53271
$$ plain form
3116 6344872 6062360 5081545 4872020 5533067 5478308 4043780 2446468 1753195 1726304 1930355
3106 1930355 2123475 1437622 -770762 -3103114 -3390948 -2067766 -1900142 -3920607 -6170920
3097 -6170920 -7154206 -7713704 -8234883 -6826371 -2416200 2389626 3890096 1623016 -1574695
3088 -1574695 -2789579 -1016239 2699826 5607690 5043267 1413584 -1829971 -2583588 -2850119
3079 -2850119 -5283728 -8702220 -9725462 -7867292 -5976310 -5751891 -5730382 -4379085 -2684136
3070 -2684136 -2298359 -2826164 -2659557 -1785306 -2154087 -4994310 -8698133 -10226839 -8607030
3061 -8607030 -6155466 -5532892 -6386807 -6399692 -5207045 -4944994 -6430201 -7452411 -6424384
3052 -6424384 -5253888 -6057563 -6958653 -4517862 590192 3977687 3708043 2575963 3299844
$$ packed form
3116F344872k82512r80815k09525O61047n4759j434528j597312o93273k6891K04051
3106A930355J93120o85853k208384k332352k87834J323182J67624k020465k250313
3097f170920r83286n59498n21179J408512M410171M805826J500470k267080l197711
3088a574695j214884J773340L716065K907864n64423l629683l243555p53617k66531
3079b850119k433609l418492j023242J858170J890982K24419K1509J351297J694949
3070b684136L85777n27805J66607Q74251l68781k840223l703823j528706J619809
3061h607030K451564O22574q53915j2885J192647K62051j485207j022210J028027
3052f424384J170496q03675r01090K440791N108054L387495k69644j132080P23881
$$ plain form
3043 3299844 4581432 3746122 1040543 -801506 -35634 2661788 5328128 6093203 4322249
3034 4322249 1350847 -807674 -2086689 -4324838 -7880893 -10189804 -9171858 -6349276
3026 -6349276 -4584838 -4143422 -3385298 -2307762 -2498946 -3803420 -3972862 -2266162 -895480
3017 -895480 -1752954 -3690879 -4468637 -3888196 -3404919 -3627965 -3870437 -3785469 -3963067 -4693483
3007 -4693483 -5078900 -3909965 -1296248 863153 514100 -2069942 -3977790 -2742437 632923
2998 632923 2986534 3121208 2900002 3984371 5487768 5820642 5044796 4035182 2898945
2989 2898945 1807900 1856792 3141168 3386155 883210 -2285721 -2678299 -409666 1391019
2980 1391019 1642338 2263586 3699132 3413070 454791 -1989084 -1111444 1231262 1712905
$$ packed form
3043C299844J281588q35310k705579j842049P65872K697422K666340P65075j770954
3034D322249k971402k158521j279015k238149l556055k308911J017946K822582
3026f349276J764438M41416P58124J077536j91184j304474j69442J706700J370682
3017h95480q57474j937925p77758N80441M83277k23046k42472Q4968j77598p30416
3007d693483l85417J168935K613717K159401l49053k584042j907848J235353L375360
2998F32923K353611J34674k21206J084369J503397L32874p75846j009614j136237
2989B898945j091045M8892J284376K44987k502945l168931l92578K268633J800685
2980A391019K51319O21248J435546k86062k958279k443875Q77640K342706M81643
$$ plain form
2971 1712905 852839 1744677 4801610 7281793 7581086 6759746 5771429 4206477 2254563
2962 2254563 1104190 496776 -1625069 -5798898 -9495586 -10408360 -9642641 -9947485 -11889312
2953 -11889312 -13511237 -13315281 -12080518 -11523531 -11920008 -11473037 -8220495 -2651489 2218437
2944 2218437 4111852 4099277 4644827 5749607 5119370 2057121 -1287617 -3206987 -4522918
2935 -4522918 -6067253 -6287609 -3430929 1201616 4187656 3583620 356677 -2882943 -3501655
2926 -3501655 -524009 3834476 5565624 3366367 403468 -88887 822004 329507 -874773
2917 -874773 404470 4183868 6545949 5210373 2435973 1181568 1410590 1765424 2143314
2908 2143314 2584024 1877839 -426591 -2332188 -1930003 -239541 592041 587706 1152936
$$ packed form
2971A712905q60066Q91838L056933K480183K99293q21340r88317j564952j951914
2962B254563j150373o07414k121845m173829l696688r12774P65719l04844j941827
2953a1889312j621925J95956J234763N56987l96477M46971L252542N569006M869926
2944B218437J893415j2575N45550J104780o30237l062249l344738j919370j315931
2935d522918j544335k20356K856680M632545K986040o04036l226943l239620o18712
2926c501655K977646M358485J731148k199257k962899m92355R10891m92497j204280
2917h74773J279243L779398K362081j335576k774400j254405K29022L54834L77890
2908B143314M40710p06185k304430j905597M02185J690462Q31582m335N65230
$$ plain form
2899 1152936 2149485 2292046 1730980 1714506 2139831 1940954 1574803 2443973 3934228 3922949
2889 3922949 2518040 2156246 3167448 2644307 -521815 -2758530 -817555 2827557 3123858
2880 3123858 -496479 -3939161 -4709815 -4470425 -5005868 -5435397 -4876553 -4712246 -6015286
2871 -6015286 -6991049 -5416760 -2142145 158563 688359 774106 1205935 1623241 2162494
2862 2162494 3425612 4722210 4370447 2082599 -640691 -2713888 -4330562 -5414917
2854 -5414917 -5200343 -3925415 -2986281 -2591397 -1252854 1334409 3048635 2548033 1627937
2845 1627937 2173716 2602289 312835 -3427489 -4543696 -2109369 123273 -924936 -3724397
2836 -3724397 -5141001 -4921107 -4964286 -5779664 -6161977 -5612227 -4708863 -3238648 -199491
$$ packed form
2899A152936R96549J42561n61066j6474M25325j98877l66151Q69170J490255j1279
2889C922949j404909l61794J011202n23141l166122k236715J940975L645112K96301
2880C123858l620337l442682p70654K39390n35443m29529N58844J64307j303040
2871f015286r75763J574289L274615K300708N29796Q5747M31829M17306N39253
2862B162494J263118J296598l51763k287848k723290k073197j616674j084355
2854e414917K14574J274928R39134L94884J338543K587263J714226n00602r20096
2845A627937N45779M28573k289454l740324j116207K434327K232642j048209k799461
2836c724397j416604K19894m3179q15378l82313N49750R03364J470215L039157
$$ plain form
2827 -199491 3828582 6182024 5100403 2112487 234501 353301 664473 -288196 -1277474
2818 -1277474 19194 3624562 6702695 6829966 4922005 3921605 4983591 6243359
2810 6243359 5605058 3526414 2180704 2597435 3725638 4130910 3599695 2810043 2159745
2801 2159745 1518863 908395 784908 1339475 1872682 1560025 928177 1637542 4013948
2792 4013948 5550909 3321994 -2134546 -6761341 -7206151 -3882666 541351 4080745
2784 4080745 5893397 5460942 3116399 538188 -986743 -2172073 -3969359 -5001407
2776 -5001407 -3017367 1388390 5050633 6492961 7281862 8362268 7932180 4768219 1185288
2767 1185288 74113 710844 492927 -283060 1108219 4653451 6560796 4669990 1941660
$$ packed form
2827a99491M028073K353442j081621k987916j877986J18800L11172r52669r89278
2818a277474J296668L605368L078133J27271j907961j000400J061986J259768
2810F243359o38301k078644j345710M16731J128203M05272n31215p89652o50298
2801B159745o40882o10468j23487N54567N33207l12657o31848P09365K376406
2792D013948J536961k228915n456540m626795m44810L323485M424017L539394
2784D080745J812652m32455k344543k578211j524931j185330j797286j032048
2776e001407J984040M405757L662243J442328P88901J080406m30088l163961l582931
2767A185288j111175O36731k17917p75987J391279L545232J907345j890806k728330
$$ plain form
2758 1941660 2393301 5524802 7305841 5726375 2844148 1367171 1383946 1226269 109172
2749 109172 -1227335 -1926125 -2074225 -2265839 -2577636 -2294977 -699125 2000819 4674581
2740 4674581 6151446 5954378 4386344 2319200 795272 310390 473449 749755 1153449
2731 1153449 1386020 -104237 -4370059 -9087164 -9691238 -4767560 1406978 3547095 1333007
2722 1333007 -1318686 -1799892 -916652 86160 1418889 2854071 2597467 -362157 -4420188
2713 -4420188 -7236081 -8151869 -7645362 -5833545 -2912041 146615 2843003 6080253 10277407
2704 10277407 13431323 12854394 8491218 3043468 -886982 -2507420 -2294248 -1467910 -1822465
2695 -1822465 -4328165 -7613955 -9180535 -8386839 -7033394 -6752083 -7048195 -6370011 -4113678
$$ packed form
2758A941660M51641L131501J781039j579466k882227j476977J6775j57677j117097
2749A09172j336507o98790j48100j91614l11797K82659J595852K699944K673762
2740D674581J476865j97068j568034k067144j523928m84882J63059K76306M03694
2731A153449K32571j490257m265822m717105o04074M923678O174538K140117k214088
2722A333007k651693m81206Q83240J002812J332729J435182k56604k959624m058031
2713d420188k815893r15788N06507J811817K921504L058656K696388L237250M197154
2704A0277407L153916n76929m363176n447750l930450j620438K13172Q26338l54555
2695a822465k505700l285790j566580P93696J353445K81311k96112O78184K256333
$$ plain form
2686 -4113678 -1063196 1478093 2703968 3003294 3651803 5236739 6692744 6723400 5674191
2677 5674191 4757743 3947318 2453729 1131379 2096210 5261255 7441164 6312891 3597242
2668 3597242 2545992 3421700 3494914 1110801 -2187608 -3958736 -3905353 -3743270 -4475827
2659 -4475827 -4665010 -2064713 2983640 6799274 6156495 2260539 -831675 -1687988 -3027898
2650 -3027898 -6884315 -10767213 -10836951 -7170712 -3072175 -20126 3528412 8147210 11453786
2641 11453786 11550400 10077829 9732442 10206976 9051160 6027601 3948947 4463113 5243677
2632 5243677 3230368 -542204 -1795170 1297423 5713570 7961739 8595679 10130546
2624 10130546 12028585 11035087 6415179 1625533 -227406 109483 455819 526623 845111
$$ packed form
2686d113678L050482K541289J225875K99326O48509J584936J456005L0656j049209
2677E674191r16448q10425j493589j322350R64831L165045K179909j128273k715649
2668C597242j051250Q75708P3214k384113l298409j771128N3383J62083p32557
2659d475827j89183K600297N048353L815634o42779l895956l092214q56313j339910
2650c027898l856417l882898o9738L666239M098537L052049L548538M618798L306576
2641A1453786R6614j472571l45387M74534j155816l023559k078654N14166P80564
2632E243677k013309l772572j252966L092593M416147K248169O33940J534867
2624A0130546J898039r93498m619908m789646j852939L36889L46336P0804L18488
$$ plain form
2615 845111 635179 -566064 -915045 1157473 3583241 3113380 496986 -249708 2180337
2606 2180337 4584005 4219024 2390253 1644259 2101255 2444155 2426500 2341974 1546936 -473070
2596 -473070 -2596179 -3321052 -2691189 -1597187 -189689 1514992 2451087 1665294 26673
2587 26673 -830610 -778293 -917892 -1529227 -1880528 -1824320 -2091353 -3057769 -4401082 -5728805
2577 -5728805 -6375934 -5058884 -1286244 3084982 5282465 4624633 2714029 886469 -665322
2568 -665322 -1190563 822959 5057077 8364508 7924666 4474683 1227881 413091 1953156
2559 1953156 4600138 6841895 7149352 4987152 1855921 206857 855749 2114776 1816266
2550 1816266 -276536 -2367013 -2628143 -1063326 564523 647725 -426497 -644829 1215850
$$ packed form
2615H45111k09932j201243l48981K072518K425768m69861k616394p46694K430045
2606B180337K403668l64981j828771p45994M56996L42900j7655q4526p95038k020006
2596d73070k123109p24873O29863J094002J407498J704681R36095p85793j638621
2587B6673q57283N2317j39599o11335l51301N6208k67033r66416j343313j327723
2577e728805o47129J317050L772640M371226K197483o57832j910604j827560j551791
2568f65322n25241K013522M234118L307431m39842l449983l246802q14790J540065
2559A953156K646982K241757L07457k162200l131231j649064O48892J259027k98510
2550A816266k092802k090477k61130J564817J627849Q3202j074222k18332J860679
$$ plain form
2541 1215850 3940460 5130254 3796689 1005129 -1892538 -4589368 -6924439 -7643700
2533 -7643700 -5334996 -587071 3889741 5880153 5767126 5376461 5331590 4706789 3184742
2524 3184742 2054366 2272508 2683696 1545517 -725404 -1934054 -1241427 -223731 -159776
2515 -159776 125544 2289451 5383194 6649350 5273766 3513067 3478230 4227820 3144779
2506 3144779 -635378 -5295056 -8327176 -8339314 -5260641 -293961 3962285 4761167 1794169
2497 1794169 -1960489 -3101526 -1526215 -370838 -1934453 -4482910 -3953390 1336338
2489 1336338 8536089 13201313 13792590 12462636 11619988 11039396 9149392 6120658 4021133
2480 4021133 3977708 4817328 5088291 4988640 5248215 5246088 3712403 800318 -1845380 -2889206
$$ packed form
2541A215850K724610J189794j333565k791560k897667k696830k335071p19261
2533g643700K308704M747925M476812J990412j13027l90665m4871o24801j522047
2524C184742j130376K18142M11188j138179k270921j208650O92627J017696O3955
2515a59776K85320K163907L093743J266156j375584j760699l4837P49590j083041
2506C144779l780157m659678l032120j2138L078673M966680M256246P98882k966998
2497A794169l754658j141037J575311J155377j563615k548457N29520N289728
2489A336338P199751M665224N91277j329954q42648n80592j890004l028734k099525
2480D021133m3425Q39620K70963r9651K59575k127j533685k912085k645698j043826
$$ plain form
2470 -2889206 -2261937 -795372 122480 -710336 -2530859 -2384946 1423162 6271584 7989542
2461 7989542 6369225 4948537 5042922 3723690 -531354 -3768000 -1498206 4443376 7755602
2452 7755602 5570254 1154730 -1053592 -56748 2278470 3655705 2644754 -179481
2444 -179481 -1915287 -301136 2656044 2422879 -2109041 -6961177 -8306960 -6768535 -5047991
2435 -5047991 -3839387 -2308594 -738406 -139299 -230143 20634 528491 585262 479493
2426 479493 809248 847431 -507882 -2606330 -3734987 -3654918 -3628978 -4032081 -3732010 -2032773
2416 -2032773 270993 1979558 2353751 892286 -2349155 -6029641 -8312922 -8518016 -7050990
2407 -7050990 -4131458 -68528 3563862 4961415 4388363 3604696 2942855 1147474 -1535873
$$ packed form
2470b889206O27269J466565R17852q32816j820523J45913L808108M848422J717958
2461G989542j620317j420688R4385j319232m255044l236646K269794N941582L312226
2452G755602k185348m415524k208322R96844K335218J377235j010951k824235
2444a79481j735806J614151K957180k33165m531920m852136j345783J538425J720544
2435e047991J208604J530793J570188N99107r0844K50777N07857N6771j05769
2426D79493L29755L8183j355313k098448j128657Q0069K5940m03103L00071J699237
2416b032773K303766J708565L74193j461465l241441l680486k283281k05094J467026
2407g050990K919532M062930L632390J397553n73052p83667o61841j795381k683347
$$ plain form
2398 -1535873 -2733747 -1534051 -252219 -921589 -2173286 -1710920 17187 1205828 2200260
2389 2200260 4445686 6776114 6332491 3326319 1314971 1719333 1591583 -1055560 -2869557
2380 -2869557 396289 6870785 10153195 7756904 3981096 3197881 3951465 2466515 -515775
2371 -515775 -387199 4226065 8675220 7888945 2336195 -3364156 -6166108 -6799665 -7006497
2362 -7006497 -6913136 -5696184 -3321593 -531782 2334431 5546190 8898548 11009898 10296088
2353 10296088 6795567 2568936 -254043 -1578573 -2794601 -4377580 -5266727 -4889144
2345 -4889144 -4377221 -4830426 -5437165 -4513037 -1683078 2059482 5662075 8083762 7921408
2336 7921408 4838551 1141008 97712 2400846 5611255 7201412 6797085 5364128
$$ packed form
2398a535873j197874J199696J281832o69370j251697M62366J728107J188641R94432
2389B200260K245426K330428m43623l006172k011348M04362j27750k647143j813997
2380b869557L265846O474496L282410k396291l775808p83215P53584j484950k982290
2371e15775J28576M613264M449155p86275n552750n700351k801952o33557k06832
2362g006497R3361J216952K374591K789811K866213L211759L352358K111350p13810
2353A0296088l500521m226631k822979j324530j216028j582979q89147L77583
2345d889144N11923m53205o06739R24128K829959L742560L602593K421687j62354
2336G921408l082857l697543j043296K303134L210409J590157m04327j432957
$$ plain form
2328 5364128 3747201 2464107 1788023 1734920 2781811 6066022 11312015 15189961 14214976
2319 14214976 9416027 5597664 5516133 7451443 9115369 10559202 11648385 10281382
2311 10281382 6065648 2891681 4111700 7055467 6371239 1744708 -1927483 -1874478 -741823
2302 -741823 -1663376 -3732100 -4153037 -2266999 493797 2863188 4209246 3938565 1911196
2293 1911196 -1070587 -3818629 -5258790 -4542273 -1955912 373711 366994 -1298089 -2127655
2284 -2127655 -1508173 -1242558 -2041029 -2064200 -7450 2732388 4301726 4583802 3685688
2275 3685688 606008 -4490130 -8638502 -9163389 -7050521 -5056367 -3846123 -2394992
2267 -2394992 -900773 -434967 -429005 634698 2322523 2748867 1924421 1983109 3883328
$$ packed form
2328E364128j616927j283094o76084n3103J046891L284211N245993L877946r74985
2319A4214976m798949l818363q1531J935310J663926J443833J089183j367003
2311A0281382m215734l173967J220019K943767o84228m626531l672191N3005J132655
2302g41823r21553k068724m20937J886038K760796K369391J346058k70681k027369
2293A911196k981783k748042j440161P16517K586361K329623o717j665083q29566
2284b127655O19482K65615p98471k3171K056750K739838J569338K82076q98114
2275C685688l079680n096138m148372n24887K112868J994154J210244J451131
2267b394992J494219M65806N962J063703J687825M26344q24446N8688J900219
$$ plain form
2258 3883328 6402357 8706557 11270963 13606517 13807995 11610455 9511820 9283477 9416926
2249 9416926 7853185 5461920 4588837 5341878 5698346 4813877 4036235 4564210 5908500
2240 5908500 7069687 7821835 8234177 7947210 6638844 4702504 2987169 2119530 2209113
2231 2209113 2808271 3004155 2034607 225294 -897128 85938 2831695 5053932 4400197
$$ packed form
2258C883328K519029K304200K564406K335554K01478k197540k098635k28343J33449
2249I416926j563741k391265q73083P53041L56468q84469p77642N27975J344290
2240E908500J161187P52148M12342k86967j308366j936340j715335q67639Q9583
2231B209113N99158J95884r69548j809313j122422R83066K745757K222237o53735
$$ [...]
##END NTUPLES=NMR SPECTRUM
##END=
