##TITLE=31Pdec_DE-91_3_k
 CDCl3, 64 sc
 23.6.2025
##JCAMPDX= 6.0         $$ Bruker NMR JCAMP-DX V2.0
##DATA TYPE= NMR SPECTRUM
##DATA CLASS= NTUPLES
##ORIGIN= UXNMR, Bruker Analytische Messtechnik GmbH
##OWNER= root
$$ XWIN-NMR		Version 3.5
$$ Mon Jun 23 13:57:47 2025 Russian Standard Time (UT+4h)  she@DPX200
##.OBSERVE FREQUENCY= 81.013821
##.OBSERVE NUCLEUS= ^31P
##.ACQUISITION MODE= SIMULTANEOUS
##.ACQUISITION SCHEME= undefined
##.AVERAGES= 64
##.DIGITISER RES= 17
##SPECTROMETER/DATA SYSTEM= spect
##.PULSE SEQUENCE= zgpg30
##.SOLVENT NAME= CDCl3
##.SHIFT REFERENCE= (INTERNAL, CDCl3, 0, 198.062)
##AUDIT TRAIL= $$ (NUMBER, WHEN, WHO, WHERE, WHAT)
$$ ##TITLE= Audit trail, XWIN-NMR		Version 3.5
$$ ##JCAMPDX= 5.01
$$ ##ORIGIN= Bruker BioSpin GmbH
$$ ##OWNER= she
$$ F:/spectra/data/she/nmr/P31/2/pdata/1/auditp.txt
$$ ##AUDIT TRAIL=  $$ (NUMBER, WHEN, WHO, WHERE, WHAT)
(   1,<2025-06-23 13:56:28.29 +0400>,<she>,<DPX200>,
      <created by zg, POWCHK disabled, PULCHK disabled
       configuration hash MD5:
       00 E9 B6 7A A2 85 ED C7 34 08 36 98 17 FE 4E 26
       data hash MD5: 32K
       8E CC A9 53 ED 1E B0 15 14 5D CD 49 62 5F E1 25>)
(   2,<2025-06-23 13:56:45.34 +0400>,<she>,<DPX200>,
      <Start of raw data processing
       efp BC_mod = 2 LB = 1.5 FT_mod = 6 PKNL = 1 PHC0 = 1701.573 PHC1 = -736.3068 SI = 64K 
       data hash MD5: 64K
       32 89 19 26 DE 63 2E DE 21 7A 7B 40 9E 8B 6F 9B>)
(   3,<2025-06-23 13:57:13.75 +0400>,<she>,<DPX200>,
      <pk PHC0 = -10.15052 PHC1 = 0 
       data hash MD5: 64K
       16 77 1C 6F 8E F7 95 A1 70 3E 59 C7 72 06 B9 5D>)
(   4,<2025-06-23 13:57:18.10 +0400>,<she>,<DPX200>,
      <abs ABSG = 5 
       data hash MD5: 64K
       D3 3C 9F 18 30 13 51 BA 8A A7 C8 6C E4 DC 39 66>)
$$ ##END=
$$ 
$$ hash MD5
$$ E3 E3 77 B8 01 84 53 1B 58 F3 3C 91 1C 9E CE 83
##$RELAX= 
##$RELAX= 
##$RELAX= 
##$RELAX= 
##$RELAX= 
##$RELAX= 
##$RELAX= 
##$RELAX= 
$$ Bruker specific parameters
$$ --------------------------
##$DU= <F:/spectra>
##$EXPNO= 2
##$NAME= <P31>
##$PROCNO= 1
##$TYPE= <nmr>
##$USER= <she>
##$AMP= (0..31)
100 100 100 100 100 100 100 100 100 100 100 100 100 100 100 100 100 100 
100 100 100 100 100 100 100 100 100 100 100 100 100 100 
##$AQSEQ= 0
##$AQ_mod= 1
##$AUNM= <au_zg>
##$AUTOPOS= <>
##$BF1= 81.014009
##$BF2= 200.13
##$BF3= 200.13
##$BF4= 200.13
##$BF5= 200.13
##$BF6= 200.13
##$BF7= 200.13
##$BF8= 200.13
##$BYTORDA= 1
##$CFDGTYP= 0
##$CFRGTYP= 5
##$CHEMSTR= <none>
##$CNST= (0..31)
1 1 145 1 1 1 1 1 1 1 1 1 1 1 1 1 1 1 1 1 1 1 1 1 1 1 1 1 1 1 1 1 
##$CPDPRG= <waltz16>
##$CPDPRG1= <>
##$CPDPRG2= <waltz16>
##$CPDPRG3= <>
##$CPDPRG4= <mlev>
##$CPDPRG5= <mlev>
##$CPDPRG6= <mlev>
##$CPDPRG7= <mlev>
##$CPDPRG8= <mlev>
##$CPDPRGB= <>
##$CPDPRGT= <>
##$D= (0..31)
0 1 0 0 0 0 0 0 0 0.06 0 0.03 2e-05 3e-06 0 0 0.0002 0 0 0 0 0 0 0 0 0 
0 0 0 0 0 0 
##$DATE= 1750672587
##$DBL= (0..7)
120 120 120 11 120 120 24 19 
##$DBP= (0..7)
150 150 150 150 150 150 150 150 
##$DBP07= 0
##$DBPNAM0= <>
##$DBPNAM1= <>
$$ [...]
##$SUBNAM4= <"">
##$SUBNAM5= <"">
##$SUBNAM6= <"">
##$SUBNAM7= <"">
##$SUBNAM8= <"">
##$SUBNAM9= <"">
##$SW= 400.765351723535
##$SWIBOX= (0..15)
0 1 3 0 0 0 0 0 0 0 0 0 0 0 0 0 
##$SW_h= 32467.5324675325
##$TD= 32768
##$TD0= 1
##$TE= 0
##$TE2= 300
##$TE3= 300
##$TEG= 300
##$TL= (0..7)
0 120 53 12 22 120 120 120 
##$TP= (0..7)
150 150 150 150 150 150 150 150 
##$TP07= 0
##$TPNAME0= <>
##$TPNAME1= <>
##$TPNAME2= <>
##$TPNAME3= <>
##$TPNAME4= <>
##$TPNAME5= <>
##$TPNAME6= <>
##$TPNAME7= <>
##$TPOAL= (0..7)
0.5 0.5 0.5 0.5 0.5 0.5 0.5 0.5 
##$TPOFFS= (0..7)
0 0 0 0 0 0 0 0 
##$TUNHIN= 0
##$TUNHOUT= 0
##$TUNXOUT= 0
##$USERA1= <user>
##$USERA2= <user>
##$USERA3= <user>
##$USERA4= <user>
##$USERA5= <user>
##$V9= 5
##$VALIST= <valist>
##$VCLIST= <CCCCCCCCCCCCCCC>
##$VD= 0
##$VDLIST= <DDDDDDDDDDDDDDD>
##$VPLIST= <PPPPPPPPPPPPPPP>
##$VTLIST= <TTTTTTTTTTTTTTT>
##$WBST= 1024
##$WBSW= 4
##$XGAIN= (0..3)
0 0 0 0 
##$XL= 0
##$YL= 0
##$YMAX_a= 32036
##$YMIN_a= -15949
##$ZGOPTNS= <>
##$ZL1= 120
##$ZL2= 120
##$ZL3= 120
##$ZL4= 120
##$ABSF1= 198.0616
##$ABSF2= -202.7028
##$ABSG= 5
##$ABSL= 3
##$ALPHA= 0
##$AQORDER= 0
##$ASSFAC= 0
##$ASSFACI= 0
##$ASSFACX= 0
##$ASSWID= 0
##$AUNMP= <proc_1d>
##$AZFE= 0.1
##$AZFW= 0.5
##$BCFW= 0
##$BC_mod= 2
##$BYTORDP= 0
##$COROFFS= 0
##$CY= -3
##$DATMOD= 1
##$DC= 0
##$DFILT= <>
##$DTYPP= 0
##$F1P= 0
##$F2P= 0
##$FCOR= 1
##$FTSIZE= 65536
##$FT_mod= 6
##$GAMMA= 0
##$GB= 0
##$INTBC= 1
##$INTSCL= 9.790993e-09
##$ISEN= 30
##$LB= 1.5
##$LEV0= 0
##$LPBIN= 0
##$MAXI= 10000
##$MC2= 0
##$MEAN= 0
##$ME_mod= 0
##$MI= 50
##$NCOEF= 0
##$NC_proc= -8
##$NLEV= 6
##$NOISF1= 182.463
##$NOISF2= 159.3651
##$NSP= 0
##$NTH_PI= 0
##$NZP= 0
##$OFFSET= 198.0616
##$PC= 4
##$PHC0= 1691.422
##$PHC1= -736.3068
##$PH_mod= 1
##$PKNL= yes
##$PPARMOD= 0
##$PSCAL= 0
##$PSIGN= 0
##$REVERSE= no
##$SF= 81.0140089999434
##$SI= 65536
##$SIGF1= 159.3651
##$SIGF2= -187.1042
##$SINO= 113.3802
##$SIOLD= 16384
##$SREGLST= <1H.CDCl3>
##$SSB= 0
##$STSI= 65536
##$STSR= 0
##$SW_p= 32467.5324675325
##$SYMM= 0
##$S_DEV= 0
##$TDeff= 32768
##$TDoff= 0
##$TI= <>
##$TILT= no
##$TM1= 0
##$TM2= 0
##$TOPLEV= 0
##$USERP1= <user>
##$USERP2= <user>
##$USERP3= <user>
##$USERP4= <user>
##$USERP5= <user>
##$WDW= 1
##$XDIM= 65536
##$YMAX_p= 154789513
##$YMIN_p= -301403832
$$ End of Bruker specific parameters
$$ ---------------------------------
##NTUPLES= NMR SPECTRUM
##VAR_NAME=  FREQUENCY,     SPECTRUM/REAL,   SPECTRUM/IMAG
##SYMBOL=    X,             R,               I
##VAR_TYPE=  INDEPENDENT,   DEPENDENT,       DEPENDENT
##VAR_FORM=  AFFN,          ASDF,            ASDF
##VAR_DIM=   65536,         65536,           65536
##UNITS=     HZ,            ARBITRARY UNITS, ARBITRARY UNITS
##FACTOR=    0.49542278885378, 1,            1
##FIRST=     16045.7642231865, 0,            0
##LAST=      -16421.768244346, 0,            0
##MIN=       -16421.768244346, -301403832,   0
##MAX=       16045.7642231865, 154789513,    0
$$ Real data points
##PAGE= N=1
##DATA TABLE= (X++(R..R)), XYDATA
$$ [...]
##PAGE= N=2
##DATA TABLE= (X++(I..I)), XYDATA
7448a5842397K111452L869876J664292o98699j00178J714298J582065J54676M68692
7439e075923K429438K522438n59937l466640k885550j9853J682637J335037Q03561
7430c234792J238337J734600J142135n29071k444900l495237k754569m64476J700465
7421g107508K243078J389376L25180m57141j127847j486983j079593j5721J134007
7412f183152J858966J600829j6082k111266k751698j239493P96242J603465J396830
7403e045359J087589N14664k90664K75873K933825M884329K825357j796993l914617
7394A474004j585577J660785K221622R36395L47466K83820r57974k706382k405742
7385g31583K74908K518359K114497J76681r14187r60128j831139m122825n390663
$$ y = [-15842397, -13730945, -9861069, -8196777, -8895476, -8995654, -7281356, -5699291, -5544615, -5075923, -2646485, -124047, -683984, -4150624, -7036174, -7056027, -5373390, -4038353, -3234792, -1996455, -261855, 880280, 351209, -2093691, -5588928, -8343497, -8807973, -7107508, -4864430, -3475054, -3149874, -3607015, -4734862, -6221845, -7301438, -7317159, -6183152, -4324186, -2723357, -2739439, -4850705, -7602403, -8841896, -8045654, -6442189, -5045359, -3957770, -3443106, -3733770, -3457897, -524072, 4360257, 7185614, 5388621, 1474004, -111573, 1549212, 3770834, 4707229, 5054695, 5338515, 4380541, 1674159, -731583, -456675, 2061684, 4176181, 4352862, 3438675, 2478547, 647408, -3475417, -8866080]
7376h866080k817684K687038O494637N215842P35859k058496j109316R88800J107387
7367B377987m57876j227889k51753J099996J454867R40996K92380l10933j005440
7358B912335j547023j493504r74127q25152j619459k600580k165551K8924J891502
7349f392635R70800k143197l790937j479495K824171M939503L512669J246465
7341c12656J014286K419509L078939J956895p3209k181976m190897n325247m429476
7332h043832k108050p37230j112830r40551J420540L475853J882984j727036k133553
7323a0023705J768788M718064K554141j617837k044929J386138L603980J961706
7315B306346r57089k354236k911204l927072m079962j625191K009356L442678
$$ y = [-8866080, -11683764, -8996726, -2502089, 2713753, 3449612, 1391116, 281800, 1270600, 2377987, 1920111, 692222, 440469, 1540465, 2995332, 3936328, 4228708, 3917775, 2912335, 1365312, -128192, -1102319, -1927471, -3546930, -6147510, -8313061, -8284137, -6392635, -5421835, -7565032, -11355969, -12835464, -10011293, -5071790, -1559121, -312656, 701630, 3121139, 6200078, 8156973, 8083764, 5901788, 1710891, -3614356, -8043832, -10151882, -10889112, -12001942, -12942493, -11521953, -8046100, -6163116, -7890152, -10023705, -8254917, -3536853, -982712, -2600549, -4645478, -3259340, 344640, 2306346, 1349257, -1004979, -3916183, -7843255, -11923217, -13548408, -11539052, -8096374]
7307h096374J593505j205237k280751j416735l07961j10079j49563R04075K919430
7298h149690M101935L345775J900520J522071J664417L97471j968157k542497
7290B71845j38219K209479R60347k896632m840351k634004J062554K546707J688619
7281a769655J175972K180725K891986J620796n48055j482985j112426r98975j507760
7272D49623j625653j514766k622467m468301m024879m0645M302828N322278L508112
7263g13870J660942K14430k108022m194693l338575j52690J468090K64983l75828
7254g275233J935348M453499L438608j34384k052145o52136J626574J943854J74091
7245C458076j680710j976094j263357j737588m059913n206128j751145M478391
$$ y = [-8096374, -6502869, -7708106, -9988857, -11405592, -11713553, -11823632, -11973195, -11069120, -8149690, -4047755, -701980, 1198540, 2720611, 4385028, 4782499, 2814342, 271845, 133626, 2343105, 3303452, 406820, -4433531, -7067535, -6004981, -3458274, -1769655, -593683, 1587042, 4479028, 6099824, 5551769, 4068784, 2956358, 1957383, 449623, -1176030, -2690796, -5313263, -9781564, -13806443, -13847088, -9544260, -4221982, -713870, 947072, 1161502, -946520, -5141213, -8479788, -8632478, -7164388, -6899405, -7275233, -5339885, -886386, 2552222, 2417838, 365693, -286443, 1340131, 3283985, 3458076, 1777366, -198728, -1462085, -3199673, -7259586, -12465714, -14216859, -9738468]
7237i738468P191061L608287j426330j934344J181124K165554j055047m353451
7229d361614l386802J157906N052139N102997J643264k058121k698755m08366
7221D2648J173095m02213k754273j949572J612015L657407K173698k61515r40205
7212B351085n91463j006451j822420j755270j093575p77096l59523R50049K181990
7203a922674J750715K17029k59547P50024J179409m32610k784286l723826l032205
7194h257971k003934j084278M39841K465571L388995K108458k94493j778666j673679
7185f690156r88631q76437j598255k562893k569398o01838K538810M046734K073777
7176g228287j497988k973269j382004P99400J487600J298409J441332J573432
$$ y = [-9738468, -2547407, 1060880, -365450, -2299794, -1118670, 1046884, -8163, -4361614, -7748416, -6590510, -1538371, 3564626, 5207890, 3149769, 451014, 42648, 1215743, 813530, -1940743, -3890315, -2278300, 1379107, 3552805, 3291290, 2351085, 1759622, 753171, -1069249, -2824519, -3918094, -4695190, -5054713, -4104664, -1922674, -171959, 45070, -214477, 535547, 1714956, 1282346, -1501940, -5225766, -8257971, -10261905, -11346183, -10906342, -8440771, -5051776, -2943318, -3237811, -5016477, -6690156, -7678787, -8555224, -10153479, -12716372, -15285770, -15887608, -13348798, -9302064, -7228287, -8726275, -11699544, -13081548, -12282148, -10794548, -9496139, -8054807, -6481375]
7168f481375R38995q5907p64473r32993m09182R17248J844024Q30079j057621
7159e201205p77109J937969L430522J537130r79914r84525J53995l10921j233355
7150b427413J94999K769128K652076k86441k205397j459147o29235j622407k702699
7141e716536j827818J72577J302558J040306J07279p06891q82543o82153j101374
7132h294595j910989j006051K080548L890230J735347j109697L88244M794641
7124E67678N877677K374687k36660J068912K352774K1283l283330l821591k769702
7115B151728k828405k981611j196340R23891O56557j222165k270551k314878j902627
7106a0984401K33126M030569N382013J436007l734521l961783K32105K943815
$$ y = [-6481375, -5542380, -5628287, -6392760, -7325753, -7734935, -6817687, -4973663, -4143584, -5201205, -5978314, -4040345, -609823, 927307, -52607, -1037132, -883137, -1194058, -2427413, -2232414, 536714, 3188790, 2902349, 696952, -762195, -1391430, -3013837, -5716536, -7544354, -7371777, -6069219, -5028913, -4921634, -5628525, -6511068, -7193221, -8294595, -10205584, -11211635, -9131087, -5240857, -3505510, -4615207, -4226963, 567678, 6445355, 8820042, 8583382, 9652294, 12005068, 12026351, 8743021, 4921430, 2151728, -676677, -3658288, -4854628, -3930737, -3274180, -4496345, -6766896, -9081774, -10984401, -10751275, -6720706, -1338693, 97314, -3637207, -7598990, -7366885, -4423070]
7098d423070J720306m00870j099819j448152k004950j356560L94269J035323L02938
7089g280585O50197K774727M012942K587063K20747r71741j398717k276126l297160
7080d978653l412573k287540k12592J980505K831408J763189L58143K34730M86067
7071c237316l30714q48262J056447L693372L108926q90604m303787m690892l274999
7062i717829j139974J973346M376920L068289p72627j965808Q28691K536413j76916
7053i89495l279825j923156J886143L086506J510151O02533P14949n70466k713326
7044a675986k447960L53012J992900P02748j149020j451908j176284j622516k158464
7035h633478k154277k367321k803281j641756J809702M969317M885098K152004
$$ y = [-4423070, -2702764, -3103634, -4203453, -5651605, -7656555, -9013115, -8618846, -7583523, -7280585, -6630388, -3855661, 157281, 2744344, 2965091, 1993350, 594633, -1681493, -4978653, -8391226, -10678766, -10891358, -8910853, -6079445, -4316256, -3958113, -3723383, -3237316, -3568030, -4416292, -3359845, 333527, 3442453, 2551849, -1751938, -6442830, -9717829, -10857803, -8884457, -4507537, -1439248, -2211875, -4177683, -3348992, -812579, -989495, -4269320, -6192476, -4306333, -1219827, 290324, 892857, 1607806, 1037340, -1675986, -4123946, -3770934, -1778034, -1075286, -2224306, -3676214, -4852498, -6475014, -8633478, -10787755, -13155076, -15958357, -17600113, -15790411, -10821094, -5935996, -3783992]
7027c783992m3989j85094K42092k62933q15566R3228J619958J353442q63432k077802
7017d724088m37490J720114J307409n03356r8876K338541K619879o18898l255141
7008a651906k088901R5724n93181k423937q82470L449995N015796J447196k890183
6999e21867l018643K87536K388216J032566j515474j981461j7816J819005J452037
6990g5901k27549q97253j64644K50765l23721m24150O54189J255334K11529r47155
6980f88556o78900k38837j298999k596468j857513L52959J696057J746548J534640
6971b029069O47977j669189l474601k157140R03160J854944N90106R62418L976475
6962c94919N375668K060340k997165m986723l470438j497429p34004m64962j61599
$$ y = [-3783992, -3827981, -4013075, -3770983, -4033916, -4849482, -4756254, -3136296, -1782854, -2646286, -4724088, -5161578, -3441464, -2134055, -2637411, -2736287, -397746, 2222133, 1603235, -1651906, -3740807, -3645083, -4238264, -6662201, -7544671, -4094676, 921120, 2368316, -521867, -3540510, -3252974, -864758, 167808, -1347666, -3329127, -3346943, -1527938, -75901, -303450, -1200703, -1365347, -1114582, -1438303, -1862453, -1208264, 47070, 258599, -688556, -1367456, -1606293, -2905292, -5501760, -7359273, -7006314, -5310257, -3563709, -2029069, -1381092, -3050281, -6524882, -8682022, -7778862, -5923918, -5333812, -4371394, -394919, 4980749, 7041089, 4043924, -942799, -4413237, -5910666, -6644670, -7109632, -7271231]
6953g271231l42832j237411k289573k736193j851474N73319L306835M330252L135075
6944d383233J281427J87114k73421n41364m44652j26445j57587q0162J230756
6935c307567L054851K972723O26498j107205l32306Q31855l87377l010729l905946
6926d565203k453895q49974l95833j26773Q28922J714446J537031N96747j4633
6917c729165K02950O43748L87794m28939m27834J038484K224103R14426k087439
6908a261872l500983k049778j46017j66722j308489j502468l46211J446007L455408
6899e381125M645618L165613o98983l285859j883275J208140J703425p84181k852407
6890d163034k508801j130966l75423j11184L4643m60899j600903j936981j21965
$$ y = [-7271231, -7614063, -8851474, -11141047, -13877240, -15728714, -15155395, -11848560, -7518308, -4383233, -3101806, -2914692, -3188113, -3729477, -4174129, -4300574, -4458161, -4538323, -3307567, -252716, 2720007, 3346505, 2239300, 1906994, 2738849, 2351472, -659257, -4565203, -7019098, -7869072, -8264905, -8391678, -7562756, -5848310, -4311279, -3714532, -3729165, -3526215, -2882467, -2494673, -2923612, -3351446, -2312962, -88859, 825567, -1261872, -4762855, -6812633, -6958650, -7125372, -8433861, -9936329, -10282540, -8836533, -5381125, -735507, 2430106, 1731123, -1554736, -3438011, -2229871, -526446, -1310627, -4163034, -6671835, -7802801, -8178224, -8289408, -8254765, -8715664, -10316567, -12253548, -12375513]
6881a2375513L196162N455882M230937p7493l511989k176366K665393N174380
6873B581393K035731l246876n139232k811178N81257K971971M117316L114496
6865D204878m03801l439074k457821J066896K208062j59150k052117r59381Q21686
6856a169822P86136j73884p18391j638261l106761k945518l55053J763764J071168
6847f486622m60236j2237J543220J846211J398737K066068L054655K186076J4065
6838E149937r38680k75849K64601J55024P6835p38776l469356o212092n413351
6829a1401707j299583J720060J025777j138948j740591q57852J40982J274013
6821a2277849K526315K234120m35099l077059k763127o3698K011561K180752J578621
$$ y = [-12375513, -9179351, -3723469, 507468, 429975, -3082014, -5258380, -2592987, 2581393, 4617124, 1370248, -3768984, -6580162, -5998905, -3026934, 1090382, 4204878, 3801077, 362003, -2095818, -1028922, 1179140, 1019990, -1032127, -1991508, -1169822, -383686, -557570, -1275961, -2914222, -6020983, -8966501, -9321554, -7557790, -6486622, -6946858, -6959095, -5415875, -3569664, -2170927, -104859, 2949796, 5135872, 5149937, 4211257, 3935408, 4200009, 4355033, 4431868, 3693092, 223736, -5988356, -11401707, -12701290, -10981230, -9955453, -11094401, -12834992, -13692844, -13551862, -12277849, -9751534, -7517414, -7952513, -11029572, -13792699, -13856397, -11844836, -9664084, -8085463]
6812h085463R33255k67503j681892j616513N70675L199020M175955L067508Q37954
6803A132996j326900k519209k530661k161185k082131j320715J532610N227246
6795d047949O073267K597517j850617l136507j605991q34018j982871k529147
6787g316316q74178R29127N49089r48263r87533M39035J007370j98262j461459
6778h861390j150835J79684J120728J544446K330919L482548L635898J858451
6770D140449o27102j478965k75935N71740r05599k960678k201967J218610L152525
6761F33078J138610k071830k591547p91116J02975o89811q87233N74755J832994
6752b749125J211587m82496j624004j751367j069157K85925J572731J467767l12776
$$ y = [-8085463, -7152208, -7419711, -9101603, -10718116, -10147441, -6948421, -2772466, 295042, 1132996, -193904, -2713113, -5243774, -7404959, -9487090, -10807805, -9275195, -4047949, 2025318, 4622835, 2772218, -364289, -1970280, -2804298, -4787169, -7316316, -8190494, -7261367, -6712278, -7660541, -8648074, -8209039, -7201669, -7399931, -8861390, -10012225, -9832541, -8711813, -7167367, -4836448, -1353900, 2281998, 4140449, 3513347, 2034382, 1758447, 2330187, 1424588, -1536090, -3738057, -2519447, 633078, 1771688, -300142, -2891689, -3682805, -3579830, -4269641, -5156874, -4582119, -2749125, -1537538, -2020034, -3644038, -5395405, -6464562, -6178637, -4605906, -3138139, -3450915]
6743c450915k387795l254972k595909r32881Q53962J611523Q60471k49420k77791
6734i823727L48880K03675l30181N77675K751800L520626J681376m40973m15238
6725a926087Q16542P30516r75400k342518k101722r16596N5740N72852J120719
6716d965954J804979J686759j76460k661038k918637k35587K005914P10998k070693
6707f819719k234474l56792m38529k222224r70185L610829M982765l3961m951394
6698i433684l019329K193498K559481j879076l844688p78103K293611K058166
6690i850124J410779K825182L908887K479870O77002P29017J021641k77333j400368
6681A524553k50473J533711J216073o85553j854448k005958k268450k395748j468247
$$ y = [-3450915, -5838710, -9093682, -11689591, -12622472, -11768510, -10156987, -9296516, -9545936, -9823727, -9474847, -9271172, -9601353, -9023678, -6271878, -2751252, -1069876, -1510849, -1926087, -1109545, -379029, -1354429, -3696947, -5798669, -6715265, -6659525, -6086673, -4965954, -3160975, -1474216, -1650676, -4311714, -7230351, -7465938, -5460024, -4749026, -6819719, -9054193, -9410985, -9849514, -12071738, -13041923, -9431094, -4448329, -4482290, -9433684, -12453013, -10259515, -7700034, -9579110, -13423798, -14201901, -11908290, -9850124, -8439345, -5614163, -1705276, 774594, 1451596, 2180613, 3202254, 2924921, 1524553, 1274080, 2807791, 4023864, 3338311, 1483863, -522095, -2790545, -5186293, -6654540]
6672f654540j02209N53892Q25228J273493R00798r31103k175686n84807K344105
6663d550829K886697L45358j957164j285548J157992K231425O95784j668431k054581
6654d199297M41272L457727L428190l45278m521793n603152l933902k331116j724008
6645a5331357m44170K214382M088529K909752l26757k119878m50921K740414L508801
6636c211205M19296l364602l378756P81020M671520M170015J55026l095595l122327
6627e975608j286761k5149J32302L74416J512422K736008K307671m90148m004266
6618d719113n303658l095237Q28877L462879L432164J613596k89325j016546k26277
6609e312640J282571J993632J044156r00097k495801l051693k607185j310893
$$ y = [-6654540, -6756749, -6202857, -5377629, -4104136, -3203338, -4134441, -6310127, -6894934, -4550829, -1664132, -1318774, -3275938, -4561486, -3403494, -1172069, -476285, -2144716, -4199297, -3758025, -300298, 3127892, 2782614, -1739179, -7342331, -11276233, -13607349, -15331357, -15775527, -13561145, -9472616, -6562864, -6889621, -9009499, -9460420, -6720006, -3211205, -2791909, -6156511, -9535267, -8754247, -4082727, 87288, 242314, -2853281, -5975608, -7262369, -7287518, -7155216, -6780800, -5268378, -2532370, -224699, -714847, -4719113, -10022771, -13118008, -12289131, -8826252, -5394088, -3780492, -4069817, -5086363, -5312640, -4030069, -2036437, -992281, -1892378, -4388179, -7439872, -10047057, -11357950]
6601a1357950N24467K111630K710131K415561J995139K004630K261342K028634
6593D693584P37217j168718k338094k022666j084623o53222m00754M35725R67215
6584h34336k11943j966082j451521J373386K982132J403579p11621k50212J642463
6575A975845J744727k33457j906071k276382k467571k991189l080555k467764
6567a1702417j445000L91233L065334M513806K740984o17236j801777l3566J784283
6558c104356J664285P61518L88624o7411j015573j225588j31495O85946n5491
6549b099541j316882j627830j136012l16780J370800L712954M445503K000232
6541E032444j616532k868868r34633J876194L239380K591817M29009k250532l975672
$$ y = [-11357950, -10833483, -8721853, -6011722, -3596161, -1601022, 403608, 2664950, 4693584, 5430801, 4262083, 1923989, -98677, -1183300, -1836522, -2237276, -1801551, -834336, -1046279, -3012361, -4463882, -3090496, -108364, 1295215, 583594, 333382, 1975845, 3720572, 3487115, 1581044, -695338, -3162909, -6154098, -9234653, -11702417, -13147417, -12756184, -9690850, -5177044, -2436060, -3053296, -4855073, -4888639, -3104356, -1440071, -678553, -289929, -357340, -1372913, -2598501, -2729996, -2044050, -2099541, -3416423, -5044253, -6180265, -6497045, -5126245, -1413291, 3032212, 5032444, 3415912, 547044, -387589, 1488605, 4727985, 7319802, 7748811, 5498279, 1522607]
6532A522607l890008k800467j963159j219489K31004J636625J209736r56175k369860
6523h599186j358667O94684J502502J114761J370363K573501K696250N57683j826411
6514a274520j666262O15061J843549O20949q02752j94838J131948L77086k468824
6505a818603m675141m451046k366970M50307L130748M221621K702242K19525k78914
6496b866231J214224J549972o47577k758510k400931r42399n25088l20332J191342
6487f505530K396491Q10279j999678j791547K056081N282818M514122J159856
6479E922892j580961k801792l289235l066410j712663J001O67882K8444r29135
6470f759977j222129n00964Q86980J730526O66964k037681m146876l863285j915499
$$ y = [1522607, -2367401, -5167868, -7131027, -8350516, -8119512, -6482887, -5273151, -6229326, -8599186, -9957853, -9263169, -7760667, -6645906, -5275543, -2702042, -5792, 551891, -1274520, -2940782, -2325721, -482172, 138777, -663975, -858813, 273135, 650221, -1818603, -6493744, -10944790, -13311760, -12861453, -9730705, -5509084, -2806842, -2587317, -2866231, -1652007, -102035, -749612, -3508122, -5909053, -6851452, -7376540, -7696872, -6505530, -4109039, -3298760, -5298438, -7089985, -5033904, 248914, 4763036, 5922892, 4341931, 1540139, -1749096, -4815506, -6528169, -6527168, -5859286, -5830842, -6759977, -7982106, -8483070, -7596090, -5865564, -5198600, -7236281, -11383157, -15246442, -17161941]
6461a7161941j92080R60056K536379M322883M494893K370195n8018o03498J23413
6452c207718j74505j781898k277659r5555K839889L412670J424662j98114P62621
6443G04393L201734M345280K962452K20561k040912l117024l599707m135852m269445
6434e728520k925765k85449J579903R43766j152686k067640j020392J98250J77427
6425a0281106k79857l1669M95368O14121J103066K825189M553391M149903J636147
6416D784553o73245j213168q45889j083620j843981j795787m53926Q58285M91063
6407a775715j192129j686051O05850L661710L732987J39298l585059m092606j983764
6398f175479R0280J315797K711658M381708N028755L902557J556064j033159k767729
$$ y = [-17161941, -17354021, -16393965, -13857586, -9534703, -5039810, -2669615, -2727633, -3331131, -3207718, -3382223, -5164121, -7441780, -7537335, -4697446, -1284776, 139886, -58228, 704393, 3906127, 8251407, 11213859, 11434420, 9393508, 6276484, 2676777, -1459075, -5728520, -8654285, -8939734, -7359831, -6416065, -7568751, -9636391, -10656783, -10458533, -10281106, -10560963, -10592632, -10097264, -9483143, -8380077, -5554888, -1001497, 3148406, 4784553, 4111308, 2898140, 2052251, 968631, -875350, -2671137, -3125063, -2266778, -1775715, -2967844, -4653895, -4048045, -386335, 3346652, 3485950, -99109, -4191715, -6175479, -6085199, -4769402, -2057744, 2323964, 7352719, 11255276, 12811340, 11778181, 9010452]
6389I010452k575502q40745N9223j541024m015843m481186k693031p43190M25374
6380g395472J532458K332945J500947n21039j452987p26369m31141j705047k715645
6371i581350j579787Q94153K751353L219675K264922j20713k810842l743726k647880
6362a1354195j495358q71191J408876N876310Q460601N443959n33284l474765
6354C460953k206852j329286l727355o313852m947708m03716L099386L469515
6346h898915K260722J447978J110706N80701J07690L67934J071752J144393L39865
6337d67174j50849P61107K390609K908811J487801r18654k789605l185454j916891
6328a880299K07259J351489L80918j194398p46537J576081K597758P17471j567222
$$ y = [9010452, 6434950, 5594205, 5653428, 4112404, 96561, -4384625, -7077656, -7820846, -7395472, -5863014, -3530069, -2029122, -2550161, -4003148, -4729517, -5160658, -6865705, -9581350, -11161137, -10266984, -7515631, -4295956, -2031034, -2151747, -4962589, -8706315, -11354195, -12849553, -13720744, -12311868, -6435558, 2025043, 7469002, 6935718, 3460953, 1254101, -75185, -3802540, -10116392, -15064100, -15467816, -12368430, -8898915, -6638193, -5190215, -4079509, -3498808, -3391118, -3023184, -1951432, -807039, -467174, -618023, 143084, 2533693, 5442504, 6930305, 6011651, 3222046, 36592, -1880299, -1673040, -321551, 59367, -1135031, -1881568, -305487, 2292271, 3009742, 1442520]
6319A442520j472368j09527l68814k195178k905018j422521O67806J976429K474040
6310a912631J883619k41822k424297k023225R26649L015939J860717q02951j852563
6301a570565q84393J29583P6808k98257k21637j25287p38085j703451j622449
6292f957733L17900K818103L339225J162596j277790j374022R7283K05297j760072
6283c429213l393064k839153j040812M00052J416041K359185K555783J446349
6275b524832j25737r78583q26532L37776K515765M379819L609256J35948k704102
6266C818778k251540k65441k78043k384497l380752j623508R58770J955241J309384
6257b141608M59647L54331R47496J433941O83793j384169k851520j696303J224444
$$ y = [1442520, -29848, -139375, -508189, -2703367, -5608385, -7030906, -6363100, -4386671, -1912631, -29012, -270834, -2695131, -4718356, -3791707, -775768, 1084949, 281998, -1570565, -2454958, -2325375, -2248567, -2546824, -2768461, -2893748, -3631833, -5335284, -6957733, -6639833, -3821730, -482505, 680091, -597699, -1971721, -1874438, -1669141, -3429213, -6822277, -9661430, -10702242, -10302190, -8886149, -6526964, -3971181, -2524832, -2650569, -3629152, -4455684, -4117908, -1602143, 2777676, 6386932, 6522880, 3818778, 1567238, 1301797, 1023754, -1360743, -4741495, -6365003, -5406233, -3450992, -2141608, -1681961, -1327630, -380134, 1053807, 1737600, 353431, -2498089, -4194392, -2969948]
6248b969948K739871J340273j044949j905311j144121j61844N67864J413008J936370
6239G71213J129332p15497j758524p39835J402038K554772J715228k04081j712308
6230B442338k337043k560935k559942j853609m37666O19202N05180K3119N33318
6221e626038J747277J846143J06294j759063j668163J79879J722576J770253J213398
6212d67444J249396J375780J05718k523199m246612l035221K66132K649989K269280
6203b356181K77403q22200L5526J665956K060801K96133k544610m168848l317269
6194h873289j302109o02142j840158l121347k608890o00492J408038K472558K381954
6185a2685877J435498Q20049J698461K970623J847151j829797m010823j661692
$$ y = [-2969948, -230077, 1110196, 65247, -1840064, -2984185, -3146029, -2578165, -1165157, 771213, 1900545, 1185048, -573476, -1313311, 88727, 2643499, 4358727, 4154646, 2442338, 105295, -2455640, -5015582, -6869191, -7306857, -6687655, -6182475, -6159356, -5626038, -3878761, -2032618, -1926324, -3685387, -5353550, -5173671, -3451095, -1680842, -467444, 781952, 2157732, 2263450, -259749, -4506361, -7541582, -7275450, -4625461, -2356181, -2078778, -2900978, -2865452, -1199496, 861305, 1157438, -1387172, -5556020, -8873289, -10175398, -10777540, -12617698, -15739045, -18347935, -18948427, -17540389, -15067831, -12685877, -11250379, -10430330, -8731869, -5761246, -3914095, -5743892, -9754715, -11416407]
6177a1416407K337505K917740K33965q14172J626621L613220J852902j231757
6169h80383j556143N90612J852719J180819M31360N12834K48611q60720j544566
6160b4857j171671j133650k636078m397294l901344o42406K840580L556141J408609
6151f101970p08559n27513P03377J60094k211648l259657r59098K784785M751967
6142e368222M129259K186601k01434k689588m038206k781309O42884L872649M810696
6133E63330L065140j68638k646684k393241P6626J620552J60117k267326k066933
6124d057057R62175L548644L515073J800697k50142k659823m765688m197584j54438
6115f258143L995820L955837j36198l605024k600051J851213N369787M749176
$$ y = [-11416407, -9078902, -6161162, -5927197, -6741369, -5114748, -1501528, 351374, -880383, -2436526, -1845914, 6805, 1187624, 1618984, 2131818, 2380429, 1519709, -24857, -1196528, -2330178, -4966256, -9363550, -13264894, -13907300, -11066720, -7510579, -6101970, -6810529, -7338042, -6634665, -6474571, -8686219, -11945876, -12904974, -10120189, -5368222, -1238963, 947638, 746204, -1943384, -5981590, -8762899, -8120015, -4247366, 563330, 3628470, 3459832, 813148, -1580093, -1503467, 117085, 277202, -1990124, -4057057, -3094882, 453762, 3968835, 5769532, 5519390, 2859567, -1906121, -6103705, -6258143, -2262323, 1693514, 1557316, -2047708, -4647759, -2796546, 2573241, 7322417]
6107G322417O43516l480682m595029k607443Q580Q75568j91289j631507k086577
6098e742446j506589o62338j25219J63382N50362J090628J411241J174969N12963
6089c133047j53247n81901q45458j140267j565637j873633j438686K9444J627780
6080i074652J841656L96905j166119j318572k69047P13393Q91954K42973j007517
6071h749026j994596j317639J106251L101585K710175R04189O1949M11463K23279
6062c542370p53708o63211J199849K913189K660441R84971o51382j737191k138071
6053a727483j513321n38044r21524k724937l343801r93940K181478K642800K62449
6044f676323j578926m92625K190064L427193J906511q64608k227895j058110R91699
$$ y = [7322417, 7965933, 4485251, -109778, -2717221, -2708641, -1833073, -2024362, -3655869, -5742446, -7249035, -7911373, -8036592, -7873210, -7322848, -6232220, -4820979, -3646010, -3133047, -3286294, -3868195, -4713653, -5853920, -7419557, -9293190, -10731876, -10702432, -9074652, -7232996, -6836091, -8002210, -9320782, -9589829, -8876436, -7984482, -7741509, -8749026, -10743622, -12061261, -10955010, -7853425, -5143250, -4239061, -4177112, -3765649, -3542370, -4296078, -4959289, -3759440, -846251, 1814190, 2799161, 2147779, 410588, -1727483, -3240804, -3778848, -4700372, -7425309, -10769110, -11763050, -9581572, -6938772, -6676323, -8255249, -8747874, -6557810, -3130617, -1224106, -2088714, -4316609, -5374719, -4383020]
6035d383020J413516J21346m09509J167448K880535K267360q8357j721373j882608
6026f34662j772163j851421j351014l70298r7508n24992q8424J630718K703040
6017b356724J474379r95581k331592j737282l76147M73835N67654K87431m7260
6008e041287l91968q02306j016201l83141J199719K346081J215338j985013m428013
5999i286791l566503j93108K394168K196348M59213m39457O6899Q45289J334796
5990f189146K073921K881517K361705K92706j045990K32531K410150K191519m16348
5981D792565j933412n19520J504763J453406M2849n36804k49106n39272j438463
5972B577006j769485j374923r42080l30265Q35771J632830J047999q142j54799
$$ y = [-4383020, -2969504, -2848158, -3257667, -2090219, 790316, 3057676, 2969319, 1247946, -634662, -2406825, -4258246, -5609260, -5979558, -6077066, -6602058, -6690482, -5059764, -2356724, -882345, -1877926, -4209518, -5946800, -6322947, -5849112, -5281458, -4994027, -5041287, -5433255, -6235561, -7251762, -7634903, -6435184, -4089103, -2873765, -4858778, -9286791, -12853294, -13046402, -10652234, -8455886, -7996673, -8436130, -8369231, -7523942, -6189146, -4115225, -1233708, 1127997, 1420703, 374713, 607244, 3017394, 5208913, 4792565, 2859153, 2339633, 3844396, 5297802, 5340651, 4803847, 4554741, 4015469, 2577006, 807521, -567402, -1509482, -1839747, -1003976, 628854, 1676853, 1668711, 1513912]
5963A513912j59011j398987k470149p57795K635940L346314J11417k953245k307374
5954b438978o24m9912k241817k889707n96120K049254K544282J555976J115311
5945i52335J562102J565159M43613p26364n84244N01618O93650q13659k393019
5936g03479j918166N14559K872579L629478K592113o1631l622172n964321n114330
5927g775370k059951J32446M57188R12654K639453L806659K760268P48925m47500
5918A174772j375826l028106m023040k541055J55761J129414J16448l57487R17935
5909g831184K284420K060800N79511j151218k673771l232555j762662J046485
5901a0680174K344316M66329k244355j828281K115683N340665L953563n35645
$$ y = [1513912, 1354901, -44086, -2514235, -3272030, -636090, 2710224, 2821641, -131604, -2438978, -2439602, -2489514, -4731331, -7621038, -8217158, -6167904, -3623622, -2067646, -952335, 609767, 2174926, 2618539, 1892175, 1307931, 1809549, 2503199, 1689540, -703479, -2621645, -2107086, 765493, 4394971, 6987084, 6925453, 3303281, -2661040, -7775370, -9835321, -9702875, -9245687, -8333033, -5693580, -1886921, 873347, 1622272, 1174772, -201054, -3229160, -7252200, -9793255, -9637494, -8508080, -8391632, -8749119, -7831184, -5546764, -3485964, -2906453, -4057671, -6731442, -9963997, -11726659, -10680174, -8335858, -7869529, -10113884, -11942165, -9826482, -4485817, -532254, -1067899]
5893a067899k812582l92451L304805L716773J178163l15721N44482P59507j642146
5884C272931m115726l472387o48934R83276L50479q90512j432792j283504n01519
5875g738688O16194P47738p56078k005099p48256K080547L408007K293198P14659
5866a387778J93824N8531o92445j883019k815446k811646j244540J389137L023362
5857f170020K459078J278524J171570Q31163j421259l496397k301572L33794k47716
5848g562835l455576l389745J666651N694609L851929m73780j565732K95704J223738
5839c715037P00599P80872R95078m44732k084329j155123J133986J288747m90896
5830b990835j153513p07965j608624k637825J58942N550142O721493J199831m735024
$$ y = [-1067899, -3880481, -4272932, -968127, 2748646, 3926809, 3611088, 4155570, 4915077, 3272931, -842795, -4315182, -4964116, -3980840, -3630361, -4520873, -5953665, -7237169, -7738688, -7122494, -6374756, -7130834, -9135933, -9884189, -7803642, -4395635, -2102437, -1387778, -1193954, -1135423, -1827868, -3710887, -6526333, -9337979, -10582519, -9193382, -6170020, -3710942, -2432418, -1260848, -429685, -1850944, -5347341, -7648913, -7315119, -7562835, -11018411, -14408156, -12741505, -7046896, -3194967, -3668747, -5234479, -4938775, -3715037, -3014438, -2233566, -1238488, -1683220, -3767549, -4922672, -3788686, -2499939, -2990835, -4144348, -4852313, -6460937, -9098762, -8939820, -3389678, 3331815, 4531646, -203378]
5821b03378m934873j541996j84139j424824j890287p01233M20186J484327L686327
5812e289890N567271M303667N20577k115420k035706j047856o45280m93098n97097
5803a832832j514468k117138n32150K186713K680863L04040j828887j750212j109515
5794e513586j368519j137230N71466J735331O88762o99779k40664O31927m34765
5785e767057k057843j108840J805934K914267J008210j207161j708027j479202
5777g599719j542850j073309K17604P01186n36201j912656j694985k51751J229995
5768a2462686K342767K636209J311588q97403j610834m6907J683068J965743J902372
5759c176083K313080J484730j228097k439012N31733M054925K396027l279589
$$ y = [-203378, -5138251, -6680247, -6864386, -8289210, -10179497, -10880730, -10460544, -8976217, -5289890, 277381, 4581048, 5101625, 2986205, 950499, -97357, -742637, -1235735, -1832832, -3347300, -5464438, -5996588, -3809875, -1129012, -824972, -2653859, -4404071, -5513586, -6882105, -8019335, -7447869, -5712538, -5023776, -5723555, -5964219, -5332292, -5767057, -7824900, -8933740, -7127806, -4213539, -3205329, -4412490, -6120517, -7599719, -9142569, -10215878, -9998274, -9297088, -9833289, -11745945, -13440930, -13692681, -12462686, -10119919, -7483710, -6172122, -7069525, -8680359, -8727266, -7044198, -5078455, -3176083, -863003, 621727, -606370, -3045382, -2513649, 1541276, 3937303, 657714]
5751F57714n598846j395344L836412L964950J12087k578681k401338j428288p94898
5742e626232J99440J293737J213122J98513k99235k91720r59932j830923j079654
5733g182884J061243K048150J021978L37070J623771K714217P29716l267650n207283
5724f121672l113025Q35098L332565L204562J305123j075035k702589k483080
5716f818053m18230J833303K400295J222504j11510n37526o45295j322346k140192
5707f537050j922990n37695Q14407J150275P85122N86533P65201Q77798O67943
5698c350456L52813R7108m00559j515460k805212k734531Q342M412876P051977
5689A116898N357926R15956k033922j822539j288083l223746n711131m593160
$$ y = [657714, -4941132, -6336476, -2500064, 1464886, 1576973, -1001708, -3403046, -4831334, -5626232, -5426792, -4133055, -2919933, -2721420, -3020655, -3312375, -4272307, -6103230, -7182884, -6121641, -4073491, -3051513, -2714443, -1090672, 1623545, 2353261, -914389, -6121672, -9234697, -8399599, -5067034, -1862472, -557349, -1632384, -4334973, -6818053, -7236283, -5402980, -3002685, -1780181, -1891691, -2429217, -3074512, -4396858, -6537050, -8460040, -8997735, -8183328, -7033053, -6247931, -5661398, -4896197, -4018399, -3350456, -2997643, -2900535, -3301094, -4816554, -7621766, -10356297, -10347955, -5935079, 1116898, 6474824, 7390780, 5356858, 3534319, 2246236, -977510, -6688641, -11281801]
5681a1281801J32483L596711K441704r66848k366528j174407K68844J164624K576583
5672e608635L994061L282821O27307q56581K07871J214563q5249j879212j633466
5663g36520o31062j593272l487779k913936K6168J624352M92734q24435r93775
5654i037525j950714l927424l188769J875395O361978N011637J0104k189920q0051
5645g115289J940286J048531o80645q15464K06360J486303L296064M894219M230290
5636H490655J369051r06935j289662j545370k528560k229713R1806J448247k51498
5627B648021k242030j095386J620047J827275o29793k198508j416761m50188q40654
5618b777977j360683p75071J89708N37694M27576J64150l88121q81842o59567
$$ y = [-11281801, -11149318, -7552607, -5110903, -6077751, -8444279, -9618686, -9349842, -8185218, -5608635, -1614574, 1668247, 2295554, 1438973, 1646844, 2861407, 2776158, 896946, -736520, -1367582, -2960854, -6448633, -9362569, -9336401, -7712049, -7219315, -8043750, -9037525, -10988239, -14915663, -18104432, -16229037, -9867059, -4855422, -4845318, -7035238, -7115289, -5175003, -4126472, -4807117, -5622581, -5416221, -3929918, -633854, 4260365, 8490655, 9859706, 8952771, 7663109, 6117739, 3589179, 1359466, 1451272, 2899519, 2648021, 405991, -689395, 930652, 2757927, 2128134, -70374, -1487135, -1937323, -2777977, -4138660, -4913731, -4724023, -4186329, -3758753, -3594603, -3982724, -4864566, -5524133]
5609e524133j31548k87949p08463K6028J657322K033773K45347j812308j877925
5600f379856M7479K215024L029441J879219o47577k715830k529013l44233J609397
5591c835949J619769J39637j163755j121267J52322J237854M26499k113720l709141
5582h367751k315611K97720P19168j043977j491635R66886L574314L439696J391989
5573b829201j97015r39692j481861j179575M57159J547081J69238j974298j435545
5564g863709J688479L592147K377931O95106J372837L052624K439404o39740k951544
5555C763535k258897J21261J534964J153258L8119r16264j830974k825351l342843
5546d563192l000146k357931k049750j582002p5220J831455K125909J44898j907481
$$ y = [-5524133, -5655681, -5943630, -6652093, -6626065, -4968743, -2934970, -2689623, -4501931, -6379856, -6332377, -4117353, -1087912, 791307, 143730, -2572100, -5101113, -5445346, -3835949, -2216180, -2076543, -3240298, -4361565, -4209243, -2971389, -2544890, -4658610, -8367751, -10683362, -10385642, -9666474, -10710451, -12202086, -11235200, -7660886, -4221190, -2829201, -3026216, -3965908, -5447769, -6627344, -6170185, -4623104, -4453866, -6428164, -7863709, -6175230, -2583083, -205152, 489954, 1862791, 4915415, 7354819, 6715079, 3763535, 1504638, 1625899, 3160863, 4314121, 4352240, 3435976, 1605002, -1220349, -4563192, -7563338, -9921269, -11971019, -13553021, -13628241, -11796786, -9670877, -9525979, -11433460]
5537a1433460j374863J403949L425127K846217J147764Q64966K219638L102968
5529B202306J929655o90477l123027m358300m057594k104874Q28887K941671K845400
5520c586353J323328L37292L03158k23459j840001k908175j833050N72370K234724
5511e620166K344219J489494K56868q19660p79623N37326J412586K96480j515255
5502b397731j365212Q07537K353421J973162J375973K061100K834601J974993
5494I617844o72j407861j862026k031200j957933j252920l24608j6114l69766
5485C94744p30473o77737j80596N56868Q43733o0370j662794k331064j239867
5476e087556P47433K414420K978080J420025k607928o451534n974509j210795
$$ y = [-11433460, -12808323, -11404374, -7979247, -5133030, -3985266, -3120300, -900662, 2202306, 4131961, 3441484, 318457, -4039843, -8097437, -10202311, -9373424, -6431753, -3586353, -2263025, -1925733, -1622575, -1846034, -3686035, -6594210, -8427260, -7854890, -5620166, -3275947, -1786453, -1529585, -2349245, -3128868, -2591542, -1178956, -882476, -2397731, -3762943, -2955406, -601985, 1371177, 2747150, 4808250, 7642851, 9617844, 9617172, 8209311, 6347285, 4316085, 2358152, 1105232, 780624, 764510, 394744, -335729, -1013466, -1194062, -637194, 206539, 146169, -1516625, -3847689, -5087556, -4340123, -1925703, 1052377, 2472402, -135526, -6587060, -12561569, -13772364]
5468a3772364K422785J186419j556430n60503L212776M567237K589925J437829
5460d72326K623257K566517m82197k757241j326919P35666k52550j922651J60027
5451a128417M335176M585379j70239m155339l065057N06230J940299R30399J20939
5442C899370K81999J80347k70841M0455Q05830L79381j337888k355192j539211
5433H4250l00683m12771j464412j609168r3167J981978L033986K383022O07500
5424D210535q14894o21312P08283R45272j313053m275622m540297j354677K109656
5415d946109K615918Q07279j00616J155610K490809J725369m63043j772125j430941
5406H2151q77889j500295k743853k918433j450227L56664J088153J190381K152780
$$ y = [-13772364, -11349579, -10163160, -11719590, -12280093, -9067317, -4500080, -1910155, -472326, 2150931, 4717448, 4235251, 1478010, 151091, 886757, 634207, -1288444, -1128417, 3206759, 7792138, 7621899, 3466560, 401503, 907733, 2848032, 3778431, 3899370, 4181369, 4361716, 4090875, 4131330, 4937160, 5316541, 3978653, 1623461, 84250, -216433, -629204, -2093616, -3702784, -3795951, -1813973, 1220013, 3603035, 4210535, 3395641, 2774329, 3482612, 4427884, 3114831, -1160791, -5701088, -7055765, -4946109, -2330191, -1522912, -1623528, -467918, 2022891, 3748260, 3285217, 1513092, 82151, -795738, -2296033, -5039886, -7958319, -9408546, -9051882, -7963729, -6773348, -4620568]
5397d620568L693540L333002m1663l508402l209090K99136K401695O67006j970150
5388b955494j825505J52708K92017j930985l161750j262519J735705K636323R56410
5379e363090j262005k027899q29309J324746K515560J659099J62936N00184K630149
5370f89629L647669J938924m01012r50365o87296j787190l270778k248870R47614
5361c500933K484896N79310j874942j719396J20163P81082j08149o78654k46011
5352d162634J64962K72413J045182K513453L080609J682801p59502k649354l355129
5343b167199l040692j969477o91425n2666k25670l25335L25844J121404J125282
5334e899934O10367O74099J511237K097906J729859Q95958K13051n49397j591906
$$ y = [-4620568, -927028, 2405974, 2364311, -1144091, -4353181, -4054045, -1652350, -985344, -2955494, -4780999, -4628291, -4336274, -6267259, -9429009, -10691528, -8955823, -6319500, -5363090, -6625095, -8652994, -9482303, -8157557, -5641997, -3982898, -3819962, -3319778, -689629, 2958040, 4896964, 4495952, 3545587, 2858291, 1071101, -2199677, -4448547, -3500933, -1016037, -436727, -2311669, -4031065, -3910902, -3129820, -3237969, -3916623, -4162634, -3997672, -3725259, -2680077, -166624, 2913985, 4596786, 3837284, 1187930, -2167199, -5207891, -7177368, -7868793, -7921459, -8147129, -8472464, -8146620, -7025216, -5899934, -5289567, -4615468, -3104231, -1006325, 723534, 1619492, 1832543, 1283146, -308760]
5325c08760k063807j192451j6030l79208k054252k619998r68781Q14818N04876
5316h283593q59680p22383Q36012J321596L5085o91027Q45948L193720M037126
5307b87196L079252J351999n89359k254866k500474r81642O61799O22955q64783
5298a762315k374777l302199l668205l031394j235276O38714J640632K379969
5290a0714851L512788L917131K391745K74246J9878J549639K243557N36750k365233
5281A365650m317675m150946k040574L94256Q54654j002976k385874q52736J919176
5272a0217045K470372Q73931M08940K110015L341739K473923J322406J466836
5264D251117J413522m65216k740129l027482j484712p1313L36282K28223n9847
$$ y = [-308760, -2372567, -3565018, -3581048, -3960256, -6014508, -8634506, -9603287, -8788469, -8283593, -9143273, -9865656, -9029644, -7708048, -7672963, -8363990, -7518042, -4324322, -287196, 2792056, 4144055, 3554696, 1299830, -1200644, -2182286, -1520487, -897532, -1762315, -4137092, -7439291, -11107496, -14138890, -15374166, -14735452, -13094820, -10714851, -7202063, -3284932, -893187, -618941, -599063, 950576, 3194133, 3730883, 1365650, -2952025, -7102971, -9143545, -8749289, -7894635, -8897611, -11283485, -12136221, -10217045, -7746673, -6872742, -6463802, -4353787, -1012048, 1461875, 2784281, 4251117, 5664639, 5199423, 2459294, -568188, -2052900, -2124213, -1787931, -1559708, -1619555]
5255a619555m84380o25051j05124Q09211J555136J506025l8130k710254m204920
5246e917042k624848M06775J539503O38902P22666K451505K575702n12830l514420
5237d234087l096640q00648j4598o88391l84227J381482L040456L687727L122056
5228B013130Q11260k456670l671709j292258J862404K399065J157700Q62979R42962
5219B628863j063879m177691m711206k130611J30175J11279k72302R85112L133248
5210e367012M450182M089404J658506k297366n116908m279219j201319K09481
5202g854251q94333j518227j25281J046997L23845l82238R08118K597460K005761
5193c892149m37660j946144j140322Q15197J977295J270481p07962j763538k76769
$$ y = [-1619555, -2103935, -2728986, -2834110, -2024899, -469763, 1036262, 998132, -1712122, -5917042, -8541890, -8135115, -6595612, -5956710, -5234044, -2782539, -206837, -719667, -4234087, -7330727, -8131375, -8145973, -8834364, -9218591, -7837109, -4796653, -1108926, 2013130, 2824390, 367720, -3303989, -4596247, -2733843, -334778, 822922, 1685901, 2628863, 1564984, -2612707, -7323913, -9454524, -9324349, -9213070, -9485372, -8500260, -5367012, -916830, 3172574, 4831080, 2533714, -2583194, -6862413, -8063732, -7854251, -8748584, -10266811, -10392092, -9345095, -9021250, -9403488, -8495370, -5897910, -3892149, -4329809, -6275953, -7416275, -6601078, -4623783, -3353302, -4061264, -5824802, -6101571]
5184f101571K141342K030065j008688l006272q31589L323570M893917K971180
5176D411954Q04681Q08791J637608P73503j840179l976556m146423l162729k502866
5167g192216k106301q79555Q80693J176678q16832k969378k702985l36938J686175
5158a3260659K188133K018191J895725J598663J341173J880441K714571J972947
5150B349185r47328l857401l950900j033721K071589K331861l50255k915272k523504
5141h825746N5785J517127L75961j531394k198293j726474n42284J869088M667819
5132f338411M905519J650965j553781j300693Q19031J129841n41403j827220k340155
5123e396307l129410l291738j482362N67786M97974j26617J472068L507657K236095
$$ y = [-6101571, -3960229, -1930164, -2938852, -5945124, -6776713, -3453143, 1440774, 4411954, 5216635, 6025426, 7663034, 8436537, 6596358, 2619802, -1526621, -4689350, -7192216, -9298517, -10178072, -9297379, -8120701, -8937533, -11906911, -14609896, -14946834, -13260659, -11072526, -9054335, -7158610, -5559947, -4218774, -2338333, 376238, 2349185, 1401857, -2455544, -6406444, -7440165, -5368576, -3036715, -3386970, -6302242, -8825746, -8769961, -7252834, -6876873, -8408267, -10606560, -12333034, -12875318, -11006230, -6338411, -1432892, 218073, -1335708, -2636401, -1817370, -687529, -1228932, -3056152, -5396307, -8525717, -11817455, -13299817, -12732031, -12234057, -12360674, -10888606, -7380949, -5144854]
5114e144854p41743l53006K883407K785937k277555o163401m427017n55910O43527
5105a3350615J16166Q70030J992320J000022j157521j704133m27187P85472R14147
5096a0961299R342j539126k337345r98652J148359J380854K46804R49793L364100
5087h737170L642772J153798J31853K122715K774095m86986l447855k077125Q65903
5078d058000J052540m48318o49440n79998k050148k495340P97235M515840L574851
5069c40778r15943l761066l534108k631712j615545N52112K207991Q07750j931449
5060a1162748k072952K30728J503669J035967J119770J978416J516862k34981
5052f085269j059835o58077o60368j028971l86269P30799P02698L2397J75858
$$ y = [-5144854, -5886597, -6239603, -3356196, -570259, -2847814, -9011215, -13438232, -13994142, -13350615, -13234449, -12364419, -10372099, -9372077, -10529598, -12233731, -12660918, -11875446, -10961299, -10951957, -12491083, -14828428, -15827080, -14678721, -13297867, -13051063, -12101270, -8737170, -5094398, -3940600, -3808747, -1686032, 1088063, 601077, -2846778, -4923903, -4058000, -3005460, -3453778, -4103218, -4683216, -6733364, -9228704, -8431469, -3915629, -340778, -1256721, -5017787, -8551895, -11183607, -12799152, -12247040, -10039049, -9231299, -11162748, -13235700, -13004972, -11501303, -10465336, -9345566, -7367150, -5850288, -6085269, -7145104, -7803181, -8463549, -9492520, -9878789, -9147990, -8445292, -8412895, -8237037]
5043h237037M77804j71950m08489J065347K157163Q03817p27591L23321J709907
5034c007708j0207k659331j680861J766098K671740P81084L06744J700792R24423
5025G92774k748816m962035l253224O4913K685118M384071M004486K21342m155490
5016b966861m457405j337416K4791j719069k623254r73443J71099p00363q53910
5007a5435831J232049L190738L243942K402762J131040j114909k451591l08794
4999h110594K907981K092426k001705l289928m77489Q35007j841898l469917l21397
4990a3677514L828779M355266K504233J340211M38086j216895j845291m20294
4982d693419N35992p75154k120028j119444J159465K746938L226134K184676n80725
$$ y = [-8237037, -7759233, -7931183, -8339672, -7274325, -5117162, -4313345, -5040936, -4717615, -3007708, -3017915, -5677246, -7358107, -5592009, -2920269, -2139185, -1832441, -131649, 792774, -1956042, -6918077, -10171301, -10106388, -7421270, -3037199, 967287, 1188629, -2966861, -7424266, -8761682, -8736891, -10455960, -13079214, -14052657, -13881558, -14581921, -15435831, -14203782, -11013044, -7769102, -5366340, -4235300, -5350209, -7801800, -8110594, -5202613, -3110187, -5111892, -8401820, -8879309, -8044302, -9886200, -13356117, -13677514, -9848735, -5493469, -2989236, -1649025, -1210939, -2427834, -4273125, -4693419, -4157427, -4932581, -7052609, -8172053, -7012588, -4265650, -1039516, 1145160, 564435]
4973E64435k441189n80511K149359J98452n064686o087007j149778K516492N41128
4964i353305k087880n80884J714711M12908k034611j638702n07j72365p38833
4955a4479468L21450Q69356r36154k242850o20413J287553J012145R89611L168265
4946a0630505M276161J684273j227094p93103R56355J021588P28383J380394N24688
4937b078860k289262k453719J362713K801107j753104n613514k467452K437834
4929a0054257R78959m018988l877352J416407M178972J809305j049965j511192
4921a2128111j064027l42785J300502K082665J9219k567937k247230n8524R89093
4912a4017135J019663J252714O40037r56717p76182J366032J263488j735144k088488
$$ y = [564435, -1876754, -2457265, -307906, -109454, -5174140, -11261147, -12410925, -9894433, -9353305, -11441185, -12022069, -10307358, -9894450, -11929061, -13567763, -13568270, -13740635, -14479468, -14158018, -13288662, -14224816, -16467666, -17088079, -15800526, -14788381, -13798770, -10630505, -6354344, -4670071, -5897165, -6690268, -5733913, -4712325, -3983942, -2603548, -2078860, -4368122, -6821841, -5459128, -2658021, -4411125, -10024639, -12492091, -10054257, -9075298, -13094286, -16971638, -15555231, -11376259, -9566954, -10616919, -12128111, -13192138, -13534923, -12234421, -10151756, -10132537, -12700474, -14947704, -15006228, -14017135, -12997472, -11744758, -11104721, -12061438, -12837620, -11471588, -10208100, -11943244, -14031732]
4903a4031732J740796K982153j496376m472082j018497K317351j97062k656832
4895a6832281P40702L947660O81681l001419l98746K558342p42932l967128p99523
4886a7813644J107029m618385p930192j060251L319541n442304j2684798m233213
4878d9356217L392995q115938j9818196r259325m991149m7454203j00703485p5922098
4870c12227616L7459556J33363884J21316693M0248270r920430k908174J0286456
4863A7618639N92360p891456J134677Q090121L22324n953949m52847K964887l523069
4854A2901687o236165J687842N634335k798540r408948l282843M058051O90235
4846C245654m874736r42418O414491N900290O79774j2260K103660J63534l757858
$$ y = [-14031732, -12290936, -9308783, -10805159, -15277241, -16295738, -13978387, -14175449, -16832281, -16091579, -12143919, -11462238, -14463657, -14862403, -12304061, -13046993, -17014121, -17813644, -16706615, -21325000, -29255192, -30315443, -26995902, -32438206, -45123004, -49356217, -45963222, -54079160, -73897356, -83156681, -88147830, -135602033, -236305518, -312227616, -274768060, -141404176, -20087483, 20160787, 10240357, 7332183, 17618639, 18210999, 10319543, 11454220, 19544341, 19866665, 13912716, 13459869, 16424756, 12901687, 6665522, 8353364, 13987699, 11189159, 1780211, -1502632, 2555419, 3245654, -1629082, -2571500, 3842991, 9743281, 10423055, 10410795, 12514455, 12677989, 8920131]
4837H920131l493970q31854j177851k850850r08691K953556L283681J22390j896428
4828D120114q12563J637484L274330K105504k582634p215991o573379j280385
4820g327520K670671L015311L192061M162466K368745k012214l313552K9225K390182
4811E175375P78867o08419P42861R49864j809040k829482N9616J412956k113287
4802A759311m968371k024124K574218K620531m52543j748423j124920q86082m10565
4793d660968J061531J237766m29580j83690K804137K921573k434552o487308l015325
4784i186416L402459M615494J030490j346354j221974j161899n20266K276212
4776b112254L645608l56869n597779m748402J025400L673351P73026j827711k02659
$$ y = [8920131, 5426161, 4594307, 3416456, 565606, -343085, 2610471, 5894152, 6016542, 4120114, 3307551, 4945035, 8219365, 10324869, 7742235, 526244, -6047135, -7327520, -4656849, -1641538, 1550523, 5712989, 8081734, 6069520, 2755968, 2785193, 5175375, 5954242, 5345823, 6088684, 7038548, 5229508, 2400026, 2459642, 3872598, 1759311, -3209060, -5233184, -2658966, -38435, -490978, -2239401, -3364321, -4250403, -4660968, -3599437, -2361671, -2791251, -2974941, -170804, 2750769, 316217, -6171091, -9186416, -5783957, -1168463, -137973, -1484327, -2706301, -3868200, -4388466, -2112254, 1533354, 1176485, -4421294, -9169696, -8144296, -4470945, -3697919, -5525630, -5728289]
4767e728289K499069K552720Q56997m02002j240234j999352j731246m1602K077186
4758c156753L798895M591051L275521l58419l683381l830544j576194n2644l82058
4749a374526j074904q48220K62121J578115J761269k41805k648044j804321K280044
4740b110271M563082J846224k408999l507395k225051j921606k263721q57074
4732h884811J295608J196319q23817j904177j479900r87662j75549J967902L921569
4723e874518L471602J567290M29539m96904k554482l781336j548641K241145L384589
4714c161716J546434l54542j381190k353614k046444R65131L911734K924248l83622
4705c33581j138153P85206J075207j096954j982123m54328K07404j113049j239692
$$ y = [-5728289, -3229220, -676500, 180497, -221505, -1461739, -3461091, -5192337, -5233939, -3156753, 642142, 5233193, 8508714, 8150295, 4466914, 636370, -939824, -992468, -1374526, -2449430, -3297650, -3035529, -1457414, 303855, 62050, -2585994, -4390315, -2110271, 2452811, 4299035, 1890036, -1617359, -3842410, -5764016, -8027737, -8884811, -7589203, -6392884, -7216701, -9120878, -10600778, -11588440, -11763989, -9796087, -5874518, -2402916, -835626, -406087, -902991, -3457473, -7238809, -8787450, -6546305, -3161716, -1615282, -1969824, -3351014, -5704628, -7751072, -6785941, -2874207, 50041, -333581, -1471734, -686528, 388679, -708275, -2690398, -3144726, -2937322, -4050371, -5290063]
4696e290063J090010K610161J245560p00231j202586j484725k182907j358856
4688g273637J197015K180097k4664k362509j892955K06045J778596K990658L997470
4679G96116L128346J73679j971007j591125o88785p93719j45392J942033K035277
4670B885423j990822n911367m328343J386435N017055L842793N52366k115616
4662f62076l976365m716803l024386M48186K469253J128233j621764k488856n50093
4653a2994671K369485L931529L174989Q82546j287753k146297j640313m25682
4645h136167P41208J239005R68741O57674J062759J829123J934947J130575p0256
4636A357609j504668l078204l752906k711735j370205j918826l633800l233635
$$ y = [-5290063, -4200053, -1589892, -344332, -1044563, -2247149, -3731874, -5914781, -7273637, -6076622, -3896525, -3921189, -6283698, -8176653, -7970608, -6192012, -3201354, 796116, 3924462, 4098141, 2127134, 536009, -152776, -946495, -1091887, 850146, 2885423, 894601, -5016766, -9345109, -7958674, -2941619, 901174, 1453540, -662076, -4638441, -9355244, -12379630, -11931444, -9462191, -8333958, -9955722, -12444578, -12994671, -10625186, -6693657, -3518668, -2636122, -3923875, -6070172, -7710485, -8136167, -7394959, -6155954, -5187213, -4529539, -3466780, -1637657, 297290, 1427865, 1357609, -147059, -3225263, -6978169, -9689904, -11060109, -12978935, -16612735, -19846370]
4628a9846370L25254M045622N136152M513887M320432M303707L040294J038665
4620F877643J1470K3632k50080r91060j155638o80508p13444j446692j460059
4611B15264J31168K005821J963829m15673l056656l585667k060474q31174j366223
4602f999785k246603j430595M84367J224440N94383P60660K400594L125083J018269
4593a069187k216340l292395j337894J497710K622016J279993r59202j496139
4585d971438N41789K725087K028437q48179k131588m42870J197032J85187j697259
4576c413802j427418M77721J150766k25938k000662k842225k271253L74206M438179
4567e740426O391592L411543j717946l158943p7450J845507j315721n711027n117562
$$ y = [-19846370, -19521116, -15475494, -10339342, -5825455, -1505023, 2798684, 5838978, 6877643, 6889113, 6912745, 6662665, 5671605, 4515967, 3835459, 3122015, 1675323, 215264, 346432, 2352253, 4316082, 3900409, 843753, -2741914, -4802388, -5633562, -6999785, -9246388, -10676983, -10192616, -8968176, -8373793, -7613133, -5212539, -2087456, -1069187, -3285527, -6577922, -7915816, -6418106, -3796090, -2516097, -3475299, -4971438, -4429649, -1704562, 323875, -524304, -2655892, -3098762, -1901730, -1716543, -3413802, -4841220, -4363499, -3212733, -3438671, -5439333, -8281558, -10552811, -10178605, -5740426, 651166, 4062709, 2344763, -814180, -891630, 953877, -361844, -6072871, -11190433]
4558a1190433K47998M372170L877340J558204R06936J087302l00377k258899j765227
4549c464986Q77241J781513p68915l503824k894267k33723O40451q12723j436319
4540i815552N08272K894635L116204J477820K6811k16291L43953Q73762M72275
4531c18111j196453k726168j834275J472275L951400K723773j224746m420550
4523c572855m772790k801479j51939J501476J001708j033660k106167o90730J431019
4514a1195417J571243K27492L09530K343311L308115J279850j309195j033810
4506d498881J530891K576861K69314l038061m070541k387620j24149Q39830M59303
4497h443053j52147r1984N28190P19062k26195j484850j260037Q25295K644616
$$ y = [-11190433, -10942435, -6570265, -2692925, -1134721, -227785, 859517, 559140, -1699759, -3464986, -2587745, -806232, -1575147, -5078971, -7973238, -8206961, -7566510, -8379233, -9815552, -9307280, -6412645, -3296441, -1818621, -1791810, -2008101, -1664148, -790386, -318111, -1514564, -4240732, -6075007, -4602732, -651332, 2072441, 847695, -3572855, -8345645, -11147124, -11299063, -9797587, -8795879, -9829539, -11935706, -12626436, -11195417, -9624174, -9396682, -9087152, -6743841, -3435726, -2155876, -3465071, -4498881, -2967990, -391129, -121815, -3159876, -7230417, -9618037, -9742186, -8902356, -8443053, -8595200, -8687184, -8158994, -7439932, -7666127, -9150977, -10411014, -9585719, -6941103]
4488f941103K034745j04338p60294J023690K676390J624844j183557k639026j426407
4479e695056Q30399J915170J190629l90300j376126j030067j99525n60041k230079
4470g544996k932965p73464K876915M882911M254407K688371J400894l65182l103597
4461A383294n304302n183391l007976o08848P51456J265680J841734K979701M065515
4452a817137L777255J751330m42156r83231k47183k71941j771459l111666k591182
4443e707370m85868J546111K008450L92904k243206l431551j571772J690474L012770
4434d789058J598977j787J36941P88796J76693j031597j144030l08883M6492l12500
4424d839956l69231K49764P86756M01910j205823l465684m449811k128719K523214
$$ y = [-6941103, -4906358, -5010696, -5770990, -4747300, -2070910, -446066, -1629623, -4268649, -5695056, -4864657, -2949487, -1758858, -2149158, -3525284, -4555351, -4754876, -5314917, -7544996, -10477961, -11251425, -8374510, -3491599, 762808, 3451179, 4852073, 4486891, 1383294, -3921008, -9104399, -12112375, -12721223, -11969767, -10704087, -8862353, -5882652, -1817137, 1960118, 3711448, 3269292, 2286061, 2038878, 1766937, -4522, -3116188, -5707370, -6193238, -4647127, -2638677, -2245773, -4488979, -7920530, -9492302, -7801828, -4789058, -3190081, -3191868, -3054927, -2266131, -2089438, -3121035, -4265065, -4573948, -4527456, -4839956, -5209187, -4959423, -4172667, -3770757, -4976580, -8442264, -12892075, -15020794, -12497580]
4415a2497580N172296K918906j593660l143556l43073L312450M406961K910651
4407A143395L97023k109849l488625k384140M76861J810436k38595l017489k611056
4398a0022039P43082L134873K611514J334393J321024J039812j483941m231065
4390e552347l181661J619415N219532L999409K62565j196817O14874K361821J410109
4381E556900j079429k483962k175721j466241j197586q73995p6304N12821J53027
4372c130490n37922k20238J166690K115013J625782M28654n84927j756213l135806
4363d029457l040242l83017K600098K829500J058224P36553K240529K161307q06767
4354C366728l458847l333181k251225k101656j212196J633048L422863J568668
$$ y = [-12497580, -7325284, -4406378, -6000038, -9143594, -9486667, -6174217, -1767256, 1143395, 1540418, -569431, -4058056, -6442196, -5965335, -4154899, -4393494, -7410983, -10022039, -9278957, -6144084, -3532570, -2198177, -877153, 162659, -1321282, -5552347, -8734008, -7114593, -1895061, 2104348, 2366913, 1170096, 1784970, 4146791, 5556900, 4477471, 1993509, -182212, -1648453, -2846039, -3720034, -3796338, -3283517, -3130490, -3668412, -3888650, -2721960, -606947, 1018835, 1447489, 862562, -893651, -4029457, -7069699, -7452716, -4852618, -2023118, -964894, -228341, 2012188, 4173495, 3366728, -92119, -3425300, -5676525, -7778181, -8990377, -7357329, -3934466, -2365798]
4346b365798r01330J24268K631004J475453k962378n062426k463968J297008K838336
4337e389831K457312J151751r41459k432825j660627l92110j842840m559806l613965
4328a7224400J195651M168718K521800M43505J585976L279792K117175K16411
4320a695372J072921L020266K071739j157352k362066k06890K126130J774789
4312D644165m71635j859142j028413L99785m50272l433899m025221P63878O251695
4303G90941M933649k379835o472176k616996K949488K970360o44203j695512L89474
4294a774810J652973R82220K23299o04420k495856l748295k307765j49326l46368
4285h568348j430103K88662M173305O076188M686751K334935L78007j639366l042075
$$ y = [-2365798, -3267128, -3142860, -511856, 963597, -1998781, -7061207, -9525175, -8228167, -5389831, -2932519, -1780768, -2722227, -5155052, -6815679, -7207789, -9050629, -13610435, -17224400, -16028749, -11860031, -9338231, -8894726, -7308750, -4028958, -1911783, -1695372, -622451, 2397815, 4469554, 3312202, 950136, 743246, 2869376, 4644165, 4172530, 2313388, 1284975, 1684760, 1234488, -2199411, -6224632, -5460754, 790941, 5724590, 3344755, -3127421, -5744417, -2794929, 175431, -468772, -2164284, -1774810, -121837, 860383, 1083682, 479262, -2016594, -5764889, -8072654, -8221980, -8568348, -9998451, -9709789, -5536484, 539704, 5226455, 7561390, 7939397, 6300031, 3257956]
4276C257956k630813j488098j244259q18928J074376K089246k11784k870023j357073
4267d199400K435555K463818j616644l612303n83011L001623K707352r302j801274
4258a213586k324265k360317j168800J373626L114824K605463J200432L33113
4250A560490o98093k429522l262705j836352N30546J572537R04120j96735p46232
4241d601946q53544j220448k103086k388213m92716L029245N237351M490942K551836
4232C649421J286926l19072l274626n261633l784744o66556M51295n23962j129272
4223i572223j023350j461512j653194k07349J064474m34590k876068k138250J529997
4214a6772065L860647L089277J337994l6366j626938k871657k473729j458211
$$ y = [3257956, 627143, -860955, -2105214, -2924142, -1849766, 239480, 27696, -2842327, -4199400, -1763845, 699973, -916671, -4528974, -5111985, -2110362, 596990, 587688, -1213586, -3537851, -5898168, -7066968, -5693342, -2578518, 26945, 1227377, 1560490, 862397, -1567125, -4829830, -6666182, -6135636, -4563099, -3658979, -3855714, -4601946, -5455490, -6675938, -8779024, -11167237, -11659953, -8630708, -3393357, 1097585, 3649421, 4936347, 4617275, 1342649, -3918984, -7703728, -8370284, -7918989, -8442951, -9572223, -10595573, -12057085, -13710279, -13917628, -12853154, -13287744, -16163812, -18302062, -16772065, -12911418, -9822141, -8484147, -8520513, -10147451, -13019108, -15492837, -16951048]
4206a6951048j301650k00731L612241O384727L128532l439289n355282j000988
4198a5123488K898064J804224j143972j895390j102438n70911J48678J134926
4190a3850307R52812R4161R85834L144125K960676m74680l849975m724319l726157
4181a8487830j567661J347109K711586R33121q61111Q86832L348699J452025k933136
4172a3170366l791623j311038o03040j546656J56142K810570O29605m460758m596844
4163b5884008R6552J572395j504179k244908L56061p4662l219218j794827K697907
4154b9998887P16129o302017o336679M23833L97928p097433o987953R52195k570408
4145e6803292j8984322k3521085j3107646k3425155o4497229p7058987o176591
$$ y = [-16951048, -18252698, -18453429, -14841188, -8456461, -5327929, -8767218, -14122500, -15123488, -12225424, -10421200, -11565172, -13460562, -14563000, -15133911, -14985233, -13850307, -12897495, -12803334, -11817500, -8673375, -5712699, -6187379, -10037354, -14761673, -18487830, -20055491, -18708382, -15996796, -15063675, -15924786, -15037954, -11689255, -10237230, -13170366, -16961989, -18273027, -18876067, -20422723, -20266581, -17456011, -16826406, -21287164, -25884008, -25787456, -24215061, -25719240, -27964148, -27608087, -27682749, -30901967, -32696794, -29998887, -29282758, -35584775, -41921454, -41497621, -41099693, -48197126, -55185079, -54232884, -56803292, -75787614, -99308699, -112416345, -135841500, -200338729, -277397716, -283574307]
4138b83574307J03365283J46711918R1478344J2299820j6155351l473809K372700
4131E3024598o927382q141146J114790K648967m902258o086517O62684K057203
4123C3450939l883257n691625p65133J643681q68855r96358K275306J650052l526844
4114B3287906n284845j571376M91757k154168l840061j147748J697823J088616
4106A2567904p60580j163595n94019M53522K208681K770980J79531k970629k610544
4097A0081251J311M30909j196868r90540J168594J568024k39438q12483N65328
4088A0576088P66296j187337k575892k090502j519949j741518j517371o99768
4080A0047m84614l11956J447076L668860L382356P27505p75023O16196K661349
$$ y = [-283574307, -180209024, -33497106, 57981238, 70281058, 54125707, 50651898, 53024598, 46097216, 37956070, 39070860, 41719827, 36817569, 30731052, 31393736, 33450939, 29567682, 23876057, 23110924, 24754605, 23885750, 22889392, 25164698, 26814750, 23287906, 18003061, 16431685, 16923442, 14769274, 10929213, 9781465, 11479288, 12567904, 11807324, 10643729, 10049710, 10503232, 12711913, 15482893, 15662424, 12691795, 10081251, 10082562, 10513471, 9316603, 8326063, 9494657, 11062681, 10823243, 10010760, 10576088, 11342384, 10155047, 7579155, 5488653, 3968704, 2227186, 709815, 10047, -474567, -786523, 660553, 4329413, 7711769, 8439274, 7664251, 8280447, 10941796]
4071A0941796K611459L78584k040068k597728r89571O15472L6150j184981M85515
4062H256628M099420M016394j390237n902381m231223L63301K186320J897018
4054I295240K866533L166895r56039o422726o510734j578978J415310M7960o79319
4045F44142K324974N184471L744130l16005k815780k458871o26587J098113J522475
4036H301062L07389j251800j662653j233383q92643k91902P07586O22859q28145
4027C778370r91261J297590K572856K32524k171326m82363K436809J144908k926374
4018D891733l874960j428272o22010k183176j648522J633373L109912J882833
4010A760911K509398N701783N556189l72330n765495m811615m43748J423778M43204
$$ y = [10941796, 13553255, 13931839, 11891771, 9294043, 8304472, 8919944, 8956094, 7771113, 8256628, 12356048, 16372442, 14982205, 9079824, 4848601, 5211902, 7398222, 9295240, 12161773, 15328668, 14372629, 7949903, 1439169, -139809, 1275501, 1323461, 644142, 2969116, 8153587, 11897717, 11581712, 8765932, 6307061, 5680474, 6778587, 8301062, 8608451, 7356651, 5693998, 4460615, 3567972, 3276070, 3983656, 4606515, 3778370, 2787109, 4084699, 6657555, 6890079, 4718753, 4236390, 6673199, 7818107, 4891733, 1016773, -411499, -1033509, -3216685, -4865207, -3231834, -121922, 1760911, 4270309, 9972092, 15528281, 15155951, 9390456, 4578841, 4135093, 5558871, 6002075]
4001F002075k61077j65712m70999o88739k76411n64076j698972j150216J574860
3992B300733K695099K03612j979777j51437K739942J760281k020001l588458j935449
3983B4545n19613q49062p18302J106890K728464K411488R63420r899j39267j5933
3973D982731k34952r11266j420201j014067r3055J79556j13708L76733J726325
3964C478096K132356P26712j002252j601056j475267j350781r89547l81557o0298
3955e23594N05283K301522L937835K678325o66572j706650Q64628K626266J86061
3946A0203104l327052l246898n68137L21230j140896j539997M24365K138725J469247
3937D733691m87234j514134p43902J152130K467224J505571j277216k956832j604496
$$ y = [6002075, 5740998, 5575286, 5104287, 4415548, 4139137, 3575061, 1876089, 725873, 2300733, 4995832, 5199444, 3219667, 3068230, 5808172, 7568453, 5548452, 1959994, 24545, -495068, -1344130, -2062432, -955542, 1772922, 4184410, 5147830, 5137931, 4998664, 4982731, 4747779, 3836513, 2416312, 1402245, 1309190, 1488746, 1375038, 1751771, 3478096, 5610452, 6337164, 5334912, 3733856, 2258589, 907808, -81739, -463296, -523594, -18311, 2283211, 6221046, 8899371, 8232799, 6526149, 7390777, 10017043, 10203104, 6876052, 3629154, 3061017, 3382247, 2241351, 701354, 1125719, 3264444, 4733691, 4246457, 2732323, 1988421, 3140551, 5607775, 7113346, 5836130, 2879298, 1274802]
3928A274802J012323K005997J355905J149863K025261K806790K853162K374249
3920A6858352J044918j390392l565357l663068j884357o5858O89530N38962j07860
3911H454870o08063j56922O23844l68984l326368m896076k533877J214845K058800
3902D62069K89967j49501J615235K046072o54054l225849k255991P73889K028951
3893I30788Q60006q1688O86702J655049J123649l07524r78304o24107l71095p97668
3883B095808j280263j331090j299903j212716k87530J294355J602149j32834j092727
3874a644751J712309O095058O388683J240857l921404m064025r63541K63422j486537
3865C620071k858692j633271O31521J419537K25804j510565j886728j07428K291730
$$ y = [1274802, 2287125, 4293122, 5649027, 6798890, 8824151, 11630941, 14484103, 16858352, 17903270, 16512878, 12947521, 9284453, 7400096, 7334238, 8023768, 8562730, 8454870, 7846807, 7689885, 8313729, 7944745, 4618377, -277699, -2811576, -1596731, 462069, 752036, 602535, 2217770, 4263842, 3609788, 383939, -1872052, -1098163, 930788, 1790794, 1709106, 2395808, 4050857, 5174506, 4866982, 3888678, 3264571, 2893476, 2095808, 815545, -515545, -1815448, -3028164, -3315694, -2021339, -419190, -552024, -1644751, 67558, 6162616, 12551299, 13792156, 9870752, 5806727, 4843186, 5106608, 3620071, 761379, -871892, -240371, 1179166, 1404970, -105595, -1992323, -2099751, 191979]
3856A91979K494699j26191k646231k170069L83117J875180J259667J78447m3662
3847A396936K16517L20629L21174L66742M29480N56562N60119j3579q74304r14568
3837B365708K1558N80426P4069l94433j65902m27985j769365k479291j405310
3828c600525k98237o55973m73006K398400N491081M561330K68531k420232j477532
3819C793837j36819j204367l085377l070047j323064L38993J238443J591682J310951
3810e45768O28413N35730J412802K351279K542659K120730J253601j10908j279529
3801H909009j279374o42795r15810k002341k044701n72967M46661j91412p76067
3792I30203O51375L007960L416285R99643k132386l488938k724132j446257r93485
$$ y = [191979, 2686678, 2560487, -85744, -2255813, -1872696, 2484, 1262151, 1440598, 1396936, 1613453, 1934082, 2255256, 2621998, 3051478, 3608040, 4168159, 4154580, 3280276, 2365708, 2387266, 2967692, 3041761, 2647328, 2481426, 2053441, 284076, -2195215, -3600525, -3898762, -4554735, -5027741, -2629341, 2861740, 7423070, 7691601, 5271369, 3793837, 3657018, 2452651, -632726, -3702773, -5025837, -4686844, -3448401, -1856719, -545768, 82645, 618375, 2031177, 4382456, 6925115, 9045845, 10299446, 10188538, 8909009, 7629635, 6986840, 6071030, 4068689, 2023988, 1451021, 1897682, 1706270, 930203, 1581578, 4589538, 8005823, 9005466, 6873080, 3384142, 660010, -786247, -1779732]
3783a779732p70687O97059L006650L504102Q28526k433047k673608j39435J551626
3774A791454N74704j104291j367141q89213j166750j748702j226539K45078J080240
3765c811160M69374n94559m04916J645687M155881M883296L262420J051063k61261
3756A0395825j391396l147519l989348k273059K59946N48775q14928m58523J898414
3747A028187K699698O49994q34827P05425K741603K250517O27266N02022O52879
3738A1022764j549224m579832m353416o81206K233809J906803K60521m97138j063211
3729B699870k599689l932212l171316m59304K474695M308446M521007K991946
3721F833443M53426j494100j916763j545502j483358j600018j059463J33221J058277
$$ y = [-1779732, -2550419, -1853360, 1153290, 4657392, 5485918, 3052871, 379263, 239828, 1791454, 2366158, 1261867, -105274, -994487, -2161237, -3909939, -5136478, -4891400, -3811160, -3341786, -3936345, -4341261, -2695574, 1460307, 6343603, 9606023, 10657086, 10395825, 9004429, 5856910, 1867562, -405497, -145551, 403224, -411704, -870227, 1028187, 3727885, 4377879, 3543052, 4248477, 6990080, 9240597, 9867863, 10369885, 11022764, 9473540, 4893708, 540292, -140914, 2092895, 3999698, 4260219, 3763081, 2699870, 100181, -3832031, -7003347, -7462651, -4987956, -679510, 3841497, 6833443, 7286869, 5792769, 3876006, 2330504, 847146, -752872, -1812335, -1679114, -620837]
3712f20837J076995L31510p36211j619988j626935l63814J419666K152865J132539
3703A145790m65853q84495J0651N69613l09928j470818j003871Q67595J655534
3694A14218j80695k850632l066523Q996L592165M271261J580838j722060k553805
3685h06237l49260K643524L468379J108185k413232l740453j713082R44619N73549
3676b84008k617529m322372j687319K625784L880888J463424j107277j704250
3668c752659j693541k089672j306927J484170L841711L377604J287481J6964n12687
3659F52444j556579k366518j627823n70594j095554j890277k35011K948626L906534
3650a834752J868355o27J11793M93123r1350l29717K36959k49516j970861j790619
$$ y = [-620837, 456158, 787668, 51457, -1568531, -3195466, -3559280, -2139614, 13251, 1145790, 679937, -204558, -193907, 375706, 65778, -1405040, -2408911, -1541316, 114218, -66477, -2917109, -5983632, -5974636, -2382471, 1888790, 3469628, 1747568, -806237, -1155497, 1488027, 4956406, 6064591, 3651359, -89094, -1802176, -857557, -284008, -2901537, -7223909, -8911228, -6285444, -2404556, -941132, -2048409, -3752659, -5446200, -7535872, -8842799, -7358629, -3516918, -139314, 1148167, 1165131, 652444, -904135, -3270653, -4898476, -5469070, -6564624, -8454901, -8689912, -5741286, -1834752, 33603, 32976, 144769, 637892, 546542, 216825, 453784, 204268, -1766593, -3557212]
3640c557212J651675M570250L108512q41553k518923j066343L56729P3475l02487
3631A474123N87742J694098J461447k75575k614876m209344l706107j135199J415910
3622e307781K011833J278894J061912J414255R34952l86136r33235q5099R79846
3613I69441J258938Q19782l59319k323116l577966j946169K035001M660967L438059
3604D975618K29129j571413j410156r82105n30944J248940L676717L685709L71394
3595I692889k633252j696954J570172K496348j07627k892875l454871l168433
3587a94603l356028k351581R95119L843081K904014m20263k087038j278627m07932
3578b353858k51141N92740J659044P25354j387884q27054K952860N351790L443248
$$ y = [-3557212, -1905537, 2664713, 5773225, 4931672, 2412749, 1346406, 1703135, 1776610, 1474123, 2061865, 3755963, 5217410, 4941835, 2326959, -1882385, -5588492, -6723691, -5307781, -3295948, -2017054, -955142, 459113, 1394065, 1007929, 74694, -10405, 969441, 2228379, 3048161, 2688842, 365726, -3212240, -5158409, -3123408, 1537559, 4975618, 5204747, 3633334, 2223178, 1241073, 710129, 1959069, 5635786, 9321495, 9692889, 7059637, 5362683, 6932855, 9429203, 9321576, 6428701, 2973830, -194603, -3550631, -5902212, -4907093, -1064012, 1840002, 1419739, -667299, -1945926, -2353858, -2604999, -2012259, -353215, 372139, -1015745, -1842799, 1110061, 6461851, 9905099]
3569I905099M63778M29726J952239J243755j515202l021467k271216j091940l57663
3560E737109N45951J112586J18699j585993j872341q37023n21790j137761o79147
3551H80290J233320K115387L13638k437968l459149k357852o02590P00613J277018
3542b337293Q93292m67111j795847j515294O79352K763538K109036j201241l748744
3533d620312k768042J33608J384645Q78176J670541M021534M007310L4634l430457
3524A311637k126460J375502J746638q56229j820811m7130P91018q65288j828040
3515b319163n0223J580320M1289k731676k752435J72284K583080K287702M92267
3506f96555p72682j253695j855291k501320j754328J039970L901980L933113J156839
$$ y = [9905099, 10368877, 10798603, 12750842, 13994597, 12479395, 9457928, 7186712, 6094772, 5737109, 6283060, 7395646, 7514345, 5928352, 4056011, 3218988, 2697198, 1559437, 880290, 2113610, 4228997, 4542635, 2104667, -1354482, -3712334, -4314924, -3614311, -2337293, -1444001, -1911112, -3706959, -5222253, -4542901, -1779363, 329673, -871568, -4620312, -7388354, -7254746, -5870101, -4991925, -3321384, 700150, 4707460, 4742094, 1311637, -814823, 560679, 2307317, 1451088, -369723, -416853, 374165, -491123, -2319163, -2369386, -789066, -747777, -3479453, -6231888, -6059604, -3476524, -1188822, -696555, -1469237, -2722932, -4578223, -7079543, -8833871, -7793901, -3891921, 41192, 1198031]
3497A198031j093868o42310N77499j97307k156172k376071m13948J448349J787013
3488a868784J014235n72867k651022l213623m28719L740839N041767K490031n92454
3479B959403j493817r14043k73957M67566J220573R45089l66031j407629k016857
3470h79703l139079l831900j789315K107844L570600J030615j610476o67861K194456
3461c014819L224349K038311P47317k9375j090604k183145k353624j605706k77082
3452d544378J701755L396158K927061O10585o68998j06579n76091k990293l166737
3443c417517J501855O026241M135092j976562m627330k007823L25245p19409j596571
3434b356779M87480K609995J786440J92981P20986J580281j48444k728250k339068
$$ y = [1198031, 104163, -538147, 39352, -157955, -2314127, -4690198, -5104146, -3655797, -1868784, -854549, -1427416, -4078438, -7292061, -7720780, -3979941, 1061826, 3551857, 2959403, 1465586, 551543, 277586, 745152, 1965725, 2910814, 2544783, 1137154, -879703, -4018782, -7850682, -9639997, -7532153, -3961553, -2930938, -4541414, -5209275, -3014819, 209530, 2247841, 2995158, 2965783, 1875179, -307966, -2661590, -4267296, -4544378, -2842623, 553535, 3480596, 4091181, 3422183, 3315604, 2739513, -250780, -3417517, -1915662, 4110579, 8245671, 6269109, 1641779, -366044, -40799, -760208, -2356779, -1869299, 740696, 2527136, 2720117, 3441103, 5021384, 4872940, 2144690, -194378]
3425a94378M98391J751872K23518j261849q63435R1967N08697J457297L319531
3416E531611L956922J760550j424186k545082j347993j17975o1445m4792Q91159
3407F598769J622168O08146j521599k424330j083827O53924K27775k356485m197582
3398a873041k719001J270808M303962L926566J029231j616817k364743j582371
3390C74594j90891J391746K720467K988830J999361P51088K63684K82462j17389
3381A0463952j043211j682368j455612o18190J08879M9164r29038j990909j935306
3372I67361o60194O52496J192031J279782R94221k76087j829628j279770J802270
3363B842482L823884J589842k729622m424011k876958j388157j067298K68265
$$ y = [-194378, 304013, 2055885, 2279403, 1017554, 154119, 246086, 754783, 2212080, 5531611, 9488533, 11249083, 9824897, 7279815, 5931822, 5813847, 5752402, 5707610, 6598769, 8220937, 8829083, 7307484, 4883154, 3799327, 4453251, 4681026, 2324541, -1873041, -4592042, -3321234, 982728, 4909294, 5938525, 4321708, 1956965, 374594, 183703, 1575449, 4295916, 7284746, 9284107, 10035195, 10298879, 10581341, 10463952, 9420741, 7738373, 6282761, 5664571, 5773450, 5822614, 4893576, 2902667, 967361, 307167, 959663, 2151694, 3431476, 4425697, 4149610, 2319982, 1040212, 2842482, 6666366, 8256208, 5526586, 1102575, -1774383, -3162540, -4229838, -3961573]
3355c961573K721255L051200M73991j196071J93970J334588o46844k733168r45005
3346a707657K630404K904537k64823k378831j298980R91249K797566L939435L003768
3337A0616668j374003o102029n772682n31208L089125J197393k147243j424331
3329b448310K563072M960566L908512J378228j092421l514220n132830m584210
3321c961613k439452q70751n07730J60394J914805L325739K788919O02631j606592
3312e93650k472314j483984R34350L319348L945187K459692L83710n61761l39029
3303E591549k30954p76352r64660J7647R91936j3403k758423m434323l115476
3294e692459l72189Q50559L4136r40456j020630r90804j160223m25416J363164
$$ y = [-3961573, -1240318, 1810882, 2284873, 1088802, 1282772, 2617360, 1970516, -762652, -1707657, 922747, 3827284, 3562461, 1183630, -115350, 875899, 3673465, 7612900, 10616668, 9242665, 3140636, -2632046, -3163254, -74129, 1123264, -1023979, -2448310, 114762, 5075328, 8983840, 10362068, 9269647, 5755427, 622597, -3961613, -6401065, -7271816, -7779546, -7619152, -5704347, -2378608, 410311, 1012942, -593650, -3065964, -4549948, -3615598, -296250, 3648937, 6108629, 6492339, 5930578, 5591549, 5360595, 4584243, 3619583, 3637230, 4629166, 4615763, 1857340, -2576983, -5692459, -6064648, -5214089, -5179953, -6120409, -7141039, -8131843, -9292066, -9717482, -8354318]
3285h354318K153458N25210j580807j008821K253405M760304L771636K55384k638556
3276A36895k924265j058820J157007K156109J618078O76300Q57965K184084K627723
3267G431076L86996l317279m929042k727192P11667J511905n57380j825576L56876
3258b957949M133204N622202L702312Q07687o19854r04412j921372m084444n478430
3249a701056m090932m33917K662250L036474J357755j97745o28601l81487L03227
3240g4032J491364K189560J054987j083266j606924R5967J425880M83242j058107
3231B918671r24923o5819q94569l061711l836697k163306K28549J621012K034187
3222d144606K150326K341906K769641L030488K097506o4929j710604j699413j379506
$$ y = [-8354318, -6200860, -5675650, -7256457, -8265278, -6011873, -1251569, 2520067, 2775451, 136895, -2787370, -3846190, -2689183, -533074, 1085004, 1761304, 2619269, 4803353, 7431076, 7818072, 4500793, -428249, -3155441, -2443774, -931869, -1489249, -3314825, -2957949, 1175255, 6797457, 10499769, 11307456, 10687602, 9783190, 7861818, 3777374, -1701056, -5791988, -6225905, -3563655, -527181, 830574, 632829, 4228, -377259, -74032, 1417332, 3606892, 4661879, 3578613, 1971689, 2067656, 3493536, 3976778, 2918671, 1993748, 1927929, 1033360, -2028351, -5865048, -8028354, -7799805, -6178793, -4144606, -1994280, 347626, 3117267, 6147755, 8245261, 8180332, 6469728, 4770315, 3390809]
3213C390809k043525k128868J51858K878326K850144R34125N80157J411947m56678
3204G568295m890524o203070j744006L082382K395672j526111k143334J359299
3196b101397L484009J096392k479601k984539q28375P00853K31292p85309o92792
3187d359467N17079J587382J280662o02844k985996m226499l230296j74344L432415
3178h761908N515356M999824K813659P52563n78519j776262k752584k398571o11123
3169b797565Q76156O32066o46159j365894j086372m33814R0919K95989M0793m57112
3159d850993p11793p49018r05239p18253N79259K206144K294126P96049r7261
3150b156979O22688J138561o8652j692102j976844j420183q91586O90444L788663
$$ y = [3390809, 1347284, -781584, -629726, 2248600, 5098744, 6032869, 6613026, 8024973, 7568295, 2677771, -3525299, -5269305, -2186923, 208749, -1317362, -3460696, -2101397, 1382612, 2479004, -597, -2985136, -3813511, -3112658, -2881366, -3666675, -4359467, -3842388, -2255006, -974344, -1577188, -4563184, -8789683, -12019979, -12194323, -8761908, -3246552, 1753272, 4566931, 5319494, 4740975, 2964713, 212129, -2186442, -2797565, -1921409, -1289343, -1935502, -3301396, -4387768, -4821582, -4730663, -4434674, -4393881, -4850993, -5562786, -6311804, -7217043, -7935296, -7356037, -5149893, -2855767, -2059718, -2156979, -1534291, -395730, -464382, -2156484, -4133328, -5553511, -6445097, -5754653, -1965990]
3141a965990N225177J700167m280789o130441j606221L925667M244373k58623
3133H53320l885314k793721J323550M182513L632821R80472j273302j884704j083543
3124E2092M66385J866310J820241p4607j954054j475969P25063J506340k11640
3115B720161j868769j534647r33741j956006k802761r08403K150695K519782q040
3106b621729j747515p21490J057312J353713N06946m02201j317202j983663j336612
3097g212441O50074K354958K755015K679055L061650L453170K890317J009423
3089A1641221j804005m053565l526179j49976K284518K48739m055199n010751
3081d425197j547404J494686R95265k10811R04203K218112P25647j590395r98260
$$ y = [-1965990, 3259187, 4959354, 678565, -5451876, -7058097, -3132430, 1111943, 853320, -3031994, -5825715, -4502165, -319652, 3313169, 4293641, 3020339, 1135635, 52092, 518477, 2384787, 4205028, 4130421, 2176367, 700398, 1425461, 2931801, 2720161, 851392, -683255, -1616996, -3573002, -6375763, -7284166, -5133471, -2613689, -2621729, -4369244, -5090734, -4033422, -2679709, -2172763, -2574964, -3892166, -5875829, -7212441, -6562367, -4207409, -1452394, 1226661, 4288311, 7741481, 10631798, 11641221, 9837216, 5783651, 2257472, 2107496, 4392014, 4640753, 585554, -4425197, -5972601, -4477915, -3482650, -3693461, -2789258, -571146, 154501, -1435894, -2434154]
3072b434154J321556J094242j749438k842315m91736J849632J285327n52732j006879
3063c526497m46873n70088j176912j051050m18540l15998m80233K81467K116626
3054e588098L840910M253436K926740L18208k159529k935634j944473p70258m48207
3045b506905r6951J310550K851650K763694J077182l43062k32619Q55601J717312
3036G396452J703186P17556q47280k008213k061951j684458k015882k525764j351920
3027b678274J611321L692451K871744P56418J23738N53734p01071l579418m230849
3018a580206o67658L356018K899517j253504l553221j286923K167999K649451
3010B731473O58888o58445o47384j126772k295923k124115j42517J274047O43421
$$ y = [-2434154, -1112598, -18356, -1767794, -4610109, -5101845, -3252213, -1966886, -2519618, -3526497, -3973370, -4543458, -5720370, -6771420, -7189960, -7505958, -7986191, -7704724, -5588098, -1747188, 2506248, 5432988, 5751196, 3591667, 656033, -1288440, -2058698, -2506905, -2603856, -1293306, 1558344, 4322038, 5399220, 5056158, 4823539, 5679140, 7396452, 9099638, 9817194, 8969914, 6961701, 4899750, 3215292, 1199410, -1326354, -2678274, -1066953, 2625498, 5497242, 6253660, 6377398, 6931132, 6230061, 2650643, -1580206, -2247864, 1108154, 4007671, 2754167, -799054, -2085977, 82022, 2731473, 3390361, 2731916, 2084532, 957760, -1338163, -3462278, -3604795, -2330748, -1687327]
3001a687327k55721L80256J065839l85942k570832k156998O78042K054610K24847
2992b653226j778546q59448J667747K535973J196659n51292j879505k996162l046552
2983h364352j015266J743656K751894K043614J831575K554538K133585m09507
2975C269737l319884m758384m591383k992233J1937K840641L130512J333254O46591
2966d429212K061138K619619L59340k320019k661751j786092j878282j952434
2958i987693n4917K473338K811442J222966J14607j49053p78962j145037J70521
2949e322788J778665J088815r92912j158576P25249J422008j63372j603464j553464
2940e779839j425284j693370q39412R68926J433477N42550R61282K636742K004561
$$ y = [-1687327, -1943048, -1562792, -496953, -882895, -3453727, -5610725, -4932683, -2878073, -2653226, -4431772, -5291220, -3623473, -1087500, 109159, -442133, -2321638, -5317800, -8364352, -9379618, -7635962, -4884068, -2840454, -1008879, 1545659, 3679244, 3269737, -50147, -4808531, -9399914, -12392147, -12380210, -9539569, -6409057, -5075803, -4429212, -2368074, 251545, 610885, -1709134, -4370885, -6156977, -8035259, -9987693, -10042610, -7569272, -4757830, -3534864, -3420257, -3569310, -4348272, -5493309, -5322788, -3544123, -2455308, -3448220, -4606796, -3881547, -2459539, -2622911, -4226375, -5779839, -7205123, -8898493, -9737905, -8768979, -7335502, -6792952, -5831670, -3194928, -1190367]
2931a190367j329759k465705J013003M311231K812612m89591l80190J652036M82866
2922D416136l019896k742499K490029O257265L705722j990062m775419l318003
2914A023273p05042O58192R65259J169068J464521J396378N99779m57157p18127
2905E396144j55778k78645j706824k382615l70909K450952K373619o83127k785139
2896A857678j566018P90384J264871L4422q43544o98042l37306k56100m09624
2887a63279q46648j263401p18240J103116K967644L279616J678503r08163k990153
2878B138995l133154j156629Q87458M46271k145213l608446k013308N75618J196562
2869f811846J70594J24806J794245L164174K723864J474516J118746J769167K286869
$$ y = [-1190367, -2520126, -4985831, -3972828, 338403, 3151015, 2661424, 2281234, 3933270, 4416136, 1396240, -1346259, 1143770, 7401035, 11106757, 9116695, 4341276, 1023273, 318231, 976423, 1941682, 3110750, 4575271, 5971649, 6571428, 6114271, 5396144, 5240366, 4961721, 3254897, 872282, 501373, 2952325, 5325944, 4642817, 1857678, 291660, 1082044, 2346915, 2381337, 1537793, 839751, 502445, 246345, -163279, -1009927, -2273328, -2991568, -1888452, 1079192, 4358808, 6037311, 5129148, 2138995, -994159, -2150788, -1263330, -817059, -2962272, -6570718, -8584026, -8008408, -6811846, -6641252, -6516446, -4722201, -1558027, 1165837, 2640353, 3759099, 5528266, 7815135]
2860G815135J940214Q90220m81163k010043l564505m739697m872907l568180j373409
2851i964335L91890R14558P41750Q33976J069722N50225o62944j231341m35743
2842g792242O18084O26488K03014J002894K884774L502903J359246j957039l642970
2833c194848k995386j591044o43470K56386J609201K684841K485259J142770l79964
2824f26255j369816j509612n66785J214016K698002K678228J216398l01596n97056
2815B835524K33940R81413P42579j22926o62468p35009j029155j543562j162419
2806d62083M57049J709083J196714J77529Q41706K545538K197459j186309m626648
2797B850038m925156k457929o4214M01820o93787j761195j349129L44979R49474
$$ y = [7815135, 9755349, 10645569, 10164406, 8154363, 4589858, -149839, -5022746, -8590926, -9964335, -9572445, -8657887, -7916137, -7082161, -6012439, -5462214, -6125158, -7356499, -7792242, -7174158, -6547670, -6344656, -5341762, -2456988, 1045915, 2405161, 448122, -3194848, -6190234, -7781278, -8424748, -8168362, -6559161, -3874320, -1389061, -246291, -626255, -1996071, -3505683, -4072468, -2858452, -160450, 2517778, 3734176, 3432580, 2835524, 3069464, 4050877, 4793456, 4670530, 4008062, 3273053, 2243898, 700336, -462083, -5034, 1704049, 2900763, 3078292, 3919998, 6465536, 8662995, 7476686, 2850038, -2075118, -4533047, -4597261, -4195441, -4889228, -6650423, -7999552, -7654573, -6705099]
2788f705099j381338m419379l598366J603856N874449M674853R1322k492373j361398
2779g713473R29644K161934K208623J198044o84149j932753j170649M55039Q95997
2770c651743N71319J320429K741251K784475J479424O03943j5753k002760m193884
2761c63299l270371M56257K258552j91655l213361k817126n11511k30538k101297
2752i984349k864875j104164J194821J865823J006458L18028J350930L927061
2744d290267N549764L598973j024989m115517l206863n62458M02837l01574l52550
2735d302644R12255K209588K935678L509862L641419K570467Q04512l46458p43625
2726A1191054j154357j371182n57422O44298L96939j555686l120261k537667n69237
$$ y = [-6705099, -8086437, -12505816, -16104182, -14500326, -8625877, -3951024, -3859702, -6352075, -7713473, -6783829, -4621895, -2413272, -1215228, -1899377, -3832130, -5002779, -4547740, -3651743, -3080424, -1759995, 981256, 3765731, 5245155, 5849098, 5833345, 3830585, -363299, -3633670, -3177413, -918861, -1110516, -4323877, -7141003, -7652514, -7883052, -9984349, -12849224, -13953388, -12758567, -10892744, -9886286, -9568258, -8217328, -4290267, 1259497, 4858470, 3833481, -282036, -3488899, -4051357, -3648520, -3950094, -4302644, -3390389, -1180801, 1754877, 5264739, 8906158, 11476625, 12281137, 11934679, 11191054, 10036697, 8665515, 8108093, 8752391, 9149330, 7593644, 4473383, 1935716, 1366479]
2717A366479P37958N64759k08497n64382n27518o03829o05190J47421J320708
2708A627909J378006j80829j432217n16646J253642J014968j222306k451231j267785
2699a796489L05237M90591K87335Q15886R81383j11346q97444M7147J222236N73617
2689A918153j131082j825339j374849p60337K34414J784228K221249N38030r15629
2680F88838M03605K804916K759891N05622p74464m87201r17035k260232k003413
2671G20527K38613J643602Q97229n4819l0055l38224j194521n60791J676463K489063
2661E487087Q87403K58072K695232M820181K797190j667201m218544m130016l576134
2652C353270k768054l54966K464185K644508j09832l070851m582281n077933m386027
$$ y = [1366479, 2104437, 2669196, 2460699, 1896317, 1368799, 764970, 159780, 307201, 1627909, 3005915, 2825086, 1392869, 876223, 2129865, 3144833, 1922527, -528704, -1796489, -1491252, -1000661, -713326, 102560, 1083943, 972597, 75153, 122300, 1344536, 1918153, 787071, -1038268, -2413117, -3173454, -2939040, -1154812, 1066437, 1604467, 688838, 1092443, 3897359, 6657250, 7162872, 6388408, 5901207, 4984172, 2723940, 720527, 959140, 2602742, 3499971, 3445152, 3415097, 3076873, 1882352, 1321561, 2998024, 5487087, 6374490, 6632562, 9327794, 14147975, 16945165, 15277964, 11059420, 6929404, 3353270, 585216, 230250, 2694435, 5338943, 5229111, 2158260, -2424021, -7501954, -11887981]
2643a1887981j722199J486338K412949J051066K58794R63430R22200o47023j051699
2634h214125J192797L170787K009584k78776k8904J885147J282768k426540m789058
2625f196320k701017J220077K616954J237831J92720P87081J134122n4414j058437
2616b821403J39873K532554L418165K259311J091094J047625O94745j123659k655132
2607D583173j503816J367433K322269o2108k959251l069755o92722J359707J595204
2598B940134Q13491J2447o96092j188378j171032j165149j960686k698798j382972
2589f497035J822168L743107K204452p36051j586524j63371R56960Q16187Q14537
2580A374430J244812N79565r59026o72719J904528K884340m50273m648938m437701
$$ y = [-11887981, -13610180, -12123842, -9710893, -8659827, -8401033, -7437603, -6515403, -7162426, -8214125, -7021328, -3850541, -1840957, -2119733, -2148637, -263490, 1019278, -1407262, -6196320, -8897337, -7677260, -5060306, -3822475, -3629755, -2842674, -1708552, -1762966, -2821403, -2681530, -148976, 3269189, 5528500, 6619594, 7667219, 8361964, 7238305, 4583173, 3079357, 4446790, 6769059, 6706951, 3747700, 677945, -14777, 1344930, 2940134, 3753625, 3766072, 3069980, 1881602, 710570, -454579, -2415265, -5114063, -6497035, -4674867, -931760, 1272692, 536641, -1049883, -1213254, -256294, 559893, 1374430, 2619242, 3198807, 2239781, 1567062, 3471590, 6355930, 5905657, 1256719, -3180982]
2571c180982l92493K060036P32672q38333K92604K106402J601799m00722j259746
2562G21237q34667p86709j201816r17059k56698n86059j587855j633341p22293
2553g805260m40766p67135L92309L532583N755656M270504J91722k820582k809495
2544e00464r22560P63251J225927M88762q95674k001424k123316j582103j297800
2535f845401j410188j092379R945J021867J060836M63561O9743o1183k75393j99732
2525g258324P56091J934217J808839N3309j942122k872186k610509j282552J062890
2516a0350347L127493K629583n47747l007320j644856K235307M707101M236142
2508A385356K483998P61018j293206l258675l224725o98623K133639L317972L233380
$$ y = [-3180982, -3573475, -1513439, -780767, -1619100, -1326496, 779906, 2381705, 1980983, 721237, -113430, -900139, -2101955, -3019014, -3275712, -3861771, -5449626, -7082967, -7805260, -8246026, -9013161, -8620852, -5088269, 667387, 4937891, 5129613, 2309031, -500464, -1423024, -659773, 566154, 1054916, 159242, -1842182, -3965498, -5547601, -6845401, -8255589, -9347968, -9338023, -8316156, -7255320, -6791759, -6722016, -6783199, -7058592, -7258324, -6502233, -4568016, -2759177, -2705868, -4647990, -7520176, -10130685, -11413237, -10350347, -7222854, -4593271, -5141018, -8148338, -9793194, -7557887, -2850786, 1385356, 3869354, 4630372, 3337166, 78491, -3146234, -3844857, -1711218, 1606754, 4840134]
2499D840134K571250N43909k985249n532947m607426j228762J334116J608987
2491c455988P53911N0065l34487l79724J6063K68468k90766j032400o71071P84426
2481d291503K096031K639817K694736K065631J92431k172179l155951k213917
2473b144904r13395o06776o54956J78748J677852K566620K301384J527534J012903
2464D945010P47873O0914j507652l257842l497619j352714J670885K868666J329943
2455B007464j068479j976895j067842K45103Q17999P57483P37146J009365J166171
2446B627515O70484m02434j242419j097311l9563J280237K324177K724214K117546
2437H962446O69890n29038m92240K92121L41962r26200k510246l034333j988919
$$ y = [4840134, 7411384, 7955293, 4970044, -562903, -5170329, -6399091, -5064975, -3455988, -2702077, -2652012, -2986499, -3366223, -3350160, -3081692, -3372458, -4404858, -5075929, -4291503, -2195472, 444345, 3139081, 5204712, 5397143, 3224964, 69013, -2144904, -3058299, -3665075, -4320031, -4141283, -2463431, 103189, 2404573, 3932107, 4945010, 5692883, 5753797, 4246145, 988303, -2509316, -3862030, -2191145, 677521, 2007464, 938985, -1037910, -2105752, -1860649, -1042650, -285167, 451979, 1461344, 2627515, 3297999, 2895565, 1653146, 555835, 516272, 1796509, 4120686, 6844900, 8962446, 9632336, 9103298, 8611058, 8903179, 9245141, 8318941, 5808695, 2774362, 785443]
2428G85443R8370J967042K313834J097252n9065K08424R87438L61988j490899
2419F269827k214315n66888J876144K868887J823687n02200k925931l767996j821487
2410A039728J482630K774465R87663j051045r47093l82301j845495l788699k758200
2401d488347O66884K255920N72069j134609n67828J50056j142064k370246o37797
2392f695962K545316L256996J144241l57966M87227J528968O04502j361137k280076
2383a127891j720310o05527K09503O9631j212035k327534j361779J275516K523747
2374d276679O20084k216651k677746n58974J778222K920673L165821K566559P17878
2365B039187j527943k348904j401684l01286k57694p38605q92393q64862j096652
$$ y = [785443, 883813, 2850855, 5164689, 6261941, 6202876, 6411300, 7398738, 7760726, 6269827, 4055512, 3488624, 5364768, 8233655, 10057342, 9555142, 6629211, 2861215, 1039728, 2522358, 5296823, 6284486, 5233441, 4286348, 3904047, 2058552, -1730147, -4488347, -3821463, -1565543, -993474, -2128083, -2695911, -2545855, -3687919, -6058165, -6695962, -4150646, -893650, 250591, -107375, 379852, 1908820, 2513322, 1152185, -1127891, -2848201, -3453728, -3244225, -3174594, -4386629, -6714163, -8075942, -6800426, -4276679, -3656595, -5873246, -8550992, -9109966, -7331744, -4411071, -1245250, 1321309, 2039187, 511244, -1837660, -3239344, -3540630, -3798324, -4536929, -5429322, -6294184, -7390836]
2356g390836j372986j069793K97941K634733M537033L716316k17067l938876l585162
2347f388697L06362L340910K926534Q48598k69898k17595J39785N92797M77318
2338A756114j419990m000310l668356O33736M805148M766512J832999k30554j050671
2329C424628k486350l563619j564044K349188L509168L96768l229855l830057
2321d994173k056643k22151P11563M44762r82780j570398J150697N526907O301787
2312D309571J773714l069709l210091k07675J031497n70375k017924j446376O5276
2303c342092J026250Q84789m83202k145591j883633R44824L370698K328507p85225
2294h4675k013448n21600Q62418M70920k67774j20371n2411q12408j085662M09736
$$ y = [-7390836, -8763822, -9833615, -9535674, -6900941, -2363908, 1352408, 1135341, -2803535, -6388697, -6082335, -2741425, 185109, 1033707, 763809, 546214, 685999, 1278796, 1756114, 336124, -3664186, -7332542, -6698806, -1893658, 2872854, 4705853, 4475299, 3424628, 938278, -2625341, -4189385, -1840197, 1668971, 2065739, -1164116, -4994173, -7050816, -7272967, -6561404, -6116642, -7099422, -8669820, -7519123, -1992216, 4309571, 6083285, 3013576, -196515, -404190, 627307, 56932, -1960992, -3407368, -3342092, -2315842, -1431053, -1914255, -4059846, -5943479, -4998655, -1627957, 700550, -84675, -2098123, -2619723, -1757305, -1286385, -1554159, -1674530, -1726941, -2539349, -3625011, -3215275]
2284c215275K637185L391865J793106j124897l526759m072483k784054q40380
2276g741692P58007J845131K197773J357946J14431K89757J669069J419964j274600
$$ y = [-3215275, -578090, 2813775, 4606881, 3481984, -44775, -4117258, -6901312, -7741692, -6983685, -5138554, -2940781, -1582835, -1468404, -1178647, 490422, 1910386, 635786]
$$ [...]
##END NTUPLES=NMR SPECTRUM
##END=
