##TITLE=31Pdec_DE-90k
 CDCl3, 64 sc
 7.5.2025
##JCAMPDX= 6.0         $$ Bruker NMR JCAMP-DX V2.0
##DATA TYPE= NMR SPECTRUM
##DATA CLASS= NTUPLES
##ORIGIN= UXNMR, Bruker Analytische Messtechnik GmbH
##OWNER= root
$$ XWIN-NMR		Version 3.5
$$ Wed May  7 13:57:48 2025 Russian Standard Time (UT+4h)  she@DPX200
##.OBSERVE FREQUENCY= 81.013821
##.OBSERVE NUCLEUS= ^31P
##.ACQUISITION MODE= SIMULTANEOUS
##.ACQUISITION SCHEME= undefined
##.AVERAGES= 64
##.DIGITISER RES= 17
##SPECTROMETER/DATA SYSTEM= spect
##.PULSE SEQUENCE= zgpg30
##.SOLVENT NAME= D2O
##.SHIFT REFERENCE= (INTERNAL, D2O, 0, 198.062)
##AUDIT TRAIL= $$ (NUMBER, WHEN, WHO, WHERE, WHAT)
$$ ##TITLE= Audit trail, XWIN-NMR		Version 3.5
$$ ##JCAMPDX= 5.01
$$ ##ORIGIN= Bruker BioSpin GmbH
$$ ##OWNER= she
$$ F:/spectra/data/she/nmr/P31/2/pdata/1/auditp.txt
$$ ##AUDIT TRAIL=  $$ (NUMBER, WHEN, WHO, WHERE, WHAT)
(   1,<2025-05-07 13:56:33.40 +0400>,<she>,<DPX200>,
      <created by zg, POWCHK disabled, PULCHK disabled
       configuration hash MD5:
       00 E9 B6 7A A2 85 ED C7 34 08 36 98 17 FE 4E 26
       data hash MD5: 32K
       95 C9 B0 92 C0 8E 16 7C 55 B6 BF B7 8B D3 E6 17>)
(   2,<2025-05-07 13:56:37.20 +0400>,<she>,<DPX200>,
      <Start of raw data processing
       efp BC_mod = 2 LB = 1.5 FT_mod = 6 PKNL = 1 PHC0 = 1369.458 PHC1 = 147.2934 SI = 64K 
       data hash MD5: 64K
       2F 4C CC 57 AD 4F E8 5A 2B 30 2D F6 55 A7 F8 AE>)
(   3,<2025-05-07 13:56:55.09 +0400>,<she>,<DPX200>,
      <pk PHC0 = -16.92449 PHC1 = 0 
       data hash MD5: 64K
       F5 15 D3 60 6D CE F0 19 2D D4 C5 2A F5 8A FA 64>)
(   4,<2025-05-07 13:57:21.46 +0400>,<she>,<DPX200>,
      <pk PHC0 = 17.77123 PHC1 = -72.59999 
       data hash MD5: 64K
       76 E8 0B B7 ED 1A 14 A8 CC 4A 55 E4 81 9F F0 96>)
$$ ##END=
$$ 
$$ hash MD5
$$ 89 09 74 6D AA 66 54 84 65 F0 9F 8D D7 D9 D9 86
##$RELAX= 
##$RELAX= 
##$RELAX= 
##$RELAX= 
##$RELAX= 
##$RELAX= 
##$RELAX= 
##$RELAX= 
$$ Bruker specific parameters
$$ --------------------------
##$DU= <F:/spectra>
##$EXPNO= 2
##$NAME= <P31>
##$PROCNO= 1
##$TYPE= <nmr>
##$USER= <she>
##$AMP= (0..31)
100 100 100 100 100 100 100 100 100 100 100 100 100 100 100 100 100 100 
100 100 100 100 100 100 100 100 100 100 100 100 100 100 
##$AQSEQ= 0
##$AQ_mod= 1
##$AUNM= <au_zg>
##$AUTOPOS= <>
##$BF1= 81.014009
##$BF2= 200.13
##$BF3= 200.13
##$BF4= 200.13
##$BF5= 200.13
##$BF6= 200.13
##$BF7= 200.13
##$BF8= 200.13
##$BYTORDA= 1
##$CFDGTYP= 0
##$CFRGTYP= 5
##$CHEMSTR= <none>
##$CNST= (0..31)
1 1 145 1 1 1 1 1 1 1 1 1 1 1 1 1 1 1 1 1 1 1 1 1 1 1 1 1 1 1 1 1 
##$CPDPRG= <waltz16>
##$CPDPRG1= <>
##$CPDPRG2= <waltz16>
##$CPDPRG3= <>
##$CPDPRG4= <mlev>
##$CPDPRG5= <mlev>
##$CPDPRG6= <mlev>
##$CPDPRG7= <mlev>
##$CPDPRG8= <mlev>
##$CPDPRGB= <>
##$CPDPRGT= <>
##$D= (0..31)
0 1 0 0 0 0 0 0 0 0.06 0 0.03 2e-05 3e-06 0 0 0.0002 0 0 0 0 0 0 0 0 0 
0 0 0 0 0 0 
##$DATE= 1746611792
##$DBL= (0..7)
120 120 120 11 120 120 24 19 
##$DBP= (0..7)
150 150 150 150 150 150 150 150 
##$DBP07= 0
##$DBPNAM0= <>
$$ [...]
##$SUBNAM2= <"">
##$SUBNAM3= <"">
##$SUBNAM4= <"">
##$SUBNAM5= <"">
##$SUBNAM6= <"">
##$SUBNAM7= <"">
##$SUBNAM8= <"">
##$SUBNAM9= <"">
##$SW= 400.765351723535
##$SWIBOX= (0..15)
0 1 3 0 0 0 0 0 0 0 0 0 0 0 0 0 
##$SW_h= 32467.5324675325
##$TD= 32768
##$TD0= 1
##$TE= 0
##$TE2= 300
##$TE3= 300
##$TEG= 300
##$TL= (0..7)
0 120 53 12 22 120 120 120 
##$TP= (0..7)
150 150 150 150 150 150 150 150 
##$TP07= 0
##$TPNAME0= <>
##$TPNAME1= <>
##$TPNAME2= <>
##$TPNAME3= <>
##$TPNAME4= <>
##$TPNAME5= <>
##$TPNAME6= <>
##$TPNAME7= <>
##$TPOAL= (0..7)
0.5 0.5 0.5 0.5 0.5 0.5 0.5 0.5 
##$TPOFFS= (0..7)
0 0 0 0 0 0 0 0 
##$TUNHIN= 0
##$TUNHOUT= 0
##$TUNXOUT= 0
##$USERA1= <user>
##$USERA2= <user>
##$USERA3= <user>
##$USERA4= <user>
##$USERA5= <user>
##$V9= 5
##$VALIST= <valist>
##$VCLIST= <CCCCCCCCCCCCCCC>
##$VD= 0
##$VDLIST= <DDDDDDDDDDDDDDD>
##$VPLIST= <PPPPPPPPPPPPPPP>
##$VTLIST= <TTTTTTTTTTTTTTT>
##$WBST= 1024
##$WBSW= 4
##$XGAIN= (0..3)
0 0 0 0 
##$XL= 0
##$YL= 0
##$YMAX_a= 5813
##$YMIN_a= -6811
##$ZGOPTNS= <>
##$ZL1= 120
##$ZL2= 120
##$ZL3= 120
##$ZL4= 120
##$ABSF1= 0
##$ABSF2= 0
##$ABSG= 0
##$ABSL= 0
##$ALPHA= 0
##$AQORDER= 0
##$ASSFAC= 0
##$ASSFACI= 0
##$ASSFACX= 0
##$ASSWID= 0
##$AUNMP= <proc_1d>
##$AZFE= 0.1
##$AZFW= 0.5
##$BCFW= 0
##$BC_mod= 2
##$BYTORDP= 0
##$COROFFS= 0
##$CY= -3
##$DATMOD= 1
##$DC= 0
##$DFILT= <>
##$DTYPP= 0
##$F1P= 0
##$F2P= 0
##$FCOR= 1
##$FTSIZE= 65536
##$FT_mod= 6
##$GAMMA= 0
##$GB= 0
##$INTBC= 1
##$INTSCL= 9.790993e-09
##$ISEN= 30
##$LB= 1.5
##$LEV0= 0
##$LPBIN= 0
##$MAXI= 10000
##$MC2= 0
##$MEAN= 0
##$ME_mod= 0
##$MI= 50
##$NCOEF= 0
##$NC_proc= -8
##$NLEV= 6
##$NOISF1= 182.463
##$NOISF2= 159.3651
##$NSP= 0
##$NTH_PI= 0
##$NZP= 0
##$OFFSET= 198.0616
##$PC= 4
##$PHC0= 1370.305
##$PHC1= 74.69341
##$PH_mod= 1
##$PKNL= yes
##$PPARMOD= 0
##$PSCAL= 0
##$PSIGN= 0
##$REVERSE= no
##$SF= 81.0140089999434
##$SI= 65536
##$SIGF1= 159.3651
##$SIGF2= -187.1042
##$SINO= 113.3802
##$SIOLD= 16384
##$SREGLST= <1H.CDCl3>
##$SSB= 0
##$STSI= 65536
##$STSR= 0
##$SW_p= 32467.5324675325
##$SYMM= 0
##$S_DEV= 0
##$TDeff= 32768
##$TDoff= 0
##$TI= <>
##$TILT= no
##$TM1= 0
##$TM2= 0
##$TOPLEV= 0
##$USERP1= <user>
##$USERP2= <user>
##$USERP3= <user>
##$USERP4= <user>
##$USERP5= <user>
##$WDW= 1
##$XDIM= 65536
##$YMAX_p= 221259800
##$YMIN_p= -158478223
$$ End of Bruker specific parameters
$$ ---------------------------------
##NTUPLES= NMR SPECTRUM
##VAR_NAME=  FREQUENCY,     SPECTRUM/REAL,   SPECTRUM/IMAG
##SYMBOL=    X,             R,               I
##VAR_TYPE=  INDEPENDENT,   DEPENDENT,       DEPENDENT
##VAR_FORM=  AFFN,          ASDF,            ASDF
##VAR_DIM=   65536,         65536,           65536
##UNITS=     HZ,            ARBITRARY UNITS, ARBITRARY UNITS
##FACTOR=    0.49542278885378, 1,            1
##FIRST=     16045.7642231865, 0,            0
##LAST=      -16421.768244346, 0,            0
##MIN=       -16421.768244346, -158478223,   0
##MAX=       16045.7642231865, 221259800,    0
$$ Real data points
##PAGE= N=1
##DATA TABLE= (X++(R..R)), XYDATA
$$ [...]
##PAGE= N=2
##DATA TABLE= (X++(I..I)), XYDATA
7490b409735J293030J043186q57126k009674k69439K587026K897574J28327k505196
7481a02027k303249R744J891169J948577P42521m50750j034630j376956j872044
7472b547645k061709j301321j11618K25921m11761p17890r084P99656R22451R91045
7462d221955J660061K236695J882187J075533O68670M78155P162m24651m86424
7453B875433p46728j520348j904354j335135q93291j425433j609952P6017K467987
7444d015804L091627J815770Q16551J182271J746114J256075j95222j836012k709440
7435A151930j971758l39260k68714k570809m108799j783147K358549L725098K149910
7426a657000J734329L657102M249845J530833j452364k143347k483140m163215
$$ y = [-2409735, -1116705, -73519, -930645, -2940319, -3209758, -622732, 2274842, 2403169, -102027, -2405276, -2395532, -504363, 1444214, 2186735, 1735985, 701355, -675601, -2547645, -4609354, -5910675, -6022293, -5796372, -6208133, -6926023, -6935107, -6135451, -5213000, -4221955, -2561894, -325199, 1556988, 2632521, 3301191, 3779346, 3786508, 3361857, 2875433, 2128705, 608357, -1295997, -2631132, -3524423, -4949856, -6559808, -6483791, -4015804, -924177, 891593, 1708144, 2890415, 4636529, 5892604, 5697382, 3861370, 1151930, -819828, -1159088, -1427802, -3998611, -8107410, -9890557, -7532008, -3806910, -1657000, 77329, 3734431, 7984276, 9515109, 8062745, 5919398, 3436258, -726957]
7418g26957m422698q90168L121790L171023P36158M01085K108286K014307j34864
7409E377962p08165P13813K27246l041374m400545j118249K623043K063591q40807
7400H96515j023978J457365J931878r85956k965231n20277L733345M664733J368389
7391H556783k287000l165782k305856k076714k069742j48752L157499M346317
7383D006753J980275o68544j54138K026689J817934j141503l160869k213381m95815
7374A997401n23987j764234k468169k306341j670706n01904O93858O09904o14830
7365f549008q54654P30348J887237O71346j199633p65902J760776L518909L075826
7356B275245J545354J31626j049832j759213j418173m65376k53624j184179k205061
$$ y = [-726957, -5149655, -6039823, -2918033, 252990, 989148, 1390233, 3498519, 5512826, 5377962, 4669797, 5383610, 5610856, 2569482, -1831063, -2949312, -326269, 1737322, 896515, -127463, 1329902, 3261780, 2275824, -689407, -1209684, 2523661, 7188394, 8556783, 6269783, 3104001, 798145, -1278569, -3348311, -3497063, -339564, 4006753, 5987028, 5318484, 5164346, 7191035, 9008969, 7867466, 4706597, 2493216, 1997401, 1473414, -290820, -2758989, -5065330, -6736036, -7237940, -6544082, -5934178, -6549008, -7403662, -6673314, -4786077, -4114731, -5314364, -6080266, -4319490, -800581, 2275245, 3820599, 3952225, 2902393, 1143180, -274993, -740369, -993993, -2178172, -4383233]
7347d383233k382438j801275p70822O40051J954700K256753J357735L39265L90124
7338b399140J303558J465825l83566l191271l956484j100687K818815L486751
7330a956199K85873k627089j764645J196764K160201J20514k464996l638044l490366
7321a2177987k236639L34091L082038L736428J903885L1022K95041J893842K459152
7312f79127J139849p53755j602960j130594l17520o5917j39099K43759Q81261
7303b424103P57263J51856R33545L371643M340995J167922l727489n125310j950933
7294b504611J203926L94208k715118l891226k082716J52421P03683Q6785j70367
7285h823015M15526J156399J228640N10721l94746r56996j337935j786532j756925
$$ y = [-4383233, -6765671, -8566946, -9337768, -8697717, -6743017, -4486264, -3128529, -2789264, -2399140, -1095582, 370243, -13323, -3204594, -7161078, -8261765, -5442950, -1956199, -1670326, -4297415, -6062060, -4865296, -2705095, -2584581, -5049577, -8687621, -12177987, -14414626, -14080535, -10998497, -7262069, -5358184, -5327162, -5032121, -3138279, -679127, 460722, -293033, -1895993, -3026587, -3344107, -3410024, -3549123, -3305364, -2424103, -1666840, -1514984, -581439, 2790204, 7131199, 8299121, 4571632, -553678, -2504611, -1300685, -906477, -3621595, -7512821, -9595537, -9443116, -8739433, -8652648, -8823015, -8407489, -7251090, -6022450, -5511729, -5906475, -6863471, -8201406, -9987938, -11744863]
7276a1744863n52262J278888K269774J806928N50219q31921k084118k555910j498133
7267a3361398N57827K114859K636133K744788K495017J334179J6796K70019J784931
7258E93151J878007n51730k860892k163616P04032K541393J835007k03011j631000
7249A41341j463143l02410j14599j977790l585005j449332L386443N168416J244346
7240A048267l337720k626673J720313L403602R92832j071738m24109J08113j611781
7231a798894l261392k397114l98443N10292Q17486J630808J886973M95293j003275
7222c518266p29060L82514L54832m81129n39458o2738m88802j629260j920775
7213h632142q75966P47760K445527L690791L195551O83809j527354j176691M47042
$$ y = [-11744863, -12297125, -11018237, -8748463, -6941535, -6391316, -7223237, -9307355, -11863265, -13361398, -12803571, -10688712, -8052579, -5307791, -2812774, -1478595, -1461799, -1191780, 593151, 2471158, 1919428, -941464, -3105080, -2401048, 140345, 1975352, 1772341, 141341, -1321802, -1624212, -1738811, -3716601, -7301606, -8750938, -5364495, -196079, 1048267, -2289453, -4916126, -3195813, 207789, 1200621, 128883, -295226, -187113, -1798894, -5060286, -7457400, -7855843, -7345551, -6528065, -4897257, -3010284, -2514991, -3518266, -4247326, -3864812, -3509980, -3991109, -4530567, -4593305, -5082107, -6711367, -8632142, -9508108, -8760348, -6314821, -2624030, 571521, 1255330, -272024, -1448715, -1001673]
7204a001673K68373j850286k973766j577474O34056J655040J326525J76595j337722
7195d680332j940071m82050J578615J360131r31277j648988P72883L100421K301982
7186e68686L34195Q11722L093848L431226Q80533j720987k462712k462884k774463
7177a438208k451989q85921N59705O87532J97728n2216n58925j436966j071544
7168f450804J494556M230788M383311K224234M16368J92749L54194j21748p39624
7159E984024j102326j792418k828474k957621j582103p0970P2406o07473m26790
7150e311745R65732K228735K140451P84567q91253j875898j603826m02889O54651
7141c311475R16046R44997J572830K487763K574283J512825K17843l93011m44911
$$ y = [-1001673, -733300, -2583586, -5557352, -7134826, -6500770, -4845730, -3519205, -3342610, -4680332, -6620403, -7102453, -5523838, -4163707, -5094984, -6743972, -5971089, -2870668, -568686, -234491, 577231, 3671079, 7102305, 7982838, 6261851, 3799139, 1336255, -1438208, -3890197, -4776118, -4216413, -3528881, -3331153, -3383369, -3942294, -5379260, -6450804, -4956248, -725460, 3657851, 5882085, 6298453, 6491202, 6845396, 6723648, 5984024, 4881698, 3089280, 260806, -2696815, -4278918, -4349888, -4277482, -4884955, -5311745, -4346013, -2117278, 23173, 807740, -83513, -1959411, -3563237, -3966126, -3311475, -2395429, -1450432, 122398, 2610161, 5184444, 6697269, 6915112, 6522101, 6077190]
7132F077190q06110k075087l724999m049631j623132K546274N126296L892738
7124E363539M78837j710850j820248j859441k821983k961116r22354J548592J813964
7115b891060j2709j452853j007775N00342J544791J396302J44528j567508k787386
7106f133328l015554k574955j741899k25765J720247K686714J893659O90595O78173
7097f022113J134566L00970j318233j368772N61510K036067J368171l3409m180
7088c345423J399294K411522J760919m74906k949351l476326j061670J924965
7080c810976J736774j651147l868320k050637J230892K165382J188371J091853
7072c967808J810605J162361l71602l1201K180388L135289J836800Q60000J372731
$$ y = [6077190, 5271080, 3195993, -529006, -4578637, -6201769, -3655495, 1470801, 5363539, 5842376, 4131526, 2311278, 451837, -2370146, -5331262, -6253616, -4705024, -2891060, -2903769, -4356622, -5364397, -4864055, -3319264, -1922962, -1778434, -3345942, -6133328, -9148882, -11723837, -13465736, -13691501, -11971254, -9284540, -7390881, -6700286, -6022113, -4887547, -4586577, -5904810, -7273582, -6712072, -4676005, -3307834, -3341243, -3345423, -1946129, 465393, 2226312, 1751406, -1197945, -4674271, -5735941, -3810976, -2074202, -3725349, -7593669, -9644306, -8413414, -6248032, -5059661, -3967808, -2157203, -994842, -1366444, -1397645, 782743, 3918032, 5754832, 6614832, 7987563]
7063G987563Q94458j967977m420284l886366k190486k069540k391403p27389J577023
7054g194401J396107m43475k36286K090496K459261m76480k601767o18569K806596
7045b818518L186775P67338m89678J054638L026655K938058R90528j202672k569052
7036D884072k767886j938240q20557l08558o97495j813275l337904m248524k920702
7027a3969069P06565L842342L721070J409965M39647J610841J961710j98424k232172
7018b707525j316988P90286L46693k342619l215231p42036J786967J428778k63329
7009f235004l98518O12345N39157l31709J22663J546452J203922j184143k272945
7000f397780j96598K287348K003244J49867p9486J138179Q78299j231726k159577
$$ y = [7987563, 8882021, 6914044, 2493760, -1392606, -3583092, -5652632, -8044035, -8771424, -7194401, -5798294, -6241769, -6478055, -4387559, -1928298, -2404778, -5006545, -5625114, -2818518, 368257, 1135595, 645917, 1700555, 4727210, 7665268, 8655796, 7453124, 4884072, 2116186, 177946, -642611, -951169, -1648664, -3461939, -6799843, -11048367, -13969069, -13262504, -9420162, -5699092, -4289127, -3849480, -2238639, -276929, -475353, -2707525, -4024513, -3234227, -2887534, -5230153, -8445384, -9187420, -7400453, -5971675, -6235004, -6633522, -6021177, -5482020, -5813729, -5691066, -4144614, -2940692, -4124835, -6397780, -6594378, -4307030, -2303786, -2153919, -2233405, -1095226, -216927, -1448653, -3608230]
6991c608230m99801J088898P9452k003295k098219j97190J123131P99590L48082
6982d967582Q80742J274806Q2347k090368l094431j696901R96590K547891J652996
6973d413910l51572q88084P42217K415937J980498J05905p97537R8983J268099
6964A60536J205925Q2111j205688k218907k670453k112672p22202M19829O02400
6955f459121M62339R99177K041219K344993J054397j299480l116529l007980j129836
6946h110821Q08405J372128J021497J106361J630220J481413Q19179J132185K189707
6937C450274J288867k603802n874815m209526J346215N229784M295198J108307
6929D030502l38601M51122J263418P97149l94771j359876j432295k69274J390018
$$ y = [-3608230, -4108031, -3019133, -2939681, -4942976, -7041195, -7238385, -6115254, -5315664, -4967582, -4086840, -2812034, -2729687, -4820055, -7914486, -9611387, -8614797, -6066906, -4413910, -4765482, -5653566, -4911349, -2495412, -514914, -409009, -1206546, -1107563, 160536, 1366461, 1448572, 242884, -1976023, -4646476, -6759148, -7481350, -7061521, -6459121, -5996782, -4997605, -2956386, -611393, 443004, -856476, -3973005, -6980985, -8110821, -7302416, -5930288, -4908791, -3802430, -2172210, -690797, 128382, 1260567, 3450274, 4739141, 2135339, -3739476, -7949002, -6602787, -1373003, 2922195, 4030502, 3691901, 4143023, 5406441, 6203590, 5808819, 4448943, 3016648, 2747374, 4137392]
6920D137392J776877K45681j432567j348804j54618K36934j62255K26002J300126
6911D824768R63834j394327l434162l023391j024862M21663Q34619J003018R35608
6902A06768J34242p61812n26251O19675J155262M72709m97353r39457r68122n68231
6892a772570P06569K328149K498408L56212k393246l176864j457923R17809J941065
6883e2391J220047k01548j002761n68011N75985J194755N67640p13285j429055
6874d08624j135956n51815n00872p39803j31303J799358L634228L128378L8419
6865E132010k832631k571085K22891K238672J846137P54919O88119O07858j082245
6856E004645l290915l533281j595365M07558J161683J025288O4001k088043m047973
$$ y = [4137392, 5914269, 6159950, 4727383, 3378579, 3223961, 3460895, 3298640, 3524642, 4824768, 5788602, 4394275, 960113, -2063278, -3088140, -2666477, -1831858, -828840, 106768, 241010, -520802, -1047053, -427378, 727884, 1200593, 703240, -236217, -1204339, -1772570, -1066001, 1262148, 3760556, 4116768, 1723522, -1453342, -2911265, -1993456, -52391, 1167656, 966108, -36653, -604664, -28679, 1166076, 1733716, 1020431, -408624, -1544580, -2096395, -2597267, -3337070, -3468373, -1669015, 1965213, 5093591, 5132010, 2299379, -271706, -48815, 2189857, 4035994, 4790913, 5479032, 6086890, 5004645, 1713730, -1819551, -3414916, -3007358, -1845675, -820387, -756386, -2844429, -6892402]
6847f892402l135924P96680M211756M046786J316872q21456r17983L76962K050785
6838A032076K927171J560580j817421m221928l095208L0597J294815m25380k433743
6829e148441k098254L19658K837254L832489K848660J102718J048062L436652
6821H178798N188060K830129k090602m406299k671949j169140k842726m297001
6813a280730j194480M432941O626656L669562n33307k633884l142289l270669
6805B673800k544038q63716L11055N05910J317949L260397L985588J779114j216074
6796I209985j794611l31392N4594j707209l388838l110460j795443j117825q38664
6787d819863L98180K539621L840350L043634Q76997r07957j396981r98665m71194
$$ y = [-6892402, -10028326, -9231646, -5019890, -973104, 343768, -477688, -1395671, -1018709, 1032076, 3959247, 5519827, 3702406, -519522, -3614730, -3584133, -2289318, -2714698, -5148441, -7246695, -6927037, -4089783, -257294, 2591366, 3694084, 4742146, 8178798, 13366858, 16196987, 14106385, 9700086, 7028137, 5858997, 3016271, -1280730, -2475210, 1957731, 8584387, 12253949, 11720642, 9086758, 5944469, 2673800, 129762, -733954, -422899, 83011, 1400960, 4661357, 8646945, 10426059, 9209985, 7415374, 7083982, 7138576, 5431367, 2042529, -1067931, -2863374, -3981199, -4819863, -4421683, -1882062, 1958288, 5001922, 5878919, 4970962, 3573981, 2575316, 2104122]
6778B104122j44929r3316l26642m79393L1909J008675J269980K05987j057855
6769B518538j060692j36651Q0758q82351j677482j070092N93812K079163K467775
6760B912778J579058J12679p17644o88189j264402l323598m774943k808759J488875
6751g484145L622913J655377j121316j007565J245387K565249K252140J767245
6743C495285J432248L73448j019096j338157n54160J04981K84627L86481j29156
6734C036501j964553l875757l793122j936127m68110j35542L22640J398560K007043
6725e408467J732386J403441J058239j49876j567020j280394M60461Q10466j456274
6716d397038l806928l514445j187183P81230J317648P17730n66829j646809j283678
$$ y = [2104122, 1959193, 1865877, 1539235, 1059842, 1091751, 2100426, 3370406, 3576393, 2518538, 1457846, 1321195, 1401953, 519602, -1157880, -2227972, -1634160, 445003, 2912778, 4491836, 4604515, 3886871, 3198682, 1934280, -1389318, -6164261, -8973020, -7484145, -3861232, -2205855, -3327171, -4334736, -3089349, -524100, 1728040, 3495285, 4927533, 5300981, 4281885, 2943728, 2389568, 2494549, 2779176, 3165657, 3036501, 1071948, -2803809, -6596931, -8533058, -9001168, -9136710, -8814070, -7415510, -5408467, -3676081, -2272640, -1214401, -1364277, -2931297, -4211691, -3751230, -2940764, -4397038, -8203966, -11718411, -12905594, -12124364, -10806716, -10088986, -10655815, -12302624, -13586302]
6707a3586302M39891K018358K839993L541850L454100P56449l452726m812424
6699h800811j878436Q19247o96926l432157k010374K642891M600798K078863k33085
6690f909990J288525M114308L855542J87643l507461m113694j016707L657104
6682b444730O100960M045976m23807l117870k874846k023125j813931q65387J067987
6673b348773J597054j59581j366984N0007J676311M06743k425059l201598j616410
6664g388290m03509m04266K75533K164097L030070J532989m90653p56265L61672
6655b078622Q04458l41027k107602k934170j961468K31667J715920Q87063j422020
6646g205801k374167m04281K587340L190587M04555l111022l770031o49161L747323
$$ y = [-13586302, -13146411, -11128053, -8288060, -4746210, -1292110, -535661, -3988387, -8800811, -10679247, -9860000, -10556926, -13989083, -15999457, -13356566, -8755768, -6676905, -6909990, -5621465, -1507157, 2348385, 2536028, -971433, -5085127, -6101834, -2444730, 3656230, 7702206, 7278399, 4160529, 1285683, -737442, -2551373, -3416760, -2348773, -751719, -911300, -2278284, -2228277, -551966, -145223, -2570282, -5771880, -7388290, -7791799, -8196065, -7920532, -5756435, -2726365, -1193376, -1684029, -2440294, -2078622, -1274164, -1615191, -3722793, -6656963, -8618431, -8386764, -6670844, -5783781, -7205801, -9579968, -9984249, -7396909, -4206322, -3801767, -6912789, -10682820, -11331981, -7584658]
6637g584658O028721M998034K296553M00550L64603J363250J789762N45776k185574
6628H017017m881965n637095l750031m56649K175158L120647L038045L065892
6620D691019L219140K347128n9511k436133k512496l25900J380688O42937j102717
6611E844155j396047n68008p57562j681143n88446K855552M846588K534998j624196
6602I465891l157484j495984K01462P2269o55077o49628l37613k44627R5297O45461
6592C939967K10400j592353l146993k802630j040537L31154M24997j31491k84077
6583d091563M82186J840399K738899K194627L98681j272087j601414o09285P02970
6574G83413J178135J83066j725818k775178j593490Q76164K109155J114981k52350
$$ y = [-7584658, -1555937, 3442097, 5738650, 6139200, 6503803, 7867053, 9656815, 10202591, 8017017, 3135052, -2502043, -6252074, -6708723, -4533565, -1412918, 1625127, 4691019, 7910159, 10257287, 10197776, 7761643, 5249147, 4923247, 6303935, 6946872, 5844155, 4448108, 3880100, 3122538, 1441395, 852949, 3708501, 8555089, 11090087, 9465891, 6308407, 4812423, 5013885, 5086154, 4431077, 3781449, 3443836, 3199209, 3294506, 3939967, 4150367, 2558014, -588979, -3391609, -4432146, -4100992, -3675995, -3807486, -4091563, -3609377, -1768978, 969921, 3164548, 3563229, 2291142, 689728, 80443, 783413, 1961548, 2144614, 418796, -2356382, -3949872, -3073708, -964553, 150428, -101922]
6565a01922J21536J720774K294859J034103n81435j058428o56468m01713l83223
6556A988083O1710R12022J164199J13497j631485k698281k231189m54133J678429
6547a097148L058493K991748J757850N05886M9709j34061j011471k157528j904034
6538B059444K18501K258732K060529L7858j428580j057311P8682L88845k92284
6529D324416r91115r83153l83997J31948j79796j494285k928896l094694j546565
6520g146137N33605J469118Q84397J63444R67918L188283M537854K778398j382528
6511E994352m376874l618414p24498M55442j029604j876902P21601M572713M879609
6502D997425P62380l130476k583566O61981J568496j076674l230690j716289J325548
$$ y = [-101922, 19614, 1740388, 4035247, 5069350, 4487915, 3429487, 2773019, 2371306, 1988083, 2049793, 2961815, 4126014, 4239511, 2608026, -90255, -2321444, -2775577, -1097148, 1961345, 4953093, 6710943, 7216829, 7266538, 7132477, 6121006, 3963478, 2059444, 2277945, 4536677, 6597206, 6635064, 5206484, 4149173, 4227855, 4616700, 4324416, 3333301, 2350148, 1966151, 2098099, 1918303, 424018, -2504878, -5599572, -7146137, -6612532, -5143414, -4259017, -4095573, -3127655, 60628, 4598482, 7376880, 5994352, 1617478, -2000936, -2725434, -2269992, -3299596, -5176498, -4454897, 117816, 4997425, 5759805, 2629329, 45763, 707744, 2276240, 1199566, -2031124, -3747413, -2421865]
6493b421865K079959P32880L31413J234668N94003k357572m303993k712740M32635
6484f390612K023572K309007L062449L325373P08266l836972o236315m576988
6476i612220j125085J454752K920404L545176K443057k35885j776705j75314K326465
6467b35355J663786k370225n274586l293766K009298N766723N383119K635224
6459F284218M14575q54354k416002m031955l886412j772202p119K374k3776J615816
6449d674837L178993K067059m39380o49149J566584K197722n64033l193401k157726
6440b668168P35422J305292p31460j804344L9590K794823L731298K553902P47556
6431F703911n41889j215486j714122k274232k354825j050939J420271L211954
$$ y = [-2421865, -341906, 390974, 722387, 1957055, 2551058, 193486, -4110507, -6823247, -6390612, -4367040, -2058033, 1004416, 4329789, 5038055, 1201083, -5035232, -9612220, -10737305, -9282553, -6362149, -2816973, -373916, -609801, -2386506, -2561820, -235355, 1428431, -941794, -6216380, -9510146, -7500848, -1734125, 3648994, 6284218, 6698793, 5844439, 3428437, -603518, -4489930, -6262132, -6269251, -6266877, -6290653, -4674837, -1495844, 571215, 131835, -517314, 1049270, 3246992, 2682959, -510442, -2668168, -1932746, -627454, -1358914, -3163258, -3123668, -328845, 3402453, 5956355, 6703911, 6162022, 4946536, 3232414, 958182, -1396643, -2447582, -1027311, 2184643]
6423B184643K672403K60133k138295l246402k878982j129798J538865L671958
6415I34525L695807J676671o32281j608414j027739K78076J239364J121328N9830
6406E737167r07601q53441M8820Q86931J063464N87077k63782j057844j384570
6397C856221j364971j537844j888886j694505p69479N1557L35679R12789K349743
6388B50304L531892K965154P39806j940860m324913n886339n500310k683247P98902
6379a2049611K389476J724896O42377M03079N37348L86063P4468k82586q46355
6370g020845j233353p33379M45125J358151J798440K309203K797066K578995J764256
6361D063659J067870M19395m58202m08623J721491L906706K326244k940107o627732
$$ y = [2184643, 4857046, 5117179, 2978884, -267518, -3146500, -4276298, -2737433, 934525, 4630332, 6307003, 5674722, 4066308, 3038569, 3316645, 4556009, 5677337, 5737167, 4829566, 3976125, 4024945, 4911876, 5975340, 6562417, 6298635, 5240791, 3856221, 2491250, 953406, -935480, -2629985, -3399464, -3347907, -3012228, -2099439, 250304, 3782196, 6747350, 7487156, 5546296, 1221383, -4664956, -10165266, -12848513, -12049611, -9660135, -7935239, -7292862, -6889783, -6352435, -5966372, -5891904, -6174490, -7020845, -8254198, -8987577, -8542452, -7184301, -5385861, -3076658, -279592, 2299403, 4063659, 5131529, 5550924, 5092722, 4684099, 6405590, 10312296, 12638540, 9698433, 3070701]
6352C070701m743669J71415K746010J688677m0621n28106p67237j459294j406481
6343a268605l641J248981J019818J41748Q2873P39743R24391J09851j277465k533107
6333h15413k868961j764255N5845Q06382k45584j571745j353321k7538M69694
6324g314896l39126q56542K8716J282005J414241O70210L48435O04489L23972
6315c838496q44276j590870o20673J520656K956126K523946Q41627n42513p04518
6306b98991n6741K89510k24740j076006j424617j158616q58459q93170r74576
6297f676406n46774P10901K525472L740493K905473R1949k271664j739143J006738
6288b52961K856765K300183Q99204J40782r21256l247244m995214l700791l46496
$$ y = [3070701, -1672968, -1501553, 1244457, 2933134, 2892513, 2364407, 1597170, 137876, -1268605, -1272246, -23265, 996553, 1138301, 1221174, 1960917, 2885308, 2995159, 1717694, -815413, -3684374, -5448629, -5392784, -4586402, -4831986, -6403731, -7757052, -7784590, -7314896, -7654022, -8510564, -8481848, -7199843, -5785602, -5115392, -4766957, -4162468, -3838496, -4682772, -6273642, -6894315, -5373659, -2417533, 106413, 948040, 405527, -298991, -355732, -66222, -290962, -1366968, -2791585, -3950201, -4808660, -5701830, -6676406, -7223180, -6512279, -3986807, -246314, 2659159, 2751108, 479444, -1259699, -252961, 2603804, 4903987, 5803191, 5943973, 5022717, 1775473, -3219741, -6920532, -7267028]
6279g267028J432808J19028k102161k854818k462100k455979k926120k580348
6271b1096718n85689K455467M867283N064465L104784J021753N91707R70053J8471
6262c588424k077400k531918J5389L100636L392993P65581j980260k595505j279099
6253f778007L57339J027267O18730J9981R204J89206m08540j643575k221016j554750
6243a0384161m46804M76944J542990K582172K368885O70299o47708m7296J386795
6234b497884J651789O79129k42220p86834j294486j053085P31045K681348K435063
6225B303865P5454j943443k398038k312025k021858j61459L153811M868778K865211
6216D430296o75605k211001j687430j726229k830481k544874L22230L447197M128219
$$ y = [-7267028, -5834220, -5715192, -7817353, -10672171, -13134271, -15590250, -18516370, -21096718, -21682407, -19226940, -14359657, -9295192, -6190408, -5168655, -4576948, -3606895, -3588424, -5665824, -8197742, -8182353, -5081717, -1688724, -923143, -2903403, -5498908, -6778007, -6420668, -5393401, -4774671, -4754690, -4745486, -4556280, -4964820, -6608395, -8829411, -10384161, -10830965, -10354021, -8811031, -6228859, -3859974, -3189675, -3837383, -3884679, -2497884, -846095, -166966, -409186, -1196020, -2490506, -3543591, -2812546, -131198, 2303865, 2379319, 435876, -1962162, -4274187, -6296045, -6457504, -3303693, 1565085, 4430296, 3754691, 1543690, -143740, -1869969, -4700450, -7245324, -6923094, -3475897, 652322]
6207F52322K659190J158116N30818K34112P7098M42262R69891N82447r41669k482590
6197C881997k958119k438262j690869j251205j058565m57488J346904M060520
6189e65087N649312M050073k18334m235740n818012n306566l841854j535723J433207
6180a0388724L423304L002807J294473O80509J480787J838620P81222p15439j936914
6171e39355l381813m648036l675310J60546L848413L842751O00632k065890j917651
6162g775713n31153l02818j121189j142981K87632J945641K638661K523565K187764
6153a290591J390187l87435k445453k984683j185445J424209K357214P91190j660495
6144c991302k734820j710988J71563J257656J352414J766871L088282L503911
$$ y = [652322, 3311512, 4469628, 5000446, 5234558, 5311656, 5753918, 6723809, 7306256, 6364587, 3881997, 923878, -1514384, -3205253, -4456458, -5515023, -5972511, -4625607, -565087, 5084225, 9134298, 8915964, 4680224, -1137788, -6444354, -10286208, -11821931, -10388724, -6965420, -3962613, -2668140, -1987631, -506844, 1331776, 2112998, 1397559, -539355, -3921168, -8569204, -12244514, -12083968, -8235555, -4392804, -3792172, -5858062, -7775713, -8306866, -8609684, -9730873, -10873854, -10586222, -8640581, -6001920, -3478355, -1290591, 99596, -287839, -2733292, -5717975, -6903420, -5479211, -3121997, -2330807, -3991302, -6726122, -8437110, -8265547, -7007891, -5655477, -3888606, -800324, 2703587]
6136B703587Q31092l697025n736223l085267J235346K987884K090567J404605
6128a265434J528649M10077k027945k771612m32313K196810K214202O62429K81983
6119G96846J249897J659325Q80048p3380p71223j660783k418402j987005l31703
6110b656380J305858J989299J824982J183769J93378r59167j918817k354101j967055
6101c358234o93136Q74351J856033K057767J829047J034384n75180j964527j553132
6092d92627K42369J111161J52616r44218q36095l54624k85367J49747J018172
6083b38866N31157j739146l094253j694056K24029P9996o31607O81807K610115
6074c270824K066168P5490K47862K284659K337300p6700j030066P98919J472014
$$ y = [2703587, 3534679, -162346, -5898569, -8983836, -7748490, -4760606, -2670039, -1265434, 263215, 673292, -1354653, -4126265, -4558578, -2361768, -147566, 514863, 796846, 2046743, 3706068, 4586116, 4512736, 3741513, 2080730, -337672, -2324677, -2656380, -1350522, 638777, 2463759, 3647528, 3840906, 2881739, 962922, -1391179, -3358234, -4051370, -3177019, -1320986, 736781, 2565828, 3600212, 3025032, 1060505, -492627, -250258, 860903, 1013519, 69301, -766794, -1121418, -1406785, -1257038, -238866, 292291, -1446855, -4541108, -6235164, -6011135, -5931139, -6562746, -5880939, -3270824, -1204656, -1129166, -881304, 1403355, 3740655, 3663955, 2633889, 3432808, 4904822]
6065D904822j483258m454612l246209M40462J928528N40587l59515Q81895K120695
6056A273395J148843j204891k472989j598045J50301Q69325K43033l25488j3094
6047a929610P2751r25095j353378O02827L080284K363615j249670l046860o00354
6038b985490K584119K237095p59193k350997j156138N28427L98705j569121l764036
6029f836629m131332j638552J974608L129988O31257k428366k662245p61709K01055
6020a2521925n86955j295858q39349M2708Q85037K233708L916577M474907L016794
6011f74356N46164j049735q35939L74204Q26026j73933j055877J91710K923423
6002A071687M227954K939897J218085J018237J172747k40798k569567l843847
$$ y = [4904822, 3421564, -1033048, -4279257, -3838795, -1910267, -1369680, -1729195, -847300, 1273395, 2422238, 1217347, -1255642, -2853687, -2703386, -1834061, -1591028, -1916516, -1929610, -1856859, -2781954, -4135332, -3532505, -452221, 1911394, 661724, -2385136, -2985490, -401371, 1835724, 1076531, -1274466, -2430604, -1902177, -1503472, -3072593, -6836629, -10967961, -12606513, -10631905, -7501917, -6870660, -9299026, -11961271, -12722980, -12521925, -13108880, -14404738, -15244087, -15201379, -14316342, -12082634, -8166057, -3691150, -674356, -128192, -1177927, -2013866, -1639662, -813636, -987569, -2043446, -1851736, 1071687, 5299641, 8239538, 9457623, 10475860, 11648607, 11407809, 8838242, 4994395]
5994D994395l793228l244835j945475L08148J510541m20137l730995m180787o75121
5985a1177494L087854L388211Q28327j026952J12020L205339N176379L893984
5977G487668M88963j534894k72443K147927K250171m50762l364970m425814l862419
5968a536573k667537j319063k65467j3913k72232j43041N75935J123768P44513
5959c773610p13659k621802l320123j182122K879754N269629L737842L43393j483298
5950h63996j429495j425476j683514q70016M94488M19049p51398m70434J551205
5941e029587K554383J430335P22308K205650L597087K061135j352423l346827
5933B842061k839613j382281k95085L13791L93784m2862k5179J456638L549648
$$ y = [4994395, 1201167, -2043668, -3989143, -3680995, -2170454, -2590591, -6321586, -10502373, -11177494, -8089640, -4701429, -3873102, -4900054, -4788034, -1582695, 3593684, 7487668, 7976631, 6441737, 6169294, 8317221, 10567392, 10116630, 6751660, 2325846, -1536573, -4204110, -5523173, -5788640, -5802553, -6074785, -6217826, -5641891, -4518123, -3773610, -4487269, -7109071, -10429194, -11611316, -8731562, -3461933, 275909, 619302, -863996, -2293491, -3718967, -5402481, -6272497, -5778009, -5358960, -6110358, -6580792, -5029587, -2475204, -1044869, -322561, 1883089, 5480176, 7541311, 6188888, 2842061, 2448, -1379833, -1674918, -1361127, -967343, -1010205, -1035384, 421254, 3970902]
5924C970902L980044J791693j236917k439402j249211J36352n69087k667412l170786
5915a453824r73572J255308P87941j065606j007489J034684J876271K55098j264579
5906e55768n10829J150815J457787N94753O0673J11646J84783L79069Q63997J104210
5896D841136J005836J355936J856067O06980k675492m798633k850739J435855
5888G76946L613385K133872l33353q98609M41870J837312J942701Q55632j87401
5879A0182355Q1625J412674J938624M37462j928502l163443l024113k764095k846136
5870C26451k366088o25603J811535L512830L012936J5697l358524l661629O648
5861a325747M075823M288765Q47504k185603k249906p39476O8375M0377L8376
$$ y = [3970902, 7950946, 9742639, 8505722, 6066320, 4817109, 4953461, 4384374, 1716962, -1453824, -2427396, -1172088, -384147, -1449753, -2457242, -1422558, 453713, 708811, -555768, -1066597, 84218, 1542005, 2136758, 2197431, 2309077, 2493860, 2872929, 3736926, 4841136, 5846972, 7202908, 9058975, 9665955, 6990463, 2191830, -658909, 776946, 4390331, 6524203, 6190850, 5292241, 5734111, 7571423, 9514124, 10369756, 10182355, 10263980, 11676654, 13615278, 14052740, 12124238, 8960795, 5936682, 3172587, 326451, -2039637, -2665240, -853705, 2659125, 5672061, 5687758, 2329234, -1332395, -1325747, 2750076, 7038841, 7886345, 5700742, 3450836, 2711360, 2779735, 2820112, 2858488]
5852B858488k60622j579684l035160k727311l31666K133489K542674J027760l86888
5843B41080k85137N83962N52367n73224j197246k37299J092391O52407j712925
5834h83624l562467k562358O13938K739699J654405j029490j714126N88400K684679
5825a470944J192240k931226n507925m304935j122640J300504K293401K460835
5817h090690J972082J082044R22860K110729L302601K554190j95275k920332l525741
5808b787532j597645J313269K834494J966472L60749L87193J808382J921778n11313
5799E695847l264037l563395j459785Q65402J803773J221550o5161p24167r9680
5790D10347L81534j179315l476971k628840J983289N438020L472068j488500l741932
$$ y = [2858488, 2597866, 1018182, -2016978, -4744289, -5075955, -2942466, -399792, 627968, 241080, -44057, 539905, 1092272, 519048, -678198, -915497, 176894, 829301, -883624, -4446091, -7008449, -6394511, -3654812, -2000407, -3029897, -4744023, -4155623, -1470944, -278704, -3209930, -8717855, -13022790, -14145430, -12844926, -10551525, -8090690, -6118608, -5036564, -4113704, -2002975, 1299626, 3853816, 3658541, 738209, -2787532, -4385177, -3071908, -237414, 1729058, 2089807, 2477000, 4285382, 6207160, 5695847, 2431810, -1131585, -2591370, -1725968, 77805, 1299355, 1234194, 510027, 410347, 791881, -387434, -3864405, -6493245, -4509956, 928064, 4400132, 2911632, -830300]
5781h30300j920815M20116O50672k93210p72500m88131N18030K035710K704282
5772B023854J400363m47506m42846J099499J711814P23306k60995o20887j242350
5763C944252j727754n49310J526260J671534m43124j709115l73215J518707J881869
5754E740104J523461J534098Q75819j228896l193791l603550l414274l456312
5746e223341k293564R22917L877010M181154K932984K277453J567670n93419k362520
5737E286344r36648K066476J968472j958475m952538l424793L23443J892276N52790
5728H17347j107751j454505j056146l64307J294040L799955N056858L203798m32059
5719I757230k171683m32826J897272J006189k681414n037222l900971j617783
$$ y = [-830300, -2751115, -2330999, -1680327, -1973537, -2746037, -3234168, -2716138, -680428, 2023854, 3424217, 2976711, 2533865, 3633364, 5345178, 6068484, 5807489, 5186602, 3944252, 2216498, 1667188, 3193448, 4864982, 4421858, 2712743, 2339528, 3858235, 5740104, 7263565, 8797663, 9673482, 8444586, 5250795, 1647245, -1767029, -5223341, -7516905, -6593988, -2716978, 1464176, 4397160, 6674613, 8242283, 7648864, 5286344, 4349696, 6416172, 8384644, 6426169, 1473631, -1951162, -1627719, 264557, 817347, -290404, -1744909, -2801055, -3165362, -1871322, 1928633, 6985491, 10189289, 9757230, 7585547, 7152721, 9049993, 10056182, 7374768, 2337546, -1563425, -3181208]
5711c181208r78042j306410o08372N90412L77973q63032r11101O65819K096987
5702d116974K415239K186794J286829j083887l635310l278151M87863M022550
5694a715047M090722J833140K75194j73684j188257k776648l044236j591625n11797
5685d802238j274782k540829k112836K32301K904485M548980M851583L946448
5677E753112K247317P31428L08483O59845M81532p85438k161302k564627k370869
5668B299481k611610k952563j804875J056050L135363J780569k176945m730238
5660f004768l209593M56742K012813L7957k397572j626528K076836M901300M131984
5651C79171J175671n04930L59467J649479Q76286j491777k518805o38369J887395
$$ y = [-3181208, -4159250, -5465660, -6074032, -5483620, -5105647, -5968679, -6879780, -6213961, -4116974, -1701735, 485059, 1771888, 688001, -2947309, -6225460, -5737597, -1715047, 2375675, 4208815, 4484009, 4310325, 3122068, 345420, -2698816, -4290441, -4802238, -6077020, -8617849, -10730685, -10498384, -7593899, -3044919, 1806664, 5753112, 8000429, 8731857, 9040340, 9700185, 10181717, 9396279, 7234977, 4670350, 2299481, -312129, -3264692, -5069567, -4013517, -878154, 902415, -1274530, -6004768, -9214361, -8757619, -6744806, -6706849, -9104421, -10730949, -8654113, -3752813, 379171, 1554842, 1049912, 1409379, 3058858, 3935144, 2443367, -75438, -713807, 1173588]
5642A173588J464978j936327m029932j507385L301295N242228L122440P53806
5634G584691R17939J723798P00777p87777m14199K80379j800706n249761n124487
5625b169346l96596L962933L818669R39784q74732j197483j513769j268518P43596
5616B044538K680563J465882k039906l407957p40416K766546L499468J971562
5608H240280R11892Q30378p6072k351464m015137l369603j460060o02304j211955
5599c104045j422515J64694K638619M234980M481349L846777K229867n78503l343849
5590I147374m119092k709532r15266j32124j70814n16160r56698p03336J064385
5581a1263L181493L165722P77827j258327j173147m50809p69312j119014n4998
$$ y = [1173588, 2638566, 702239, -3327693, -4835078, -1533783, 3708445, 6830885, 7584691, 8502630, 10226428, 10927205, 10139428, 9725229, 10005608, 8204902, 2955141, -2169346, -2565942, 1396991, 5215660, 6155444, 5280712, 4083229, 2569460, 1300942, 2044538, 4725101, 6190983, 4151077, 743120, 2704, 2769250, 6268718, 8240280, 9152172, 9982550, 9906478, 7555014, 3539877, 170274, -1289786, -1892090, -3104045, -4526560, -4361866, -1723247, 2511733, 6993082, 10839859, 13069726, 12491223, 9147374, 5028282, 2318750, 1403484, 1271360, 1100546, 584386, -372312, -1075648, -11263, 3170230, 6335952, 7113779, 5855452, 4682305, 4231496, 3462184, 2343170, 2288172]
5572B288172J344227J196323k64236j818707l465289m960979m242617n10638K939656
5563g494088K701725N92186Q12143K947272K760927l51764k218696j105714n08279
5554a864288k525714l659559p75027K971448K633551r36269k669162q29211J497650
5545f156581J795103Q73065J11786m58820o46126L74076K057268K406200Q80881
5536A236852o15791o34889j98611p50222j730277j702299p72965k73142n54312
5527e995656n68752L96185J715235K402539K272564J728115R51858j16416j185913
5518A599759j599422j138333n01765o03463j470481k176060j920285r16405m7329
5509h773784K58939O04150J804407L396200L519183J173201j640276j587542J542051
$$ y = [2288172, 3632399, 4828722, 4564486, 2745779, -719510, -5680489, -9923106, -10433744, -7494088, -4792363, -4200177, -3388034, -440762, 2320165, 1968401, -250295, -1356009, -1864288, -4390002, -8049561, -8824588, -5853140, -3219589, -4155858, -6825020, -7654231, -6156581, -4361478, -3488413, -3376627, -3835447, -4481573, -4107497, -2050229, 355971, 1236852, 621061, -13828, -212439, -962661, -2692938, -4395237, -5168202, -5441344, -5995656, -6564408, -6168223, -4452988, -2050449, 222115, 1950230, 2902088, 2785672, 1599759, 337, -1137996, -1639761, -2243224, -3713705, -5889765, -7810050, -8726455, -8773784, -8514845, -7910695, -6106288, -2710088, 809095, 1982296, 342020, -1245522, 296529]
5500B96529L734134J722276k245719l071294K63277L383644K762719L21063o2883
5491G103746J625997K022779k40344k565598k219259O3313J408101M36878j675824
5482E959789l162074l428492k804367j542260K22299J900572K715341K694711
5474B555519K662669K875699K462063Q72144r44672j837175k150787k697156k681216
5465A117088p02215K231969L043893P16467k018494k386316j123887o46325j211803
5456i79623j148281q5139M59360j98783o43064M57472K228785K590800Q00506
5447C482033j675070k705771j636745J82422J039688P97204O82337J290056J741260
5438C197414J091604m19425k006273l213710l578795k594473q75991j43240q51575
$$ y = [296529, 4030663, 5752939, 3507220, 435926, 699203, 4082847, 6845566, 7166629, 7103746, 8729743, 10752522, 10512178, 7946580, 5727321, 5790634, 7198735, 7635613, 5959789, 2797715, -630777, -3435144, -4977404, -4755105, -2854533, -139192, 2555519, 5218188, 8093887, 10555950, 11428094, 10483422, 8646247, 6495460, 3798304, 1117088, 414873, 2646842, 5690735, 6407202, 4388708, 2002392, 878505, 232180, -979623, -2127904, -2213043, -1753683, -1952466, -2595530, -2138058, 90727, 2681527, 3482033, 1806963, -898808, -2535553, -2353131, -1313443, -516239, 166098, 1456154, 3197414, 4289018, 3869593, 1863320, -1350390, -4929185, -7523658, -8399649, -8542889, -9394464]
5429i394464j008617J108196M034593M778537K794496L64104o59036m59323L16390
5420A874876J543795K528959J919754l35637k414397k936260k609273k653705
5412c081888k791404j975497k81409J141910J604590J432463J249242J396161
5404a305832J854788K231323K007264J126047Q4903o81123j069544r20323o6320
5395C261183R99360J251732K84970j280708k697756l552373l228925j248880J275953
5386d935444J974498J41453j829853j326825J113464K886982K954606K446037
5378C424918K089455J318713J46911l33649j02273p60030k633179l216422m90498
5369e56054L442425M416137J541176j783670k486437j324079p95426j317391j235539
$$ y = [-9394464, -10403081, -9294885, -5260292, -481755, 2312741, 2676845, 2017809, 1558486, 1874876, 3418671, 5947630, 7867384, 7531747, 5117350, 2181090, -428183, -3081888, -5873292, -7848789, -8130198, -6988288, -5383698, -3951235, -2701993, -1305832, 548956, 2780279, 4787543, 5913590, 5998493, 5317370, 4247826, 3327503, 3261183, 4260543, 5512275, 5797245, 4516537, 1818781, -1733592, -4962517, -6211397, -4935444, -2960946, -2819493, -4649346, -5976171, -4862707, -1975725, 978881, 3424918, 5514373, 6833086, 6979997, 6646348, 6544075, 5784045, 3150866, -65556, -556054, 2886371, 7302508, 8843684, 7060014, 4573577, 3249498, 2454072, 1136681, -98858]
5360i8858J30603J358548J105647K8047l30837J63794J45717j082812k305560
5351h85711j922865j37850J276939J206194J82082r41727k084904l090478k964816
5342i363136j171308J055515K036116J805377J533693J260734Q0704j462408j401977
5333e626690M99015J728049N51323j143611m28639K345086L985712K901794J010401
5324E822440P12014J548695J052804j623588m177232l893991j366595k1450j371495
5315c318398k528403l94421L151227L567300O73966q40451J200936L145097J805724
5306F462577m99258q09513j083910l790958n572654j982361L602696L482888k208710
5297b399203m765919P7464N935215N768336J368024j559692k040254k213988j618834
$$ y = [-98858, 31745, 1390293, 2495940, 2523987, 2193150, 2356944, 2502661, 1419849, -885711, -2808576, -2946426, -1669487, -463293, -281211, -1222938, -3307842, -6398320, -9363136, -10534444, -9478929, -7442813, -5637436, -4103743, -2843009, -2762305, -4224713, -5626690, -5127675, -3399626, -2848303, -3991914, -4420553, -2075467, 1910245, 4812039, 5822440, 6534454, 8083149, 9135953, 7512365, 3335133, -558858, -1925453, -1946903, -3318398, -5846801, -6241222, -3089995, 477305, 1151271, 310820, 1511756, 4656853, 6462577, 5963319, 5153806, 4069896, 278938, -5293716, -7276077, -3673381, -190493, -2399203, -7165122, -7087658, -1152443, 4615893, 5983917, 4424225, 2383971, 169983, -1448851]
5288a448851R62409L019476J468506j730449k340379n67325k2327j449705k524543
5279d633188k682760k980312k088344K029358O752297O833822K325364j004220
5271D552017k32584J135741r2942j781015j061031M42492l92685k956450m088792
5262d475249k603334L1952K062094K508847J271475l67257p65237k98386q08313
5253c443408k149862j971697K31683J980927J951958J806075K173127O30197l587713
5244b378713o377430l868856J813793N450229N290685L289324Q53159j723153
5236B349038k993460j523341J241997K501181J875614R01441r2802j487440j986520
5227G85708k82215J803369J484981m03145p23968P22594J293872M04671K2889
$$ y = [-1448851, -486442, 2533034, 4001540, 2271091, -69288, -636613, -658940, -2108645, -4633188, -7315948, -10296260, -12384604, -10355246, -3602949, 3230873, 5556237, 4552017, 4319433, 5455174, 5362232, 3581217, 2520186, 2962678, 2569993, -386457, -4475249, -7078583, -7046631, -4984537, -2475690, -1204215, -1571472, -2336709, -2635095, -3443408, -5593270, -7564967, -7333284, -5352357, -3400399, -1594324, 578803, 1209000, -2378713, -8756143, -12624999, -10811206, -5360977, -70292, 3219032, 4072191, 2349038, -644422, -2167763, -925766, 1575415, 3451029, 4352470, 4259668, 2772228, 785708, 503493, 2306862, 3791843, 3388698, 2664730, 3387324, 4681196, 5085867, 5108756]
5218E108756L52727m18453j726696p75145K061715K883615P14175p23862L22844
5209G799676M61506k342509m246034j788413J717893J244819j844764k459673
5201a457499k62567N88071q92299j232384Q69852K334078J387151M53946J383740
5192C172089K154669R29669k79627Q17733K324728Q58718k831377m485314k234508
5183D26780J023636J641729m43092k312157j865531Q360R16013j0620j154280
5174a769162o83790R38322J687992Q49335j93827j45505N69310Q18928L06569
5165B378172m21712o46439J22714J488844J893294K97434j821545j876224J14683
5156A529221J257506j3064j686943j457057m6896O37909O77072R83004O40170
$$ y = [5108756, 5461483, 5043030, 3316334, 2541189, 4602904, 7486519, 8200694, 7476832, 7799676, 8261182, 5918673, 1672639, -115774, 1602119, 2846938, 1002174, -1457499, -1720066, -1131995, -2024294, -3256678, -2386826, -52748, 1334403, 1788349, 3172089, 5326758, 6256427, 5976800, 6794533, 9119261, 9977979, 7146602, 2661288, 426780, 1450416, 3092145, 2649053, 336896, -1528635, -1520275, -604262, -614882, -1769162, -2452952, -1514630, 173362, 1022697, 828870, 683365, 1252675, 2071603, 2378172, 1956460, 1310021, 1432735, 2921579, 4814873, 5112307, 3290762, 1414538, 1529221, 2786727, 2773663, 1086720, -370337, -417233, 220676, 897748, 1880752, 2520922]
5147B520922j515821l623196k584212Q69704K349522k7403k721097j744419J877975
5138d598025L974522L025595J408528J207449J329109k59276k987518m038677
5130i38293k095410O89622J350248l5614o40995R21592K509511J600330r77596
5121B383395k302671j546280p49281j418772k383395j773704K81307J944099J998556
5112c566746J121229Q66802J553693J505584p34861l515961l318881J59953K568887
5103c360301Q03968j956970p62155L192488M061831N66494j863382K72173L192236
5094D146382K346516m18387p88305M48799o36087l511307l569248J8512K490149
5085E27024Q91514j536405p80636J903756K512955L67949j660410j747590q91377
$$ y = [2520922, 1005101, -2618095, -5202307, -4332603, -1983081, -2010484, -4731581, -6476000, -4598025, -623503, 2402092, 3810620, 5018069, 6347178, 6087902, 3100384, -938293, -3033703, -2344081, -993833, -1029447, -1670442, -748850, 1760661, 3360991, 2383395, 80724, -1465556, -2214837, -3633609, -6017004, -7790708, -7509401, -5565302, -3566746, -2445517, -1578715, -25022, 1480562, 745701, -2770260, -6089141, -5929188, -3360301, -2556333, -4513303, -5275458, -2082970, 1978861, 2545355, 681973, 954146, 4146382, 6492898, 6074511, 5286206, 5735005, 5098918, 1587611, -1981637, -1963125, 527024, 1418538, -117867, -898503, 1005253, 3518208, 3886157, 2225747, 478157, -413220]
5076d13220m13616k30431L6599R8652k10564m31310l37175l37956n10545j34225
5066b883791J133289K382127K575148J915729J136375N9996j737535l201877k592535
5057a213074k62535J242576N71658p80927j123405q02128m69319N45528K114011
5048a77615J941268q71945l049418j395913J992944K807441J211883O62182J225844
5039D346671j35174k773963k242783J844863M098025J633994j830486k717550
5031B223597k396250k177881M9190L979893M198089j113430m826795j019211M865844
5022C783046L928171k393567n268605k323280P66487J091250J498949K722039
5014C804490J550902j804100k737562n93251l81845l728239n319177j577010L500844
$$ y = [-413220, -826836, -1057267, -1020668, -922016, -1132580, -1563890, -1901065, -2239021, -2749566, -2883791, -1750502, 631625, 3206773, 5122502, 6258877, 6318873, 4581338, 1379461, -1213074, -1475609, -233033, 338625, -442302, -1565707, -2367835, -2837154, -2291626, -177615, 1763653, 891708, -2157710, -3553623, -1560679, 1246762, 2458645, 3120827, 4346671, 4211497, 1437534, -805249, 1039614, 5137639, 6771633, 4941147, 2223597, -172653, -2350534, -2301344, 1678549, 5876638, 4763208, -63587, -1082798, 3783046, 7711217, 5317650, 49045, -2274235, -1507748, -416498, 1082451, 3804490, 5355392, 3551292, 813730, 220479, -161366, -3889605, -9208782, -10785792, -7284948]
5005g284948M744540K657398M59846r14665j675956j319784o83850j821856l695977
4996i535252k456836J991059M720164L380416J693155K489477K840312q7832l488063
4987A546600l671139j974464j325064p33927K010530N220684N501550K848044
4979I422814k07347k362982l313446k284382Q9932R54313q13398k429338j526027
4970b469861L61410J139388J527839K290376J765283o31941j981944k97614J971810
4961C674746K069103J025935M60933p84169l220142l947118j403489Q54488n93002
4952a862715l390211l230984j37037L016889M943374N149543K351575k398162
4944D442272m696598k742028m00218p43410j257755M77254J715523R9244j103394
$$ y = [-7284948, -2540408, 116990, 576836, -337829, -2013785, -3333569, -4017419, -5839275, -9535252, -11992088, -10001029, -5280865, -1900449, -207294, 2282183, 5122495, 5034663, 1546600, -2124539, -4099003, -5424067, -6157994, -4147464, 1073220, 6574770, 9422814, 9215467, 6852485, 3539039, 1254657, 1344589, 2298902, 1485504, -943834, -2469861, -2108451, -969063, 558776, 2849152, 4614435, 3982494, 2000550, 1702936, 3674746, 5743849, 6769784, 7230717, 6446548, 3226406, -720712, -2124201, -1269713, -1862715, -5252926, -8483910, -8620947, -5604058, -660684, 4488859, 6840434, 4442272, -254326, -2996354, -3396572, -4139982, -5397737, -4920483, -3204960, -3105716, -4209110]
4935d209110J076781L344002K036203k19774m8410j38098l525548o283111l547268
4926a1514333J786219L968451L380170L098635J663790k522636m904438j827524
4918f871666J374707j132561m553773j333990N079523N916780J934607M26232
4910H39859J538484L49219j185261K028775N682016J542908o853212q569876l456539
4901h083627r71325k416050k96092N235574N821626J282022K67211L688802L710009
4892H238150q0120k31656K488501K84832m413904k106973L684359R39702o515839
4883B287052l671407O250101N183519n127788m508322N390944P16053j6089662
4875i569510j3891228K694375j9155459r0683115j31153865o6877267N3749684
$$ y = [-4209110, -3132329, 211673, 2247876, 2028102, 1979692, 1841594, -1683954, -7967065, -11514333, -9728114, -5759663, -2379493, 719142, 2382932, -139704, -5044142, -6871666, -5496959, -6629520, -11183293, -12517283, -7437760, -1520980, 413627, 839859, 2378343, 2727562, 1542301, 3571076, 9253092, 10796000, 3942788, -4627088, -8083627, -9054952, -11471002, -11767094, -6531520, -709894, 572128, 839339, 4528141, 8238150, 8158030, 7926374, 10414875, 10699707, 6285803, 4178830, 7863189, 8802891, 2287052, -1384355, 4865746, 10049265, 4921477, 413155, 5804099, 6520152, -9569510, -23460738, -20766363, -39921822, -130604937, -261758802, -328636069, -274886385]
4868b74886385J13238905P6752708K0151389Q640537K1197002J4680760l388083
4861b3613167m318637O299908N609471l025582j775441N878653M349008l163137
4853a3758924k254333M698657M199908k678280l658009J690347L231441k3727
4845h552920l77791K078874O56879l188898k026446K889657L413937q17696k474845
4836h399249K42964K245837J982936K505081L512368K019983o39620j119012j003553
4827A347735l267454m966515j927007K679322L113802R51998J353779L000862
4819B286522J075018k811405l164511o17127j98453j831436j501797K75040N1723
4810f436426o73425J784272M724456K592431k575521l760996q53106k49410l063695
$$ y = [-274886385, -161647480, -84894772, -64743383, -56102846, -34905844, -20225084, -23613167, -27931804, -21631896, -16022425, -19048007, -20823448, -14944795, -10595787, -13758924, -16013257, -11314600, -7114692, -9792972, -13450981, -11760634, -8529193, -8552920, -8930711, -6851837, -6194958, -9383856, -11410302, -8520645, -5106708, -5924404, -8399249, -8156285, -5910448, -3927512, -1422431, 2089937, 4109920, 3470300, 2351288, 1347735, -1919719, -6886234, -8813241, -6133919, -3020117, -2068119, -714340, 2286522, 3361540, 550135, -2614376, -3231503, -3429956, -5261392, -6763189, -6488149, -6436426, -7109851, -5325579, -601123, 1991308, -584213, -4345209, -5198315, -5447725, -8511420]
4801h511420l488997M96424L952585L788581K543086K011833P08010r45662l0327
4792E24113K836441L387993P59061j451112j774922k327408l269924k293474j87580
4783c796812m29316k498454k048433J417243L466088K342303J282186J946553
4775A681358J737536o73205k778284k839646k056714j073515P23449J852039j2560
4766c439542k945299k477101J112101K946682J499294L24780J155478J614549
4758b09058R68060J765078M077796M156374O96032l073669m942061n710983m733161
4749g005592k0577N739042O276865J159345k638557j173394J272924M92873j146188
4740B956741n38497K94011j077204k437927j415261j44455q36690j280710O06958
$$ y = [-8511420, -12000417, -11503993, -7551408, -3762827, -1219741, 792092, 1500102, 554440, 524113, 3360554, 6748547, 7507608, 6056496, 4281574, 1954166, -1315758, -3609232, -3796812, -4226128, -6724582, -8773015, -7355772, -3889684, -1547381, -265195, 1681358, 3418894, 2745689, -32595, -2872241, -4928955, -6002470, -5279021, -3426982, -3439542, -6384841, -8861942, -7749841, -4803159, -3303865, -2979085, -1823607, -209058, 759002, 2524080, 6601876, 10758250, 11454282, 8380613, 3438552, -2272431, -7005592, -7026169, -1287127, 4989738, 6149083, 3510526, 2337132, 3610056, 4102929, 2956741, 2418244, 2712255, 1635051, -802876, -2218137, -2362592, -3199282, -4479992, -3873034]
4731c873034K124623N02318j664557o16584K278472L157130J713164K65421o03698
4722C283255j452540j452861p8174J011002P57808O39637J219845L83034k057449
4713B253557k271914J274288L805853J239214k851704k768811K33858N95498k207651
4704f97812l455504j268734J212549J752910J756117K303779J914060l85488k877397
4695B54480l341580j592997P08446J664830Q19633p6770R09769K677082K094119
4686D117012j039105l111140k128554m45333j07646N10327K623791L690440J735589
4677E845381p88667j381282j842464l849621m341213q15079K590922Q92548k873270
4668f562745j944982K903965M284881q3432m287257l679866m34605J899073L096029
$$ y = [-3873034, -1748411, -1246093, -2910650, -3527234, -1248762, 1908368, 3621532, 3886953, 3283255, 1830715, 377854, 299680, 1310682, 2068490, 2708127, 3927972, 4311006, 2253557, -18357, 1255931, 5061784, 6300998, 3449294, 680483, 914341, 1509839, -697812, -4153316, -5422050, -4209501, -2456591, -700474, 1603305, 3517365, 3131877, 254480, -3087100, -4680097, -3971651, -2306821, -1487188, -1563958, -654189, 2022893, 4117012, 3077907, -33233, -2161787, -2607120, -2714766, -2204439, 419352, 4109792, 5845381, 5056714, 3675432, 1832968, -2016653, -6357866, -7172945, -4582023, -3689475, -6562745, -8507727, -5603762, -1318881, -1402313, -5689570, -9369436, -9804041, -7904968, -4808939]
4659d808939L541122K399399O03263P36839K182130J309386j911524k912906j90247
4650I48523J779144J71272j397220L09951J958565m72522l992735l022979J269155
4641b448846K629802l73597k432895l9775L536607L679630O95393j886293k541101
4632H18925k543289k895254k917874j783055Q9951J559940K030795J853060J657289
4623b129512J590271J390311J034967Q35401Q09366N28357p8839k74759N73016
4614D278579J861787K141957P59140j241017k124823j340122j26159j03480j449459
4605B656403k761068k555281n15093K485176M887899N141577K869214m45291k722837
4596I040699l298034k834782j624895L44360J660871K59373l062870m258207j053253
$$ y = [-4808939, -1267817, 1131582, 1734845, 2471684, 4653814, 5963200, 4051676, 1138770, 948523, 2727667, 2898939, 1501719, 1811670, 3770235, 3297713, -695022, -3718001, -2448846, 180956, -192641, -2625536, -2665311, 871296, 4550926, 5246319, 3360026, 818925, -1724364, -4619618, -7537492, -9320547, -9230596, -7670656, -5639861, -3786801, -2129512, -539241, 851070, 1886037, 2721438, 3530804, 4059161, 3980322, 3705563, 4278579, 6140366, 8282323, 9041463, 7800446, 5675623, 4335501, 4209342, 4105862, 2656403, -104665, -2659946, -3175039, -689863, 4198036, 9339613, 12208827, 11763536, 9040699, 5742665, 2907883, 1282988, 1627348, 3288219, 3547592, 484722, -3773485, -4826738]
4587d826738L429101M381108J414456j562297j887663r02154j035632k475370
4579c465189l565413l071041j217039P82107J787572J745544J652504K208309
4571c142646K866127K631303J296641n23479j953730k167055j079837l8759n47462
4562b658897j914165j788497L36694K100427J735788M41276q3150k47949q91041
4553b969514j153066k87030L81075j92381l17440J685472L941872L403389N60676
4544E053053j430543j423858r54933j034559j373622k070059k973814k231527
4536h439862J186485M400239L828641P66789m30280P26877N71187j840235k863510
4527b093669p81756R00664o69990k828182j796941J302368K584615J374960L66362
$$ y = [-4826738, -1397637, 2983471, 4397927, 2835630, 947967, 45813, -989819, -3465189, -7030602, -10101643, -11318682, -10536575, -8749003, -7003459, -5350955, -3142646, -276519, 2354784, 3651425, 3127946, 1174216, -992839, -2072676, -2111435, -2658897, -4573062, -6361559, -6024865, -3924438, -2188650, -1747374, -1830524, -2078473, -2969514, -4122580, -4409610, -4028535, -4220916, -4538356, -2852884, 1088988, 4492377, 5053053, 3622510, 2198652, 1243719, 209160, -1164462, -3234521, -6208335, -8439862, -7253377, -2853138, 975503, 1742292, 1312012, 2038889, 2610076, 769841, -2093669, -2875425, -1974761, -2644751, -5472933, -7269874, -5967506, -3382891, -2007931, -1641569]
4518a641569R18869J474634N26379j210422j980375j108398L41405P17018k40486
4509b202945r13643j16609Q78417K62922j157530j175131l2417J6288j048523
4500e489171q02662R67254J335017n94635j597254K31324J767469l7892k552859
4491f773409j275355K775613M273155J653844o63434Q65705L627774K759685j776544
4482E467034m827713k630977K324523M277689J224935k906548l581204j110458
4474a762719R73207J264067J205069J229960j03288k530636l141294n81628K577101
4465h70161L392374K049206J24546k103178m443374n161161l163382k44705J247912
4456i171923J639671K520672L444682K618834J09915k046623k590606j983142
$$ y = [-1641569, -722700, 751934, 1278313, 67891, -1912484, -3020882, -2679477, -1962459, -2202945, -3116588, -3233197, -2354780, -2091858, -3249388, -4424519, -4456936, -4440648, -5489171, -6291833, -5324579, -3989562, -4584197, -6181451, -5950127, -4182658, -4220550, -6773409, -8048764, -5273151, -999996, 653848, -9586, 856119, 4483893, 7243578, 5467034, 639321, -1991656, 332867, 4610556, 5835491, 2928943, -652261, -1762719, -789512, 474555, 1679624, 2909584, 2806296, 275660, -2865634, -3447262, -870161, 2522213, 4571419, 4695965, 2592787, -1850587, -7011748, -10175130, -10419835, -9171923, -7532252, -5011580, -1566898, 1051936, 1161851, -884772, -3475378, -5458520]
4448e458520j023688k29776j46329o76724n41189J135453L155884L533998J997894
4439A747003J2687j153070j267344o72941p8436k14668q33191q15365N1052N78302
4429b645971K08472j6099M47667L98822p21328j058306Q94015L221243K787040
4420C515555l05298k834900k667724p52258Q63739J091991r2895j905656k884004
4411e971450j999597J43708J892587K138616R09960r29961k018556j443262M492
4402g273463N37439j40916m30710M73845J269782R09442L58087O26024R15805
4393b754665L43343k57819L3793N15152M92266P45164J494798J032733j306682
4384C38083k938035j595050P76210Q35380j037651j862611j032377m82731o28328
$$ y = [-5458520, -6482208, -6711984, -6858313, -7535037, -8076226, -6940773, -3784889, -250891, 1747003, 1759690, 606620, -660724, -1333665, -1412101, -1626769, -2459960, -3275325, -3224273, -2645971, -2437499, -2453598, -2005931, -1607109, -2328437, -3386743, -2492728, 728515, 3515555, 3210257, 375357, -2292367, -3044625, -2180886, -1088895, -1181790, -3087446, -5971450, -7971047, -7827339, -5934752, -3796136, -2886176, -3816137, -5834693, -7277955, -7273463, -6736024, -6876940, -7307650, -6833805, -5564023, -4654581, -4296494, -3670470, -2754665, -2411322, -2669141, -2635348, -2120196, -1627930, -882766, 612032, 1644765, 338083, -2599952, -4195002, -3418792, -2583412, -3621063, -5483674, -6516051, -6998782, -7627110]
4375g627110J25631J934753K998899K678706K123764J658559M50628j032336j090414
4366B221080L33481J415379J305849P58661n9630j640821k930273j973290Q18637
4357B49073K764306K659974J745500P10349j146237l159175l002555m16952J651144
4348B055427J100259o64746j525652j569751j554526q45711J022020K510381J910193
4339B437894j32894j571997j468234k99876J099724J671102L66267k312140l874070
4330d084224k377460J007702L054620J944590r34588k499535j038632K022343
4322b905184L529443K075585m57317j395479m00303R69486J755434J976530J352960
4313F501155k70355j667193j486434m80025m01714j032421o76876N26045M46494
$$ y = [-7627110, -7501479, -5566726, -2567827, 110879, 2234643, 3893202, 4343830, 3311494, 2221080, 2554561, 3969940, 5275789, 6034450, 5974820, 4333999, 1403726, -569564, 249073, 3013379, 5673353, 7418853, 8129202, 6982965, 3823790, 821235, 404283, 2055427, 3155686, 2490940, 965288, -604463, -2158989, -3004700, -1982680, 527701, 2437894, 2305000, 733003, -735231, -1035107, 64617, 1735719, 2101986, -210154, -4084224, -6461684, -5453982, -2399362, -454772, -1389360, -3888895, -4927527, -2905184, 624259, 2699844, 2242527, 847048, 446745, 1416231, 3171665, 5148195, 6501155, 6230800, 4563607, 3077173, 2597148, 2195434, 1163013, 486137, 1012182, 1458676]
4304A458676j495831l078073k306657J66711K169321K018425m91340l362274l212092
4295h133134Q70974M939084M494410N58680k024378j835889j986552l637770l534036
4286a0288611J22608L979918M532018K968874J968462J142651p86703k287138
4278A352079j497676j61814r66434k570455j500730J890271L533036J654432j021951
4269G10758j592929l64463Q46992J142544L31657j442861k815434j893822R18380
4260d159178K451298O39928k349338k682904L2537K273240J553921k13312J61113
4251b292695K133114K131235r10536l627451k909292N3271K217101K913241L201450
4242B909438K908793J288956o41195j407667j654744k477513k537153l72720J716369
$$ y = [1458676, -37155, -3115228, -5421885, -5255174, -3085853, -1067428, -1558768, -4921042, -8133134, -7262160, -2323076, 2171334, 2730014, 705636, -1130253, -3116805, -6754575, -10288611, -10166003, -6186085, -1654067, 1314807, 3283269, 4425920, 3639217, 1352079, -145597, -307411, -1273845, -3844300, -5345030, -3454759, 78277, 1732709, 710758, -882171, -1246634, -399642, 742902, 1074559, -368302, -3183736, -5077558, -4159178, -1707880, -1067952, -3417290, -6100194, -6067657, -3794417, -2240496, -2453808, -2292695, -159581, 1971654, 1061118, -2566333, -5475625, -5422354, -3205253, -292012, 2909438, 5818231, 7107187, 6465992, 5058325, 3403581, 926068, -1611085, -1983805, -267436]
4233b67436M02658k852391l466930r21348Q51866M06486M64600J782700J400745
4224b199050j073539j537754J340435K821061j41261l379801k452970m7319q43194
4215g513392l198678k320166J276384L066583K353274K213639K584665P7954m858133
4206f317870o699933k557352L546574O187218M753513K120031P8144j454732k423261
4197b767668k234478j070947j73726l90135q85374l6992K063120L049758J419207
4188a027235r76944j638217j313423k085903k773075o24326K910443L430167R45544
4179c152969P5767J796007J608946j912591l867552j656706L21801j048986j941413
4170i777696L74882J218044k956954o614144l701563J992146L599360K512861
$$ y = [-267436, 135222, -2717169, -6184099, -7105447, -6253581, -5847095, -5382495, -3599795, -2199050, -3272589, -4810343, -3469908, -648847, -790108, -4169909, -6622879, -6670198, -7513392, -10712070, -13032236, -11755852, -8689269, -6335995, -4122356, -1537691, -1459737, -6317870, -13017803, -15575155, -12028581, -5841363, -1087850, 1032181, 1110325, -344407, -2767668, -5002146, -6073093, -6246819, -6636954, -7522328, -7559320, -5496200, -2446442, -1027235, -2004179, -3642396, -4955819, -7041722, -9814797, -10439123, -7528680, -4098513, -3152969, -3077202, -1281195, 327751, -1584840, -5452392, -7109098, -6787297, -7836283, -9777696, -9402814, -8184770, -11141724, -17755868, -21457431, -19465285, -15865925, -13353064]
4162a3353064L669066M951140J648110l070820k944086L0037j54813k042667q56621
4153a2123718P15954j416504j815646L752302L450362j3228429k7281578p721836
4145e5669093L8109100O1549881L4281545j2649797l1498196j7947790l336811
4138A2838839l165327m443636J548450M751049j253308o651553l541824J406212
4130A488902R85620n42075J732653K864589k100980p342032m999485K063578N168892
4121f80338K752279K99409M46917N33765j099814k316236j139537J213442K179390
4112B189277J057204k60211L10095J976164J759843q20101k163505o718K420652
4103F462700J379855j026637m98315J816143J432267j260682j816307j81540q90505
$$ y = [-13353064, -9683998, -4732858, -3084748, -6155568, -9099654, -9069617, -9224430, -11267097, -12123718, -11407764, -12824268, -14639914, -10887612, -7437250, -20665679, -47947257, -55669093, -17559993, 43989888, 78271433, 65621636, 34123440, 16175650, 12838839, 9673512, 5229876, 6778326, 11529375, 10276067, 3624514, 82690, 1488902, 2474522, 1932447, 3665100, 6529689, 4428709, -2913323, -7912808, -5849230, -680338, 2071941, 2371350, 2818267, 3352032, 2252218, -64018, -1203555, 9887, 2189277, 3246481, 2986270, 3296365, 5272529, 7032372, 6212271, 4048766, 4042048, 6462700, 7842555, 6815918, 6317603, 8133746, 9566013, 8305331, 6489024, 6307484, 5416979]
4094E416979m227208m789569p19486K812157K035013j05093j83939L96809o6414
4085E69249L42334K449534K761664o02783l630742k667816l72277n70174j581964
4076c302975j51555J872860R00851j330438m66347K582283K865117k86768k190725
4067D92303k92768K526626K970763J278149r14872k965975m203566l452308r16228
4058e477876J469583K388365K318510K165851K244129K577041K810896K098250
4050A2594749K69895j559445k634423l475676l856964j959279K253420N047597
4042F679874L482725J47197m46067J201909P41528k503636m254120k311492J990
4033B739908m89849j857077q21378J533761J441067j626045m047729k902118O57069
$$ y = [5416979, 1189771, -3599798, -4319284, -1507127, 527886, 422793, 238854, 635663, 569249, 911583, 3361117, 6122781, 5519998, 1889256, -778560, -1150837, -1721011, -3302975, -3454530, -1581670, -680819, -2011257, -2477604, 104679, 2969796, 2683028, 492303, 199535, 2726161, 5696924, 6975073, 6060201, 3094226, -1109340, -4561648, -5477876, -4008293, -1619928, 698582, 2864433, 5108562, 7685603, 10496499, 12594749, 12864644, 11305199, 8670776, 5195100, 1338136, -621143, 1632277, 6679874, 10162599, 10309796, 9863729, 11065638, 11807166, 9303530, 5049410, 2737918, 2739908, 2250059, 392982, -428396, 1105365, 2546432, 920387, -3127342, -6029460, -5372391]
4024e372391L219264K874151P11762p78242n26395O059j062859l148554l626413
4015g703618j311294J870217L302598K568603J145544L35796M57491J179907J619726
4006C464970P81709j127299k412273j840284l11897L60747k30787j090305j608343
3997d013762j963313j898367o27148J652714L398434L507323K519003J422362
3989C997246K54057j210505k237776j868610m16949J011823K154629L295068L539503
3980H518486J333892k742963n564449m999076k413923l69783O36257J305882Q74725
3971c420952j886861n372618n792159j948258K815503M560956L034756R31076
3963g078557L16901J075679J899377J562751k10383k203770k498660n12828K174574
$$ y = [-5372391, -2153127, 721024, 1432786, 654544, 128149, 134208, -928651, -4077205, -7703618, -9014912, -7144695, -3842097, -1273494, -127950, 207846, 665337, 1845244, 3464970, 4246679, 3119380, 707107, -1133177, -1445074, -1084327, -1315114, -2405419, -4013762, -5977075, -7875442, -8502590, -6849876, -3451442, 55881, 2574884, 3997246, 4251303, 3040798, 803022, -1065588, -1482537, -470714, 1683915, 4978983, 8518486, 9852378, 7109415, 1544966, -3454110, -5868033, -6237816, -5601559, -4295677, -3420952, -5307813, -10680431, -16472590, -18420848, -15605345, -11044389, -8009633, -7078557, -6761656, -5685977, -3786600, -2223849, -2434232, -4638002, -7136662, -7649490, -5474916]
3954e474916L452285K557129J38516k533415l928845k918794K0070K836571L741585
3945b109814K597588M49978j368679j621588o3353J661877J501601j24019o41722
3936B81869P26997J395446p54594l835001m309808j655163J450359K767006K291002
3927a641887J011266q0927N444J388851K491957J657851n12806j891602j669021
3918G59126r27413n73022m30412m85098j290870k629398l114254j813109M82242
3909a0022208J960952J401411o21175j653522N94547N066639P346148M597619
3901H670411l98785k467756p19655Q53603m35904k452670k167285k12353P20951
3892A390557J18315k57242M38923J138758Q26095k75364j477979k235489j961326
$$ y = [-5474916, -2022631, 534498, 673014, -1860401, -5789246, -8708040, -8687970, -5851399, -2109814, 487774, 937752, -430927, -2052515, -2115868, -453991, 1047610, 923591, 281869, 1008866, 2404312, 1649718, -2185283, -6495091, -8150254, -6699895, -3932889, -1641887, -630621, -711548, -706104, 682747, 3174704, 4832555, 4319749, 2428147, 759126, -168287, -741309, -1171721, -1656819, -2947689, -5577087, -8691341, -10504450, -10022208, -8061256, -6659845, -7281020, -8934542, -8339995, -3273356, 4072792, 8670411, 8271626, 5803870, 5084215, 5937818, 5501914, 3049244, 881959, 669606, 1390557, 1508872, 1251630, 1690553, 2829311, 3655406, 3380042, 1902063, -333426, -2294752]
3883b294752m28348J505934K466639J972252O67244o72532j612691j757180r36350
3874a089784K52445R44697J155936J580425K076674J394210r35193l235947l281506
3865a138043j073331R31125O06727j515419l103929k644467o01670J641234L107345
3856c790428L418439K575476J176155L87559R18127J998576J975354J70136k210677
3847F618717l365988k910922k120409k073672k146422r79182J352409L126642
3839b498827L135105K018852Q87111k64288j634722k114691m88275K146921L021978
3830D209164J078479j775806l123644k315004k4681K685002M173358K911908m51992
3821G366784l174870l749489l696781m658163n306527l273723P97579L500139
$$ y = [-2294752, -2723100, -1217166, 1249473, 3221725, 3888969, 3216437, 1603746, -153434, -1089784, -837339, 107358, 1263294, 2843719, 4920393, 6314603, 5379410, 2143463, -1138043, -2211374, -1280249, -673522, -2188941, -5292870, -7937337, -8539007, -6897773, -3790428, -371989, 2203487, 3379642, 3767201, 4685328, 6683904, 8659258, 8829394, 6618717, 3252729, 341807, -1778602, -3852274, -5998696, -6977878, -5625469, -2498827, 636278, 2655130, 3542241, 3277953, 1643231, -471460, -959735, 1187186, 4209164, 5287643, 3511837, 388193, -1926811, -1951492, 733510, 4906868, 7818776, 7366784, 4191914, 442425, -3254356, -7912519, -13219046, -16492769, -15695190, -12195051]
3813a2195051K895643O15610n52643K30626J579562J777745N76929n39507J0692
3804e600394J871140L010204K307621Q12513j24292n78383r36475n86399P52103
3795I27638J692003R90387l47794o92636n56235j534582l132396l057702o53833
3786f365150K013861K705114J115020j471561l217213k734872m78706J292569
3778g140938J175388K98410l0404o57973k299811k790656o025L762772M360601
3769c328636K043370Q16042J602728J040259j943895l482828j035670K136122
3761b152508J931472o20665j755481o03186R85557K026823K410354J138007j951680
3752A408693m005936k208915J663779K982604L95337k614934k529399J82360K372785
$$ y = [-12195051, -9299408, -8683798, -9236441, -9005815, -7426253, -5648508, -5071579, -5611086, -5600394, -3729254, -719050, 1588571, 2401084, 2276792, 1698409, 761934, 175535, 927638, 2619641, 3610028, 3262234, 2569598, 2013363, 478781, -2653615, -5711317, -6365150, -4351289, -1646175, -531155, -2002716, -5219929, -7954801, -8433507, -7140938, -5965550, -5667140, -5697544, -6355517, -8655328, -11445984, -11452009, -7689237, -3328636, -1285266, -469224, 1133504, 2173763, 229868, -3252960, -4288630, -2152508, -221036, -841701, -2597182, -3200368, -2214811, -187988, 2222366, 3360373, 1408693, -2597243, -4806158, -3142379, -159775, 235562, -2379372, -4908771, -4726411, -2353626]
3743b353626J951837k35130j550583n59676J092474Q17496r36685j038761J297329
3734a515325K748474J000833j291908o01739J829716K116222j40395j884418j931243
3725C30217k090386k985831k800266j007506J83160n20664j250638N5702K642640
3716g443572M342607M242434K734104N20323j236191j191739N01390J818204J192110
3707E479670n62824j433953o20456Q48817J340936O4639k193683l538848k624338
3698c240040Q475K437639L003784J429482r39606j869891m20239J355345O48495
3689B413444j705294j740947J403605L139129J74193l583949k274812K964303
3681G89672N625649L481326Q50493Q22502J013707j015855l168040k567773j75820
$$ y = [-2353626, -401789, -636919, -2187502, -2747178, -1654704, -837208, -1773893, -2812654, -1515325, 1233149, 2233982, 942074, 340335, 2170051, 4286273, 4145878, 2261460, 330217, -1760169, -4746000, -7546266, -8553772, -8370612, -8891276, -10141914, -10086212, -7443572, -3100965, 1141469, 3875573, 4395896, 3159705, 1967966, 2469356, 4287560, 5479670, 4916846, 3482893, 2862437, 3711254, 5052190, 5116829, 2923146, -615702, -3240040, -3231565, -793926, 2209858, 3639340, 2699734, 829843, 409604, 1764949, 2413444, 708150, -1032797, 370808, 3509937, 3684130, 100181, -2174631, 789672, 6415321, 9896647, 10747140, 11569642, 12583349, 11567494, 8399454, 5831681, 5655861]
3672E655861J303809J270311M90627q33536k031689j649875k35242n32855k791609
3663F45802l303839l99959J796434m78985l938106k646109K907693O397515M504606
3654E485052K40593k479954k938553j756863O79699K681138J856374j118009k381157
3645B68320j89133K361397J736125j181568k687181j151801J547656K552785O44423
3636C901023k877636n033431l734797j83599K228317J822148J97880m89524j33470
3627d303089L52879J001661K200688L167869K591974M24892k018529l416550l191984
3618c190189j516893N84117J660470J249009M87535N54889R38611J91061j797380
3609h38770l272905k617353k95299J558637J363492k80846j300313n11950J017632
$$ y = [5655861, 6959670, 8229981, 8720608, 7887072, 5855383, 4205508, 3970266, 3437411, 645802, -2658037, -3057996, -1261562, -1740547, -5678653, -8324762, -5417069, 980446, 5485052, 5725645, 3245691, 307138, -1449725, -770026, 1911112, 3767486, 2649477, 268320, 79187, 2440584, 4176709, 2995141, 307960, -843841, 703815, 3256600, 3901023, 1023387, -4010044, -7744841, -7928440, -5700123, -3877975, -3680095, -4169619, -4303089, -3950210, -2948549, -747861, 2420008, 5011982, 5436874, 3418345, 1795, -3190189, -4707082, -4122965, -2462495, -1213486, -725951, -171062, 767549, 958610, -838770, -4111675, -6729028, -7024327, -5465690, -4102198, -4383044, -5683357, -6195307, -5177675]
3600e177675J382978L69921k10189J069847L230361L888283K030945p80277k108598
3591C695596j255605J83466M84174Q170M58278K056950K812749J323811r06519
3582H861070j319335L03537J906251K181235J659446Q02650q94140l185129m304469
3573F011116l181573j181265l28746p25431j085724j155399j999055l880761n146775
3564a2673613l778942L32407M847923O633499M306733m38219m180776m689619
3556i640607k407241O76344K740077K664772K84052k858446l973316j696049K005565
3547a2204849L805772K723377O68232n30879j066776j699174j917174p86015J154170
3538i853316K191965J586896M15265O3351N74525Q42900L7105j476385k376142
$$ y = [-5177675, -3794697, -3424776, -3634965, -2565118, 665243, 4553526, 6584471, 5804194, 3695596, 2439991, 2623457, 3107631, 3115801, 3574079, 5631029, 8443778, 9767589, 8861070, 7541735, 7845272, 9751523, 11932758, 13592204, 14394854, 13500714, 10315585, 6011116, 2829543, 1648278, 1319532, 594101, -491623, -1647022, -3646077, -7526838, -12673613, -16452555, -16120148, -11272225, -4638726, -331993, -770212, -4950988, -9640607, -12047848, -11371504, -8631427, -5966655, -5682603, -8541049, -12514365, -14210414, -12204849, -8399077, -5675700, -5007468, -5538347, -6605123, -8304297, -10221471, -11007486, -9853316, -7661351, -6074455, -5659190, -5595839, -5021314, -4178414, -4141309, -5617694, -7993836]
3529g993836j412914J364751M103760M420688J934646p47633o09418K055932L651942
3520F767918J710895j738741k606432l4616K508103J785461j171054k687971j076702
3511C456861J798617L183624K208424j46628k506889l789402l353080j564897
3503g13370M2914J41147q13050j164299l46705M14832J78602p8102R08969K261186
3493H32124J994723L13311l39144Q33858J362874n95312k821231k117305N32538
3484c564J278467m75681j158754Q21131K031107l27098l095650j577442K645809
3475A38325L267921j354071n271778l279769J872811L869106J659115k95756M99306
3466A105210J414195j35759k283712j912630K45065Q29616q81760k081590r55654
$$ y = [-7993836, -9406750, -8041999, -3938239, 482449, 2417095, 1669462, 1060044, 3115976, 6767918, 8478813, 6740072, 4133640, 4099024, 6607127, 8392588, 7221534, 4533563, 3456861, 5255478, 8439102, 10647526, 10500898, 7994009, 4204607, 851527, -713370, -670456, -529309, -1342359, -2506658, -2853363, -2438531, -2259929, -2338031, -1429062, 832124, 2826847, 3140158, 2801014, 3634872, 4997746, 4402434, 1581203, -536102, -3564, 1274903, 799222, -359532, 461599, 2492706, 2165608, -930042, -2507484, 138325, 3406246, 2052175, -3219603, -6499372, -4626561, -757455, 901660, 605904, 1105210, 2519405, 2383646, 99934, -1812696, -1567631, -738015, -1619775, -3701365, -4657019]
3457d657019P19615O54946m53702l54146J154935K184660J850247J300101J396321
3448C795958J225296j76440j909661k216711p57648J103654J902910J178629o22275
3439C523712k463711l163325k345540q77426K70967J269716K630230L524509K378825
3430D747957n54970k700247k145021n3935J028255M14749n73597j059449j396893
3421b293151j559637p37337P44766Q86167j253253l564372l331597q75908J105793
3412a0878529J440089J560567K422830K594772P13736j754783k077849R262J828531
3403d141374J181650r39236j639659L38825K949211L064219L88349j691137k29039
3394g18191K906605K867191j590401n802828n054606n80614K745071L065523K571480
$$ y = [-4657019, -3937404, -3282458, -3736160, -4090306, -2935371, -750711, 1099536, 2399637, 3795958, 5021254, 4844814, 2935153, 718442, -39206, 1064448, 2967358, 4145987, 3523712, 1060001, -2103324, -4448864, -5326290, -5055323, -3785607, -1155377, 2369132, 4747957, 4192987, 1492740, -652281, -706216, 322039, 736788, 163191, -896258, -2293151, -3852788, -4590125, -3845359, -2959192, -4212445, -7776817, -11108414, -11984322, -10878529, -9438440, -7877873, -5455043, -2860271, -2146535, -3901318, -5979167, -5969905, -4141374, -2959724, -3898960, -5538619, -5199794, -2250583, 813636, 1201985, -489152, -718191, 2188414, 5055605, 3465204, -2337624, -7392230, -7972844, -5227773, -2162250, 409230]
3385D09230K631912J834817m21596k044604j710180j208399k028528k185808N11214
3376d211942L860946L580562l92237l440375k458492N98493K266470J865580P23413
3367B392418n14002j644857j587532L02069K362466K292777L60912j112659j342631
3358A508961j876306l408379m197857k906025r75351l16526j79081J307633L454941
3349g587990L719131J966187J022474K111928K575119m0619l823966m894893k641010
3340g593639J5037R50750R03672J203470J782253K051416K027655J836357J234736
3331D411707J09369j357544k975092m098512l443784p97267J690090J866610P39669
3322c854754Q41408J810822Q60566j965289k824855k0724K729028J743749q72281
$$ y = [409230, 3041142, 4875959, 4454363, 2409759, 699579, -508820, -2537348, -4723156, -4211942, -350996, 3229566, 2837329, -603046, -3061538, -2463045, -196575, 1669005, 2392418, 1878416, 233559, -1353973, -1051904, 1310562, 3603339, 3964251, 2851592, 1508961, -367345, -3775724, -7973581, -10879606, -11854957, -12171483, -12350564, -11042931, -7587990, -3868859, -1902672, -880198, 1231730, 3806849, 3766230, -57736, -4952629, -7593639, -7578602, -6627852, -5724180, -4520710, -2738457, -687041, 1340614, 3176971, 4411707, 4521076, 3163532, 188440, -3910072, -7353856, -8151123, -6461033, -4594423, -3854754, -3013346, -1202524, -341958, -2307247, -5132102, -5152826, -2423798, -680049, -1552330]
3313a552330n59276K609090M258405K393445j92233n45386O85683J168342K01608
3304H467348j118486j596362q82236M21836J227635J130725Q68706R44042O27621
3295A0090829n39210j341207o55872L91559O3894j111333j445213j238641k014342
3286B200464l083944k113892P11309K329809J293292m30930j075850j416049k152676
3277c738467j990697k71886J052434L23090j016785p46986P56821J686143J750606
3268b195727J690636J231398p9252j058417l12061J261794J616601O19049j26724
3259B647297L4644M28546R18535J914539K647156J650654p96600k672136k997635
3250C775000k775926k664577j694582N47576K051834N64554k810591m050274j038163
$$ y = [-1552330, -2111606, 497484, 4755889, 7149334, 6957101, 6411715, 7097398, 8265740, 8467348, 7348862, 5752500, 4870264, 5292100, 6519735, 7650460, 8519166, 9463208, 10090829, 9551619, 8210412, 7554540, 7946099, 8009993, 6898660, 5453447, 4214806, 2200464, -883480, -2997372, -2286063, 43746, 1337038, 906108, -169742, -1585791, -3738467, -5729164, -6001050, -4948616, -4625526, -5642311, -6389297, -5632476, -3946333, -2195727, -505091, 726307, 647055, -411362, -723423, 538371, 2154972, 2774021, 2647297, 2681941, 3110487, 4029022, 5943561, 8590717, 10241371, 9444771, 6772635, 3775000, 999074, -1665503, -3360085, -2812509, -760675, -196121, -3006712, -7056986, -8095149]
3241h095149L160222L457623q14730m530717l036877J949407N036456M479843
3233A606078L313658L349053K380443j011799l901275l260808p29559L65246L47531
3224B458568J581675L290676K494455n41779k209413j116482K08156j89200j097527
3215D879129j030114m81138j33618L53223O62784m02572k421205l234248k262432
3206d070191j207382n95237J135562L800652M298670J386877j704821k056848
3198I87282j319503k027999k623281k54660L514360M400574J900798l43440n83842
3189C650289j084889l420519n479331m788133k002255N96345J924135J979879
3181h624479R20292k25596K47641K124604K523361k40071l355059k550212K085792
$$ y = [-8095149, -4934927, -1477304, -2292034, -6822751, -9859628, -7910221, -2873765, 1606078, 4919736, 8268789, 10649232, 9637433, 5736158, 2475350, 1745791, 2111037, 2458568, 4040243, 7330919, 9825374, 9283595, 7074182, 5957700, 6165856, 5976656, 4879129, 3849015, 3367877, 3234259, 3587482, 4250266, 3847694, 1426489, -1807759, -4070191, -5277573, -5872810, -4737248, -936596, 3362074, 4748951, 3044130, 987282, -332221, -2360220, -4983501, -5238161, -1723801, 2676773, 4577571, 4234131, 3650289, 2565400, -855119, -6334450, -11122583, -13124838, -12528493, -10604358, -8624479, -7704187, -7929783, -7682142, -5557538, -3034177, -3274248, -6629307, -9179519, -7093727]
3172g093727N830880N220010K005744K03479R31624J886912J026124j179669l090070
3163E741307l713691k726261l03215K125534K388470K39170j609645q19295J122148
3154B444522R37804j453331k629219o77494K086725K513852N91901j393401j950086
3145D71273j118222M61623J694600J411826m7465q07375j98833Q065j375682k459779
3135a959969j002123J721362K367148J35383k517306l371569k389475n06547J260865
3126f262231J720767P20235K01625J731952L333895J658303k576582m604203k082194
3117f158433J567424K129489L13626n0599K096359L815100K502024q13756l004972
3108B396262k406368k34893J061411M53994p92277r13056J54565R78389O85926
$$ y = [-7093727, -1262847, 3957163, 5962907, 6166386, 7098010, 8984922, 10011046, 8831377, 5741307, 2027616, -698645, -1001860, 1123674, 3512144, 3751314, 2141669, 1322374, 2444522, 3382326, 1928995, -700224, -1377718, 709007, 3222859, 3814760, 2421359, 471273, -646949, -185326, 1509274, 2921100, 2873635, 2066260, 1867427, 1875492, 499810, -1959969, -2962092, -1240730, 1126418, 1261801, -1255505, -4627074, -7016549, -7523096, -6262231, -4541464, -3821229, -3619604, -1887652, 1446243, 3104546, 527964, -4076239, -6158433, -4591009, -2461520, -2147894, -2198493, -102134, 3712966, 6214990, 5401234, 2396262, -10106, -244999, 816412, 1270406, 478129, -434927, -280362, 698027, 1383953]
3099A383953j50571o43992o58396n78410o86366q27173l30103J257825K906757
3090A673524K641101K97204j639358j465761q67110j769123k379809J4861L392885
3081a01586K787062j944250m938154k523677J796087L018518J362331R1269r5615
3072e48015o22302j234246n86344O46486O88103k11325n13828k70867m24750l39495
3062c416583R38868J937464N09738k309233l387220j999758j79464R77370K103091
3053d825727K933481K295034Q15043M17723R78510O85537k63933O8496J247742
3044D351906P42158j014433m21743K828270L807855k81054m927806m345283L50255
3035A090125L210615J740979j114271k278287j854235j165442p21753o34434q22825
$$ y = [1383953, 1233382, 589390, -69006, -647416, -1333782, -2160955, -2491058, -1233233, 1673524, 4314625, 4611829, 2972471, 1506710, 639600, -1129523, -3509332, -3494471, -101586, 2685476, 741226, -4196928, -6720605, -4924518, -1906000, -543669, -452400, -548015, -1170317, -2404563, -2990907, -2344421, -1656318, -1867643, -2381471, -2652338, -3077088, -3416583, -2477715, -540251, -30513, -2339746, -5726966, -7726724, -7906188, -6928818, -4825727, -1892246, 402788, 1217831, 1635554, 2614064, 3299601, 3035668, 3104164, 4351906, 5094064, 4079631, 3657888, 6486158, 10294013, 10012959, 5085153, 739870, 1090125, 4300740, 6041719, 4927448, 2649161, 794926, -370516, -1092269, -1726703, -2549528]
3026b549528n28376P20637J870435J666200O85483K90954K25757o73880j882856
3017a75174j608852K89571J942554K109958J267302M2629j437512k477455k056677
3008b103656n07400P63603J416434K221001K844621J817268p12348k395253j862294
2999A481976n38333j27525j82666L19183O75659l22147j967996k410063j274118
2990d346030J88211J150682J736813J729153N45802j209863j728985k42694J739077
2981d37834K190269R10129n77117r77293l30660O38971J470705J953791J673866
2972F514827K56118j816546l173338k865898j511951n60234m74366l49489N19614
2963c461263J527008J736305J244871P43172K50014o02417j263850o58872P78591
$$ y = [-2549528, -3077904, -2357267, -486832, 1179368, 1864851, 2155805, 2381562, 1707682, -175174, -1784026, -1494455, 448099, 2558057, 3825359, 3867988, 2430476, -46979, -2103656, -2611056, -1847453, -431019, 1789982, 4634603, 6451871, 5739523, 3344270, 1481976, 943643, 816118, 633452, 952635, 1628294, 1306147, -661849, -3071912, -4346030, -4157819, -3007137, -1270324, 458829, 1004631, -205232, -1934217, -2176911, -437834, 1752435, 2662564, 2085447, 1108154, 777494, 1416465, 2887170, 4840961, 6514827, 6770945, 4954399, 1781061, -1084837, -2596788, -3157022, -3631388, -3980877, -3461263, -1934255, -197950, 1046921, 1790093, 2040107, 1437690, 173840, -485032, 293559]
2954B93559R16274j183187l285051k530035N01569K203685P15543j692276k088708
2945f148627r38666o63793j258953j53793L285577N782299M185953j80210l045232
2936H64555k248590M30950K174899K229885J804417J937603K116943R48760j759754
2927H499668l860739k875429N09640K486848Q83717j624843j160204J559724K030545
2918F448927j352367m583394l435461Q90001L621415K413039p43288k788510k613851
2909b143489r87037O72557J136332K45322p91184q27848l40177m72934q47812
2900d356270N2083K100438K901465Q88087k263436l569406k291995l08310N74444
2891f272900L66404O5032K80995R59594J628230J630241P49759k10748j30704
$$ y = [293559, 1209833, 26646, -3258405, -5788440, -5286871, -3083186, -2367643, -4059919, -6148627, -7087293, -7751086, -9010039, -9163832, -5878255, -95956, 4089997, 3909787, 864555, -1384035, -953085, 1221814, 3451699, 5256116, 7193719, 9310662, 10259422, 8499668, 4638929, 1763500, 2273140, 4759988, 5643705, 4018862, 2858658, 4418382, 6448927, 5096560, 513166, -2922295, -2032294, 1589121, 4002160, 3258872, 470362, -2143489, -3130526, -2457969, -1321637, -1076315, -1867499, -2695347, -3035524, -3508458, -4356270, -4304187, -2203749, 697716, 1585803, -677633, -4247039, -6539034, -6847344, -6272900, -5906496, -5841464, -5560469, -4600875, -2972645, -1342404, -592645, -803393, -934097]
2882i34097R66966J856402J716329R57204J11101j043564k491587l123371k064832
2873d049449k02862R28690J259095J646704J677501R5100k361619k887182m80909
2864d374931K107453J976701M8854o48060M37729J070304K02437m25195N88685
2855I83977J768515Q86682j583613k855522j490718O51573P32025j357827k643973
2846d908881r63551J686393J372882k185454m538480k298708K109034L809468
2838e917297J998613M0085o1089L89227M31173J156973K585600K481060K96301
2829C400646r36589P45507K577190J283260j465518j776298p8379l45482l168252
2820B36085m344315j439723K363365L034944J122091j77285o9734l34940j596796
$$ y = [-934097, 32869, 1889271, 3605600, 4562804, 4673905, 3630341, 1138754, -1984617, -4049449, -4252311, -3323621, -2064526, -417822, 1259679, 1354779, -1006840, -3894022, -4374931, -2267478, -290777, -241923, -889983, -452254, 618050, 820487, 395292, 983977, 2752492, 3639174, 2055561, -799961, -2290679, -1639106, -907081, -2264908, -4908881, -5872432, -4186039, -2813157, -4998611, -9537091, -11835799, -9726765, -5917297, -3918684, -3878599, -3939688, -3550461, -3119288, -1962315, 623285, 3104345, 3400646, 2464057, 3209564, 5786754, 7070014, 5604496, 3828198, 3749819, 3404337, 236085, -4108230, -5547953, -3184588, -149644, 972447, 795162, 725428, 390488, -1206308]
2811a206308k277449j263462M52047J290028J012625N84284P23244J068590Q08706
2802A192305K6718r8175R67464J740134M57552j929416k327963L23369L224655
2793C576643L205302N38497k119564l159338k606654o19860K150351L405083J225295
2784E595755k575785l810147j365161J257279J111420n0986R48756L299715L231805
2775G642651j93722l530049l694402j616948l3464J60957k47677q63987j521769
2766c898410j064873J450401M538213N291447K955646r4554j449146j307457j287511
2757E133756j829309j914257p46644J276851L006540L264903J442803j837935
2749G796708m619351m804468j978595J850906L657678K193017m52260r12719J319869
$$ y = [-1206308, -3483757, -4747219, -4295172, -3005144, -1992519, -1408235, -684991, 383599, 1192305, 1219023, 1120848, 2088312, 3828446, 4285998, 2356582, 28619, 351988, 3576643, 6781945, 7320442, 5200878, 2041540, -565114, -1184974, 965377, 4370460, 5595755, 3019970, -790177, -2155338, -898059, 213361, 162375, 1111131, 4410846, 7642651, 7448929, 3918880, 224478, -1392470, -1425934, -1264977, -1512654, -2376641, -3898410, -4963283, -3512882, 1025331, 6316778, 9272424, 9177870, 7728724, 6421267, 5133756, 3304447, 1390190, 643546, 1920397, 4926937, 8191840, 9634643, 7796708, 3177357, -1627111, -3605706, -1754800, 1902878, 4095895, 3643635, 2730916, 4050785]
2740D050785K977749J377868j609399k120729K649J088885o62092k702660k537357
2731a34301j307071q48904j70693K043928L676853J719142k544390m630309k845067
2722e040812J35057J610018J545139P10215o02558j335331j55728J936794K291049
2713A093843P02455j55533O14155M34365k058099l985261k525245M78104J305557
2704d095659j83294j059965K5030J762848K923871L339802K653027O73216j290910
2695D747966j719174j193410j326513j865383j176466O97752J888669J580387
2687A633828P60283N4487q91281j685736j176382L79580J263121R29855O50366
2678A918121R92913Q12221m89683j755461k032767j784744j222418M39671K800107
$$ y = [4050785, 7028534, 8406402, 6797003, 4676274, 4678923, 5767808, 5105716, 2403056, -134301, -1441372, -2290276, -2460969, -417041, 3259812, 4978954, 2434564, -2195745, -5040812, -4905755, -3295737, -1750598, -1040383, -1642941, -2978272, -3134000, -1197206, 1093843, 1796298, 1640765, 2254920, 2689285, 631186, -3354075, -5879320, -5401216, -4095659, -4278953, -5338918, -5313888, -3551040, -627169, 2712633, 5365660, 6038876, 4747966, 3028792, 1835382, 508869, -1356514, -2532980, -1835228, 53441, 1633828, 2394111, 2448598, 1557317, -128419, -1304801, -925221, 337900, 1267755, 1918121, 2911034, 3723255, 3233572, 1478111, -554656, -2339400, -3561818, -3122147, -322040]
2669c22040L513189J534561o82294l94530J404969J591877l18318j645639p53616
2660C928159O54008K03531j909928l425395k806181o30626J297081J597216L98293
2651f93842p94425n59822Q16228J483291J57435k169155l225444k144976m43681
2642g574391P3484l07224J22150J711378K660854J469236r11232k202144j393566
2633f351455N58872K024233J948478M41893j154561j443799p88661r12422k007055
2624g684477j889371N71335L026611K897101J428009J489893K508473J376157
2616C723731j858457l402383j674501J47294o65177k078840o63412L265037O315404
2607C108696O016694K316187k906437o180801m740160m14292J387761j236047
$$ y = [-322040, 3191149, 4725710, 4043416, 3648886, 5053855, 6645732, 6327414, 4681775, 3928159, 4582167, 4785698, 2875770, -549625, -3355806, -3986432, -2689351, -1092135, -693842, -1488267, -2048089, -1231861, 251430, 408865, -1760290, -4985734, -7130710, -7574391, -7500907, -7808131, -7685981, -5974603, -3313749, -1844513, -2755745, -4957889, -6351455, -5792583, -3768350, -1819872, -1377979, -2532540, -3976339, -4765000, -5677422, -7684477, -9573848, -9002513, -5975902, -3078801, -1650792, -160899, 2347574, 3723731, 1865274, -1537109, -3211610, -3064316, -3729493, -5808333, -6471745, -3206708, 3108696, 9125390, 11441577, 8535140, 2354339, -2385821, -2800113, -1412352, -2648399]
2599b648399l659187j661794J989989K117114n34700r28114J791781L271236J327437
2590A065363j132196j498850q80033o47268P1710J580048K064211Q02701l79577
2581A046109n24423j012194k007502j218313J702262L390076J979035J66132K8275
2572C549457j003697m805898p201239l597416K748835M472998P93826k025978
2564g069112p42925R75065L740j197132J54398K007682J317704p25184j185942
2555f461706l91278o45972j819951j813470k98598J142638J901840K703554L643446
2546b039497M110451M027898L232947O84642l482437o306182n121633j481950
2538f375761R07814J434423K483552M474848M753986K056239j369792l209849
$$ y = [-2648399, -6307586, -7969380, -5979391, -3862277, -4396977, -5325091, -3533310, -262074, 1065363, -66833, -1565683, -2445716, -3092984, -3021274, -1441226, 622985, 1425686, 1046109, 521686, -490508, -2498010, -3716323, -2014061, 1376015, 3355050, 3521182, 3549457, 2545760, -2260138, -9461377, -13058793, -10309958, -5836960, -5043134, -7069112, -7812037, -6836972, -6833232, -8030364, -7875966, -5868284, -4550580, -5275764, -6461706, -6852984, -7498956, -9318907, -11132377, -11430975, -10288337, -8386497, -5682943, -2039497, 2070954, 6098852, 9331799, 10016441, 6534004, 227822, -4893811, -6375761, -5467947, -4033524, -1549972, 2924876, 7678862, 9735101, 8365309, 5155460]
2530E155460l612611l130879j311526J084638J618248L3167l82196K157347M342338
2521E953986K408208k003041m311791l560848k479475k141219r15644J445652
2513e604172K817165K293196J248639L92821p41656j078554J172007M178163L466212
2504H143821j130742m066975k108571P74108K1563k326502j818125N18519L48569
2495a644335j914448j554887K303333M974310L498779M23022j185605j773806
2487C126363k359538j848487J31124J317187N42156K96099K632839N247767M850890
2478A3936400K197048L59772k10063j307969k918151l282661k519420k600415
2470C654541l642028l526877j761043o07336j257628j568614O51263L944869M733849
$$ y = [5155460, 1542849, -1588030, -2899556, -1814918, -196670, -163503, -545699, 1611648, 5953986, 8362194, 6359153, 2047362, -1513486, -3992961, -6134180, -7049824, -5604172, -2787007, -493811, 754828, 1147649, 405993, -672561, 499446, 4677609, 8143821, 7013079, 2946104, 837533, 1611641, 1633204, -693298, -2511423, -1992904, -1644335, -3558783, -5113670, -2810337, 2163973, 5662752, 6085774, 4900169, 3126363, 766825, -1081662, -950538, 366649, 908805, 1204904, 3837743, 9085510, 13936400, 16133448, 16493220, 16283157, 14975188, 12057037, 8774376, 6254956, 3654541, 12513, -3514364, -5275407, -5882743, -7140371, -8708985, -8057722, -4112853, 620996]
2461F20996J726480k635610m819591l462778k86089J710020J148041m96381q76624
2452g371536K85149J132418M95115n06905l08616O77125O34326r50872k296120
2443h209916j454819J236451L612246M328058L975650L283316J660187j156190
2435G274983l208299k350747K23451J173831K3037r4771K127398L323330N64180
2426I056393l498389m137852j360064P61471N42722J85176Q67860P36925j087147
2417B067095k353933j411939j3454k64105j269699j066002J36885R07968J146731
2408b120453J424635J092714o71183k763938l129585j332802J304321L385177
2400b811114L934332K308939p35959k856745k684777j637773j482306j322544
$$ y = [620996, 2347476, -288134, -5107725, -8570503, -8856592, -7146572, -5998531, -6494912, -7371536, -7086387, -5953969, -5458854, -5965759, -6274375, -5597250, -4962924, -5913796, -8209916, -9664735, -8428284, -4816038, -487980, 3487670, 6770986, 8431173, 7274983, 4066684, 1715937, 1939388, 3113219, 3136256, 3041485, 5168883, 8492213, 9056393, 5558004, 1420152, 60088, 821559, 1364281, 1549457, 2417317, 3154242, 2067095, -286838, -1698777, -1712231, -1976336, -3246035, -4312037, -4175152, -3267184, -2120453, -695818, 396896, -274287, -3038225, -6167810, -7500612, -6196291, -2811114, 1123218, 3432157, 2696198, -160547, -2845324, -4483097, -5965403, -7287947]
2392g287947O87264L571508M261866J936292r21443j969828j219496L51252J909103
2383A318571K074790k10576l175277l199962J88214K780910J266723j858211j893106
2374b707924J040121K278498k24406k915086k238520J14893L70895j116399o64580
2365f062508K190247L083848o93294n381235n341901o25049L403961L343398J250490
2356d832043N15601J530415K799435L579012L402516J147179k981565n973782
2348h13232n059801j473923J061220J058129L26738P05383J909659K631245J937624
2339B283042l86092l231325m194768k081108R34678J710177L49756m26575J35559
2330d906656j3394j533291k056093j92739J817913J527338p4862o01301O7527
$$ y = [-7287947, -6600683, -3029175, 1232691, 3168983, 2247540, 277712, -941784, -590532, 1318571, 3393361, 3182785, 7508, -3192454, -3004240, -223330, 1043393, -814818, -2707924, -1667803, 610695, 386289, -2528797, -4767317, -4652424, -4281529, -5397928, -6062508, -3872261, -788413, -1481707, -6862942, -12204843, -12829892, -9425931, -6082533, -4832043, -4316442, -2786027, 13408, 3592420, 6994936, 8142115, 5160550, -813232, -5873033, -7346956, -6285736, -5227607, -4900869, -4195486, -2285827, 345418, 2283042, 1896950, -1334375, -5529143, -7610251, -6675573, -4965396, -4615640, -5042215, -4906656, -4920050, -6453341, -8509434, -8702173, -6884260, -5356922, -5431784, -6033085, -5965558]
2321e965558N58578O99775Q48439q258k612134m858208l827420l6716L008019
2312a2193483L345511K151822R74439J02664r0569J027246K456567K047978j16091
2303b93916j178504M13775K513506K490801P93992n75291j320047k272417k902520
2294b330621k034083m41558j73638j290810j565964J64200K328018K973237K175446
2285a95773J298114J113698J395981J369403J24637k248668l696041k093763J273638
2276a658774K328139k75059k542049n84847L223315L235236j034068l819988j411809
2267b539904K609299K890680k46030k412250k077172j700922k585800k747936
2259h810035p33125J781921K712812K404939K058957J336800m26034j949581j170811
$$ y = [-5965558, -5406980, -4707205, -3858766, -3867024, -6479158, -11337366, -15164786, -15201502, -12193483, -8847972, -6696150, -5721711, -5619047, -5709616, -4682370, -2225803, -177825, -293916, -1472420, -1058645, 1454861, 3945662, 4739654, 4164363, 2844316, 571899, -2330621, -4364704, -4806262, -4979900, -6270710, -7836674, -7672474, -5344456, -2371219, -195773, 1102341, 2216039, 3612020, 4981423, 5106060, 2857392, -838649, -2932412, -1658774, 669365, 394306, -2147743, -2732590, 490725, 3725961, 2691893, -1128095, -2539904, 69395, 2960075, 2714045, 301795, -1775377, -3476299, -6062099, -8810035, -9543160, -7761239, -5048427, -2643488, -584531, 752269, 326235, -1623346, -2794157]
2250b794157J659568L728821K746817n42326l049204k295258J030443L443289
$$ y = [-2794157, -1134589, 2594232, 5341049, 4798723, 1749519, -545739, 484704, 3927993]
$$ [...]
##END NTUPLES=NMR SPECTRUM
##END=
