##TITLE=31Pdec_DE-89K3_TFA
 CDCl3, 64 sc
 7.7.2025
##JCAMPDX= 6.0         $$ Bruker NMR JCAMP-DX V2.0
##DATA TYPE= NMR SPECTRUM
##DATA CLASS= NTUPLES
##ORIGIN= UXNMR, Bruker Analytische Messtechnik GmbH
##OWNER= root
$$ XWIN-NMR		Version 3.5
$$ Mon Jul  7 15:17:50 2025 Russian Standard Time (UT+4h)  she@DPX200
##.OBSERVE FREQUENCY= 81.013821
##.OBSERVE NUCLEUS= ^31P
##.ACQUISITION MODE= SIMULTANEOUS
##.ACQUISITION SCHEME= undefined
##.AVERAGES= 64
##.DIGITISER RES= 17
##SPECTROMETER/DATA SYSTEM= spect
##.PULSE SEQUENCE= zgpg30
##.SOLVENT NAME= CDCl3
##.SHIFT REFERENCE= (INTERNAL, CDCl3, 0, 198.062)
##AUDIT TRAIL= $$ (NUMBER, WHEN, WHO, WHERE, WHAT)
$$ ##TITLE= Audit trail, XWIN-NMR		Version 3.5
$$ ##JCAMPDX= 5.01
$$ ##ORIGIN= Bruker BioSpin GmbH
$$ ##OWNER= she
$$ F:/spectra/data/she/nmr/P31/2/pdata/1/auditp.txt
$$ ##AUDIT TRAIL=  $$ (NUMBER, WHEN, WHO, WHERE, WHAT)
(   1,<2025-07-07 15:16:27.78 +0400>,<she>,<DPX200>,
      <created by zg, POWCHK disabled, PULCHK disabled
       configuration hash MD5:
       00 E9 B6 7A A2 85 ED C7 34 08 36 98 17 FE 4E 26
       data hash MD5: 32K
       F3 16 C2 85 2D 12 2F 3A 68 EE 3C 08 9A 1E ED 01>)
(   2,<2025-07-07 15:16:29.92 +0400>,<she>,<DPX200>,
      <Start of raw data processing
       efp BC_mod = 2 LB = 1.5 FT_mod = 6 PKNL = 1 PHC0 = 1400.728 PHC1 = 58.4939 SI = 64K 
       data hash MD5: 64K
       DD C9 71 6A A4 95 F1 DA A8 F3 15 D5 D5 B9 8C 3E>)
(   3,<2025-07-07 15:17:17.79 +0400>,<she>,<DPX200>,
      <pk PHC0 = 111.3798 PHC1 = -272.6 
       data hash MD5: 64K
       F9 37 56 2E 5F 34 96 A5 3D B0 90 66 0C ED B9 17>)
$$ ##END=
$$ 
$$ hash MD5
$$ 2C DA 5A 0A 19 7A A7 4B 31 8D 35 1C A3 75 3F BF
##$RELAX= 
##$RELAX= 
##$RELAX= 
##$RELAX= 
##$RELAX= 
##$RELAX= 
##$RELAX= 
##$RELAX= 
$$ Bruker specific parameters
$$ --------------------------
##$DU= <F:/spectra>
##$EXPNO= 2
##$NAME= <P31>
##$PROCNO= 1
##$TYPE= <nmr>
##$USER= <she>
##$AMP= (0..31)
100 100 100 100 100 100 100 100 100 100 100 100 100 100 100 100 100 100 
100 100 100 100 100 100 100 100 100 100 100 100 100 100 
##$AQSEQ= 0
##$AQ_mod= 1
##$AUNM= <au_zg>
##$AUTOPOS= <>
##$BF1= 81.014009
##$BF2= 200.13
##$BF3= 200.13
##$BF4= 200.13
##$BF5= 200.13
##$BF6= 200.13
##$BF7= 200.13
##$BF8= 200.13
##$BYTORDA= 1
##$CFDGTYP= 0
##$CFRGTYP= 5
##$CHEMSTR= <none>
##$CNST= (0..31)
1 1 145 1 1 1 1 1 1 1 1 1 1 1 1 1 1 1 1 1 1 1 1 1 1 1 1 1 1 1 1 1 
##$CPDPRG= <waltz16>
##$CPDPRG1= <>
##$CPDPRG2= <waltz16>
##$CPDPRG3= <>
##$CPDPRG4= <mlev>
##$CPDPRG5= <mlev>
##$CPDPRG6= <mlev>
##$CPDPRG7= <mlev>
##$CPDPRG8= <mlev>
##$CPDPRGB= <>
##$CPDPRGT= <>
##$D= (0..31)
0 1 0 0 0 0 0 0 0 0.06 0 0.03 2e-05 3e-06 0 0 0.0002 0 0 0 0 0 0 0 0 0 
0 0 0 0 0 0 
##$DATE= 1751886987
##$DBL= (0..7)
120 120 120 11 120 120 24 19 
##$DBP= (0..7)
150 150 150 150 150 150 150 150 
##$DBP07= 0
##$DBPNAM0= <>
##$DBPNAM1= <>
##$DBPNAM2= <>
##$DBPNAM3= <>
##$DBPNAM4= <>
##$DBPNAM5= <>
##$DBPNAM6= <>
##$DBPNAM7= <>
##$DBPOAL= (0..7)
0.5 0.5 0.5 0.5 0.5 0.5 0.5 0.5 
##$DBPOFFS= (0..7)
$$ [...]
##$SUBNAM3= <"">
##$SUBNAM4= <"">
##$SUBNAM5= <"">
##$SUBNAM6= <"">
##$SUBNAM7= <"">
##$SUBNAM8= <"">
##$SUBNAM9= <"">
##$SW= 400.765351723535
##$SWIBOX= (0..15)
0 1 3 0 0 0 0 0 0 0 0 0 0 0 0 0 
##$SW_h= 32467.5324675325
##$TD= 32768
##$TD0= 1
##$TE= 0
##$TE2= 300
##$TE3= 300
##$TEG= 300
##$TL= (0..7)
0 120 53 12 22 120 120 120 
##$TP= (0..7)
150 150 150 150 150 150 150 150 
##$TP07= 0
##$TPNAME0= <>
##$TPNAME1= <>
##$TPNAME2= <>
##$TPNAME3= <>
##$TPNAME4= <>
##$TPNAME5= <>
##$TPNAME6= <>
##$TPNAME7= <>
##$TPOAL= (0..7)
0.5 0.5 0.5 0.5 0.5 0.5 0.5 0.5 
##$TPOFFS= (0..7)
0 0 0 0 0 0 0 0 
##$TUNHIN= 0
##$TUNHOUT= 0
##$TUNXOUT= 0
##$USERA1= <user>
##$USERA2= <user>
##$USERA3= <user>
##$USERA4= <user>
##$USERA5= <user>
##$V9= 5
##$VALIST= <valist>
##$VCLIST= <CCCCCCCCCCCCCCC>
##$VD= 0
##$VDLIST= <DDDDDDDDDDDDDDD>
##$VPLIST= <PPPPPPPPPPPPPPP>
##$VTLIST= <TTTTTTTTTTTTTTT>
##$WBST= 1024
##$WBSW= 4
##$XGAIN= (0..3)
0 0 0 0 
##$XL= 0
##$YL= 0
##$YMAX_a= 7666
##$YMIN_a= -15670
##$ZGOPTNS= <>
##$ZL1= 120
##$ZL2= 120
##$ZL3= 120
##$ZL4= 120
##$ABSF1= 0
##$ABSF2= 0
##$ABSG= 0
##$ABSL= 0
##$ALPHA= 0
##$AQORDER= 0
##$ASSFAC= 0
##$ASSFACI= 0
##$ASSFACX= 0
##$ASSWID= 0
##$AUNMP= <proc_1d>
##$AZFE= 0.1
##$AZFW= 0.5
##$BCFW= 0
##$BC_mod= 2
##$BYTORDP= 0
##$COROFFS= 0
##$CY= -3
##$DATMOD= 1
##$DC= 0
##$DFILT= <>
##$DTYPP= 0
##$F1P= 0
##$F2P= 0
##$FCOR= 1
##$FTSIZE= 65536
##$FT_mod= 6
##$GAMMA= 0
##$GB= 0
##$INTBC= 1
##$INTSCL= 9.790993e-09
##$ISEN= 30
##$LB= 1.5
##$LEV0= 0
##$LPBIN= 0
##$MAXI= 10000
##$MC2= 0
##$MEAN= 0
##$ME_mod= 0
##$MI= 50
##$NCOEF= 0
##$NC_proc= -8
##$NLEV= 6
##$NOISF1= 182.463
##$NOISF2= 159.3651
##$NSP= 0
##$NTH_PI= 0
##$NZP= 0
##$OFFSET= 198.0616
##$PC= 4
##$PHC0= 1512.108
##$PHC1= -214.1061
##$PH_mod= 1
##$PKNL= yes
##$PPARMOD= 0
##$PSCAL= 0
##$PSIGN= 0
##$REVERSE= no
##$SF= 81.0140089999434
##$SI= 65536
##$SIGF1= 159.3651
##$SIGF2= -187.1042
##$SINO= 113.3802
##$SIOLD= 16384
##$SREGLST= <1H.CDCl3>
##$SSB= 0
##$STSI= 65536
##$STSR= 0
##$SW_p= 32467.5324675325
##$SYMM= 0
##$S_DEV= 0
##$TDeff= 32768
##$TDoff= 0
##$TI= <>
##$TILT= no
##$TM1= 0
##$TM2= 0
##$TOPLEV= 0
##$USERP1= <user>
##$USERP2= <user>
##$USERP3= <user>
##$USERP4= <user>
##$USERP5= <user>
##$WDW= 1
##$XDIM= 65536
##$YMAX_p= 325830296
##$YMIN_p= -36056856
$$ End of Bruker specific parameters
$$ ---------------------------------
##NTUPLES= NMR SPECTRUM
##VAR_NAME=  FREQUENCY,     SPECTRUM/REAL,   SPECTRUM/IMAG
##SYMBOL=    X,             R,               I
##VAR_TYPE=  INDEPENDENT,   DEPENDENT,       DEPENDENT
##VAR_FORM=  AFFN,          ASDF,            ASDF
##VAR_DIM=   65536,         65536,           65536
##UNITS=     HZ,            ARBITRARY UNITS, ARBITRARY UNITS
##FACTOR=    0.49542278885378, 1,            1
##FIRST=     16045.7642231865, 0,            0
##LAST=      -16421.768244346, 0,            0
##MIN=       -16421.768244346, -36056856,    0
##MAX=       16045.7642231865, 325830296,    0
$$ Real data points
##PAGE= N=1
##DATA TABLE= (X++(R..R)), XYDATA
$$ [...]
7508B330019J658633O12685P71237J644333Q72147q49539j002523k54660j537175
7499D245157m475826n224869k220896J822186M176094M636938L252783m54737
7491E756830m699646n641848k321061J684200L257002L236565L067894J664347
7483F004283j403926k986021p14696K097404N71826m039257n625742j963006K578180
7474e480955L829632K835884K311691K065851P23765q42589r35231j62816k97340
7465D047892j101293r22142K15721O05618k25394p87749p8320R35892P46073q60501
7455B575797k653963l017812j373661Q62552J426552J07337n44850J320346L880714
7446B583012M039679J842552R5115J04121N31066M57085O22656J028424K79584
$$ y = [2330019, 3988652, 4601337, 5372574, 7016907, 7889054, 7039515, 6036992, 5782332, 4245157, -230669, -5455538, -7676434, -5854248, -1678154, 2958784, 6211567, 5756830, 1057184, -4584664, -6905725, -5221525, -1964523, 1272042, 4339936, 6004283, 4600357, 1614336, 899640, 2997044, 3568870, -470387, -6096129, -8059135, -5480955, -1651323, 1184561, 3496252, 5562103, 6285868, 5443279, 4508048, 4345232, 4047892, 2946599, 2024457, 2240178, 2845796, 2620402, 1832653, 1754333, 2690225, 3436298, 2575797, -78166, -3095978, -4469639, -3607087, -2180535, -2073198, -2618048, -1297702, 2583012, 6622691, 8465243, 8560358, 8664479, 9195545, 9652630, 10275286, 11303710, 11583294]
7437A1583294j521781k099433q40078m63167k551006m057682j509166L160900
7429A701881M760189K044263j029332j358395l21211l29436j060568j072454p77359
7420B557578j424180k459947k151517k79950J601390K424681K635616K819669
7412E723340K452652N70351k677235n470351n571595k578202J112593K370544
7404d067903P03042j169328n74090K050844M079528L991696K660820J584483R98778
7395A0257870K00045r41548j603451j264969p33234j138687j957428j231455J436426
7386C023569L276952J472770k668085m895511l573925j584367j648488k273272
7378h870357n39207K835615M091678J554196k398828m598945m211158k301811
$$ y = [11583294, 10061513, 7962080, 7122002, 6658835, 4107829, 50147, -1459019, 1701881, 6462070, 8506333, 7477001, 6118606, 5797395, 5467959, 4407391, 3334937, 2557578, 1133398, -1326549, -3478066, -3758016, -2156626, 268055, 2903671, 5723340, 8175992, 8746343, 6069108, 598757, -4972838, -7551040, -6438447, -4067903, -3364861, -4534189, -5108279, -3057435, 1022093, 5013789, 7674609, 9259092, 10257870, 10457915, 9516367, 7912916, 6647947, 5914713, 4776026, 2818598, 1587143, 3023569, 6300521, 7773291, 5105206, 209695, -3364230, -4948597, -6597085, -8870357, -9409564, -6573949, -2482271, -928075, -3326903, -7925848, -12137006, -14438817]
7370a4438817j95828J132210J473155J705831K597904L254693K205192J052j133117
7361c397725m96744L34538N30028J395286L468735M508575K452621j164949l013973
7352D616392k259038r25586n73281p26186n36613j79588k13204o36854q14225
7343b248183O7014J910558K768061M82213l702143n139226j465878L475515M272421
7334D20352J166047r47876k7443R84958J09259j88685K287791M916858L697364
7325A2418625q64882m417505m237456j584938O95786R51914l52133j066589N57601
7316B100423L288389L823115J289962j233831j283937o07834j710195l240402
7308B425690k377640n8807M16344p99934j90229L002292N073817L387873j75676
$$ y = [-14438817, -14634645, -13502435, -12029280, -10323449, -7725545, -4470852, -2265660, -2264608, -3397725, -3894469, -3559931, -3029903, -1634617, 1834118, 6342693, 8795314, 7630365, 4616392, 2357354, 1431768, 858487, 132301, -404312, -583900, -797104, -1433958, -2248183, -2181169, -270611, 2497450, 2979663, -722480, -5861706, -7327584, -3852069, 420352, 1586399, 638523, 611080, 1596038, 1705297, 1516612, 3804403, 8721261, 12418625, 11553743, 7136238, 2898782, 1313844, 2009630, 2961544, 2609411, 1542822, 2100423, 5388812, 9211927, 10501889, 9268058, 7984121, 7376287, 5666092, 2425690, 48050, -10757, 405587, -394347, -584576, 2417716, 7491533, 10879406, 10703730]
7299A0703730k724747l817205l754094j919745Q47332J388898j362401l721828
7291d360060k259321P34083O18781k232235k891641M19320L490210K373083j047762
7282e155542k120501J92749K721231K852187J307358J28552p441L35480P68246
7273A022319J169163R91804k81540j984220k544071j267147P82343J970806J611331
7264A470788J66758j233641j255675N27954K478574K214708l7362j069135Q36806
7255D099775K846690J437267k078007l205165r43207R75690R4845j315305n42982
7246A369601J084916O44548j662504l057735k221782k99584J356911K230809J830975
7237A276155j67444k830501m265341l248662k28483K856056L712739J802653m79420
$$ y = [10703730, 7978983, 4161778, 407684, -1512061, -664729, 724169, -638232, -4360060, -6619381, -5885298, -5266517, -7498752, -10390393, -9971073, -6480863, -4107780, -5155542, -7276043, -7083294, -4362063, -1509876, -202518, -73966, -81407, 254073, 1022319, 2191482, 3183286, 2901746, 917526, -1626545, -2893692, -2111349, -140543, 1470788, 1637546, 403905, -851770, -323816, 2154758, 4369466, 4332104, 3262969, 4099775, 6946465, 8383732, 6305725, 3100560, 2157353, 3133043, 3227888, 1912583, 1369601, 2454517, 3099065, 1436561, -1621174, -3842956, -4142540, -2785629, -554820, 1276155, 1108711, -1721790, -5987131, -9235793, -9464276, -6608220, -2895481, -1092828, -1572248]
7228a572248k25067K148480L442346K394345J170591J217035Q26024j239491k839341
7219E322674j941564k95659l95354j169108l45807R93134L94301j034964j98043
7210A329610K467958L659365K831058K363130K282649l011m090183n941267m283613
7201F15696k629464k942512k326225J092483L731940K007459j509542j913229
7193c873394O44061J943620M04918j656636k623857l199738l439793j914378J340617
7184a2374580L810911L552351J555825L03786J017578K643875K945301Q58625
7176D313672j824090k139988M9837J423586j44080k230251j385149J575634K727873
7167B367044P65839j499827j577538n31124p91129k508248l351127j425502K167506
$$ y = [-1572248, -1797315, 351165, 3793511, 6187856, 7358447, 8575482, 9401506, 8162015, 5322674, 3381110, 3085451, 2690097, 1520989, 1175182, 2168316, 2562617, 1527653, 1329610, 3797568, 7456933, 10287991, 12651121, 14933770, 14930759, 10840576, 4899309, 615696, -2013768, -4956280, -7282505, -6190022, -2458082, -450623, -1960165, -3873394, -3229333, -1285713, -880795, -2537431, -5161288, -8361026, -11800819, -13715197, -12374580, -8563669, -5011318, -3455493, -3151707, -2134129, 509746, 3455047, 4313672, 2489582, 349594, 399431, 1823017, 1678937, -551314, -1936463, -360829, 2367044, 3132883, 1633056, 55518, -475606, -1266735, -3774983, -7126110, -8551612, -6384106]
7158f384106L930371J799375j753693k180410J099140L603577K147978p22370
7150A539862j397180j263726l656222o759010n333791N24493M227197J990395
7142a0127982j839887j574548K012754M330641M074253L337999K705991Q23606
7134C742827j776022k565352j130006m0238q04177j750366j094661K86367P68758
7125d362870Q44910J992446L586269L168821L7481l182944l603856j757368p71705
7116d048816k017879l234756j834984J288358K940911J989445N31084N71526J543938
7107b271173J924213J556295J094521M69034n76185j295569q15661K94759O48987
7098A029221p9853r84647j271147q39308k0633L65125n50032k132034k186307
$$ y = [-6384106, -2453735, -654360, -2408053, -4588463, -3489323, 114254, 2262232, 1539862, 142682, -1121044, -4777266, -11536276, -16870067, -16345574, -12118377, -10127982, -11967869, -13542417, -11529663, -7199022, -3124769, 213230, 2919221, 3742827, 1966805, -598547, -1728553, -1768791, -2572968, -4323334, -5417995, -5131628, -4362870, -3517960, -1525514, 2060755, 5229576, 5267057, 2084113, -1519743, -3277111, -4048816, -6066695, -9301451, -11136435, -9848077, -6907166, -4917721, -4386637, -3815111, -2271173, -346960, 1209335, 2303856, 2772890, 2196705, 901136, 85475, 380234, 1029221, 949368, -35279, -1306426, -2145734, -2166367, -1801242, -2351274, -4483308, -6669615]
7089f669615O4377K134366J525839k66382J03584K334251K846699R47145K74978
7080C295242K348698L083657p31620n078173l830929J779138M545574J801445
7072G213032j328876n36755J466848N04883j966528j906279J92706M62875j433876
7063B668030j846433K91647J377965q39496l288975k225074J063614K326850N26169
7054E4297j203264l87134J677241K287796J031735j05811K86009J135890M65670
7045E242429j596468k523207o73349K169347K842904P96829j547025k123623j112586
7036A475251M58960J921156K356307R10781j444921k391144j437618o84670j370092
7027b05990j882269p55002O29457M94109j76673M00830J286434L78129j470503
$$ y = [-6669615, -6605238, -4470872, -2945033, -3211415, -3107831, -773580, 2073119, 3020264, 3295242, 5643940, 8727597, 7995977, 2917804, -913125, 866013, 5411587, 7213032, 5884156, 5347401, 6814249, 7319132, 5352604, 3446325, 3639031, 4101906, 2668030, 821597, 1113244, 2491209, 1651713, -1637262, -3862336, -2798722, -471872, 54297, -1148967, -1536101, 141140, 2428936, 3460671, 3354860, 3640869, 4776759, 5242429, 3645961, 1122754, 449405, 2618752, 5461656, 6258485, 4711460, 2587837, 1475251, 1934211, 3855367, 6211674, 7122455, 5677534, 3286390, 1848772, 1164102, -205990, -2088259, -2843261, -2213804, -1719695, -1896368, -1495538, -209104, 169025, -1301478]
7018a301478j327664Q82327J621124j201656m950416n365074j403975L964742
7010i082070O702171M886580O7174l979562m488108j929468J186517K959366K895955
7001g81445J389701j70158q686J578095J743083q22458l008620j506890J661005
6992G3627J878494p34493j628859M40110J460473n85612k052908j74691J720770
6983C96911k05543l455455l050740M33123K174741J002502L92137J748748K095155
6974A531579l01517k525330j439412J676599L277348K237096L09543o84178m01803
6965C679925L91716N23174n83177j903794j663901L12410K125781K193650J022972
6956F098756J3247l48696k94978J86108J070482J664661J218043o8421j285067
$$ y = [-1301478, -2629142, -1746815, -125691, -1327347, -6277763, -11642837, -13046812, -9082070, -2379899, 2506681, 2573855, -1405707, -5893815, -7823283, -6636766, -3677400, -781445, 608256, 438098, 429412, 2007507, 3750590, 2928132, -80488, -1587378, 73627, 1952121, 1217628, -411231, 28879, 1489352, 903740, -1149168, -1323859, 396911, 191368, -3264087, -6314827, -5881704, -3706963, -2704461, -2312324, -563576, 1531579, 1230062, -1295268, -2734680, -1058081, 2219267, 4456363, 4765906, 4081728, 3679925, 4071641, 4594815, 4011638, 2107844, 443943, 756353, 2882134, 5075784, 6098756, 6112003, 5763307, 5468329, 5654437, 6724919, 8389580, 9607623, 9539202, 8254135]
6947H254135j903560k171595k494519k733077k282591r86523J97051J21834p65371
6938d764216n94617J267214K868540K293958O51593N75230K271687L254675K081212
6929I905276J29477r30184j331870j828280j955826j198707n79881j384492k939137
6920b113624l170205j244511J357682K421330J157446j033456j771584j51670
6912d548592J973028K003806p6723j703145j352765m23428n47126q84760J11799
6903e447906J635344J587548J16512l53782J209324K913653K731849J066905l77385
6894E082062q80181p80153l49147J76728P4909j154181k756200l329545k448210
6885f363918j007123L9093O59329J338086K171091K677600K404327J569019R92773
$$ y = [8254135, 6350575, 4178980, 1684461, -1048616, -3331207, -4317730, -4120679, -3998845, -4764216, -5358833, -4091619, -1223079, 1070879, 1722472, 2297702, 4569389, 7824064, 9905276, 10034753, 9104569, 7772699, 5944419, 3988593, 2789886, 2210005, 825513, -2113624, -5283829, -6528340, -5170658, -2749328, -1591882, -2625338, -4396922, -4548592, -2575564, -571758, -648481, -2351626, -3704391, -4127819, -4674945, -5559705, -5447906, -3812562, -2225014, -2108502, -2462284, -1252960, 1660693, 4392542, 5459447, 5082062, 4201881, 3421728, 3072581, 3249309, 3324218, 2170037, -586163, -3915708, -6363918, -7371041, -7331948, -6672619, -5334533, -3163442, -485842, 1918485, 3487504, 4480277]
6876D480277J177291J424470L44529k298194m568120m039707p33866K425554K825718
6867A037952J315612R71714K733619L846246J666299k259100l857363j918868
6859C536111M30941K54130j381972j639119k23242Q47816Q75430J168638K044644
6850E913377J820401j96356j906759j247245O58093J011794p90524k549453k251150
6841D62178k71816J408728J275946l23388j283291J95962L028508L796231R74088
6832I263146k683369l686333k414467j650179j556075K62934L549968M353103
6824E438728R55470k643633j992833J597277L370340J934829J68395R0839M41581
6815I360993l53243j785568k615877k420698j192261O95246J750831N83916j766957
$$ y = [4480277, 5657568, 7082038, 7426567, 5128373, 560253, -3479454, -4213320, -1787766, 1037952, 2353564, 3325278, 6058897, 9905143, 11571442, 9312342, 5454979, 3536111, 3967052, 4221182, 2839210, 1200091, 976849, 1824665, 2700095, 3868733, 5913377, 7733778, 7537422, 5630663, 4383418, 5041511, 6053305, 5262781, 2713328, 462178, 190362, 1599090, 2875036, 2551648, 1268357, 1464319, 4492827, 8289058, 9263146, 6579777, 2893444, 478977, -1171202, -2727277, -2464343, 1085625, 5438728, 6394198, 3750565, 1757732, 3355009, 6725349, 8660178, 8828573, 8919412, 9360993, 9007750, 7222182, 4606305, 2185607, 993346, 1688592, 3439423, 4023339, 2256382]
6806B256382k753067j905479j234649j581501j282026M30306J479755L08699j154457
6797e436037l11498J978103K662122R00345j204143j762019q92231L70342J182409
6788b512607J038954J80715m07224l91015o60818j393127r24360J600962L804951
6779C36431K840709k46082j740120n04531R26716O08048m69587r12529r36822
6770i7767q24431k7279R30897K49255j890178k413580K44715L155604K825826
6761B153062J85216j228172n40377K75627N23580J411291K596483J794289j222218
6752E948781l444623k958367j640961j575368j352674J221981M525688M732186
6744E456643J604366p28869M33157K581650J656733k363386n576748n090726k017436
$$ y = [2256382, -496685, -2402164, -3636813, -5218314, -6500340, -6070034, -4590279, -4281580, -5436037, -5747535, -3769432, -1107310, -206965, -1411108, -3173127, -4065358, -3695016, -2512607, -1473653, -1292938, -1700162, -2091177, -2751995, -4145122, -5069482, -3468520, 336431, 3177140, 2931058, 1190938, 686407, 1613123, 2221171, 1751584, 839055, -97767, -922198, -949477, -18580, 230675, -1659503, -4073083, -3828368, -672764, 2153062, 2338278, 1110106, 569729, 845356, 1368936, 2780227, 5376710, 7170999, 5948781, 2504158, -454209, -2095170, -3670538, -5023212, -3801231, 724457, 5456643, 7061009, 6332140, 6765297, 9346947, 11003680, 8640294, 3063546, -2027180, -4044616]
6735d044616M51631O38428l93728n68159P33803K058256J839683N75057J24703
6726A415058Q81963J089242l56418j951014j799319n00903M6321k02938K17226
6717a160782J224197J062688n23808j551796r84646k61043m95592m28029J203650
6708a915161L102108L068651R05305j831819l590237l055407M07992M725795N637475
6699G454702J766268k675237l162362j076661j023413l338413l867697j038562
6691f961375J700696J667387Q08500J686533L169200K705416K35643k619884m977509
6682b585393n921379l607700J988975P064152P630649M248826P67888n93326n23579
6673H469113n6034N15082O24761j47695q25007k82696O14949K29757j014131j397043
$$ y = [-4044616, -3592985, -2954557, -3348285, -3916444, -3182641, -1124385, 715298, 1290355, 1415058, 2297021, 3386263, 3029845, 1078831, -720488, -1221391, -1175070, -1378008, -1160782, 63415, 1126103, 602295, -949501, -1934147, -2195190, -2690782, -3118811, -1915161, 1186947, 4255598, 5160903, 3329084, -261153, -3316560, -2908568, 1817227, 7454702, 9220970, 6545733, 3383371, 2306710, 1283297, -2055116, -5922813, -6961375, -5260679, -3593292, -2784792, -1098259, 2070941, 4776357, 5012000, 2392116, -2585393, -8506772, -12114472, -10125497, -3061345, 4569304, 8818130, 9586018, 8992692, 8469113, 8413079, 8928161, 9552922, 9405227, 8580220, 8297524, 8912473, 9142230, 8128099, 6731056]
6663F731056j080913j732001k974456k318128N80755K498197J002221k035508
6655F71223l053631j222369J490652L265615L592521K520792O56821o23225o09148
6646F689251n17702j739874l146410k034526J879443N140257M328505K21394l044208
6637G776130k708340k04915J039859j83065j712246j015800J544903L186668K149521
6628I872715k94414j636532j170285l94625o52035j369788j028930P53006K685076
6619F764188L061142J110601k524479n947425o897113m552761p27235J665682
6611h047400J777786J524632K542133L685975K853731L21032j591568j787225
6603A279096j293502q10262M23503K506953L643177K465840J72143j189873j399877
$$ y = [6731056, 5650143, 3918142, 943686, -1374442, -793687, 1704510, 2706731, 671223, -2382408, -3604777, -2114125, 1151490, 4744011, 7264803, 7921624, 7298399, 6689251, 6171549, 4431675, 1285265, -749261, 1130182, 6270439, 10598944, 10820338, 7776130, 5067790, 4862875, 5902734, 5719669, 4007423, 2991623, 4536526, 7723194, 9872715, 9578301, 7941769, 6771484, 6376859, 5724824, 4355036, 3326106, 4079112, 6764188, 9825330, 10935931, 8411452, 2464027, -4433086, -8985847, -9713082, -8047400, -6269614, -4744982, -2202849, 1483126, 4336857, 4657889, 3066321, 1279096, -14406, -824668, -401165, 2105788, 5748965, 8214805, 8386948, 7197075, 5797198]
6594E797198j376197q60756J009465L130158K766376q17673m700800n397298k753604
6585c203131K36531J023381j02368j167834j068391k64728N94048J558199K459004
6576F4711K169043l1739k822763l943453k890563j236668k34960M15776J172380
6567g338236J665391J724904J825100J775836O20071j242568j654547K18847K158373
6558b46829J977661P40680P73829J801653J606658j97400j637884j455222m41399
6549B921747K96561L68914n97065k577211l847610k205251J789463M510488L190864
6540C850900q59846l657066k590346J135498L690688K494270q07211k141191k22001
6531H93695J807691J139569o20330n50994N70364p4544k058743k303679n39676
$$ y = [5797198, 4421001, 3560245, 4569710, 7699868, 10466244, 9648571, 4947771, -449527, -3203131, -2966600, -1943219, -2045587, -3213421, -4281812, -4546540, -3952492, -2394293, 64711, 2233754, 2202015, -620748, -4564201, -7454764, -8691432, -8926392, -8510616, -7338236, -5672845, -3947941, -2122841, -347005, 273066, -969502, -2624049, -2405202, -246829, 1730832, 2471512, 3245341, 5046994, 6653652, 6456252, 4818368, 3363146, 2921747, 3218308, 3587222, 2990157, 412946, -3434664, -5639915, -3850452, 660036, 3850900, 2991054, -666012, -3256358, -2120860, 1569828, 4064098, 3256887, 1115696, 893695, 2701386, 3840955, 3220625, 2669631, 3239995, 3165451, 1106708, -1196971, -1736647]
6522a736647K00184j077286j788096n61101O06830M77477Q01188K392491K794412
6513B109452M12238k373771k945198k196654j734919m93352K461782M573869L173204
6504B986651R9482r84489j78840k45816j327053j025703R15081K073534J359781
6495C672628O7838r12936j659532j331525Q23698K802324J749124j453623l004336
6486G53660j616826M66831J846230L213878L909984J860498j842789k885679j90114
6477E515673J842408p1495l326659m092729k830023j728440l32295K075417K858732
6468h9411k31608l838291k813362J832284M071360J733327r93642o62294Q50218
6459a41419O91504l27176r8680R57799J254200Q93302N43273n99755k999966m453280
$$ y = [-1736647, -1536463, -2613749, -4401845, -4962946, -4356116, -3878639, -3077451, -684960, 2109452, 2521690, 147919, -2797279, -4993933, -6728852, -7222204, -4760422, -186553, 2986651, 3086133, 2101644, 1922804, 1676988, 349935, -675768, 239313, 2312847, 3672628, 3740466, 2827530, 1167998, -163527, 660171, 3462495, 5211619, 3757996, 753660, -863166, -396335, 1449895, 4663773, 8573757, 10434255, 8591466, 5705787, 5515673, 7358081, 7286586, 3959927, -132802, -2962825, -4691265, -5023560, -2948143, -89411, -321019, -4159310, -6972672, -5140388, -1069028, 664299, -329343, -991637, -141419, 550085, 222909, 124229, 1082028, 2336228, 3229530, 3772803, 3173048, 173082, -4280198]
6449d280198k505672J582413M025647L368536J653548P94657L81627l27310o71697
6440D021551j80684p6019j455827l107624k972933j232774n6072l05433m17439
6431e783254P76563J874657J024887q61043r67621J467819L858444L487021O47665
6422E525138k228509l425369k862457j154225P66520J537928M82660j030465p12777
6413c101556J661663L490085K308710j159689l707518l089377j90908K093730
6405a694860J723955p15922k852236l005131j653707l36205L40775Q53929J317432
6396f021970J161098M76750L77349J261137J805446Q07196p37328p64977R32078
6387g03221K290787J644873l30992j770036j866859j415887j531564k273999k488330
$$ y = [-4280198, -6785870, -5203457, -1177810, 2190726, 3844274, 4638931, 5020558, 4693248, 4021551, 3840867, 3764848, 2309021, -798603, -3771536, -5004310, -5060382, -5365815, -5783254, -5006691, -3132034, -2107147, -2968190, -3935811, -2467992, 1390452, 4877473, 5525138, 3296629, -128740, -2991197, -4145422, -3378902, -1840974, -1358314, -2388779, -3101556, -1439893, 2050192, 4358902, 3199213, -508305, -3597682, -3788590, -1694860, 29095, -686827, -3539063, -6544194, -8197901, -8534106, -8193331, -7339402, -6021970, -4860872, -4384122, -4006773, -2745636, -940190, -132994, -870322, -1635299, -703221, 1587566, 3232439, 2901447, 1131411, -735448, -2151335, -3682899, -5956898, -8445228]
6378h445228j080215J370223K759687J921348M37936P67671K711837L364043J069491
6369D876793k159757l271436j943782k58166N22627J043470J947916K664750K551242
6360E973657J940901J362028N79506q50152k517008l240090k167609K45287K191892
6351C518412J821900p24427k870744k208497N01760K159831J356120L6265L33508
6342C924128J332112P27714j209835j677632L85359K206717P07228l154057n357038
6333b115304l838417p87544N44945j78895q19446j96606P26788J057108J464430
6324d142941K562393L255319K202641J49279q18030n9541J067305J358162R46994
6315F521581K55905o11673j066682l20421Q56654M26314j785606l015185j284126
$$ y = [-8445228, -9525443, -8155220, -5395533, -3474185, -3036249, -2268578, 443259, 3807302, 4876793, 2717036, -554400, -2498182, -2756348, -2233721, -1190251, 757665, 3422415, 5973657, 7914558, 9276586, 9856092, 9005940, 6488932, 3248842, 1081233, 1326520, 3518412, 5340312, 4615885, 1745141, -463356, 38404, 2198235, 3554355, 3590620, 3924128, 5256240, 5983954, 4774119, 3096487, 3481846, 5688563, 6395791, 3241734, -2115304, -5953721, -6741265, -6196320, -6375215, -7194661, -7391267, -6664479, -5607371, -4142941, -1580548, 1674771, 3877412, 4026691, 3208661, 3149120, 4216425, 5574587, 6521581, 6777486, 6165813, 5099131, 4778710, 5635364, 6061678, 4276072, 1260887, -23239]
6306b3239J292050J157701j594326l306572j789425J183812K866571K763688J897207
6297D447467P99265l09658p02483n3313P12673P94374Q37257J441356J356561
6288I323499p33605l124621k421605J481546M241928K385909k108934m566381
6280D477736l574281j661611o93146L39546K304283L520419K166505o53164k279320
6271C946967j992828j292601j235244j234846l58474J514049L617941M378641
6263G343605K313059j748174m332719l243736q98629j061910k888204j895675
6255f412383K692325N749519L378195j415071l243769j689944l09354k14563Q58364
6246f06681L478542M812516K994578K0651j167028l14680O83656L53332j305705
$$ y = [-23239, 1268811, 2426512, 832186, -2474386, -4263811, -3079999, -213428, 2550260, 4447467, 5246732, 4937074, 4234591, 4181278, 4893951, 5688325, 6525582, 7966938, 9323499, 8589894, 5465273, 3043668, 4525214, 8767142, 11153051, 9044117, 4477736, 903455, -758156, -1451302, -1111756, 1192527, 4712946, 6879451, 6226287, 3946967, 1954139, 661538, -573706, -1808552, -2167026, -652977, 2964964, 7343605, 9656664, 7908490, 3575771, 332035, -566594, -1628504, -4516708, -6412383, -3720058, 2029461, 5407656, 3992585, 748816, -941128, -1250482, -1465045, -606681, 2871861, 7684377, 10678955, 10699606, 9532578, 9217898, 9901554, 10254886, 8949181]
6237H949181l068087l248347j470732J95346n08180k591528k760412j67412K215431
6228b454740J897077J00544p47894m94342l03199j60075L91153N00702n42649
6219a813423j218135K87727K776274L388892J919750Q77403J073011K96826k476374
6210E111951m473556k883062P30533K339265P90916j280909j582122p31314k60011
6201b238309k18446L8682J84306m33453j235205r58841M58507J727092J945689
6192g29978J536506J319817J458718J528487J046228j62416j606429k219416j435411
6183G36106m1552P39150P42369N60755K20488m64202n82118R07275K804566K465802
6173H088639l99276k905692k915624j546142n66963J83840J010186O00862j441314
$$ y = [8949181, 5881094, 2632747, 1162015, 1357361, 849181, -1742347, -4502759, -4670171, -2454740, -557663, -457119, -1205013, -1699355, -2002554, -2162629, -1771476, -1270774, -1813423, -3031558, -2743831, 32443, 3421335, 5341085, 6218488, 7291499, 7588325, 5111951, 638395, -2244667, -1514134, 825131, 1616047, 335138, -1246984, -1978298, -2238309, -2456755, -2418073, -2233767, -2667220, -3902425, -4861266, -4402759, -2675667, -729978, 806528, 2126345, 3585063, 5113550, 6159778, 5997362, 4390933, 2171517, 736106, 694554, 1433704, 2176073, 2736828, 2957316, 2493114, 1910996, 2818271, 5622837, 8088639, 7689363, 4783671, 1868047, 321905, -245058, -61218, 948968, 1549830, 108516]
6164A08516k682041j431704k59q90735j976519O2837L272144K896414m25870j155337
6154b222554J897450L343600K86654k790017j774139K48895j131738l707762k594080
6145h443691J178239K491544P37127J24881J964848K821306R71401q37674m79980
6136E28001M34356K27723k25661l41760j340443k841422j784299K533619N675800
6127B865914L584625j598984m519997l488526j069603O65543J829030K295022
6119E63024J151060j036189k167556j545144p70651j037720j379359n22386R53548
6110e791373J417479L93170q68311p23769J255885L704639M496123K805297K4625
6101F713765j828368k237088k009570j521064m26467R45958J347476K73523j128111
$$ y = [108516, -2573525, -4005229, -4005488, -4896223, -6872742, -6809905, -3537761, -641347, -1067217, -2222554, -325104, 3018496, 3305150, 515133, -1259006, -1010111, -2141849, -5849611, -8443691, -7265452, -4773908, -4036781, -3911900, -1947052, 874254, 1845655, 1007981, 528001, 962357, 1190080, 964419, 622659, -717784, -3559206, -5343505, -2809886, 2865914, 6450539, 4851555, 331558, -3156968, -4226571, -3561028, -1731998, 563024, 1714084, 677895, -1489661, -3034805, -3805456, -4843176, -6222535, -6744921, -5791373, -4373894, -3980724, -4849035, -5572804, -4316919, -612280, 3883843, 6689140, 6713765, 4885397, 2648309, 638739, -882325, -1308792, -362834, 984642, 1258165, 130054]
6092A30054j389642k72675J353626K402669K049096L11242j337020r87205J287978
6083C548123K987055K098092m01430k042209j959258j095299j42700Q55879J292223
6074E140476M84780o49953o25245k59750j904340n050319n715527k006658K512794
6065h073742L689084K589208K889432M274527L079245q29275k771417k49095L007039
6056G605006K472981q57946k586089j185589R16132J378590L28220q15758q20870
6047F434677O63162K313731J729572j598467m703172m262635o64054K702333L496908
6038F112055K031149l96920k608353l310102j909477K78165J315602J199419J569899
6029D281437K877450L491902J929952j297320m238124m940176k640112J248924
$$ y = [130054, -1259588, -1532263, -178637, 2224032, 4273128, 4584370, 3247350, 2260145, 3548123, 6535178, 8633270, 8231840, 6189631, 4230373, 3135074, 2992374, 3848253, 5140476, 5625256, 4975303, 4350058, 4090308, 2185968, -2864351, -8579878, -10586536, -8073742, -4384658, -1795450, 1093982, 5368509, 8447754, 7618479, 4847062, 4597967, 7605006, 10077987, 9220041, 6633952, 5448363, 6364495, 7743085, 8071305, 7255547, 6434677, 7097839, 9411570, 11141142, 9542675, 4839503, 576868, -87186, 2615147, 6112055, 8143204, 7746284, 5137931, 1827829, -81648, 196517, 1512119, 2711538, 4281437, 7158887, 10650789, 12580741, 11283421, 7045297, 2105121, -534991, 713933]
6021G13933L653763K696105j83095k082512k011258j038671m59R31026J008814
6012C687646m00529k008703j719427L48185J974503J967598J072609j56078j951372
6003B814432l588253l542771j914555m20556L93389J481653K527150J779050n52556
5994a023017j789266q69651J04490j41671J35737J746938J867598j411160m611165
5985e991167l148718J469684L229989J47917l079586k029377J444914K437769
5977e518575L782j950401m16914K602772L036482M70439j382233k63647J194944
5968b223351k24525k610496j282954L577798O058139K580933l112895n477485
5960b714836m294245l007069k543573r55436J882415L295600J909472k12005l94058
$$ y = [713933, 4367696, 7063801, 6880706, 4798194, 2786936, 1748265, 1747806, 2678832, 3687646, 3287117, 1278414, -441013, -92828, 1881675, 3849273, 4921882, 4765804, 2814432, -773821, -4316592, -6231147, -6651703, -6258314, -4776661, -2249511, -470461, -1023017, -2812283, -3681934, -3577444, -3719115, -3583378, -1836440, 31158, -1380002, -5991167, -9139885, -7670201, -4440212, -4292295, -7371881, -9401258, -7956344, -5518575, -5514793, -7465194, -7882108, -5279336, -2242854, -1772415, -3154648, -3418295, -2223351, -2447876, -5058372, -6341326, -2763528, 3294611, 5875544, 2762649, -2714836, -7009081, -10016150, -12559723, -13515159, -11632744, -8337144, -6427672, -6639677, -7033735]
5951g033735J425527K936866K052012p70761k473580n50046L448585N302406L653125
5942G990399J602753J425538Q81071k456128o109652n848701k040955J242389
5934c313286K234793K453450K543397J529212L9454P1184J251573J150619m25571
5925G534825j251164r71854j463313k479377j428151J491779K504781K75604j651352
5916B561778n79553J281624J047841l40087p40094n34709o87450j95035J332348
5907C146663J454888j347170m326584m310798k379847j126885J36134L158856
5899e594743N908259M864425J035728j136554m77729r9225j594819k627451j171467
5890h93576J556913L475533L854147K353444j086805m457548m712006j781644
$$ y = [-7033735, -5608208, -2671342, -619330, -1390091, -3863671, -4413717, -965132, 4337274, 7990399, 9593152, 11018690, 11899761, 9443633, 3333981, -2514720, -4555675, -3313286, -1078493, 1374957, 3918354, 5447566, 5487020, 5558204, 6809777, 7960396, 7534825, 6283661, 5311807, 3848494, 1369117, -59034, 1432745, 3937526, 4213130, 2561778, 1982225, 3263849, 4311690, 3971603, 3231509, 2696800, 2009350, 1814315, 3146663, 4601551, 3254381, -1072203, -5383001, -7762848, -8889733, -8753599, -5594743, 313516, 5177941, 6213669, 5077115, 4599386, 4500161, 2905342, 277891, -893576, 663337, 4138870, 7993017, 10346461, 9259656, 4802108, 90102, -1691542]
5882a691542R19922R89200m17549j407901j998864k551874k065903O1564K269314
5873e893633K574591J020318p49409j377951n96159P47391J090313j41855j227398
5864d553792k00448J996241K663031J500704P17828Q06230j98569k286683k319888
5855a875346O35732K709982J024031j364943k77226K602784K392639r24899k391124
5846B531630O2275K623836J676062j288864k771894k079865p55251M41912J534473
5837A974314J780649M35800j561512k410109j719611p64050o15159r27739o35436
5828d442853O07944J821185J698800M40232N05J653277L814936L700064J046025
5819A0340115j416428j539674k06924N28482K96178K09098P46274J164278P58150
$$ y = [-1691542, -771620, 217580, -199969, -1607870, -3606734, -6158608, -8224511, -8162947, -5893633, -3319042, -2298724, -3048133, -4426084, -5022243, -4274852, -3184539, -3326394, -4553792, -4754240, -2757999, -94968, 1405736, 2123564, 2929794, 2731225, 444542, -1875346, -1239614, 1470368, 2494399, 1129456, 852230, 3455014, 5847653, 4922754, 2531630, 2593905, 5217741, 6893803, 5604939, 2833045, 753180, -2071, 439841, 1974314, 3754963, 4190763, 2629251, 219142, -1500469, -2264519, -2879678, -3807417, -4442853, -3834909, -2013724, -314924, 125308, 125813, 1779090, 5594026, 9294090, 10340115, 8923687, 7384013, 7177089, 7705571, 8001749, 8210847, 8957121, 10121399, 10879549]
5810A0879549k51957j158327j566992j558162j131402J66780K380537L921658
5802A1681684K639622r82837l320000k110443K4542o84350l052079k453188J606994
5793C349945L986311J517614k171418k253296N06590K178633J966792J735817
5785A0816988J272647j098497l994253l931396j055621M75894j322234l643691
5777b480163l598154j823828N1376J935569L333945K306952j104933l269038j562213
5768f210487J709342K698498J144362p73044k506497m469906m899110j595071
5760a4901913L561658N762815L455259J55569o41298N34063J242651P18241o2570
5751a75525j21715Q21113K056417J813746q81962l992889m187169j263693J491511
$$ y = [10879549, 10627592, 9469265, 7902273, 6344111, 5212709, 5379489, 7760026, 11681684, 14321306, 13338469, 10018469, 7908026, 7932568, 7248218, 4196139, 1742951, 3349945, 7336256, 8853870, 6682452, 4429156, 4935746, 7114379, 9081171, 10816988, 12089635, 10991138, 6996885, 3065489, 2009868, 2485762, 1163528, -2480163, -6078317, -7902145, -7850769, -5915200, -2581255, -274303, -1379236, -4648274, -6210487, -4501145, -1802647, -658285, -1431329, -3937826, -8407732, -13306842, -14901913, -11340255, -5577440, -2122181, -1966612, -2607910, -2073847, -831196, -112955, -175525, -297240, 523873, 2580290, 4394036, 3512074, -480815, -4667984, -5931677, -4440166]
5742d440166K056173J947296K445272J786869j275054l840854k424809J442741
5734b302532L059321J334413j97181O95809J914133J082892q22111j801050k025162
5725I38532k460250k458056j150071L87856P84060Q09199J657367K078696K34767
5716H22100k375115k269048O69562K569714J083617j574196k359736j304912Q625
5707d729389J221214K211430J607727j002227k988554j674196J559469K859727
5699i34799R92117j612794k404286r77752J670960L792219L355684L79222j852369
5690B408202o63579J692222J012818k144862l063596m38961J523877R1294j757455
5681a340040p88951J069007M27612j804971k409739j104983J95262J314058K920733
$$ y = [-4440166, -2383993, -436697, 2008575, 3795444, 2520390, -1320464, -3745273, -2302532, 756789, 2091202, 1894021, 2589830, 4503963, 5586855, 4764744, 2963694, 938532, -1521718, -3979774, -5129845, -4741989, -3957929, -3148730, -1491363, 587333, 822100, -1553015, -3822063, -3152501, -582787, 500830, -1073366, -3433102, -4738014, -4729389, -3508175, -1296745, 310982, -691245, -3679799, -5353995, -3794526, -934799, 57318, -1555476, -3959762, -4937514, -3266554, 525665, 3881349, 4260571, 2408202, 1744623, 3436845, 4449663, 2304801, -758795, -1197756, 326121, 417415, -1340040, -2128991, -1059984, -632372, -2437343, -4847082, -5952065, -5756803, -4442745, -1522012]
5672a522012L409441R77339k297259k704506n06655Q32379L93976L89505J248330
5663B20538Q14839j035232j504511L22805J935975J877508J651463J718736k4952
5654E977169l562955m815497j510790K551993K705591O1094r02729P19561J839938
5645C063375Q34778m08835J36581K047686L417080K602625o20911m169645m844434
5636B058300k037016R81102J233180j03511k43732O14817L30393r16365j042432
5627H74736j22427k18526j126871k09595K680169L869088J247820k085135j962526
5618B946733J163851L184795J798057j252332k933858k128804m7466J392020J307946
5609E430942L76646k70647m04095m58542l71392K63524J070648J241299J001334
$$ y = [-1522012, 1887429, 2864768, 567509, -2136997, -2643652, -1811273, -1417297, -1027792, 220538, 1035377, 145, -1504366, -1181561, 754414, 2631922, 4283385, 6002121, 5977169, 2414214, -2401283, -3912073, -1360080, 1345511, 1406605, 503876, 1223437, 3063375, 3898153, 3489318, 3625899, 5673585, 9090665, 11693290, 11072379, 6902734, 2058300, 21284, 1002386, 2235566, 2132055, 1888323, 2503140, 2833533, 1917168, 874736, 752309, 533783, -593088, -802683, 1877486, 5746574, 6994394, 4909259, 2946733, 4110584, 7295379, 9093436, 7841104, 4907246, 2778442, 2730976, 4122996, 5430942, 5807588, 5536941, 5132846, 4674304, 4302912, 4566436, 5637084, 6878383, 7879717]
5600G879717J249719J615585O40355j635878l161330k823827k060659k274051
5592e70369k453686j151744O79230J071328L31294M95914J823837K317225J075048
5583C618077j64791K44620J416533J446321O711j864823l431299m219717l237852
5574f186220j17104L248412M141580K436280Q80519J310531K217286J262180j175727
5565H017737k699077k327595j275730n48059J94322J052475J180074N44015O41961
5556D780123K128198L153708J784737r38042k338254j950566j831850k984907
5548A803147l779629k822228j425378j608240k859019k799589o72886J635274
5540a2528548K294116J756544J611798K301703K933449K734230J709649J92256
$$ y = [7879717, 9129436, 10745021, 11385376, 9749498, 6588168, 3764341, 1703682, -570369, -3024055, -4175799, -3496569, -2425241, -2093947, -1598033, 225804, 2543029, 3618077, 3453286, 3697906, 5114439, 6560760, 6567471, 4702648, 1271349, -2948368, -6186220, -6303324, -3054912, 1086668, 3522948, 4403467, 5713998, 7931284, 9193464, 8017737, 5318660, 2991065, 1715335, 1167276, 1361598, 2414073, 3594147, 4138162, 4780123, 6908321, 10062029, 11846766, 10908724, 8570470, 6619904, 4788054, 1803147, -1976482, -4798710, -6224088, -7832328, -10691347, -13490936, -14163822, -12528548, -10234432, -8477888, -6866090, -4564387, -1630938, 1103292, 2812941, 3005197]
5532C005197j276209j742708n97322J261921J984299R08975o46778j168043o52368
5523A076964K070L48505L21122k25383q46252l38425J372106K103053P8832k849630
5513A042962k961006K93051L335314L144701P04628j177203j424326p11153K66067
5504B513035Q48373J21401j677498k502147r44426J547507K581584K102100J849521
5495F439450K159256J529916n11483k129310j537379N82478J806722N84865k219498
5486F705017m115695l379406r32010N40659l27495k040707k301227p63101J086296
5477e527669J964792J672875O15109m38852o05453J60031Q92420J094247J414988
5468A242488K005154J612761k39380j632499q27800P43150M91724j221620j793795
$$ y = [3005197, 1728988, -13720, -611042, 650879, 2635178, 3544153, 2897375, 1729332, 1076964, 1079034, 1427539, 1748661, 1523278, 677026, 338601, 1710707, 3813760, 3892592, 1042962, -1918044, -1624993, 1710321, 4855022, 5559650, 4382447, 2958121, 2246968, 2513035, 3361408, 3482809, 1805311, -696836, -1641262, -93755, 2487829, 4589929, 6439450, 8598706, 10128622, 9617139, 7487829, 5950450, 6532928, 8339650, 8924515, 6705017, 2589322, -790084, -1722094, -1181435, -1508930, -3549637, -5850864, -6613965, -5527669, -3562877, -1890002, -1274893, -1713745, -2319198, -2159167, -1266747, -172500, 1242488, 3247642, 4860403, 4621023, 2988524, 2160724, 2903874, 3395598, 2173978, 380183]
5459C80183p18011p5688n06222M8141K521907M521168L571743M20034k468343
5450G694912l767947l114847j99269L749487N263212K204419k695110m506398
5442D628459k175174N24217L59212j525708k146653q63772P56119J800412K519193
5433C876305K605835J322213m93159p93851M97418P94534j270530l240685k237168
5424A060912N91424J806811R34793P06246K147394K896839J262259j179652k374374
5415G852652k415121j921881n37524J233014J393264l16219j202740J51669J230062
5406E467176k04867k108502j714286m80901j461460l727208l778039j238709J103170
5397h143626K016678K453734K317382Q98489j18762J416177L553263K269761j913957
$$ y = [380183, -337828, -413516, -919738, -871597, 1650310, 6171478, 9743221, 10163255, 7694912, 3926965, 812118, 612849, 4362336, 9625548, 11829967, 9134857, 4628459, 2453285, 2977502, 3336714, 1811006, -335647, -1199419, -443300, 1357112, 3876305, 6482140, 7804353, 7311194, 6517343, 7014761, 7809295, 6538765, 3298080, 1060912, 1652336, 3459147, 4393940, 5100186, 7247580, 10144419, 11406678, 10227026, 7852652, 5437531, 3515650, 2978126, 4211140, 5604404, 5288185, 4085445, 4237114, 5467176, 5262309, 3153807, 1439521, 958620, -502840, -4230048, -8008087, -9246796, -8143626, -6126948, -3673214, -1355832, -457343, -576105, 840072, 4393335, 6663096, 4749139]
5388D749139m084429k154345O62385J272127J32537j462414l026983l077517l91524
5379g381024K160754K44287m378068m709642J103743O297401N369077J576273
5371B82801N90375K037724K278536J207324R23920R49414o1179n58972R92939
5362H642882J925635q44183m810824m824548p56346K657415K830619J613099R38203
5353G371952M49901k86627o61500n71832o98093j189268j692238j968998j324794
5344e71497Q19948K637240J082106k888865m075534o51825K374781J120749n66791
5335g19688K057572N626031L699220k182178m582858j933356N0296j237858j596942
5326h19761J669174M923308M308030J015871j964927l515693k974017Q5716L014646
$$ y = [4749139, 664710, -1489635, -827250, 444877, 577414, -885000, -3911983, -6989500, -7381024, -5220270, -4975983, -9354051, -14063693, -12959950, -6662549, -1293472, 282801, 873176, 2910900, 5189436, 6396760, 7320680, 8270094, 8208915, 7649943, 8642882, 10568517, 9724334, 4913510, 88962, -667384, 1990031, 4820650, 6433749, 7371952, 7821853, 7535226, 6873726, 6301894, 5603801, 4414533, 2722295, 753297, -571497, 248451, 2885691, 3967797, 1078932, -2996602, -3648427, -1273646, -152897, -719688, 1337884, 6963915, 10663135, 8480957, 3898099, 1964743, 2015039, 777181, -819761, 849413, 5772721, 10080751, 11096622, 9131695, 5616002, 2641985, 2727701, 5742347]
5317E742347K005433j574751k057464J600189L642925P80454k522771j730388
5309E885974N48841j33557k346907j977396L10439N46940j723300l318925k832359
5300e040250j586223r6763K196063M114851L459648O09795j574413j541998m06152
5291A34558K94798Q3167r25861k084729k096418l87492J823882K978127K816400
5282B636432J584106q17858l361899l414402q1589L263515K486574j805935m719008
5273d230064k994152J544262M678778M265825J551905p66464j077094J43597J294040
5264D410633J218265k27281k339566l567987k346348P05940K427404Q79720j566223
5255d05443j484136K64726k8038k552033l366018q04497J938355K154758J248664
$$ y = [5742347, 7747780, 6173029, 4115565, 5715754, 9358679, 10139133, 7616362, 5885974, 6434815, 6301258, 3954351, 1976955, 2287394, 2834334, 1111034, -2207891, -5040250, -6626473, -6723236, -4527173, -412322, 3047326, 3657121, 2082708, 540710, 134558, 429356, 512523, -413338, -2498067, -4594485, -4981977, -3158095, -179968, 2636432, 4220538, 3402680, 40781, -3373621, -3455210, -191695, 2294879, 488944, -4230064, -7224216, -5679954, -1001176, 3264649, 4816554, 4050090, 2972996, 3116593, 4410633, 5628898, 5401617, 3062051, -505936, -2852284, -2146344, 281060, 1160780, -405443, -1889579, -1624853, -1652891, -4204924, -7570942, -8375439, -6437084, -4282326, -3033662]
5246c033662Q79315k16394k585034l287567o06179J867580K73697l006949k703585
5237a2418778J240641L971567L391547K487168L536311M518388K933960j17310
5229I543494j817301j633195j430135k374287l269879k236849N56575K643011
5221a8566K228419N89266J45811Q49388O79161o07707j120901m60329l79206j074145
5211H31191n05775J258753J125598j471311k390209P13806L809249K475469j137370
5202D709401k136308p31927q42578k839644l341702j372175N41910J193419J904673
5193b914931K927632K945968K206326K147095K074317K56070j984241j673326
5185E984910M38206O28656j381519j722164R80703L131614J966338o04048j932090
$$ y = [-3033662, -2154347, -2370741, -4955775, -8243342, -8849521, -6981941, -6708244, -9715193, -12418778, -11178137, -7206570, -3815023, -1327855, 2208456, 6726844, 9660804, 9543494, 7726193, 6092998, 4662863, 2288576, -981303, -3218152, -2661577, -18566, 2209853, 2799119, 2944930, 3794318, 4473479, 3865772, 2744871, 2284542, 1905336, 831191, 325416, 1584169, 2709767, 1238456, -1151753, -437947, 3371302, 5846771, 4709401, 2573093, 1841166, 998588, -1841056, -5182758, -6554933, -6013023, -4819604, -2914931, 12701, 2958669, 5164995, 7312090, 9386407, 9642477, 7658236, 5984910, 6423116, 7051772, 5670253, 3948089, 4928792, 8060406, 10026744, 9422696, 7490606]
5176G490606k396886k983864k718349j047689J74061m61174j481427j059135J85925
5167d297932P04197L10956m94823j426379j457152O62268L774832M783447K998680
5158E558094J273743J431201J609272R590j794766j745071q33960j053615k002842
5149B451646k245879k119953k411802j915804P48272M059303N142505L637819
5141G346107J594818K39486p64865j383609r37312L24704J313479J735824K060272
5132A1528904K035011Q32250j334462l110595l606452l050463j916219m71991
5124I05983P31682Q85510j93944j631692k235375j667719q04708o27619p12800
5115e350682L35132K417372L194940J216336j399477j549487M13015J465522O86519
$$ y = [7490606, 5093720, 2109856, -608493, -1656182, -1482121, -1943295, -3424722, -4483857, -4297932, -3593735, -3282779, -3777602, -5203981, -6661133, -5998865, -2224033, 2559414, 5558094, 6831837, 8263038, 9872310, 9881900, 8087134, 6342063, 5508103, 4454488, 2451646, 205767, -1914186, -4325988, -6241792, -5493520, -1434217, 3708288, 7346107, 8940925, 9180411, 8415546, 7031937, 6094625, 6419329, 7732808, 9468632, 11528904, 13563915, 14396165, 13061703, 9951108, 6344656, 3294193, 1377974, 905983, 1637665, 2523175, 2329231, 697539, -1537836, -3205555, -4010263, -4637882, -5350682, -5015550, -2598178, 596762, 1813098, 413621, -1135866, -722851, 742671, 1429190]
5106A429190R7566O29687P68694J01369N77227K516459K812396l38414l780843
5097D813331l505148k57541K060302J922433R08826J24454q07773j710494j766909
5088A781481j298844j176610q31278O46039J891375O78205k092891k934254q93681
5079d230458R20492J65164j253635n32405J490426J849572K25401p18116M11527
5070a672032J772092J252053o63721k136365k515338k177693r86121J257141L366100
5061b503884L695007K446608J257363M67787j012652k698627k069298J417376
5053I99680M310054L490954O72903j91757J285874J833496l13544l252096m566593
5044D268971l908787k009020L93148K002341J613396J17084n2233J739243L208129
$$ y = [1429190, 1526756, 2156443, 2925137, 3026506, 3603733, 6120192, 8932588, 8594174, 4813331, 1308183, 1050642, 3110944, 5033377, 5942203, 6066657, 5258884, 3548390, 1781481, 482637, -693973, -1525251, -879212, 1012163, 1690368, -402523, -3336777, -4230458, -3309966, -3144802, -4398437, -4930842, -3440416, -1590844, -1365443, -2083559, -1672032, 100060, 1352113, 688392, -1447973, -3963311, -6141004, -7127125, -5869984, -2503884, 1191123, 3637731, 4895094, 5362881, 4350229, 1651602, -417696, 999680, 5309734, 8800688, 9473591, 9281834, 10567708, 12401204, 12087660, 8835564, 4268971, 360184, -1648836, -1255688, 746653, 2360049, 2477133, 2424900, 4164143, 7372272]
5035G372272K146121q21050l045533k466924N61572L093961J974166k198362m760146
5026A856077k773914M94649J14269k984642l508060k39818K336531J596918M37841
5017b670149J322591J937409J12710j445170L63863L194787K623874q01821k541754
5008B096340r78996R37852P18867o96539j372410q97052J75946J348074K032054
4999C364136J718951O29399m84740r46041k18229J611678K905681J626296j566020
4990H641111l132668j109371J888337K048677n32904k337841j289089J050820
4982E227072K086098J233057j13745p05034q92022j870314l581209m149728k224786
4973d990611Q67718K638602K496833J753435J238729P94625N54136P14546O47911
$$ y = [7372272, 9518393, 8697343, 5651810, 3184886, 3746458, 6840419, 8814585, 6616223, 1856077, -917837, -423188, -308919, -3293561, -6801621, -7041439, -4704908, -3107990, -2670149, -1347558, 589851, 702561, -742609, -378746, 2816041, 5439915, 4638094, 2096340, 1117344, 2055196, 2774063, 2077524, 705114, -191938, -15992, 1332082, 3364136, 5083087, 5712486, 5227746, 4281705, 4063476, 5675154, 8580835, 10207131, 8641111, 5508443, 4399072, 6287409, 8336086, 7803182, 5465341, 4176252, 5227072, 7313170, 8546227, 8432482, 7727448, 6835426, 4965112, 1383903, -2765825, -4990611, -4122893, -1484291, 1012542, 2765977, 4004706, 4799331, 5353467, 6068013, 6715924]
4964F715924J79707O05261K115752J972793j496200m958928m287740r46241P27127
4955F27455P71075K028150K884424p23416o326113o580396j186010J756031j159437
4946g908237l374573k44259L013740J144346j689398L61221M467849M472939J238598
4937A482226k76114L3940r38781k452476j753696l6782m139m01976R16989J756460
4927a674349m78852l034099k198888N1720K0735q53596M45367J998023Q01416
4918d922523o99428J046800L593111K805564M08311J09961L98985j442908k743962
4909a446089o47782J039634j504498l964842j308963K369555J186683j428494
4901e704796K87619K719625J05900k989823K44715M712819K046764k804021P8777
$$ y = [6715924, 6895631, 7500892, 9616644, 11589437, 10093237, 5134309, 846569, -99672, 627455, 1398530, 3426680, 6311104, 5587688, -738425, -7318821, -8504831, -6748800, -7908237, -11282810, -11527069, -8513329, -7368983, -9058381, -8697160, -4229311, 243628, 1482226, 1206112, 1240052, 301271, -2151205, -3904901, -3941683, -3945822, -4347798, -3430809, -1674349, -2153201, -5187300, -7386188, -7334468, -7313733, -8167329, -7721962, -5723939, -4922523, -5621951, -4575151, -982040, 1823524, 2231835, 2341796, 2740781, 1297873, -1446089, -2093871, -1054237, -2558735, -6523577, -7832540, -5462985, -4276302, -5704796, -5417177, -2697552, -2591652, -5581475, -5336760, -623941, 1422823, -1381198, -1302421]
4892a302421O393126M682242k381496l008300J727150J393307k331652J79903
4884E351859M800823M91701o059264k90290R456498L503702r356787k831973J5523217
4875B0589486J2590612j740231K6178765R7560259J25049062M5602343p5946947
4868B49883349j21859967p2652278j3788226m935517j7686850j0909066L667365
4861A1718810M50336r507909m630671O385809M768878k994686r29295N443063
4853A0704335K121006n439228l498889L674083K790541l553123l378932J670113
4845E089906R77278l893515k608483L923014N308911N06954j686957Q68022J578367
4836A0063497j484920l230600j980619r88425n20133J567446L036892N51327k454935
$$ y = [-1302421, 5090705, 9772947, 7391451, 4383151, 6110301, 7503608, 5171956, 5351859, 10152682, 10644383, 4585119, 4294829, 13751327, 17255029, 7898242, 5066269, 20589486, 33180098, 31439867, 57618632, 155178891, 280227953, 325830296, 249883349, 128023382, 55371104, 41582878, 36647361, 18960511, 8051445, 11718810, 12169146, 2661237, -1969434, 4416375, 9185253, 6190567, 5261272, 10704335, 12825341, 7386113, 3887224, 7561307, 10351848, 6798725, 3419793, 5089906, 6067184, 2173669, -434814, 3488200, 8797111, 9304065, 7617108, 8485130, 10063497, 8578577, 5347977, 3367358, 2378933, 1858800, 3426246, 6463138, 7014465, 4559530]
4827D559530n11892L720151L343512j149660l470032k475665k231773l153427
4819a369256k273031o18158j388146k452545M18660M460611L243454k028175l808554
4810e815140l52961K492066J795667J033629K123075K113695m82508k901341l200223
4801c194041k405775r51860J542839K985707R73493k122363k062509J3021m11815
4792e633303k807144k321297J275473K894438J052147Q6170K020970L264690J515723
4783A347867m58199m20245l30440j791200k802272j597762M89579J970517L071761
4774e20394L291273J231596j863148k614290p30792N18403N5954N90568L098653
4765C057823M410906K285238j161765l003746k934737j709270K69251J551938
$$ y = [4559530, 4047638, 7767789, 11111301, 9961641, 6491609, 4015944, 1784171, -1369256, -3642287, -4260445, -5648591, -8101136, -7682476, -3221865, 21589, -2006586, -5815140, -6168101, -3676035, -1880368, -846739, 1276336, 3390031, 2907523, 6182, -3194041, -5599816, -6551676, -5008837, -2023130, -1049637, -3172000, -5234509, -5221488, -5633303, -8440447, -10761744, -9486271, -6591833, -5539686, -5453516, -3432546, -167856, 1347867, 889668, 469423, 138983, -1652217, -4454489, -6052251, -5562672, -3592155, -520394, 2770879, 4002475, 2139327, -474963, -1205755, -687352, -631398, -40830, 3057823, 7468729, 9753967, 8592202, 5588456, 2653719, 944449, 1213700, 2765638]
4757B765638M28107j822014k044470k49672N01550k13586O00583L351660M236597
4748G554393J595434j004625n55328R80485Q34081r0546J9444K10836r83693k545316
4738F015165l026256k957998k852877j636398O46948J599511M00710j48622J689550
4729b70267K938669L71461l805996m506936o63708L708923M700657K279416o33101
4720D119118j065706J479109M241132L792976J30806l154603l322284j254332
4712D966216P86447J812168J518350m38014k972626l481052r50654K329986L410676
4703F981497J621716j776760m989751o059007l974493k76854K308402L177852
4695b987398L633235L558215J518805j555866k522687p72616Q28020P74323P70045
$$ y = [2765638, 3193745, 1371731, -672739, -922411, -420861, -634447, -33864, 3317796, 7554393, 9149827, 8145202, 7589874, 8570359, 9404440, 9313894, 9333338, 9544174, 8560481, 6015165, 2988909, 30911, -2821966, -4458364, -3811416, -2211905, -1811195, -1959817, -270267, 2668402, 3039863, -766133, -5273069, -5936777, -2227854, 2472803, 4752219, 4119118, 3053412, 4532521, 8773653, 12566629, 12697435, 9542832, 6220548, 4966216, 5752663, 7564831, 9083181, 8645167, 5672541, 2191489, 1240835, 3570821, 6981497, 8603213, 6826453, 1836702, -4222305, -8196798, -8473652, -6165250, -2987398, 645837, 4204052, 5722857, 4166991, 1644304, 871688, 1699708, 2474031, 3244076]
4686C244076J489298R12874j151044j419451J301397L217473J415622j436755
4678G573490j873912j204248k096048l098440j382224J709766K714555J665436
4670D008375J078729J111363K92989n08284M41570J605667L52302j695502n72904
4661F114305L111997M341049J227382k466199l459069l129148l746506m318796
4653b324985k693851O04395K904478K529681J89764j791155j240521J675234M019346
4644C872386L181609Q0259k254448k557976j761146m57748J242208J812872m03312
4635B754704l691713m017713n36608K912446L134788J595240J225508J669798
4627E046450M28003k527442m137244k405074Q79483K461160J572760L46752M54194
$$ y = [3244076, 4733374, 5646248, 4495204, 3075753, 4377150, 7594623, 9010245, 7573490, 5699578, 4495330, 2399282, -699158, -2081382, -371616, 2342939, 4008375, 5087104, 6198467, 6491456, 5983172, 6424742, 8030409, 8382711, 6687209, 6114305, 9226302, 13567351, 14794733, 12328534, 8869465, 5740317, 1993811, -2324985, -5018836, -4414441, -1509963, 1019718, 1209482, -581673, -1822194, -146960, 3872386, 7053995, 7134254, 4879806, 2321830, 560684, 102936, 1345144, 3158016, 2754704, -937009, -4954722, -5491330, -2578884, 555904, 2151144, 3376652, 5046450, 5474453, 2947011, -1190233, -3595307, -2715824, -254664, 1318096, 1664848, 2119042]
4618B119042P51426o69731l019712l440457j233200Q22373M86346o66730J70701
4609d679942K742023M252326L293236J063441q62361j997512k342957j982537
4601e14283j299401n49457M17777J279213J130161K36866L84627K001958K645182
4592E732643M39484k519268k773600l75406J577612J452978L31530p06958j670157
4583A488858k147284j364259J06170Q54758P65171O39178K13545j093790j983917
4574b521570n60165K316997L636715K341013M18858k04478L86566J271325J653131
4565H738392P70470j122263k136948j150048J52021Q017j50243J583165L194233
4556I886796J377873k465917l807243k189353j487332k704030k403698L46927
$$ y = [2119042, 2870468, 2200737, -818975, -4259432, -5492632, -4670259, -4183913, -4850643, -4679942, -1937919, 2314407, 5607643, 6671084, 5808723, 3811211, 1468254, -514283, -1813684, -2363141, -1945364, -666151, 464010, 700876, 1085503, 3087461, 5732643, 6172127, 3652859, 879259, 503853, 2081465, 3534443, 3865973, 3159015, 1488858, -658426, -2022685, -1916515, -1061757, -296586, 342592, 556137, -537653, -2521570, -3081735, -764738, 2871977, 5212990, 5631848, 5427370, 5813936, 7085261, 8738392, 9508862, 8386599, 6249651, 5099603, 5251624, 5259641, 5109398, 6692563, 9886796, 11264669, 8798752, 4991509, 2802156, 1314824, -1389206, -3792904, -3445977]
4548c445977J533949p44641k393058l6298L228081K955153K40772r40244q1888
4539C15849O45487J004106K050494K710837J171779j512514k740063k179307j287522
4530A79146m71319L49248O9686j578283k129857J44665K680207K141266k74584
4521A110175j056068k22591l60527j066138M27372L369486L633964N04273j766892
4512D573054p61164M35058j224945l587152k934449P8050J662799N03754j124596
4503b379591j281830o56767n88445p28065K51699K288474L431335K307436M48064
4494C092310O02546K522466K636760o51448l684178k365646J433106K143197j330515
4485D398598m021166k394275O76335O96065j886233l068349j402900O27663Q34774
$$ y = [-3445977, -1912028, -2656669, -5049727, -5086025, -1857944, 1097209, 1337981, 397737, 315849, 961336, 1965442, 4015936, 6726773, 7898552, 6386038, 3645975, 1466668, 179146, -292173, 57075, 126761, -1451522, -3581379, -3436714, -756507, 1384759, 1110175, 54107, -168484, -529011, -1595149, -1167777, 2201709, 5835673, 6339946, 4573054, 3811890, 4246948, 3022003, -565149, -3499598, -3421548, -1758749, -1254995, -2379591, -3661421, -4318188, -4906633, -5634698, -5382999, -3094525, 336810, 2644246, 3092310, 3694856, 6217322, 8854082, 8202634, 4518456, 2152810, 3585916, 5729113, 4398598, 377432, -2016843, -1340508, -644443, -2530676, -5599025, -7001925, -6374262, -5539488]
4476e539488J1682j38672L16213J16815r14841j446512n12730J025169J525580
4467e556784P25058j06333k51622n31758j496696j896157l43256K249501L446802
4458c761245K262231J43876q07787K78600K420639L218973R13093k915024m106066
4449b352710j056470K491816K193370q10979j750625P06659L065432K759302J366683
4440F612478J013060J101937M03979m38687n00954m74203j112344j600100j118167
4431C886999l69176r6082K29042Q76837Q33493k33657p98065J38987J185830P05929
4421F360137q00006k012282k771507l127612k259648j69044J370888J456809J667594
4412b84671K910372K931856j28339l699922l856600j136032M57622m45316j318606
$$ y = [-5539488, -5527806, -5666478, -5350265, -5233450, -6148291, -7594803, -8107533, -7082364, -5556784, -4831726, -4938059, -5189681, -5721439, -7218135, -9114292, -9457548, -7208047, -3761245, -1499014, -1355138, -2162925, -1884325, 536314, 3755287, 4668380, 1753356, -2352710, -3409180, -917364, 1276006, 465027, -1285598, -578939, 2486493, 5245795, 6612478, 7625538, 8727475, 9131454, 8692767, 8191813, 7717610, 6605266, 5005166, 3886999, 3517823, 3421741, 3650783, 4527620, 5361113, 5127456, 4329391, 4468378, 5654208, 6360137, 5560131, 3547849, 776342, -2351270, -4610918, -4779962, -3409074, -1952265, -284671, 2625701, 5557557, 5429218, 1729296, -2127304, -3263336, -2805714, -3251030, -4569636]
4403d569636m70000P77939J198977J488043J973939J535536j3684j119190j191382
4394c89458j477530k008968n59481L434245O504672N286519J220315j554797j756046
4385H699471j595808k515545l245707k500048j136616n21663l78915L67767J490182
4376a336882J586672K02189j264641j225908P5509Q89855K40860q62228r28812
4367b623386j14849M0620j102102k239149j766936J99512K073030K744951K622511
4358a65798K645180K829808K341085R29799m28827q62250j000822k025993l525822
4349G36360l694837k009574k13393K00899K7471N81731J313270J071844O55445
4340a330784J617487L020849K279956l59669j177981J678226M683378L178239
$$ y = [-4569636, -5039636, -4261697, -3062720, -1574677, 399262, 1934798, 1921114, 801924, -389458, -1866988, -3875956, -4435437, -1001192, 5503480, 10789999, 12010314, 10455517, 8699471, 7103663, 4588118, 1342411, -1157637, -2294253, -2815916, -3194831, -2827064, -1336882, 249790, 451979, -812662, -2038570, -1963061, -1073206, -832346, -1694574, -2623386, -2738235, -2697615, -3799717, -6038866, -7805802, -7606290, -5533260, -2788309, -165798, 2479382, 5309190, 7650275, 8580074, 8151247, 7288997, 6288175, 4262182, 736360, -2958477, -4968051, -5181444, -4980545, -4953074, -4371343, -3058073, -1986229, -1330784, 286703, 3307552, 5587508, 5227839, 4049858, 5728084, 10411462, 13589701]
4332A3589701k268276o393923n766386k293094K40459R30521J580885L024084
4324B643971L677910K034551q82780k616358k209534q60318K02917J089651K012335
4315E092345K092465O43017j206053j646543o11683L44697M46231N06114J160820
4306F821410J685903J138155k77250j504500j704300q75638l0980n79958k666673
4297B006169m431230m072448k219244p19602L78047K313970M249896L544189L48559
4288A398306j314254Q25948L394047K107726j674933k848098J0599K999035K759184
4279G657560L49693j653136k698435l277552k949739j433898l3905l8338p75097
4270d852847q30479j97297L07939Q14759J903387K940956K520337L61427k309332
$$ y = [13589701, 11321425, 4927502, -838884, -3131978, -2891519, -1960998, -380113, 2643971, 6321881, 8356432, 7473652, 4857294, 2647760, 1787442, 1990359, 3080010, 5092345, 7184810, 7827827, 6621774, 4975231, 4363548, 4708245, 5154476, 5660590, 6821410, 8507313, 9645468, 9368218, 7863718, 6159418, 5283780, 5252800, 4672842, 2006169, -2425061, -6497509, -8716753, -9436355, -9058308, -6744338, -2494442, 1049747, 1398306, 84052, 910000, 4304047, 6411773, 4736840, 1888742, 1899341, 4898376, 7657560, 8007253, 6354117, 3655682, 378130, -2571609, -4005507, -4039412, -4077750, -4852847, -5683326, -5880623, -5572684, -4757925, -2854538, 86418, 2606755, 2968182, 658850]
4261F58850l890189l182682j25694L103897L201079j60317k747444q81494L102071
4252i21923L946672J295861l5318J929781L158139O66357k156979j215147J266354
4243G933797N03271k744987l661485j556313l87489j285505r42277J400557J692083
4234I51652j641314l937693j564121K007109J949289j87007K07599K783227L343831
4225C912572J272604N8279Q87359J044877q29304k457690j878440m8461J394734
4216C356530J967405J452031M453p33779M61714J592549j53534l437311m052523
4207D57535j286802J128034R63425J01557J90502Q3565p31933l24577J858728
4198B440034L033787J368402r33981j190509J0597Q77249J471522K348804K513937
$$ y = [658850, -3231339, -6414021, -6539715, -3435818, -234739, -395056, -3142500, -4023994, -921923, 3024749, 4320610, 4285292, 6215073, 9373212, 10039569, 7882590, 6667443, 7933797, 8437068, 5692081, 2030596, 474283, 86794, -1198711, -2140988, -740431, 951652, -689662, -4627355, -6191476, -4184367, -2235078, -2422085, -2214486, 568741, 3912572, 5185176, 5243455, 6130814, 7175691, 6346387, 3888697, 2010257, 1961796, 3356530, 5323935, 6775966, 6780419, 6046640, 6508354, 8100903, 7947369, 4510058, 457535, -829267, 298767, 1262192, 1363749, 1554251, 1637816, 905883, 581306, 2440034, 5473821, 6842223, 5908242, 4717733, 4728330, 5605579, 7077101, 9425905, 11939842]
4189A1939842R68504j489886l428985l940146k262689J037408K563181l67810
4181E019419m528161l970437J013242L873679J986219J74339J677508K862435
4173H108243Q16635r79177L02349R31997k127440m406373j281937L570901M418767
4164I353965K762762K703562K538464l96286j853585K571132P471204M948883
4156C0100101k040697m574335k203690q92403m00427L230230O166180K420545
4148C1805504k178330J691883P609014L028137l199891J0601362L7326720L7745323
4140A24429722m949838n2939425n9840426k9994943m633679k508676n619591J067250
4132c4989606Q092349N028969r50814p94521J291941n20193j696406K393620O108515
$$ y = [11939842, 12908346, 11418460, 7989475, 4049329, 1786640, 2824048, 5387229, 5019419, 491258, -3479179, -2465937, 1407742, 3393961, 3568300, 5245808, 8108243, 8924878, 7945701, 8248050, 9180047, 7052607, 2646234, 1364297, 4935198, 9353965, 12116727, 14820289, 17358753, 16962467, 15108882, 17680014, 25151218, 30100101, 28059404, 23485069, 21281379, 20388976, 19988549, 23218779, 29384959, 31805504, 29627174, 31319057, 38928071, 41956208, 38756317, 49357679, 86684399, 124429722, 119479884, 66540459, 6700033, -23294910, -27928589, -30437265, -36056856, -34989606, -26897257, -21868288, -22819102, -23613623, -22321682, -22841875, -24538281, -22144661, -16036146]
4123a6036146L559455o04927J98954L224068K616291K9705L88951K475358J822454
4114b325837j015921k074230o76875J099641K530725L167464J274429k305356
4106c25960k764093J653455N384144L181623j908793l410623p76208J492757J232230
4097C758532j82093j819343l438239l430238q50398J932752K158632N45260o82749
4088b007884j215505j242748K56338K572427K212015j444690l393709m49352K759835
4079a953273R20911k792235j710955L106592M653281J514222p61054Q7034j57873
4070B906650l255486m256260J18136N114120M632703j19409l321075k828248j269315
4061b278184o93441l75009M67528J042392N49099n43106j270841j258726q46371
$$ y = [-16036146, -12476691, -13081618, -12882664, -9658596, -7042305, -7012600, -6623649, -4148291, -2325837, -3341758, -5415988, -6092863, -4993222, -2462497, 704967, 1979396, -325960, -3090053, -1436598, 3947546, 7129169, 5220376, 1809753, 1033545, 2526302, 3758532, 3576439, 1757096, -1681143, -5111381, -5961779, -4029027, -1870395, -1325135, -2007884, -3223389, -4466137, -4209799, -1637372, 574643, -870047, -4263756, -4713108, -1953273, -1032362, -3824597, -5535552, -2428960, 2224321, 3738543, 2977489, 3064523, 2906650, -348836, -4605096, -4486960, 627160, 5259863, 5140454, 1819379, -1008869, -2278184, -2971625, -3346634, -2879106, -1836714, -1287615, -1830721, -3101562, -4360288, -5206659]
4052e206659o53992j028000j716724k158366j954064r11380Q71623K594056L135284
4043g028222K388245J394767O70416l78341j697342j905477n42458P20684O11677
4034e766051K40240Q23738J365622P75434L40110J394692K324379J032132j071608
4025A458688r95921R85066J967470J107766M8830p06555j963181k700105r39061
4016a737003J992566K236897o83416k602124o56297K917222M381177K928730J84669
4007H962421k001584k116563M0075K019155J034203j782521k519458m01372J198236
3998D432592N81748J93452J455804J696813q51129l117300k011707K26408k68570
3989B338111k604894l004981j191674j95514p65594n95413R59650J636825M31618
$$ y = [-5206659, -5860651, -6888651, -8605375, -10763741, -12717805, -13629185, -12757562, -10163506, -7028222, -4639977, -3245210, -2574794, -2953135, -4650477, -6555954, -7098412, -6377728, -5766051, -5525811, -4702073, -3336451, -2561017, -2220907, -826215, 1498164, 2530296, 1458688, 462767, 1447833, 3415303, 4523069, 4571899, 3865344, 1902163, -797942, -1737003, 255563, 2492460, 1809044, -793080, -1449377, 1467845, 5849022, 8777752, 8962421, 6960837, 4844274, 4884349, 6903504, 7937707, 6155186, 3635728, 3234356, 4432592, 5014340, 5207792, 6663596, 8360409, 7509280, 4391980, 2380273, 2606681, 2338111, -266783, -3271764, -4463438, -4658952, -5424546, -6019959, -5060309, -3423484, -2991866]
3980b991866n62481L12224J658562J376948k14797r43565M55241K825572L507500
3971E423338J098644k264694k628919O71690L335798J533333k648861m129398
3963C90931k030215k76816j212416k554952j669753O86008K628477M167999N662122
3954E791385N538278K308617k336428m885072l971045j266669R94163J795035
3946C968264J251647M03987O90196K137182K578414L05623l027765m154797k596080
3937A556671r99787r02913p93708O28420J887953J298220j4495m2409P10001M64416
3927C792369l64870o8501O31368o67430l396616l920221j205148J096619J76227
3918c926203j755783j499892P5151N25357P39857K919558N306903L994762l08343
$$ y = [-2991866, -3554347, -3242123, -1583561, -206613, -421410, -1364975, -909734, 1915838, 5423338, 6521982, 4257288, 1628369, 2300059, 5635857, 7169190, 4520329, 390931, -1639284, -1916100, -3128516, -5683468, -7353221, -6667213, -4038736, 129263, 5791385, 11329663, 13638280, 11301852, 6416780, 2445735, 1179066, 2173229, 3968264, 5219911, 5623898, 6314094, 8451276, 11029690, 11335313, 8307548, 4152751, 1556671, 556884, -346029, -1139737, -511317, 1376636, 2674856, 2660361, 2617952, 3327953, 3792369, 3427499, 3358998, 3990366, 3322936, -73680, -3993901, -5199049, -4102430, -3926203, -5681986, -7181878, -7106727, -6581370, -5841513, -2921955, 2384948, 6379710, 6071367]
3909F071367k385698l00158J625724l95508l893311m154931j031154J659234J873480
3900i30955J248828J768444L096430L514364K036871o74325k846250l168830k101997
3891A942580j138042q02955l73294M75635J160047J464054J715557J462277j61068
3882E744791k345917k992487j841609r97882j458827j598077m19168K72003j078647
3873f715820k779020k304878j6139J845602K441528K369975J730744M68660l95066
3864c354414m5694N18762N1364q75224j158433j068438q76892N92293L500218
3855b716458M982192K826294m58473r91814M05330p9471k228974j754211K083222
3846B067637M144512R34748l977225n132512k362010O38453K252512L521540M280980
$$ y = [6071367, 3685669, 3385511, 5011235, 4615727, 722416, -3432515, -4463669, -2804435, -930955, 317873, 2086317, 5182747, 8697111, 10733982, 10059657, 7213407, 4044577, 1942580, 804538, 1583, -371711, 103924, 1263971, 2728025, 4443582, 5905859, 5744791, 3398874, 406387, -1435222, -2433104, -3891931, -5490008, -5909176, -5637173, -6715820, -9494840, -11799718, -11815857, -9970255, -7528727, -5158752, -3428008, -2959348, -3354414, -3400108, -2881346, -2829982, -3705206, -4863639, -5932077, -6808969, -6216676, -2716458, 2265734, 5092028, 4633555, 3641741, 4047071, 3967600, 1738626, -15585, 2067637, 6212149, 7146897, 3169672, -1962840, -4324850, -3686397, -1433885, 2087655, 6368635]
3837F368635K814963n98503l019880k555643o44836J65708p43897j996641k147537
3828b357631j008506L59068N90010n96493j814616j397619M27163J425335j9920
3819d393209k613073l349037j061527K151779L557145K905602J847486J054578
3811I9744j38871j321555p10150J674732K825562P26144k195226k144096N46140
3802f37576J934746L06001j523069n57870K173459L291465J424340j635765l382844
3793A392887k976886j386736P7775J122183K223642L139292K667551O45492r69016
3784E936184n25787O95160K96889j356020j557471L76924J853798R46367q78098
3775E787946j415752j039593j426741k429306k436424j244889m83833j009567
$$ y = [6368635, 9183598, 8585095, 5565215, 3009572, 2364736, 2530444, 1786547, -210094, -2357631, -3366137, -3007069, -2417059, -3013552, -4828168, -6225787, -5798624, -4373289, -4393209, -7006282, -10355319, -11416846, -9265067, -5707922, -2802320, -954834, 99744, -39127, -1360682, -2070832, -396100, 2429462, 3155606, 960380, -1183716, -637576, 1297170, 1603171, 80102, -477768, 1695691, 4987156, 6411496, 4775731, 1392887, -1583999, -2970735, -2892960, -1770777, 452865, 3592157, 6259708, 6905200, 5936184, 5410397, 6105557, 6402446, 5046426, 3488955, 3865879, 5719677, 6666044, 5787946, 4372194, 3332601, 1905860, -523446, -2959870, -4204759, -4688592, -5698159]
3767e698159j449134n5174K754590M531079L507277O67845j450021j842850j828298
3758h62845k323307j892955Q81082M213231M738903K161604k28419j64945R18157
3749G440506Q82734J83047K75374M85600j030126l802749m874453k513066J425490
3740a527643L575672K709311O11296l83763j4288J17090j000324k453873k844491
3731a211013k081787r12960M46626J929659K535096J260671j141199k911632l558883
3722e645422l685457k880028j19513L482000M913314L264238J175547R13297J211173
3713B629149m239j664388j109071J319753K238227J19326k269901j604655J435798
3704A089999L141760J761128m18166n61441P93479J016039k99783q60239J43390
$$ y = [-5698159, -7147293, -7202467, -4447877, 83202, 3590479, 4258324, 2808303, 965453, -862845, -3186152, -5079107, -4198025, 15206, 4754109, 6915713, 6687294, 6522349, 7440506, 8323240, 8506287, 8781661, 9267261, 8237135, 4434386, -440067, -2953133, -1527643, 2048029, 4757340, 5368636, 4984873, 4970585, 5087675, 4087351, 1633478, -1211013, -3292800, -4205760, -3759134, -1829475, 705621, 1966292, 825093, -2086539, -5645422, -9330879, -12210907, -12330420, -8848420, -3935106, -670868, 504679, 1417976, 2629149, 2624910, 960522, -148549, 1171204, 3409431, 3528757, 1258856, -345799, 1089999, 4231759, 5992887, 5574721, 5013280, 5806759, 6822798, 6523015, 5662776, 5806166]
3695E806166K43284k152483m250343k411557K185162M669417K832892o87028k594568
3686C640942k387262j227894q8949K73954k47345k75632J258878K529443Q82611
3677D358746k401255k992003J2602K328831R21013j487638r26082J844544L002037
3668D660795J260043j251630k469751k250970j523846j328972j928678k001547
3660f834556j95026K024984J573887j324514k615252m40476J807843R25829j053697
3651f130978n57864J739464K697867K039534J880213K475065K228270Q88858n23284
3642F737145j846714k922865k206944O39092K562306J007034j780065k060638
3634A28351m18399j08736j228187j135921M45258J426032J636090K511011L235672
$$ y = [5806166, 6049450, 3896967, -353376, -2764933, -579771, 4089646, 6922538, 6235510, 3640942, 1253680, 25786, -63163, 210791, -36554, -312186, 946692, 3476135, 4358746, 1957491, -1034512, -1021910, 1306921, 2227934, 740296, -185786, 1658758, 4660795, 5920838, 4669208, 2199457, -51513, -1575359, -2904331, -4833009, -6834556, -7029582, -5004598, -3430711, -4755225, -7370477, -7810953, -6003110, -5077281, -6130978, -6688842, -4949378, -2251511, -211977, 1668236, 4143301, 6371571, 7260429, 6737145, 4890431, 1967566, -239378, 399714, 2962020, 3969054, 2188989, 128351, -290048, -398784, -1626971, -2762892, -2317634, -891602, 744488, 3255499, 6491171]
3625F491171J879328l31470p23550l57579k160987m587391l252060J130372K997831
3616A085665R00597n26654R25238J513131q56130k234300L85199L563439L211411
3607G967596R14183J13625M31091J34759R3052Q86869O1755l123823m255138k41261
3597B982708M429754L616859j305448m145890l296078k169696j983911o48777
3589b520479J709498K249569P01260j45387M30101L71188m61896J33257J863882
3580D330993J659849p28409j660777L20116J826486N9253l003518m096916l025281
3571d318204j300642O47691K614927L352368K272282O24865m34876j063351j146756
3562A248304j0623J308842M42347k290849l358157j278304Q72881N19577k99134
$$ y = [6491171, 8370499, 8039029, 7315479, 6957900, 4796913, 209522, -3042538, -1912166, 1085665, 1986262, 1459608, 2384846, 3897977, 3041847, 807547, 1192746, 4756185, 7967596, 8881779, 8995404, 9426495, 9561254, 9654306, 10541175, 10602930, 7479107, 3223969, 2982708, 7412462, 11029321, 9723873, 5577983, 2281905, 112209, -1871702, -2520479, -810981, 1438588, 2139848, 1994461, 2424562, 2795750, 2333854, 2467111, 4330993, 5990842, 5262433, 3601656, 3921772, 5748258, 5807511, 2803993, -1292923, -4318204, -5618846, -4971155, -2356228, 996140, 3268422, 3893287, 3458411, 2395060, 1248304, 1237681, 2546523, 2988870, 698021, -2660136, -3938440, -3065559, -2545982, -2845116]
3553b845116R24710K162678L65955k351627j316583K750987L861867l54063m818868
3544a620060m200977P637K601307K005987R34306J216065J706711J289493P83692
3535D724161R17225P13910o86881k109909j773534J86154J959256K318642J433808
3526G682832j45782j962765l164178k833799j108574R38466K619953L844957M020073
3517I891183K187098j200711l961806m542022l690970k882103k055930k09844
3509f465105K335165L682959K568462J8624j559761q42781R40677J318497l34366
3500A662371j708997n69244J892905K508365O01795j322957j552864j098276q63418
3491d50320O7949J662699J503903j265724l162815q38668L552047N063214K736410
$$ y = [-2845116, -1920406, 242272, 608227, -1743400, -3059983, -308996, 3552871, 3198808, -1620060, -5821037, -5813400, -3212093, -1206106, -271800, 944265, 2650976, 3940469, 4724161, 5641386, 6355296, 5668415, 3558506, 1784972, 1971126, 3930382, 6249024, 7682832, 7537050, 5574285, 2410107, -423692, -1532266, -593800, 2026153, 5871110, 9891183, 12078281, 10877570, 6915764, 2373742, -1317228, -4199331, -6255261, -6465105, -4129940, -446981, 2121481, 2140105, 580344, -262437, 678240, 1996737, 1662371, -46626, -615870, 1277035, 3785400, 4387195, 3064238, 1511374, 413098, -450320, -382371, 1280328, 2784231, 1518507, -1644308, -2482976, 1069071, 6132285, 8868695]
3482H868695p7214j275176j800127k076279q87138J393896K159287M32183j653015
3473E085112k347593k299042j946586j36453K949173M495317K914372N22394L2742
3464I269436N94518j15977j760042k190516j181916m24139m62865l17858J08847
3455C519488k65669j393170j605276k8314K034346K764692J847068L52094o18898
3446F606361p38686l68369m7429o6852n21424j476661k562131k696978j225460
3437c097629P23780J251564J93890q12475r95720j349696k241984k242804o39871
3428i210945Q85235Q92422O71677J825401K953532J673712r74304j474369P91424
3419a966215K383090R40338j374807j213731J330023L415506L343828J726308
$$ y = [8868695, 8791481, 7516305, 5716178, 3639899, 2752761, 4146657, 6305944, 6738127, 5085112, 2737519, 438477, -1508109, -1644562, 1304611, 5799928, 8714300, 9236694, 9269436, 9863954, 9747977, 7987935, 5797419, 4615503, 4191364, 3728499, 3410641, 3519488, 3253819, 1860649, 255373, 227059, 2261405, 5026097, 6873165, 7225259, 6606361, 5867675, 5499306, 5451877, 5385025, 4863601, 3386940, 824809, -1872169, -3097629, -2373849, -1122285, -928395, -1740870, -2736590, -4086286, -6328270, -8571074, -9210945, -8325710, -7433288, -6761611, -4936210, -1982678, -308966, -1283270, -2757639, -1966215, 416875, 1357213, -17594, -1231325, 98698, 3514204, 6858032, 8584340]
3411H584340k85770j808289j685683O08531L208977L037676k71862l267234k914089
3402E206597n84591K26912p34297l33182K435185M073218J709058k046062k571124
3393G381714q4128P92560j896940m715135m189589j422086M99250P93448L49065
3384b491841q05780k596224l216296j357126J009733J037366o05398q44091P12458
3375i157199J187632o62420k256745j148642J525615L210607L361363K800175
3367a139614J417503j153343l530445l599837j397034Q94051J921408K397643
3359d189668K909105K314339k56707k893472k469582J070633L836505K585924
3351B907077j077833k899154j661359k64933q77084j776228o24782J437980J626053
$$ y = [8584340, 8298570, 6490281, 4804598, 5413129, 8622106, 11659782, 11387920, 8120686, 5206597, 4622006, 4848918, 4114621, 3781439, 6216624, 10289842, 11998900, 9952838, 7381714, 7297586, 8090146, 6193206, 1478071, -2711518, -4133604, -3634354, -2840906, -2491841, -3297621, -5893845, -9110141, -10467267, -9457534, -8420168, -9025566, -9869657, -9157199, -7969567, -8631987, -10888732, -12037374, -10511759, -7301152, -3939789, -1139614, 277889, -875454, -4405899, -8005736, -9402770, -8508719, -6587311, -4189668, -1280563, 1033776, 777069, -2116403, -4585985, -3515352, 321153, 2907077, 1829244, -1069910, -2731269, -2996202, -3873286, -5649514, -6274296, -4836316, -3210263]
3342c210263O2814o06524K81054O16715k54678J02319K914018N126251L414517
3333H446223n30938k058331k98197O46467j993949n334617m954860j236567J384791
3324e929978Q20016j85042J277291L838961M074873J471005j315483k438398k484828
3315h71583k078274n96110J689691K544491O58763j938582k308719m46110J226902
3306b119531J488425J354286J686487J785981Q04092q47675j984381j716819m1882
3297D08983J784180J818537m38071k830357k861055r11012M46623Q3305o73768
3288c172635o67040l42587j33934L27054O01577o24354k779135k921076J75716
3279i536414L551921L959718K382079J826870K113670N57774k600726l603713
$$ y = [-3210263, -3147449, -3753973, -3472919, -2856204, -3110882, -3008563, -94545, 5031706, 8446223, 7915285, 5856954, 5558757, 6205224, 4211275, -1123342, -6078202, -7314769, -5929978, -5109962, -5295004, -4017713, -178752, 3896121, 5367126, 4051643, 1613245, -871583, -2949857, -3545967, -1856276, 688215, 1346978, -591604, -2900323, -3346433, -2119531, -631106, 723180, 2409667, 4195648, 4999740, 4152065, 2167684, 450865, 408983, 2193163, 4011700, 3573629, 743272, -2117783, -3028795, -2582172, -2498867, -3172635, -3839675, -4182262, -4316196, -3989142, -3387565, -4011919, -6791054, -9712130, -9536414, -5984493, -2024775, 357304, 2184174, 4297844, 4855618, 2254892, -1348821]
3271a348821j046722J399558L37892k274872k447459m50665L9477j690810k082600
3262i565022P47760L478982K341924j127337k135350P51592M048272M249135J700047
3253D490003q36489j389739L7754J771911J502487j261471l531320j848655K579791
3244A514272M552416J828540j722093j986143l43924k47127r95131L91621K858964
3235E851395K400161q33471k174851k07212P18462j956137m214609j986861J915648
3226d87475K192349p08058k085963q94730n24833k145467k731152o17731J724916
3217f278144K141404J971527K643817K624915N12342j629731j196446O26414P54908
3208B171006p26206p66157J630667L756575L237943J172547n013J5909l57249
$$ y = [-1348821, -2395543, -995985, -658093, -2932965, -5380424, -5831089, -5791612, -7482422, -9565022, -8817262, -5338280, -2996356, -4123693, -6259043, -5507451, -1459179, 2789956, 4490003, 3653514, 2263775, 2301529, 4073440, 5575927, 4314456, 783136, -1065519, 1514272, 6066688, 7895228, 6173135, 4186992, 3843068, 3595941, 2600810, 2992431, 5851395, 8251556, 7418085, 5243234, 5036022, 5754484, 3798347, -416262, -2403123, -487475, 1704874, 996816, -1089147, -1983877, -2508710, -4654177, -7385329, -8003060, -6278144, -4136740, -2165213, 478604, 3103519, 3615861, 1986130, 789684, 1416098, 2171006, 1444800, 678643, 2309310, 6065885, 9303828, 10476375, 10471362, 10487271, 10130022]
3199A0130022j880591l387926l280946j295806J218042K473532J876448N84684
3191F437459Q3202K79742j80924j599834k454649j676018m43738l14042n37083
3182d05885O65147K477619J820462j824823m437657k357551K493552M869710K941432
3173F242006P3399k13426J534685K399430R69428j742082l864584l957449j750177
3164c08770J354199L219762L044435J746759K20758j324858k117588j123761N65982
3155E276918J54313k529927l730180j099654K214466K025064n66637j397381j90672
3146A56310k28676j600418n80395L118011M312400M27310l545519k338178J502897
3137A223742K028730n88956j047894J896799L638966J618883q97336q52851j35211
$$ y = [10130022, 8249431, 4861505, 1580559, 284753, 1502795, 3976327, 5852775, 6437459, 6520661, 6800403, 6619479, 5019645, 2564996, 888978, 445240, 131198, -405885, 259262, 2736881, 4557343, 2732520, -1705137, -4062688, -1569136, 3300574, 6242006, 6315405, 6101979, 7636664, 10036094, 11005522, 9263440, 5398856, 1441407, -308770, 1045429, 4265191, 7309626, 9056385, 9277143, 7952285, 5834697, 4710936, 5276918, 5431231, 2901304, -828876, -1928530, 285936, 2311000, 1744363, 346982, 156310, -72366, -1672784, -2253179, 864832, 5177232, 5604542, 2059023, -279155, 1223742, 3252472, 2663516, 1615622, 3512421, 7151387, 8770270, 7872934, 7020083, 6884872]
3128F884872j349226k992329k532527j245317j880928l500630k891202j26834
3120i634121J483555Q83626O62053K233523L381598K212833M07422L00715J151048
3111C082252Q64492l56963q57575q01591j650095k931470k573305o04648M10882
3102e418021n45373j124291O98966L360886M028435K472354N35025r18546k112742
3093I76693k298864l40200K624811L636991J682749j013144k190164k109523j938765
3084i69416j542903m51626N22755N63625O89204K196053L868526L107669j8919
3075G964968k132523q44791K067160L094128J354492j026995k147206k144175
3067F185058j814415j153675r9009M43542l76709j682066j535198M66443K362099
$$ y = [6884872, 5535646, 2543317, 10790, -1234527, -3115455, -6616085, -9507287, -9634121, -8150566, -7266940, -6604887, -4371364, -989766, 1223067, 1630489, 1931204, 3082252, 3946744, 3589781, 2732206, 1930615, 280520, -2650950, -5224255, -5828903, -5418021, -5963394, -7087685, -6388719, -3027833, 1000602, 3472956, 4007981, 3089435, 976693, -1322171, -1662371, 962440, 4599431, 6282180, 5269036, 3078872, 969349, -969416, -2512319, -2963945, -2441190, -1877565, -1188361, 1007692, 4876218, 7983887, 7964968, 5832445, 4987654, 7054814, 10148942, 11503434, 10476439, 8329233, 6185058, 4370643, 3216968, 3117959, 3561501, 3184792, 1502726, -32472, 433971, 2796070]
3058B796070K257863P00887m28630p54241j519930k823844k641597K29072L608808
3049A424458M171624J825355k9545J000464L149178K888528m60505l850950m144557
3040E974050j559320R87698J404881M29720p4642Q2159m64619j859615k151358
3031B768954k94347J466982L33625k588052l212625k44189K691413K122899l66097
3022B678563o50423J980221M151198L243471K80151k285719l391996l276981k435137
3013B93348j590803j330938j044791M27184K533203L093126J501535m2860J22346
3004C961350M77957r12518k626676j728126J363018K965463J308625j289051k246103
2995A273939k018373k062269j829480o0381K339513L158234K070574Q22708L24371
$$ y = [2796070, 5053933, 5754820, 5326190, 4571949, 3052019, 228175, -2413422, -2184350, 1424458, 5596082, 7421437, 7391892, 8392356, 11541534, 14430062, 13969557, 10118607, 5974050, 4414730, 5402428, 6807309, 7237029, 7162387, 7244546, 6779927, 4920312, 2768954, 2474607, 3941589, 4275214, 1687162, -1525463, -1769652, 921761, 3044660, 2678563, 2028140, 4008361, 8159559, 11403030, 11683181, 9397462, 6005466, 2728485, 293348, -1297455, -2628393, -3673184, -3246000, -712797, 2380329, 3881864, 3839004, 3961350, 4439307, 3526789, 900113, -828013, 535005, 3500468, 4809093, 3520042, 1273939, -744434, -2806703, -4636183, -4696564, -2357051, 801183, 2871757, 3694465, 4018836]
2986D018836m33645k105365l290713k122631J197308M243144M594838K076467
2978H178239j015831k105888j111982n35390k083781l953643k964118Q82239L928300
2969g81855L507809J231923M00174J546065K310232J058303j196000k497101k139774
2960C439776q37182K52984K83639p36435j776437j646329k24124J500166K491213
2951B747271K365613J375529L49616K10112O96781K11921j747723k760043k97915
2942C151162L792293M562839O91213l050453k180377J213864J754800j378816
2934H556525l813661k747340k82088Q09534R19456J347601J241573n62823k584748
2925B884029k376016j96384J405713J190639K96162o8239q2451l39464q73674
$$ y = [4018836, 3585191, 1479826, -1810887, -3933518, -2736210, 1506934, 6101772, 8178239, 7162408, 5056520, 3944538, 3409148, 1325367, -2628276, -5592394, -4710155, -781855, 2725954, 3957877, 4358051, 5904116, 8214348, 9272651, 8076651, 5579550, 3439776, 2602594, 2855578, 3139217, 2402782, 626345, -1019984, -1244108, 256058, 2747271, 5112884, 6488413, 6838029, 7048141, 7744922, 7956843, 6209120, 3449077, 3151162, 6943455, 11506294, 12197507, 9147054, 6966677, 8180541, 9935341, 8556525, 4742864, 1995524, 1713436, 2522970, 3442426, 4790027, 6031600, 5468777, 2884029, 508013, 311629, 1717342, 2907981, 3204143, 3135904, 3053453, 2713989, 1840315]
2916A840315j353557j250426r681J919225K664096Q95487k022797l236745j715847
2907b269930Q53885K363705K191993R36676l54463n61108O58347K183882K518131
2898H521118J439221k81222k148285l575523l121501k28774K734241K682306O9768
2889F091349j689103j276203r04433j918432k358722p30055R04379K49262j214309
2880b846267n97537J731062K992113K323300J114338j73962k230073m160034l789236
2871e636296j151141J092010J393412J061480J512145K106542J794805R83975
2863C156932O12649Q52301J602776K812515L551424K374462m58114k646619k755197
2854I103129k006393k085915k587140j997032j07705J917282L054845K891224
$$ y = [1840315, 486758, -763668, -773349, 1145876, 3809972, 4705459, 2682662, -554083, -2269930, -1416045, 947660, 3139653, 4076329, 3721866, 3160758, 3819105, 6002987, 8521118, 9960339, 9679117, 7530832, 3955309, 833808, 605034, 3339275, 6021581, 6091349, 4402246, 3126043, 2221610, 303178, -2055544, -2785599, -1881220, -1631958, -2846267, -3443804, -1712742, 1279371, 3602671, 4717009, 4543047, 2312974, -1847060, -5636296, -6787437, -5695427, -4302015, -3240535, -1728390, 378152, 2172957, 3156932, 3769581, 4621882, 6224658, 9037173, 12588597, 14963059, 14504945, 11858326, 9103129, 7096736, 5010821, 2423681, 426649, 318944, 2236226, 5291071, 8182295]
2846H182295J466053k87843q86084j46820K97995n81243j546103j228458n05686
2837D764106p43074r24971P36148K916142K111869k041389n412410m725886j747564
2828e067029j61623l59974p455J477813K156608J167956J22776J25201o742j141858
2818a694327j715880k92082J462664R84507j020886j600615m19414k43761j918476
2809f458270k370501M41765L590886L163985J64703j007870J077648L583674M167117
2800F353137L470580K392788L67757k293139l339293j775644J79476L22871l04615
2791E373918M39899K121792K640038J655565O20849R5036n58163j182522r18993
2782A0287419k27709n17091j496738j159652R21630K391221J361482q48077j742496
$$ y = [8182295, 9648348, 9360505, 8474421, 8327601, 8625596, 8044353, 6498250, 5269792, 4764106, 4021032, 3096061, 3832209, 6748351, 8860220, 6818831, 1406421, -3319465, -5067029, -5228652, -5588626, -5596081, -4118268, -1961660, -793704, -670928, -545727, -552469, -1694327, -3410207, -3702289, -2239625, -1255118, -2276004, -3876619, -4296033, -4539794, -6458270, -8828771, -8387006, -4796120, -1632135, -1467432, -2475302, -1397654, 2186020, 6353137, 9823717, 12216505, 12584262, 10291123, 6951830, 5176186, 5355662, 5678533, 5373918, 5813817, 7935609, 10575647, 12231212, 12852061, 12947097, 12388934, 11206412, 10287419, 10059710, 9542619, 8045881, 6886229, 7807859, 10199080, 11560562, 10712485, 8969989]
2773H969989j208574j247014k660143l820907l077026j056568K57476R4069m05647
2764d154345N2415J319488K287807K292546J443640R5481j154849j284873J99541
2755A096851K089438K389530O98731j337648k186567j827733o92079J154850K861182
2746D246555K488977n02248l575532l744890j284078Q94616J120628L92689K3156
2737E9873k33977j104519k183655k276628q65086J179517K264577J700765P74828
2728f84305J385303L209091L557405J083509j887261k512602j551356j778888
2720H20896l094054k389992J361692M885758M714657J379345j848335k764871
2712C065096j549876L40568J340920P83274l75850o22591J2429J63572l68210
$$ y = [8969989, 7761415, 6514401, 3854258, 33351, -3043675, -4100243, -3842767, -3748698, -4154345, -4101930, -2782442, -494635, 1797911, 3241551, 3337032, 2182183, 897310, 1096851, 3186289, 5575819, 6274550, 4936902, 2750335, 922602, 230523, 1385373, 4246555, 6735532, 6233284, 2657752, -1087138, -2371216, -1476600, -355972, 36717, 59873, -174104, -1278623, -3462278, -5738906, -6603992, -5424475, -3159898, -1459133, -684305, 700998, 3910089, 7467494, 8551003, 6663742, 4151140, 2599784, 820896, -2273158, -4663150, -3301458, 1584300, 6298957, 7678302, 5829967, 3065096, 1515220, 1855788, 3196708, 3979982, 3604132, 2981541, 2993970, 3157542, 2789332]
2703B789332j59158J164925J833257O78929q54671r41029m2564K69995j54828
2694D584188m21389m21234n64141m68108M59129J684106K127321J541342L03851
2685H825065j310341k644125k596498j292428o00700j573608k650266k011868
2677e854769l59873N61844Q60461J619333K281680J529527M0616k98125M84756
2668H65450O53530k34814j042832j375329j537251o34684K166390M655383L366356
2659F882199j185065m471417l918790j521252L44675J885785L173065K444049
2651C633249m51822k427839j794502j234338k924159l965191r04203L745153M506009
2642a817643J168868j029880P17135L414378L429225R69198j743460l357869l190779
$$ y = [2789332, 2630174, 3795099, 5628356, 6307285, 5452614, 4511585, 4469021, 4739016, 4584188, 4162799, 3741565, 3177424, 2709316, 3168445, 4852551, 6979872, 8521214, 8825065, 7514724, 4870599, 2274101, 981673, 380973, -1192635, -3842901, -5854769, -6214642, -5652798, -4792337, -3173004, -891324, 638203, 678819, 380694, 865450, 1518980, 1284166, 241334, -1133995, -2671246, -3305930, -1139540, 3515843, 6882199, 5697134, 1225717, -2693073, -4214325, -3869650, -1983865, 1189200, 3633249, 3181427, 753588, -1040914, -2275252, -5199411, -9164602, -10068805, -6323652, -1817643, -648775, -1678655, -961520, 2452858, 5882083, 6851281, 5107821, 1749952, -1440827]
2633a440827j106175J104892Q46286j584242k911838j592449R0031M0040l10914
2624f865196J207615L564807L837163J232348k159451l795424k550956P56626
2616d772468L583023L621038J502340N3663J22558n56176k984883m190611j471851
2607e093367K857143M240442K065083k81986q02517q80573j851163k767895k383393
2598d898226j002504M39176J413373J526520Q33019N26817J624566L024536K736402
2589F223679Q96343n06460p06527n93937k60261J013873K143430Q79482k130628
2580F958994l264483j286508N07296n51059k394907j923161j6534M15816o56398
2571b210944r60405r7216L28865N0683L57197J251711J328675M27029k24290m07566
$$ y = [-1440827, -2547002, -1442110, -595824, -2180066, -5091904, -6684353, -6594322, -6554282, -6865196, -5657581, -2092774, 1744389, 2976737, 817286, -2978138, -5529094, -4772468, -1189445, 2431593, 3933933, 3987596, 4110154, 3553978, 569095, -3621516, -5093367, -2236224, 2004218, 4069301, 3787315, 2984798, 2104225, 253062, -2514833, -4898226, -5900730, -5461554, -4048181, -2521661, -1688642, -1161825, 462741, 3487277, 6223679, 7120022, 6613562, 5907035, 5313098, 5052837, 6066710, 8210140, 9089622, 6958994, 3694511, 2408003, 2915299, 2364240, -30667, -1953828, -1970362, -1554546, -2210944, -3171349, -3268565, -2939700, -2889017, -2531820, -1280109, 48566, 475595, 251305, -156261]
2561a56261q85478j121549J96203K278454K735548J301519K20831M09803K35284
2552E214354r96437j452520j53646R65850L35121m84480L90164J814796J699655
2543G332857N97617L11662L58605r12790k492461j567637J631266L235733J089530
2534I584382k070511k455250k17745J347999L31327k040420l575073l292420j551125
2525c938836N42884J662401J292624M80338O47590J533409J446787o1042j144047
2516B462108k82887J240844J116212m76956j179439j76462P09947K62575j87820
2507C488122N32730J008689k69919j686343o57588J864537K216939o14190l428299
2498B454678l309313j148713L53681R8856j075483j683301l74443K728450M840397
$$ y = [-156261, -1041739, -2163288, -1967085, 311369, 3046917, 4348436, 4569267, 4979070, 5214354, 4217917, 2765397, 2611751, 3577601, 3912722, 3428242, 3818406, 5633202, 7332857, 7930474, 8242136, 8600741, 7687951, 5195490, 3627853, 5259119, 8494852, 9584382, 7513871, 5058621, 4840876, 6188875, 6520202, 4479782, 904709, -2387711, -3938836, -3395952, -1733551, -440927, 39411, 687001, 2220410, 3667197, 3606155, 2462108, 2179221, 3420065, 4536277, 4059321, 2879882, 2703420, 3413367, 3675942, 3488122, 4020852, 5029541, 4759622, 3073279, 2415691, 4280228, 6497167, 5882977, 2454678, -854635, -2003348, -1649667, -1550811, -2626294, -4309595, -4684038, -1955588, 2884809]
2489B884809K981690j457612l375732p29012K284091J200837k291943l239549
2481a742421o65607J975148K480133J952724J385450J78677j276800j109077O74061
2472C852288J322367n85770k688773k206088K46717K010866J961110R37579j65396
2463D684900r83974j190635r46600j225349k383669l030729j667208R59185K472751
2454c311328J784926K92233l3188J036714J984758J546322K24267n05981k90901
2445B727822l09846j183628j651707n94800O20526j69247k311599k839765q70453
2436f582697J029896Q31808n5173M77149J689281J485768J01079k53471J031886
2427b44474J993368Q74953j710793l649162l283455n81773K635592L849224K293936
$$ y = [2884809, 5866499, 4408887, 1033155, 304143, 2588234, 3789071, 1497128, -1742421, -2408028, -432880, 2047253, 3999977, 5385427, 5564104, 4287304, 3178227, 3852288, 5174655, 4588885, 1900112, -305976, -59259, 1951607, 3912717, 4850296, 4684900, 3700926, 2510291, 1563691, 338342, -2045327, -5076056, -6743264, -5784079, -3311328, -1526402, -1234169, -1267357, -230643, 1754115, 3300437, 3524704, 3018723, 2727822, 2417976, 1234348, -417359, -1012159, -391633, -560880, -2872479, -5712244, -6582697, -5552801, -4720993, -4776166, -4299017, -2609736, -1123968, -1022889, -1276360, -244474, 1748894, 2623847, 913054, -2736108, -6019563, -6601336, -3965744, -116520, 2177416]
2418B177416L7905m36971O47179R88113l24478j629976j302628k8150L39721p44457
2408b76326k050348k147298q36688Q07263J508457J012049L09550M79305J391301
2399A97265J876993J133829l87356j535248j637608j013103l66105J63115R53459
2390f14759J744638J286667r32015l162459l074062q68850R48270J118270R95019
2381b559281J727208K286151J646955Q45586R54993Q44365p03904k215386j653474
2372A173213j36976l20074j741020j402449R18047J744733o12295l130169k567744
2363f074734q0095J079209L75322k20657j9147l84215j883149k877511j580550
2354a1665527J531437L889085L305356M39967j459169j38521K610216L029855
$$ y = [2177416, 2215321, 1778350, 2425529, 3413642, 3089164, 1459188, 156560, 128410, 468131, -276326, -2326674, -4473972, -5310660, -4503397, -2994940, -1982891, -1673341, -1194036, 197265, 2074258, 3208087, 2820731, 1285483, -352125, -1365228, -1731333, -1568218, -614759, 1129879, 2416546, 1484531, -1677928, -4751990, -5620840, -4672570, -3554300, -2559281, -832073, 1454078, 3101033, 3946619, 4901612, 5745977, 5042073, 2826687, 1173213, 1036237, 716163, -1024857, -2427306, -1509259, 235474, -376821, -3506990, -6074734, -6154829, -5075620, -4700298, -4920955, -4940102, -5324317, -7207466, -10084977, -11665527, -10134090, -6245005, -2939649, -2499682, -3958851, -4097372, -1487156, 1542699]
2346A542699N14520j583953r63426M00149k33557j916229j678150P96608L005043
2337a16296L444956K879804K006499M94392j335239k168838j679599j021639p83763
2328A720277j67124J178747K186011K064086J469764J048883J98316j554347l100395
2319E044218l108849k142171j943925k803000k967788j040948J934443L446332
2311c581688K315920j1269j107145j61732J388702J653887K20629j686373k418017
2302c387086j243779Q61744J787590N80173q25150L90152L823814N651237L599412
2293A1238107J10910j282395q22103j081723k144126j765860O5106N60285j129132
2284C749069k058036J9457L029279L425920P25504k607818m246104l406501o71021
$$ y = [1542699, 2057219, 473266, -490160, -90011, -323568, -2239797, -3917947, -3121339, -116296, 3328660, 6208464, 8214963, 8709355, 7374116, 5205278, 3525679, 2504040, 1720277, 1553153, 2731900, 4917911, 6981997, 8451761, 9500644, 9698960, 8144613, 5044218, 1935369, -206802, -2150727, -4953727, -7921515, -8962463, -7028020, -3581688, -1265768, -1277037, -2384182, -2545914, -1157212, 496675, 717304, -969069, -3387086, -4630865, -3769121, -1981531, -1401358, -2226508, -1836356, 1987458, 7638695, 11238107, 11349017, 10066622, 9244519, 8162796, 6018670, 4252810, 4317916, 4878201, 3749069, 1691033, 1710490, 4739769, 8165689, 8891193, 6283375, 2037271, -1369230, -2040251]
2275b040251K055404K684153J309300R9723m2931o17644k027106j678351J889143
2266A631440N239035L804875j719572o030429n744632k359447R24337K356710
2258a897683J632086l89642j530756k40269K003550K389576Q15853k51633R8570
2249B629652K00866p03861j100869k58520L22062k34287o91160m78042j044376
2240a358535k658200k817737k70845K077747J261023r52165p51685J824632L394422
2231b51343K742695J971460K104170J232852j859578n055521n456868k880169
2223g452302M15445K296948K227320J199689Q47206J834630K889323K304303M03076
2214F965638o69653K42392J950101K706947K200635J222276K43740r36939k346513
$$ y = [-2040251, 15153, 2699306, 4008606, 4108329, 4065398, 3447754, 1420648, -257703, 1631440, 6870475, 10675350, 8955778, 2925349, -2819283, -5178730, -4254393, -1897683, -265597, -655239, -2185995, -2426264, -422714, 1966862, 2782715, 2531082, 2629652, 2830518, 2126657, 1025788, 767268, 1089330, 855043, 163883, -314159, -1358535, -4016735, -6834472, -7105317, -5027570, -3766547, -4718712, -5470397, -3645765, -251343, 2491352, 4462812, 6566982, 7799834, 5940256, 884735, -4572133, -7452302, -7036857, -4739909, -2512589, -1312900, -465694, 1368936, 4258259, 6562562, 6965638, 6295985, 6538377, 8488478, 11195425, 13396060, 14618336, 14862076, 13925137, 11578624]
$$ [...]
##END NTUPLES=NMR SPECTRUM
##END=
