##TITLE=31Pdec_DE-88solid
 CDCl3, 64 sc
 8.7.2025
##JCAMPDX= 6.0         $$ Bruker NMR JCAMP-DX V2.0
##DATA TYPE= NMR SPECTRUM
##DATA CLASS= NTUPLES
##ORIGIN= UXNMR, Bruker Analytische Messtechnik GmbH
##OWNER= root
$$ XWIN-NMR		Version 3.5
$$ Tue Jul  8 13:48:47 2025 Russian Standard Time (UT+4h)  she@DPX200
##.OBSERVE FREQUENCY= 81.013821
##.OBSERVE NUCLEUS= ^31P
##.ACQUISITION MODE= SIMULTANEOUS
##.ACQUISITION SCHEME= undefined
##.AVERAGES= 64
##.DIGITISER RES= 17
##SPECTROMETER/DATA SYSTEM= spect
##.PULSE SEQUENCE= zgpg30
##.SOLVENT NAME= CDCl3
##.SHIFT REFERENCE= (INTERNAL, CDCl3, 0, 198.062)
##AUDIT TRAIL= $$ (NUMBER, WHEN, WHO, WHERE, WHAT)
$$ ##TITLE= Audit trail, XWIN-NMR		Version 3.5
$$ ##JCAMPDX= 5.01
$$ ##ORIGIN= Bruker BioSpin GmbH
$$ ##OWNER= she
$$ F:/spectra/data/she/nmr/P31/2/pdata/1/auditp.txt
$$ ##AUDIT TRAIL=  $$ (NUMBER, WHEN, WHO, WHERE, WHAT)
(   1,<2025-07-08 13:47:48.28 +0400>,<she>,<DPX200>,
      <created by zg, POWCHK disabled, PULCHK disabled
       configuration hash MD5:
       00 E9 B6 7A A2 85 ED C7 34 08 36 98 17 FE 4E 26
       data hash MD5: 32K
       66 9D 0E 49 D1 2E 90 4E C8 46 7C 36 C5 75 C8 16>)
(   2,<2025-07-08 13:47:50.57 +0400>,<she>,<DPX200>,
      <Start of raw data processing
       efp BC_mod = 2 LB = 1.5 FT_mod = 6 PKNL = 1 PHC0 = 1768.073 PHC1 = -949.5064 SI = 64K 
       data hash MD5: 64K
       1B 2A 76 A4 FE 48 E1 17 F8 FE 21 DD 8F 55 9B E7>)
(   3,<2025-07-08 13:48:08.18 +0400>,<she>,<DPX200>,
      <pk PHC0 = 12.3078 PHC1 = 0 
       data hash MD5: 64K
       F9 2E 57 52 10 5D FF 9E 63 48 0E 93 7D 39 45 11>)
(   4,<2025-07-08 13:48:12.32 +0400>,<she>,<DPX200>,
      <abs ABSG = 5 
       data hash MD5: 64K
       34 77 8C F7 77 9F 45 A1 32 D1 F0 D7 0E 0E 4A 77>)
(   5,<2025-07-08 13:48:21.70 +0400>,<she>,<DPX200>,
      <abs ABSG = 5 
       data hash MD5: 64K
       5C EC E6 13 99 AC 97 07 57 54 4B 16 76 B7 5C 17>)
$$ ##END=
$$ 
$$ hash MD5
$$ FF A5 D5 89 DC D1 31 43 E4 4B A9 05 2B A8 E8 D5
##$RELAX= 
##$RELAX= 
##$RELAX= 
##$RELAX= 
##$RELAX= 
##$RELAX= 
##$RELAX= 
##$RELAX= 
$$ Bruker specific parameters
$$ --------------------------
##$DU= <F:/spectra>
##$EXPNO= 2
##$NAME= <P31>
##$PROCNO= 1
##$TYPE= <nmr>
##$USER= <she>
##$AMP= (0..31)
100 100 100 100 100 100 100 100 100 100 100 100 100 100 100 100 100 100 
100 100 100 100 100 100 100 100 100 100 100 100 100 100 
##$AQSEQ= 0
##$AQ_mod= 1
##$AUNM= <au_zg>
##$AUTOPOS= <>
##$BF1= 81.014009
##$BF2= 200.13
##$BF3= 200.13
##$BF4= 200.13
##$BF5= 200.13
##$BF6= 200.13
##$BF7= 200.13
##$BF8= 200.13
##$BYTORDA= 1
##$CFDGTYP= 0
##$CFRGTYP= 5
##$CHEMSTR= <none>
##$CNST= (0..31)
1 1 145 1 1 1 1 1 1 1 1 1 1 1 1 1 1 1 1 1 1 1 1 1 1 1 1 1 1 1 1 1 
##$CPDPRG= <waltz16>
##$CPDPRG1= <>
##$CPDPRG2= <waltz16>
##$CPDPRG3= <>
##$CPDPRG4= <mlev>
##$CPDPRG5= <mlev>
##$CPDPRG6= <mlev>
##$CPDPRG7= <mlev>
##$CPDPRG8= <mlev>
##$CPDPRGB= <>
##$CPDPRGT= <>
##$D= (0..31)
0 1 0 0 0 0 0 0 0 0.06 0 0.03 2e-05 3e-06 0 0 0.0002 0 0 0 0 0 0 0 0 0 
0 0 0 0 0 0 
$$ [...]
##$SUBNAM3= <"">
##$SUBNAM4= <"">
##$SUBNAM5= <"">
##$SUBNAM6= <"">
##$SUBNAM7= <"">
##$SUBNAM8= <"">
##$SUBNAM9= <"">
##$SW= 400.765351723535
##$SWIBOX= (0..15)
0 1 3 0 0 0 0 0 0 0 0 0 0 0 0 0 
##$SW_h= 32467.5324675325
##$TD= 32768
##$TD0= 1
##$TE= 0
##$TE2= 300
##$TE3= 300
##$TEG= 300
##$TL= (0..7)
0 120 53 12 22 120 120 120 
##$TP= (0..7)
150 150 150 150 150 150 150 150 
##$TP07= 0
##$TPNAME0= <>
##$TPNAME1= <>
##$TPNAME2= <>
##$TPNAME3= <>
##$TPNAME4= <>
##$TPNAME5= <>
##$TPNAME6= <>
##$TPNAME7= <>
##$TPOAL= (0..7)
0.5 0.5 0.5 0.5 0.5 0.5 0.5 0.5 
##$TPOFFS= (0..7)
0 0 0 0 0 0 0 0 
##$TUNHIN= 0
##$TUNHOUT= 0
##$TUNXOUT= 0
##$USERA1= <user>
##$USERA2= <user>
##$USERA3= <user>
##$USERA4= <user>
##$USERA5= <user>
##$V9= 5
##$VALIST= <valist>
##$VCLIST= <CCCCCCCCCCCCCCC>
##$VD= 0
##$VDLIST= <DDDDDDDDDDDDDDD>
##$VPLIST= <PPPPPPPPPPPPPPP>
##$VTLIST= <TTTTTTTTTTTTTTT>
##$WBST= 1024
##$WBSW= 4
##$XGAIN= (0..3)
0 0 0 0 
##$XL= 0
##$YL= 0
##$YMAX_a= 6185
##$YMIN_a= -11381
##$ZGOPTNS= <>
##$ZL1= 120
##$ZL2= 120
##$ZL3= 120
##$ZL4= 120
##$ABSF1= 198.0616
##$ABSF2= -202.7028
##$ABSG= 5
##$ABSL= 3
##$ALPHA= 0
##$AQORDER= 0
##$ASSFAC= 0
##$ASSFACI= 0
##$ASSFACX= 0
##$ASSWID= 0
##$AUNMP= <proc_1d>
##$AZFE= 0.1
##$AZFW= 0.5
##$BCFW= 0
##$BC_mod= 2
##$BYTORDP= 0
##$COROFFS= 0
##$CY= -3
##$DATMOD= 1
##$DC= 0
##$DFILT= <>
##$DTYPP= 0
##$F1P= 0
##$F2P= 0
##$FCOR= 1
##$FTSIZE= 65536
##$FT_mod= 6
##$GAMMA= 0
##$GB= 0
##$INTBC= 1
##$INTSCL= 9.790993e-09
##$ISEN= 30
##$LB= 1.5
##$LEV0= 0
##$LPBIN= 0
##$MAXI= 10000
##$MC2= 0
##$MEAN= 0
##$ME_mod= 0
##$MI= 50
##$NCOEF= 0
##$NC_proc= -8
##$NLEV= 6
##$NOISF1= 182.463
##$NOISF2= 159.3651
##$NSP= 0
##$NTH_PI= 0
##$NZP= 0
##$OFFSET= 198.0616
##$PC= 4
##$PHC0= 1780.381
##$PHC1= -949.5064
##$PH_mod= 1
##$PKNL= yes
##$PPARMOD= 0
##$PSCAL= 0
##$PSIGN= 0
##$REVERSE= no
##$SF= 81.0140089999434
##$SI= 65536
##$SIGF1= 159.3651
##$SIGF2= -187.1042
##$SINO= 113.3802
##$SIOLD= 16384
##$SREGLST= <1H.CDCl3>
##$SSB= 0
##$STSI= 65536
##$STSR= 0
##$SW_p= 32467.5324675325
##$SYMM= 0
##$S_DEV= 0
##$TDeff= 32768
##$TDoff= 0
##$TI= <>
##$TILT= no
##$TM1= 0
##$TM2= 0
##$TOPLEV= 0
##$USERP1= <user>
##$USERP2= <user>
##$USERP3= <user>
##$USERP4= <user>
##$USERP5= <user>
##$WDW= 1
##$XDIM= 65536
##$YMAX_p= 331171422
##$YMIN_p= -188876289
$$ End of Bruker specific parameters
$$ ---------------------------------
##NTUPLES= NMR SPECTRUM
##VAR_NAME=  FREQUENCY,     SPECTRUM/REAL,   SPECTRUM/IMAG
##SYMBOL=    X,             R,               I
##VAR_TYPE=  INDEPENDENT,   DEPENDENT,       DEPENDENT
##VAR_FORM=  AFFN,          ASDF,            ASDF
##VAR_DIM=   65536,         65536,           65536
##UNITS=     HZ,            ARBITRARY UNITS, ARBITRARY UNITS
##FACTOR=    0.49542278885378, 1,            1
##FIRST=     16045.7642231865, 0,            0
##LAST=      -16421.768244346, 0,            0
##MIN=       -16421.768244346, -188876289,   0
##MAX=       16045.7642231865, 331171422,    0
$$ Real data points
##PAGE= N=1
##DATA TABLE= (X++(R..R)), XYDATA
$$ [...]
9630 66245 -418818 -2028068 -2249635 -1317799 -852567 -307895 1719120 3864210 3367071
9621 3367071 701323 -609671 923073 2904525 2939864 1630838 670336 296442 -20301
9612 -20301 -192761 -265802 -1204847 -3515582 -5871736 -6208008 -3755975 413983 4113653
9603 4113653 5110641 2759650 -838416 -2455167 -1149856 1033782 2240848 3066293 4654348
9594 4654348 6233908 6287788 5054476 3924486 3031158 1506149 -107709 135020 2733705
9585 2733705 5709772 7175709 7422015 7438194 6681179 3892881 -354906 -3474406 -3559880
9576 -3559880 -1458650 222126 -253273 -2347619 -4129620 -4245146 -3108747 -2281304 -2646039
9567 -2646039 -3296615 -2524787 52549 2787695 3731006 2669823 899996 -667712 -2183197
9558 -2183197 -3620090 -4165474 -3597426 -3203215 -4094087 -5290250 -4974906 -3340200 -2481974
9549 -2481974 -3272062 -4028491 -3006003 -845788 364937 -557534 -3295302 -6745157 -9426905
9540 -9426905 -10129294 -9107329 -7807073 -6660887 -4397410 -609488 2460798 2404858 -212753
9531 -212753 -3054282 -5239155 -7107288 -7770398 -5948528 -3074662 -2320215 -3860662 -4176077
9522 -4176077 -1336633 1879173 2048842 -145135 -1634376 -1567723 -1400140 -1483057 -539433
9513 -539433 1512188 2666765 1383077 -1482605 -3774446 -4109862 -2741975 -1170078 -806654
9504 -806654 -1387872 -1153562 708197 2656921 2893349 1791750 611755 -1243673 -5272244
9495 -5272244 -10270968 -12205123 -8690148 -2099950 2775727 3297977 648901 -2215086
9487 -2215086 -3642736 -4541373 -6524338 -8848922 -8514301 -4441595 88861 1432593 801614
9478 801614 2315818 6233059 7977489 4873612 128299 -2047151 -2286266 -4186980 -8636770
9469 -8636770 -13063961 -15189140 -14744844 -12205986 -8467390 -5466478 -4694688 -5053709 -4202981
9460 -4202981 -2006282 -668009 -1393820 -2915555 -3644259 -3436463 -2768739 -1957280 -1927584
9451 -1927584 -4101585 -8335589 -12011162 -12401266 -9590004 -6305322 -5046891 -5839244 -6764936
9442 -6764936 -6428003 -5550532 -5765173 -7192683 -8383213 -8761961 -9378275 -10350588 -9628061
9433 -9628061 -6240207 -3000468 -3060100 -4732101 -3177868 2677350 8283626 9391757 6803705
9424 6803705 3839973 1904437 633703 226857 1079118 2295387 2704444 2538500 2422985
9415 2422985 1685377 -497960 -3074133 -4126816 -3441176 -2409826 -1861939 -1584323 -1472646
9406 -1472646 -1405389 -374644 2365030 5431362 6489136 5326233 3861614 2946730 1359267
9397 1359267 -1307468 -2989619 -1963998 223507 552528 -1517552 -3695037 -4118987 -3142920
9388 -3142920 -1685743 289065 2527766 3076080 43697 -5289205 -8831777 -7940033 -4270734
9379 -4270734 -1484743 -1035422 -1531384 -1550700 -1172675 -690679 147453 849599 -3839 -2299793
9369 -2299793 -3288423 -816477 3316559 5367763 4561833 3634382 4210590 4074157 399514
9360 399514 -5940611 -11129037 -12742305 -11608486 -9555279 -7182736 -4600760 -2923208
9352 -2923208 -3440864 -5606435 -7232475 -6970738 -5536244 -4139848 -2996274 -2206875 -2738419
9343 -2738419 -4894295 -6686773 -5767978 -2698004 -221014 654731 1467829 2859964 3163235
9334 3163235 1727608 932355 2610462 4498948 2995625 -1753627 -6178168 -7890854
9326 -7890854 -7396600 -5838409 -3902418 -2903108 -4073255 -6117715 -5865008 -2316177 1755787
9317 1755787 3022350 813313 -3420215 -7978162 -11295423 -12108349 -10588428 -8494364
9309 -8494364 -7398547 -7403363 -7787869 -7808173 -6660290 -4016459 -1004253 606469 487918
9300 487918 -252461 -1171960 -2847310 -4995188 -6362921 -6983510 -8235773 -9850211 -9393618
9291 -9393618 -6105602 -2724903 -1546225 -994379 1311957 3994558 3625768 127035 -2669788
9282 -2669788 -1875845 1521498 4785564 6303694 5863355 3900225 1291817 -1095827 -3040097
9273 -3040097 -4520126 -4973835 -4028205 -2600286 -2008866 -2207778 -2128965 -1514517 -1044352
9264 -1044352 -825230 -268584 408470 -30865 -2181512 -5167448 -7764072 -9503107 -10542189
9255 -10542189 -11274799 -12164297 -13224059 -13659359 -12687996 -10583176 -8280599 -6266395 -4522437
9246 -4522437 -3093600 -1916294 -622941 672646 1125725 629284 559424 1764514 2812133
9237 2812133 1902245 -301008 -1600869 -1349642 -675096 -356674 -674048 -2610200 -6406331
9228 -6406331 -9245870 -7629618 -2569719 667974 -948413 -4745453 -6625063 -6147914
9220 -6147914 -5626304 -6426093 -8153850 -9793657 -9872718 -7133299 -2783234 -404429 -1674312
9211 -1674312 -3733257 -2949479 143285 2155611 1952224 1547178 2274694 3020199 2811243
9202 2811243 2705038 3851405 5237035 4761175 1896954 -1787978 -4585843 -6307946 -7694739
9193 -7694739 -8687893 -8273974 -6437180 -5127518 -5861544 -7033209 -5710058 -2128749 28740
9184 28740 -1370392 -4083663 -5131406 -4941300 -5565811 -6469080 -4995067 -534817 4268767
9175 4268767 6672952 6506626 5537963 5401194 6218269 6563105 5131875 2777882 1679174
9166 1679174 1857559 449504 -4055919 -8776705 -9805954 -7027588 -3142024 556057
9158 556057 4438109 7778799 9190498 9366684 10149719 11167742 10654844 9231910 9059220
9149 9059220 9226150 6369978 749154 -2887463 -2393174 -1844870 -5222329 -10211503 -11929547
9140 -11929547 -9969493 -7755751 -6909532 -6415373 -6172561 -7082689 -7787605 -5325062 148990
9131 148990 4448362 4355885 1139881 -2092789 -4396704 -6710889 -9094388 -10300403 -9918876
9122 -9918876 -9467253 -10713158 -13387318 -15265153 -14708364 -12501318 -10503633 -9124759 -7508830
9113 -7508830 -5913903 -5830918 -7160356 -7391440 -4933478 -1534298 263892 618700 1489267
9104 1489267 3460917 5441308 6503929 5986518 2770573 -3059543 -8412740 -9683417
9096 -9683417 -7080628 -4223840 -3428814 -3727293 -3674054 -3433052 -3238585 -2179049 104284
9087 104284 2185050 2615144 1686431 448881 -794430 -2005845 -2538392 -1844003 -380741
9078 -380741 903681 1383979 750274 -881180 -2568761 -3363873 -3835000 -5528218 -8563101
9069 -8563101 -11174088 -12066780 -11609515 -10089313 -6726811 -1628845 3014947 5263970 5626595
9060 5626595 5414567 4296647 1426828 -2051144 -3873004 -3625585 -2854227 -2358245 -1290598
9051 -1290598 859629 3071427 4077430 3677624 2423541 953017 -157660 -744110 -1335373
9042 -1335373 -2300703 -2902005 -2200474 -677606 291291 450336 722721 1272736 1225273 659749
9032 659749 962629 2279827 2507300 424768 -1657257 -567439 3168380 5845413 5653338
9023 5653338 4803850 5774881 7632457 7796470 5970660 4060961 2752692 561680 -3305489
9014 -3305489 -7175967 -9014572 -8816771 -7690797 -5791169 -2723969 793480 3416169
9006 3416169 4999594 6295769 6905250 5286513 1221153 -3231022 -5917882 -6607997 -6268704
8997 -6268704 -5528146 -4648870 -4043389 -3856293 -3551860 -2518006 -639379 1883053 4439231
8988 4439231 5627533 4223701 930435 -2171512 -4342696 -6627740 -8810732 -8145905
8980 -8145905 -3039243 3597894 7092695 6385256 4468836 3864435 3842595 2297934 -1393974
8971 -1393974 -5840729 -8881252 -9285087 -7954393 -6989480 -6836302 -5478581 -1657676 2681906
8962 2681906 5156869 6494012 8398646 9297181 6297179 1080453 -821730 2255104
8954 2255104 5547288 5105966 3375137 4236868 6067871 4334660 -885290 -4898318 -5405126
8945 -5405126 -4864690 -5204695 -4507956 -1011136 2894770 3657170 1779735 929692 2316622
8936 2316622 2923706 159965 -4074383 -5944279 -5154017 -5334631 -8715702 -12857128 -14171878
8927 -14171878 -12826876 -11800314 -12158013 -12112856 -10565685 -8617528 -7031474 -5044305 -2759801
8918 -2759801 -1994155 -3229377 -4270619 -3723948 -3255520 -4195976 -4555980 -2420040 11930
8909 11930 -486848 -2674751 -2597609 60971 1806260 1340107 1080902 1906597 1105077 -2392216
8899 -2392216 -4905028 -3288388 -317659 -1130451 -5973166 -10033406 -9889033 -7047397 -4908146
8890 -4908146 -4698219 -5220332 -5019456 -3744200 -1962397 -367477 709296 1097884 485426
8881 485426 -1165257 -3130319 -4593151 -5512517 -5853630 -4497450 -689309 3525284 4595164
8872 4595164 1926184 -1033829 -1260691 319106 1234635 1362058 2133032 3193373 2536638
8863 2536638 -250148 -3039827 -3740420 -2296335 152441 2820251 5443180 7640946
8855 7640946 8759303 8511002 7785111 8243336 10227149 11523806 9791968 6106988 3956368
8846 3956368 4278724 4073308 1179259 -2224979 -3027495 -1829108 -1467076 -2566408 -3518074
8837 -3518074 -3712915 -3770960 -3384319 -1991450 -957004 -1839618 -2894879 -860094 3699842
8828 3699842 6560132 5953579 4662583 4758545 4295458 1648655 -458481 1116925 4264122
8819 4264122 3912924 -778801 -5166635 -5323511 -2560149 -791732 -1569376 -3195438 -3616163
8810 -3616163 -2677258 -1658792 -1605301 -2549122 -3960347 -5317207 -6128168 -5971420 -4873815
8801 -4873815 -3181160 -823822 2372487 5146240 5029893 1497037 -2457245 -3878352
8793 -3878352 -3829264 -5155681 -7169358 -6211350 -1823773 1473614 140002 -3799164 -6113798
8784 -6113798 -5591698 -3598128 -917552 2011434 3388834 1693169 -1679124 -3876989
8776 -3876989 -4153881 -3913732 -3881551 -3315295 -1614836 1016098 3999781 6072924 5564581
8767 5564581 2625610 -25777 -451051 -188994 -1401869 -2943173 -2266102 -24919 755654
8758 755654 -477624 -1437025 -1309967 -1615400 -2376717 -1474509 955788 1309396 -2235173
8749 -2235173 -6361443 -6915021 -4116236 -1076589 775571 2145086 3288508 3708322 3703875
8740 3703875 4031304 4407428 3962091 2681064 1073397 -905904 -3292927 -5183558 -5624680
8731 -5624680 -4791343 -3273064 -1120764 1321004 2777055 2566239 1675606 979054 -258656
8722 -258656 -2352704 -3130587 -460155 3867200 5543657 3144693 -253438 -1286925 -7151
8713 -7151 1361073 1494276 677170 -292718 -714671 -89128 1572793 3703464 5566170
8704 5566170 6397197 5549954 3315740 1240372 505902 262753 -1089060 -3169021 -3909441
8695 -3909441 -2729380 -1351043 -633567 1275951 5848133 10717772 11713622 7927230 2560978
8686 2560978 -1384496 -3997687 -6158182 -6604423 -3554371 1722031 5602269 6716918
8678 6716918 7556040 10394266 13680037 14417887 12618480 10755330 9590511 7695113 5264652
8669 5264652 4911998 7182357 8348880 5166966 -355288 -3711691 -3747584 -2657178 -1377789
8660 -1377789 1291689 5110356 7556534 7379047 6059916 4844948 3159504 1095948
8652 1095948 456457 1474166 1244984 -2086641 -5818656 -6297781 -4334546 -3641386 -4847097
8643 -4847097 -4864366 -2389992 -333526 -1361521 -3913649 -4727391 -3354484 -1851095 -1176775
8634 -1176775 -355649 1100635 2160018 2037120 1267481 349430 -1231048 -3589308 -5196036
8625 -5196036 -4532629 -2552107 -1954815 -3794832 -6027766 -5957430 -3203675 348230 2665834
8616 2665834 2823983 962198 -1760139 -3425711 -2764039 -483966 1487769 2040750 1469749
8607 1469749 338902 -1122194 -2469921 -3094193 -3197329 -3784231 -5275866 -6935992 -7955465
8598 -7955465 -8197081 -7562943 -5705580 -2960795 -683218 -75512 -1389080 -4418517 -8467897
8589 -8467897 -11439804 -10808528 -6758772 -2843855 -1960691 -2993480 -3222947 -2631596 -3247739
8580 -3247739 -5076832 -5796106 -4604672 -3346309 -2990017 -1896919 808004 2615674 728177
8571 728177 -3760714 -7193195 -7991001 -7661256 -7610460 -7379097 -6392702 -5410859 -5248679 -5299786
8561 -5299786 -4306722 -1965697 836014 2879348 3347875 2258116 525093 -786270 -1361440
8552 -1361440 -1274143 58151 3322018 7323065 8943941 6335082 1465354 -1826733 -2082296
8543 -2082296 -1267084 -1531780 -2266589 -1098908 2926863 8020091 11370095 11760174 10471504
8534 10471504 9729657 10218621 10306619 8083170 3930250 321334 -987794 -672423 -430257
8525 -430257 -904446 -1820644 -3280873 -5540687 -7741729 -8230551 -6449836 -3597146 -1138803
8516 -1138803 495972 1516373 2090582 2636594 3895389 5825717 6945692 5722982 2522098
8507 2522098 -492623 -1393970 -68729 2001688 3051212 2308644 500646 -909585 -1184685
8498 -1184685 -750722 -48831 1254631 3183971 4322856 3072740 -144187 -3258298 -5194661
8489 -5194661 -6705136 -8187745 -8358471 -6254129 -3230911 -1285670 -161544 1921883
8481 1921883 4869896 6212827 4601892 1858819 268417 -662145 -2920817 -6263520
8473 -6263520 -7813263 -5519272 -490574 4494580 7622694 8829782 9095866 9504617 10159950
8464 10159950 9703658 6859387 2673721 -120732 -478035 -197205 -796467 -992380 1050972
8455 1050972 4392904 6368298 6050834 4477821 2243722 -480915 -1964205 -136066
8447 -136066 3668122 5174379 2523052 -1477257 -3798010 -5217463 -7968785 -11765940
8439 -11765940 -14619184 -15758268 -15267322 -12601894 -8336121 -5741908 -7062041 -9169935
8431 -9169935 -6908857 -636434 3675042 2640041 -313595 -707512 721076 482377 -1575112
8422 -1575112 -2291614 -245460 2552608 4054941 4660504 5641598 6912564 7375983 6592099
8413 6592099 5224895 3999853 2717961 670800 -1895677 -3431882 -3054149 -2260921 -3131129
8404 -3131129 -5034557 -5224611 -3043633 -1050996 -841338 -375903 2383707 5438792 5360654
8395 5360654 2567078 705277 1347974 2598473 2968985 3265385 3860375 3280603 1007092
8386 1007092 -950780 -1142962 -1202374 -3177369 -6012445 -6996123 -5588327 -3465121 -1427305
8377 -1427305 1322796 4851852 7621767 8492671 7996291 6935139 4991630 1652116 -2227629
8368 -2227629 -4735869 -4739138 -2986096 -1258225 -433294 417906 2583047 5482576 6912345
8359 6912345 6001074 4784902 5686889 8286482 10144354 10311106 10057038 10004914 8648354
8350 8648354 4775975 -86528 -3021115 -2792601 -566613 1788646 3050179 2744345 1084599
8341 1084599 -1057863 -2702772 -3355009 -2973899 -1885965 -1032521 -1513017 -3193429 -4431849
8332 -4431849 -3960675 -2365265 -831189 692275 2727036 4399355 4203393 2492626 1292213
8323 1292213 1307033 990498 -642112 -1982773 -850421 2606894 6189903 7918722 7038238
8314 7038238 3839620 -161336 -2604163 -2234874 -130743 1915185 3405200 4378478 3782324
8305 3782324 607071 -3828092 -6848448 -7732227 -8112175 -8902083 -8938788 -7361072 -5355960
8296 -5355960 -4394755 -4293551 -4263960 -4537503 -5535054 -6472226 -6267327 -5117787 -3847756
8287 -3847756 -2366849 -193290 2003146 2926104 2611957 2527863 3590171 5085470 5615592
8278 5615592 4263320 944853 -3362099 -6688989 -7399742 -5757410 -3497299 -1719838
8270 -1719838 67142 2647286 5605619 7612802 7917353 7273729 7311121 8749989 10268703
8261 10268703 9802426 7210517 4681301 3827853 3539002 2009831 -47807 -100774 2561332
8252 2561332 5675643 6650830 4905688 1575797 -1457978 -2133936 298439 3799120 5239659
8243 5239659 4142564 2960825 3091251 2896356 910964 -1353936 -1880905 -1549715 -2533209
8234 -2533209 -4552902 -5459918 -4816625 -4114266 -3760592 -2806430 -1882793 -3317991 -7243197
8225 -7243197 -10264462 -9689572 -6998370 -5236023 -4724357 -3675834 -1894741 -1179362 -2172478
8216 -2172478 -3178536 -2751071 -1768094 -2014081 -3789685 -5913982 -7513581 -8829245 -10205874
8207 -10205874 -10881219 -9288065 -4792960 1065700 5677589 7916627 8964006 10164390
8199 10164390 10939931 9907478 7502640 5920676 6226740 6886446 5827074 2962879 -98666
8190 -98666 -2052627 -2672227 -2180001 -966465 163104 388908 -277526 -1061184 -1350889
8181 -1350889 -1050578 -83720 1689443 3766228 4843231 4012188 2014531 773584 1378911
8172 1378911 2686569 2323596 -704483 -4729693 -7199649 -7482300 -7096335 -7180916 -6958111
8163 -6958111 -5352158 -2983468 -1302664 -457141 490131 1567483 1786806 1104331 780730
8154 780730 1234945 1081208 -773529 -3301262 -4706088 -4666704 -4075144 -3185670 -1159787
8145 -1159787 2772551 8274888 13544033 15785147 13402526 8584633 6141256 8114540
8137 8114540 10791566 9214164 3800553 -121073 831286 4512143 7081163 7653227 7613232
8128 7613232 7445228 6488579 4949854 4153280 4729225 5647502 5256740 3024455 502311
8119 502311 478311 4291779 9851831 13339688 12991327 9942317 5458802 -359278 -6316515
8110 -6316515 -9232656 -7503965 -3820914 -1890591 -1677492 -542634 1771222 2446156 -4991
8101 -4991 -3532398 -5590562 -6099726 -6318963 -6659858 -6876802 -7046095 -7171828 -6794707 -5857242
8091 -5857242 -5074949 -4875499 -4982941 -5431528 -6593333 -7659895 -6836494 -4093422 -2013955
8082 -2013955 -2394781 -3484041 -2475254 396725 2383994 2083720 416188 -1995319 -5900498
8073 -5900498 -11277706 -16138147 -18501208 -18249328 -16264378 -13082416 -9395950 -6672436
8065 -6672436 -5875275 -6129765 -5854725 -4966326 -4955864 -6808598 -9607462 -11315081 -10542805
8056 -10542805 -7636251 -4380171 -2479579 -1993829 -1462775 182168 2294201 3546657
8048 3546657 3726555 3665747 3750142 3600445 3239377 3344115 3791584 2963815 -482843 -5545927
8038 -5545927 -9518400 -10757562 -10215491 -10082358 -11307187 -12634696 -11949679 -8559569 -4174186
8029 -4174186 -1374546 -957669 -1166854 162771 3173671 6168871 7637169 7243542 5263676
8020 5263676 2313084 -311864 -1293612 -706560 267759 1366138 3628709 7014825 9131692
8011 9131692 7874556 4414211 1772166 826063 -391467 -3270471 -6271704 -6750281 -4008480
8002 -4008480 165123 3209994 3582086 1680418 -447786 -958678 -110996 402400 170195
7993 170195 877108 3719015 7175102 8538327 7013089 4177765 1837722 578001 233896
7984 233896 617845 1490903 2418584 2831582 2065860 -206806 -3077882 -4539591 -3524185
7975 -3524185 -1581532 -1486582 -4092454 -7423876 -9059891 -8652620 -7823799 -8196992 -9871264
7966 -9871264 -11441083 -11266612 -8946265 -5618636 -2711641 -637999 1045707 2705198
7958 2705198 4454244 6452254 8532990 9828140 9677913 8702399 7970069 7317573 5763210
7949 5763210 3590040 2517350 3334951 4741180 5272468 5163265 5340587 5655000 5317789
7940 5317789 4321848 3133257 1462900 -1318841 -4691163 -7096346 -7641016 -6785367 -5310537
7931 -5310537 -3546209 -1847917 -982523 -1483605 -2920409 -4107822 -4025027 -2684801 -1257421
7922 -1257421 -950524 -1397555 -680611 2360860 6300024 8533450 8242461 6855754 5696660
7913 5696660 4605137 3348938 3006272 4744402 7828502 10008768 9842074 7852843 5389573
7904 5389573 3088641 757907 -1769575 -4197081 -6021528 -6775764 -6053866 -3908510 -1515798
7895 -1515798 -713836 -1975977 -3276042 -2323645 64283 564749 -1995577 -4529841 -3880688
7886 -3880688 -1448988 -1038188 -2942128 -3412159 -406791 3225663 3766506 1458366 -557299
7877 -557299 -399913 1427696 3728122 5280901 4673958 1565369 -2239137 -4632734 -5661110
7868 -5661110 -6514064 -6792811 -5017974 -1722939 307068 -499104 -2540502 -3203159 -1541910
7859 -1541910 1731087 5445730 8286857 8948670 6866453 2493812 -3046580 -7869035
7851 -7869035 -9530408 -7053362 -2668087 283636 1248995 2250178 3721445 3369925 163263
7842 163263 -3440353 -5122022 -6026151 -7937587 -9232243 -6902890 -1597655 2598227 3251869
7833 3251869 1751696 389853 -100104 268111 1533034 2932629 3147976 2195323 1520266
7824 1520266 1676062 1581009 670807 -7818 277264 624084 227683 -53583 808801 2102846
7814 2102846 2322857 1217907 -295106 -1550174 -2332319 -2314820 -1516820 -976893 -1932457
7805 -1932457 -4455579 -7504392 -9926721 -10875613 -9935595 -7692511 -5611457 -4444905 -3268023
7796 -3268023 -1018040 1585050 2866303 2622158 2383346 3190865 4302844 4406924 3099691
7787 3099691 762041 -2055269 -4432409 -5044193 -3378894 -859494 135814 -1356718 -3998508
7778 -3998508 -5845786 -6358325 -6236384 -5841653 -4810100 -3169143 -1693150 -796148 -184349
7769 -184349 -152517 -1829282 -4968994 -6890750 -5572310 -2928545 -2614847 -4885963 -6369809
7760 -6369809 -5305463 -4030259 -4924066 -6590998 -6306128 -4306597 -3015322 -3181695 -3526602
7751 -3526602 -3698569 -4814318 -6757405 -7340018 -5193949 -1984705 -616428 -1963875 -4201070
7742 -4201070 -5085236 -4418923 -4087428 -5459306 -6973995 -5379107 118780 6088782 8301931
7733 8301931 6022861 1788329 -1976264 -4458400 -5475244 -5192474 -4730570 -5159823 -5783240
7724 -5783240 -5100932 -3525382 -3277512 -5224121 -7539417 -8026919 -6300136 -3363122 -725360
7715 -725360 -271921 -2914734 -6478227 -6962124 -3265005 1119496 2684869 2411295 3473517
7706 3473517 5841010 6243859 3483659 751475 1317809 4041662 5245672 3935962 2593604
7697 2593604 2646222 1861485 -1976002 -6693068 -8065891 -6097492 -5458001 -8546980 -11492802
7688 -11492802 -9653515 -4477414 -1244590 -1535102 -2159615 -1129435 -161584 -391389 155986
7679 155986 2847732 5612543 6184831 5421194 4985540 4305572 2599088 1701394 3688825
7670 3688825 7182540 9041081 8570555 7265373 5696922 3822040 3178239 5008595 6739568
7661 6739568 4343784 -1502321 -5460910 -4545236 -1388386 770480 2529320 5390443
7653 5390443 7669965 6785563 3844423 2558707 4228039 6600980 7551450 7387918 7160372
7644 7160372 6772587 5703311 4358655 3763331 4369298 5610022 6371234 5817437 4060329
7635 4060329 2036995 600347 -11043 296878 1755530 3950221 5411978 5021072 3612754
7626 3612754 3167258 4303886 5476450 4957014 2880370 896489 360390 1305441 2695690
7617 2695690 3193009 2228078 1068957 2326894 7160394 12937187 15054702 11752283 6038912
7608 6038912 2014572 451749 -610848 -1986145 -2323243 -861045 1136252 2454744
7600 2454744 3580468 5210873 6643630 6879164 6114953 4952976 3249779 957334 -1018723
7591 -1018723 -2067435 -2825819 -3574787 -3088542 -837839 1035084 203561 -2398623 -4063042
7582 -4063042 -4367837 -4899126 -5419268 -3698715 304911 3174239 2153158 -1714670 -5526341
7573 -5526341 -7443428 -6871458 -4184952 -1495187 -1324984 -3025215 -2749995 1335032 6090662
7564 6090662 7670052 6522731 5570444 5339379 4169869 2129387 1129138 1215715 53219
7555 53219 -3111179 -5616416 -4787319 -1337572 1861308 3102353 2790571 1998735 1188310
7546 1188310 29759 -2079470 -5049757 -7527039 -7913018 -6225889 -4326972 -3919803 -4780543
7537 -4780543 -5275665 -4167849 -1519653 1782168 4741007 6431471 6053422 3440316 -418189
7528 -418189 -3891633 -6079858 -7228123 -7404697 -5546772 -871531 5192595 9795190 11378414
7519 11378414 10502840 8187362 4977817 1783996 -85503 -347897 87551 706895 1681222
7510 1681222 2414979 1810339 498048 586613 2347412 3512848 2964958 2426591 2833948
7501 2833948 1928480 -1996550 -6446007 -7875782 -6544223 -5068889 -3946672 -2049869
7493 -2049869 -162113 -185586 -1677781 -2824437 -3992319 -6421539 -8226769 -6251316 -1694667
7484 -1694667 902316 627697 1139218 3731770 4901066 2931666 1679966 4432968 8280454
7475 8280454 8538774 5482944 2678195 1306462 311996 155799 2129073 4994557 6077331
7466 6077331 5097274 3792576 2490093 192615 -2444411 -3290132 -1811426 494543 2506310
7457 2506310 4120682 4945080 4531834 3485664 2461160 910222 -1247594 -2106467 -491118
7448 -491118 1182179 -133024 -3351732 -4824893 -3804372 -2603631 -1832670 327857 3868984
7439 3868984 6185535 6514505 7305013 9872784 12224500 12662806 12151889 11464128 9394991
7430 9394991 5868620 3569394 3962693 4452798 2112753 -2185906 -5864029 -8276287 -9415985
7421 -9415985 -7628199 -2337581 2854222 3915115 2172237 2257569 4763190 5325902 1650367
7412 1650367 -2700583 -3383019 -1063852 237523 -1345628 -4087167 -5742954 -5847299 -5012909
7403 -5012909 -3638337 -1993282 -829274 -1036319 -2513243 -3836615 -3612512 -2039664 -455846
7394 -455846 587576 1727722 3047133 3325246 1863660 -158766 -1271746 -1637299 -2219032
7385 -2219032 -3081605 -3892880 -5049531 -6593843 -6957584 -4858473 -1834361 -642033 -1463034
7376 -1463034 -2120705 -1990254 -2843697 -5114199 -6244802 -4515045 -2251890 -2786711 -5454321
7367 -5454321 -6229169 -3179947 966153 2422174 1007033 -5856 1806985 5125865
7359 5125865 6840167 6205012 5749882 7598360 10108517 9634319 5215143 -176504 -3292501
7350 -3292501 -3832483 -3224955 -1843093 781597 3654989 4337899 1904296 -1428195 -2696699
7341 -2696699 -1599904 -332143 -218307 -53389 1511629 3400479 3631636 2612378 2610135
7332 2610135 3915862 4209684 2743450 2365395 5158437 8310348 7495297 3089844 -530874
7323 -530874 -1466782 -2240202 -4677439 -6635909 -5700982 -3228962 -2271296 -3413150 -5029965
7314 -5029965 -6183997 -6816175 -6081324 -3079457 1012040 3747643 4493017 4861348 5750010
7305 5750010 5673184 2988494 -1242351 -3802929 -2707915 621268 2986235 3020574 2384292
7296 2384292 2962785 3997769 3484314 1707231 1032813 1922931 1757361 -1100827 -4404799
7287 -4404799 -5267679 -4564945 -5483335 -8574930 -10988500 -10601827 -8534567 -6990294 -6442173
7278 -6442173 -5818320 -4248088 -1759505 1060008 3416695 4593782 4271473 2752565 1179272
7269 1179272 1331511 4120931 7819685 8980295 6118086 1598275 -1124009 -1212876 -340525
7260 -340525 35050 -171368 -413302 6583 1436766 2656314 1437253 -2022560 -3808943
7251 -3808943 -961607 3760188 4889024 1442201 -2276868 -3073134 -2459970 -3055379 -4799825
7242 -4799825 -6287596 -6957929 -6166104 -2695184 2663487 6258723 5678328 2956776 1356778
7233 1356778 632198 -1664403 -5271626 -6903730 -4950661 -1730292 -174742 -225243 281727
7224 281727 2308956 4483177 4991960 3738504 2290193 1994302 2782213 4120320 6268697
7215 6268697 9397320 11936362 11661614 8789238 6213874 5815179 6143104 4972672 2694643
7206 2694643 1520950 2279524 3745015 4689824 4992305 4801926 3998940 2801864 2082647
7197 2082647 2698793 4661430 6836647 7484792 5691699 2457973 -251307 -1623234 -2371291
7188 -2371291 -3067503 -3352445 -2998637 -2367948 -1445909 145690 1836116 2491485 2526602
7179 2526602 3608182 5589101 6097479 4310840 2655655 3146551 4502460 4865800 4800624
7170 4800624 5019598 3693650 -504808 -4561708 -4263545 -223414 2960759 3011936 1806122
7161 1806122 1204971 814316 193881 -138931 -506100 -1880191 -3507879 -3700785 -3186178
7152 -3186178 -4262868 -6217317 -5477795 -1459549 1671229 907476 -1560026 -2521857 -2534930
7143 -2534930 -3542384 -4618369 -3732180 -1876167 -1709994 -3010638 -2902365 -462197 1803643
7134 1803643 1441467 -1184966 -4076508 -5816221 -5997580 -4698899 -2407218 -174833 632110
7125 632110 -739669 -3232617 -4223818 -2227506 835257 1655760 -203932 -2034221 -2084166
7116 -2084166 -1382027 -752431 969096 4001061 5675691 4036352 1335769 1041131 2728203
7107 2728203 2935776 365759 -2575587 -3247364 -1491834 1073192 2624153 2131414 372997
7098 372997 -343836 1168944 3240852 3605278 2365064 1006086 -328532 -2368243 -4530506
7089 -4530506 -5680914 -6297860 -7285596 -7366666 -4668363 -548488 1459177 728522 270224
7080 270224 1694144 2753784 1311392 -1158491 -1945093 -781173 757273 1735346 1864573
7071 1864573 547134 -2100329 -4303101 -4497980 -3399712 -2670357 -2260542 -687986 2468883
7062 2468883 5908132 8378468 9857721 10798633 11185454 10770715 9750470 8701726 7776307
7053 7776307 6275180 3628973 927615 497472 3107338 6421826 7480470 6020585
7045 6020585 3800153 1413041 -1842295 -5085567 -5768091 -3465253 -1250431 -1649040 -3153855
7036 -3153855 -2636505 280167 3268593 4579914 4169645 2298226 -715917 -3390793 -3671840
7027 -3671840 -1113243 2655844 5748253 7264022 6895058 4766537 2046800 471354
7019 471354 561546 1110817 1085763 1357709 3595797 7531875 10239023 8823507 3684758
7010 3684758 -1691023 -4610220 -6077589 -8725656 -12289192 -13073819 -8739738 -1950424
7002 -1950424 2476210 3189629 3006850 4098425 4802006 2378623 -2729333 -7301547 -9349133
6993 -9349133 -9714906 -9582413 -8552241 -6376596 -4838707 -5712813 -7593607 -7264400 -4397055
6984 -4397055 -2350600 -3296035 -4968035 -4112886 -1154324 1136396 2209408 3794849 5868473
6975 5868473 5996515 3393935 591265 -416166 -1215128 -4198335 -8560937 -11382261 -11670839
6966 -11670839 -10964394 -10158843 -7995119 -3429301 1937260 4997289 4357185 1545142 -1155868
6957 -1155868 -3354049 -6183432 -9515222 -10968351 -8578714 -3434824 1556566 4683605
6949 4683605 5757676 4414132 462128 -4140822 -6114532 -4472801 -1664990 -542969
6941 -542969 -1728638 -4253517 -6796496 -7690482 -5880019 -2934229 -2135899 -4339930 -6557464
6932 -6557464 -5921661 -3211890 -1029437 -401247 -965533 -2748246 -5589120 -8018418 -8682433
6923 -8682433 -7935689 -6508416 -4034923 -728562 1087260 -458292 -3786684 -5795502
6915 -5795502 -5829967 -5388571 -4906690 -3632861 -2130773 -1989668 -3070985 -3660013 -3487698
6906 -3487698 -4118004 -6018021 -7544752 -7289016 -5437424 -2628141 352568 1502985 -1234330
6897 -1234330 -6864208 -11471107 -12451851 -10938267 -9289950 -8067323 -6535039 -4474463
6889 -4474463 -2147060 461749 3279225 5760186 7462882 8258634 7802658 5932189 3755836
6880 3755836 2944884 3550406 3864070 2869073 1556783 1482692 3292935 6759779 10616284
6871 10616284 12218652 9533048 4216531 679930 954790 2280137 1075626 -2355061
6863 -2355061 -4666624 -3733499 -412253 3126965 5331642 5965909 5972927 6390904 6969931
6854 6969931 6550517 5028948 3673479 2989635 1845902 -294339 -1758562 -636770 2717885
6845 2717885 6391173 9030878 9986703 8500415 4531427 -124166 -3062776 -3472996 -2230134
6836 -2230134 -431038 1104248 1607067 1045974 728500 2031803 4717833 7395467 9229356
6827 9229356 10208155 10212675 9049683 7212673 5456551 3633505 988938 -2226346 -4318184
6818 -4318184 -3770848 -1002932 1738877 2304249 623973 -1296415 -1666076 -923417 -838514
6809 -838514 -2004803 -3394930 -4243455 -4779098 -4781326 -3153741 171839 3324030 4560595
6800 4560595 4188918 3551159 3203867 2935435 2366360 666908 -2891539 -7005995 -8518418
6791 -8518418 -6064422 -2280507 -722891 -1662048 -2601661 -1904675 3828 2198786 3938600
6782 3938600 4222877 2640367 593848 87112 1293429 2539956 2455666 1001555 -1182179
6773 -1182179 -3237792 -4319844 -4409248 -4320727 -4114621 -2723735 -251904 1135385 502640
6764 502640 485670 3544693 7203905 6464233 577009 -5930522 -9118706 -9281178 -8243138
6755 -8243138 -6425871 -4083803 -2772480 -3592061 -5483085 -6660688 -6534302 -5319374 -3130487
6746 -3130487 -411249 1842690 2972583 2878506 1338117 -1527169 -4249755 -5316358 -5445467
6737 -5445467 -6464800 -7909729 -7301603 -4174356 -991816 744057 2375444 4911808
6729 4911808 6984156 7634675 8238935 9584599 9838285 7913559 6208814 6954758 8067504
6720 8067504 6066846 1482613 -2117772 -3184874 -2729460 -1002337 2283511 4901187
6712 4901187 3633099 -635161 -3312682 -2629331 -2014098 -4354489 -7441839 -7667515 -5563925
6703 -5563925 -4624707 -6096397 -7751805 -7262377 -4630457 -1461786 688269 1431050 1907828
6694 1907828 3426360 5096023 4212448 205634 -3520450 -3837951 -2581474 -4005164 -8177829
6685 -8177829 -10524491 -8609855 -5722667 -5639063 -6902408 -5659565 -2255792 -731641 -1967970
6676 -1967970 -1765375 2548801 7154272 6411922 462608 -5167715 -6629372 -5088040 -3124257
6667 -3124257 -1297912 535395 1400312 769541 98280 670616 1228521 -54314 -2167250
6658 -2167250 -2300777 -58808 1771392 1073232 -1092282 -2683454 -3483888 -4264817 -4513095
6649 -4513095 -2990371 -239725 1296694 198800 -2085525 -3120279 -2421204 -1446261 -1014386
6640 -1014386 -167209 1907876 4106379 4831942 4486446 4831134 5866802 5219374 1468244
6631 1468244 -3404550 -6132704 -5663409 -3279513 -390832 1957972 2199000 -660502 -4841075
6622 -4841075 -6885542 -5661467 -3420732 -2089186 -622707 2415220 5589123 6351097
6614 6351097 5034247 4379137 5267347 5661183 4397190 3422743 4728161 7051833 7758495
6605 7758495 6800701 6461276 7553883 8201707 6808534 4390635 3102616 3683924 5155281
6596 5155281 6075483 5411195 3091999 453154 -690535 -145089 288058 -720207 -2099043
6587 -2099043 -1954152 -351351 666071 -530674 -3704322 -7263907 -9289921 -8547993 -5577232
6578 -5577232 -2480802 -770380 65311 962011 1181121 -667369 -4105556 -7012573 -8100231
6569 -8100231 -7585394 -5810162 -3125691 -945497 -690977 -1430608 -725227 1668785 3060948
6560 3060948 1547308 -1518858 -3659673 -3950155 -2586932 205448 3457006 5307112
6552 5307112 4998649 3710856 2449575 846079 -881460 -980853 1059181 2791261 2037845
6543 2037845 186521 -40179 1379697 2487205 2814678 3281371 3423637 1751584 -1216661
6534 -1216661 -2925557 -2067206 172016 2222885 3515599 3749815 2812907 1629677 1336528
6525 1336528 1512978 864306 -457979 -980463 -230425 859665 1755511 2778770 3976035
6516 3976035 5229786 6944639 8667735 7964109 3436603 -1803387 -3091024 -603219
6508 -603219 822635 -1235637 -3723806 -3359796 -1182001 167949 426124 467786 -235636
6499 -235636 -2221058 -4122446 -4637425 -4673495 -5355506 -5793302 -5160739 -5039192 -6962028
6490 -6962028 -9272888 -9362425 -7753573 -6968789 -7314736 -6876082 -5119259 -3456024 -2389346
6481 -2389346 -940007 959443 2083583 2240699 2678446 3740129 4129430 3002285 1192884
6472 1192884 95425 609794 2867066 5455369 5595008 2146323 -2199717 -4148782 -4502418
6463 -4502418 -6466728 -9568606 -9292262 -3864553 2389324 4603321 3296996 2262737
6455 2262737 3003702 4207432 5054007 5891010 6287086 5100212 2422987 -405376 -2468891
6446 -2468891 -3427606 -2712565 -488015 1138530 78660 -2632268 -3761214 -2079643 315848
6437 315848 1196866 686634 -177305 -1479399 -3775974 -6609747 -8770301 -9218428 -7159622
6428 -7159622 -2470808 3009203 5885434 4246040 -456186 -5469430 -9449888 -11846772
6420 -11846772 -11291158 -7177046 -2107108 180361 -466675 -690068 1024047 2104145 523334
6411 523334 -1242246 365943 4421741 6472170 4317581 32571 -3489836 -5286066
6403 -5286066 -5402315 -3770693 -856491 2241424 4842521 6525119 6224381 3566702 883273
6394 883273 1137523 3468588 3771126 579300 -2808031 -3518120 -3029884 -3556419 -3720962
6385 -3720962 -1245868 2449363 4278333 4587353 6108115 8606181 8856552 6102877 3464992
6376 3464992 2915106 2410150 -372078 -4274047 -6500314 -6204681 -4621036 -3190521 -2844897
6367 -2844897 -3702074 -4402103 -3219601 -815395 -263947 -3140638 -7042288 -8322631 -6114985
6358 -6114985 -2433408 597136 2318121 3181591 3995136 5122299 5987356 6101629 6567677
6349 6567677 8986671 12475890 13746302 11236028 7435650 5712039 6278550 6842138 6015115
6340 6015115 4409667 3142037 2712543 2861724 2570653 890432 -1588317 -3225198 -3911795
6331 -3911795 -5491802 -8524632 -10491125 -8890086 -4554873 -97677 3414598 6206815
6323 6206815 7735296 7380736 6211664 5622669 4965852 2828962 -179497 -2408187 -4081734
6314 -4081734 -6394053 -8276132 -7311247 -3922168 -1439060 -1419960 -1847381 -793136 994922
6305 994922 2346941 3807354 5837675 7013387 5864129 3098362 546623 -906430
6297 -906430 -1252998 -572576 566915 1077963 615889 -221100 -1357932 -3251837 -4971780
6288 -4971780 -4502773 -2033296 -659652 -2256331 -4766304 -5465956 -4856512 -4935064 -5343666
6279 -5343666 -4114253 -1253228 1223852 2359943 2834904 2813321 1749689 340892 249998
6270 249998 1554178 2616814 2914423 3896579 6374907 9005145 10295775 10458377 10190942
6261 10190942 9094163 6672066 3935532 2550533 2694977 2822403 1539416 -946298
6253 -946298 -3299261 -4542075 -4852714 -4927993 -4840944 -4076006 -2801262 -2248601 -3116353 -4238168
6243 -4238168 -3827414 -1700353 677575 2054417 2333615 1971378 1534630 1672699 2422120
6234 2422120 2663455 1331261 -1069912 -3347840 -5624062 -8719580 -11525330 -11076773 -6261358
6225 -6261358 -110850 2749819 393977 -5041898 -9409897 -9670801 -6127337 -2212501
6217 -2212501 -1288270 -3318152 -5539884 -6332417 -6786452 -8021131 -8903738 -7787706 -5180248
6208 -5180248 -3112073 -2558647 -2757956 -2558894 -1363180 829760 3347508 5060895 5260217
6199 5260217 4027308 1698809 -1090185 -2756278 -1765687 1062090 2889067 2433491 1504307
6190 1504307 1862935 2623652 2499954 2455051 3539624 3930714 1479133 -1851388 -1826995
6181 -1826995 1901590 5098941 4901892 3019032 1951113 1418384 430753 104836 1957459
6172 1957459 5204762 7980714 9846134 11088944 10907682 8593864 5659338 4463042
6164 4463042 4942098 4613534 1908659 -1916377 -4283034 -3648946 -466882 3215814 5134837
6155 5134837 4527498 2506516 593835 -478828 -424291 745139 1835598 1046243 -1322450
6146 -1322450 -2236353 377991 4685679 7550051 8608697 9279377 9047097 6212705 2118905
6137 2118905 974755 4416723 9070548 10862389 9464092 7155287 5496797 4765185
6129 4765185 4820775 4782390 3340508 968501 216038 2014089 3335632 884143 -4042933
6120 -4042933 -6957777 -5868354 -3027458 -1162971 -504440 -6860 705517 1559436 2590858
6111 2590858 3356924 2991586 1608694 581803 718775 1167437 944465 723319 2154172
6102 2154172 5733215 9931881 12278196 11183835 7161975 2409629 -1162621 -3401352
6094 -3401352 -5066042 -6137646 -6011942 -4942426 -3911007 -3273500 -2995994 -3816906 -5994573
6085 -5994573 -7039005 -3780661 2303522 5125225 1628245 -3400660 -3364804 1430825 5097038
6076 5097038 4950303 4195943 5463272 6465674 4327731 670445 -725743 698832 2167491
6067 2167491 1730806 28833 -1509846 -2061284 -1251321 576403 1945960 1463143 -571082
6058 -571082 -2662551 -3788554 -3621108 -1898868 1004147 3457717 4075154 3521783 3403110
6049 3403110 3711172 2950202 592365 -2227705 -4440885 -5872947 -6285648 -5236230 -3245460
6040 -3245460 -1719562 -1322521 -1494608 -1600337 -1328546 -132817 2169657 4331254 4906467
6031 4906467 4453974 4578432 4908099 3458760 192814 -2608434 -4186889 -6421674 -9823014
6022 -9823014 -11651111 -10138612 -7639567 -6898528 -6838340 -5269083 -3436966 -3914232 -5475209
6013 -5475209 -4369801 -174882 3658303 5056383 5253076 5208298 4116790 2466908 2773275
6004 2773275 5559091 7761663 7008274 4765510 3394299 2740912 1845608 1655636 3448782
5995 3448782 6227766 8047128 8575041 8304376 6802993 4082406 2273304 3281927 5722429
5986 5722429 6749646 6183279 6134116 7005853 6762799 4417771 1707608 599184 1044187
5977 1044187 1829159 2021031 1074887 -870472 -2161422 -555017 4158754 9384863 12135530
5968 12135530 11494712 8556773 5004169 2170305 666926 437583 1384293 3532063 5931745
5959 5931745 6266885 3096691 -1844304 -5203239 -5740924 -4923645 -4072101 -3065022 -2081692
5950 -2081692 -2241282 -3564237 -4312110 -3539668 -2558131 -2610288 -2817036 -1988915 -945856
5941 -945856 -1186742 -2405836 -3240702 -3595364 -4251557 -4855538 -4422084 -3518148 -3724465 -4754837
5931 -4754837 -4240864 -1112733 2510762 3845270 2704180 1236083 1180052 2306152 3142638
5922 3142638 2522203 612659 -1183748 -1581081 -824859 -345693 -877439 -1563985 -1283927
5913 -1283927 -191666 708306 1105019 1723580 3145440 4844739 5549293 4303505 1203410
5904 1203410 -2539416 -5132588 -5196614 -2753684 609855 2833429 2952564 1585447 -258904
5895 -258904 -2538459 -5743914 -9214236 -10962760 -9878008 -7302093 -5307279 -3886174
5887 -3886174 -1374737 2261659 4360075 2793039 -1049176 -3994322 -4970972 -5344538 -5726509
5878 -5726509 -4745375 -1788160 1010595 1266220 -176020 -172023 2536630 5806797 7013561
5869 7013561 5925025 3971309 1924027 -562310 -3705230 -6906647 -9166407 -9665671
5861 -9665671 -8225968 -5576210 -2755197 35646 3289518 6534046 7949595 6702351
5853 6702351 4708247 4476127 5605456 5216664 2070901 -1396099 -1931396 752593 3946290
5844 3946290 5057591 3943831 2356980 1684049 1580331 1054238 584400 1904783 5014052
5835 5014052 6891173 4964852 866236 -1642070 -1953313 -2875374 -5390035 -6597826 -4379195
5826 -4379195 -971410 584004 1141422 3526421 7436884 9475341 7625276 2983096
5818 2983096 -2336694 -6245731 -6278013 -1577943 4400580 6402758 3512281 98390 -216701
5809 -216701 1410406 2414489 3111018 5047256 7234347 7142909 4629982 2219244 1614003
5800 1614003 2020678 2086425 1810348 2036231 3045438 4095110 4072016 2776847 1672882
5791 1672882 2569351 5189119 7150202 7018907 6002388 5513130 4643197 2011821 -978128
5782 -978128 -1227327 1890588 5683387 7693153 8001440 7366869 5094821 268109 -5852996
5773 -5852996 -10122477 -10327562 -7303756 -4178258 -3348048 -4024707 -3281579 42454 3435461
5764 3435461 3824293 1738939 652006 2544312 6019578 8766881 9827620 9121542 6978134
5755 6978134 5030452 5471580 8040978 9475753 7528317 4028911 2181068 2169980 1685643
5746 1685643 -28364 -1155015 -279329 1869834 4093499 6176969 7857948 8042727 6384295
5737 6384295 4590376 4647798 6074462 6260571 3721291 -26451 -2370356 -2632525 -2269080
5728 -2269080 -2350907 -2136891 -673415 1316818 2334525 2268417 2195951 2221629 1198382 -1032358
5718 -1032358 -2743412 -2514295 -1058786 69208 460756 523430 283964 -204828 -158180
5709 -158180 823576 1546994 533843 -1812985 -3525178 -3224057 -1031771 2027683 4437277
5700 4437277 4782868 3374537 2678021 4647219 8167463 10655428 11505324 12080390 12857397
5691 12857397 12832412 11653513 10135731 8557031 6617931 5240888 6000179 8275822 9413578
5682 9413578 8493991 7504738 7722429 7470144 5086982 1883847 140207 -85454 -110952
5673 -110952 -104348 457846 1008419 789469 756098 2472151 5463673 7357101 6395995 2678611
5663 2678611 -2333729 -6258844 -6785873 -3944576 -713190 103944 -1205745 -2741497 -3875595
5654 -3875595 -4634464 -3753137 -314039 3454045 4197167 2111827 497562 510495 -200763
5645 -200763 -2717105 -4202324 -2104861 1651039 3328901 2598771 2342159 3922144 5205449
5636 5205449 3623037 -522566 -4463337 -5734414 -4031906 -995693 1138946 832758
5628 832758 -1960934 -5563960 -7397374 -6084198 -3045281 -1055864 -857087 -514491 1182386
5619 1182386 2529529 1753934 359471 1125220 3787622 5564496 5524605 5405176 6002828
5610 6002828 5873816 4308097 2686798 1897416 1212021 950597 3273942 8364358 12383169
5601 12383169 11704442 7430867 3517766 2079525 2780374 5127578 8490386 10846713
5593 10846713 10451380 8535808 7905163 8844652 8656557 5650936 1745843 312194 2404791
5584 2404791 5627594 6366598 3302013 -979082 -2438395 34116 3669676 5553161
5576 5553161 5607862 4967708 3535067 1143806 -570629 -84195 1218550 825249 -865028
5567 -865028 -997232 1277640 3361477 2650725 -720575 -5001234 -8577362 -9919705 -7799536
5558 -7799536 -2885410 1945200 3953339 2817406 346716 -1471753 -2121610 -2860301 -5146331
5549 -5146331 -8243008 -9248454 -6576179 -2376109 138922 849284 2075359 4363818
5541 4363818 5485514 3805954 396208 -2643558 -4027160 -3175294 -388608 2307881
5533 2307881 2483879 236056 -1805258 -1839672 -511035 1133154 3093401 5116193 6145689
5524 6145689 6145135 6516488 7623655 7850193 6337401 4692847 4506202 5009754 4882471 4670240
5514 4670240 5450617 6440833 6008610 4173470 2254795 777502 -536497 -1355383 -1089235
5505 -1089235 -300092 -217498 -1015988 -1761105 -1824136 -1389317 -949252 -1102449 -2201093 -3385440
5495 -3385440 -2921523 -610413 1156118 247549 -2019980 -2201703 1069065 5642195 8510425
5486 8510425 8650311 7140813 5418723 3694656 913479 -3404505 -7423173 -8322802 -5721922
5477 -5721922 -2185851 433451 3223086 7343132 10972685 11541094 9739532 8658063
5469 8658063 9549017 10926745 11445047 11098168 9713209 6968048 4274726 4037059 6153744
5460 6153744 7466536 5798055 2702623 993222 1091505 1219719 147167 -1570785 -2524229
5451 -2524229 -1740608 501263 2616552 2932581 1197550 -1631852 -4857132 -8173969 -10499068
5442 -10499068 -10317753 -7675721 -4365774 -1551246 1288666 4291177 5803065 4463515
5434 4463515 1468158 -853879 -1915268 -2702162 -3310251 -2569161 -340317 1419102 775697
5425 775697 -1692923 -3257548 -1745474 2357844 6353278 7741335 6324665 4025838
5417 4025838 2702293 2367242 1688008 -80560 -2151426 -3291589 -3454239 -3788715 -4862144
5408 -4862144 -5399108 -3558565 533596 4385608 5694014 4600080 2870548 1627429
5400 1627429 809476 282547 259838 740350 1508056 2561281 3640288 3679481 2042050
5391 2042050 195816 573470 3331775 5679210 5224805 2856431 1295714 1623590 2403641
5382 2403641 1925072 267541 -1049999 -951365 -28283 160863 -1006592 -2337869 -2168475
5373 -2168475 -218945 2429898 4754892 6278292 6489110 5049524 2675886 640719
5365 640719 -852604 -2695496 -5012642 -6509129 -6213306 -4773782 -3371328 -2293274 -1261456
5356 -1261456 -344771 95258 -291350 -1872325 -4379611 -6011830 -4713984 -1104643 1426930
5347 1426930 766989 -1097487 -762340 2204070 5283878 6635480 6766601 6813885 6926515
5338 6926515 6671987 5950176 5307506 5879374 8482957 11983328 13541371 11863617 9248850
5329 9248850 8570731 9132086 8014076 5041496 3215100 3754947 4130266 2600869 1567929
5320 1567929 3710022 7091735 7501996 4475447 1533813 797792 801144 62419 -570419
5311 -570419 -453551 -1028012 -3086524 -4469459 -2999429 -81869 1302825 1007672 1156624
5302 1156624 1913182 1279637 -643634 -749134 2402976 6049035 7294520 7069606 7516058
5293 7516058 7736121 5543158 2194277 1678995 5335493 10324446 13751080 15293183 15170494
5284 15170494 12777722 8837616 6097658 5801956 5610526 3153583 -303058 -2191806
5276 -2191806 -2905871 -4682236 -7250301 -7991670 -6407225 -5173468 -5903392 -6623175 -4951231
5267 -4951231 -1724182 307680 43945 -1403561 -2774152 -3556086 -3249534 -1406010 1321805
5258 1321805 3252586 3319155 2211715 1570354 2168618 3068909 2776405 1368141 1000505
5249 1000505 3487652 7546666 9673407 8140875 4920510 2940570 2786290 3402180 4769289
5240 4769289 7656223 11084708 12516829 11169442 9042551 7658585 5877754 2653679
5232 2653679 28968 594678 2837670 2290601 -2198212 -6285486 -5646374 -1333388 2345557
5223 2345557 3465517 3438522 3456257 3095978 2628251 3825148 7195720 10409139 11117853
5214 11117853 10141420 10170586 11934465 13270378 11962745 8233781 4148049 1504310 797474
5205 797474 1581360 3023717 4067468 3710022 1822081 -245923 -538675 1465014 4024915
5196 4024915 4958952 4010692 2680667 2009194 1612538 933790 231944 -75827 2139 628019
5186 628019 2303695 4773615 6660468 6913437 5774019 3686625 504640 -3056356 -4435171
5177 -4435171 -1675884 3496861 6912620 6432828 3742692 1601749 1020517 1698326 3489645
5168 3489645 6036979 7880402 7444719 4828168 1684866 -664445 -2300124 -3811803
5160 -3811803 -4941167 -4537072 -1942316 1594876 3216549 821063 -4582229 -9333885
5152 -9333885 -10361639 -7783416 -4185827 -1881992 -1290874 -1370107 -750107 1295146 4017249
5143 4017249 5344352 3950563 1459918 1351050 4778689 8497550 8397351 4663787 1687901
5134 1687901 2576649 5479311 6367623 4041600 686907 -1757616 -3558669 -5161093 -5267524
5125 -5267524 -2512506 1842075 4617905 4226630 2218475 968529 1018688 1622475 2920642
5116 2920642 5815630 9665177 11960203 11322586 9465563 8709381 8646366 7348738 5265526
5107 5265526 5108154 7311790 8395925 5500718 467061 -2653587 -2526261 -669610 1882188
5098 1882188 5022271 7243046 6187650 2207941 -1226626 -1734779 -611417 -178991 -535412
5089 -535412 -445509 49712 -184422 -1140478 -1136897 1351926 5965697 10564857 12958299 12842203
5079 12842203 11961411 11935233 12367274 11910614 10492489 8982838 7140975 3934147 3738
5070 3738 -2293514 -1924297 -480985 195393 31549 -175112 157727 1830831 5385577
5061 5385577 9348859 10987960 9808391 8189182 7437657 5684839 1449451 -3069663
5053 -3069663 -4666800 -3394674 -1737440 -842087 16971 1159003 1945513 1962808 1126879
5044 1126879 -557173 -2034927 -1498927 727425 1479053 -910909 -3569781 -3184937 -1181616
5035 -1181616 -1170999 -2704575 -2037903 1185397 2599308 -611169 -5991300 -9767732 -11103353
5026 -11103353 -10685309 -8271167 -4189317 -1066092 -1228150 -3331669 -3749476 -893741 3345443
5017 3345443 6054113 5873932 3356387 -28782 -2801355 -3807143 -2279113 1652947
5009 1652947 6148929 8178803 5912410 427851 -5484496 -9612300 -10954534 -9509201
5001 -9509201 -6852241 -5658787 -6677693 -7113319 -4199288 483393 2935853 2467435 2297582
4992 2297582 4220373 6146368 6280577 6537601 9236865 12414224 11553487 5641495 -1058310
4983 -1058310 -4009353 -3518090 -3453870 -5547209 -6998534 -4768101 -595751 766064 -2000899
4974 -2000899 -5075072 -5024248 -2973475 -1474971 -182397 2496150 5656302 7121207 6952047
4965 6952047 6605646 5928046 4212701 2905381 3645472 4760921 3688295 1987319 3469102
4956 3469102 7620805 9643426 7551110 4653855 3895642 4068415 3257794 2090690 1500762
4947 1500762 557721 -1344524 -2730126 -2246875 -480924 1569606 3649080 5261640 6038137
4938 6038137 7338652 10470358 13237670 12118792 8382159 7625612 11941508 16954002
4930 16954002 18445433 17463443 16394081 14369071 10117746 6060610 5706238 8845845
4922 8845845 12180599 13125306 10968038 6238569 963403 -2168289 -2516536 -1866967 -1403073
4913 -1403073 -467539 1204621 2737487 4125825 6144749 7971249 8024695 7140710 7347668
4904 7347668 7863508 6511066 4484304 4711691 6221612 5940230 5119299 6935983 8659824
4895 8659824 4955703 -1111313 -465250 7435087 13264301 13100866 13211856 16382464 16394498
4886 16394498 11113834 7865150 9678179 9942655 7423831 10960004 21013823 24693265
4878 24693265 20109886 24659710 43923478 57765975 61893420 95575356 186222661 282237230
4870 282237230 293450896 202854894 91190008 36423220 32158357 28297313 10718004
4863 10718004 1841408 8193807 11475297 4418566 -148171 3604833 5929733 2465610
4855 2465610 1182759 4902410 5862376 1564639 -354416 2955253 4258595 -18673
4847 -18673 -3543696 -1748304 1481126 2605604 3727570 5605643 4963407 2168928 2530923
4838 2530923 6527036 7449567 2461183 -2290072 -1715485 659289 -232921 -2942288 -3367494
4829 -3367494 -1540723 -158035 -245130 -1574074 -3915716 -5600466 -4392510 -1376406 -176487
4820 -176487 -1298600 -1569854 11653 845355 131967 287195 1524472 699641 -2383800
4811 -2383800 -3164212 467217 4392538 4789381 3538951 3714792 4263617 3152415 1944189
4802 1944189 2895083 4270192 2653184 -1905599 -6394301 -8982601 -9896251 -9551858 -8274162
4793 -8274162 -6829823 -5466979 -3517745 -1120539 228412 -27347 -390328 321587 1130276
4784 1130276 519821 -1544356 -3982287 -5557872 -5121283 -2573479 213166 1223785 1007069
4775 1007069 1605773 3150319 3906546 3361142 2625500 2129618 1659518 2061113 3776109
4766 3776109 4549059 2434845 357312 3088640 9812922 14519111 14076723 10922399 7280937
4757 7280937 2459892 -2657986 -4262932 -1353022 2133207 3524995 4979730 8093354
4749 8093354 9876951 7629985 3543449 781444 -1175892 -3652527 -4958019 -3292471
4741 -3292471 -235752 2192255 4608177 6950069 6008214 682368 -3807904 -2091101
4733 -2091101 3528799 6434806 4816451 2396979 1665923 1610342 1567673 2590153 4724217
4724 4724217 6402473 6591217 5084974 1640226 -2658694 -4770509 -3333374 -1110003
4716 -1110003 -716089 -228133 3101884 7137442 7696833 5388727 4350152 5222727 4935832
4707 4935832 3127760 3004833 5176057 6125505 4211174 2178645 1839204 873185 -2608115
4698 -2608115 -6244441 -6936370 -5096062 -2852949 -767055 1106513 1332872 -880002 -3438894
4689 -3438894 -3700722 -1924653 -355911 52856 76551 241622 271358 128131 252279 922757
4679 922757 2054456 3172401 3253919 1494456 -1367209 -3522891 -4245091 -4303872 -3910185
4670 -3910185 -2052631 1107447 2957288 1359802 -2088675 -3578093 -1600941 1585833
4662 1585833 3130762 2946312 3320463 5858152 9565236 12017474 11936027 10073188 7643547
4653 7643547 4797324 1306070 -1951554 -3399463 -2631215 -907962 313341 541965 -48466
4644 -48466 -1019673 -1446565 -347796 1945326 3589631 3281348 2050802 1979583 3290071
4635 3290071 4055888 3365370 3378091 6550226 11378341 13212564 9933481 4654068 1418136
4626 1418136 364342 -554819 -1004870 990597 4476781 5765257 3796035 1652204 1515361
4617 1515361 1600586 -45333 -1968270 -2059236 -1173222 -1143298 -1392697 -561634 304386 -578597
4607 -578597 -2191700 -2026138 14369 2095028 4021347 7136441 11109483 13976261 15196081
4598 15196081 15584247 14292283 9331626 1850661 -3313899 -2906212 1112785 4552925
4590 4552925 5806433 6317539 7691030 9859201 11575808 11802152 10726633 9546995 9027303
4581 9027303 8689235 7896966 6922429 6089421 4824446 2670305 234273 -1991079 -4315772
4572 -4315772 -5942554 -4405274 625098 4842020 3982112 -188225 -2304645 -1071637
4564 -1071637 -163063 -1332731 -1364691 2467086 7897055 11078216 11521318 11063729 10238001
4555 10238001 8426399 6204265 5051888 5395452 6587032 8129219 9655485 10503927
4547 10503927 10402870 9790194 8686446 6347015 2843673 -244928 -1677293 -1954473 -2054327
4538 -2054327 -2064950 -2022577 -2652315 -3910088 -3948885 -1105035 3716730 7908474 9936059
4529 9936059 10273589 10143089 10376533 11176800 12052630 12010247 10295418 6952698 2747418
4520 2747418 -1016000 -2898776 -2559417 -1534914 -1621656 -2395741 -1696209 1148001 4073708
4511 4073708 4874682 3646421 1863435 376784 -572066 -465771 932345 2611124 3111778
4502 3111778 2280338 1513684 2213757 4327903 6385441 6878825 5720604 4279062 3899004
4493 3899004 4765746 6390780 8395186 10161220 10563114 9109871 6848096 5278903 5051800
4484 5051800 6415512 9571746 13207400 14211439 11007972 6082153 2877195 1273374
4476 1273374 -1022966 -3537982 -3207720 300065 3086384 2046400 -1406082 -3866463
4468 -3866463 -3752342 -1407972 2259784 5830978 7912018 8804413 10036261 11579066 11552060
4459 11552060 9416461 7194316 6522246 6705358 6711970 6749109 6642877 5089046 2091610
4450 2091610 -45653 171539 1296840 1433190 768039 68631 -1014686 -2173889 -1326935
4441 -1326935 2139368 4866675 3159895 -2017823 -6358316 -7645995 -7205264 -6445911 -4890871
4432 -4890871 -2216471 -4630 -61259 -1833782 -2744346 -1380661 321864 -726246 -4190099
4423 -4190099 -5820550 -3098199 615703 574805 -2123507 -2057633 2010387 5105818 3802905
4414 3802905 1142693 1181458 2885412 3049697 1987715 2180843 3421177 3353540 1699239
4405 1699239 529983 1052597 2755492 4840962 6227396 5358862 2282192 -429551 -957981
4396 -957981 -750418 -1536962 -2028124 -462799 1704969 2160010 1996033 3760204 6478534
4387 6478534 6681629 3813053 880112 62304 1110268 3593152 7013678 8929282 6843356
4378 6843356 2249725 -743507 -1038130 -1117296 -1704878 -130489 4598516 9041801 9920846
4369 9920846 8454492 7613698 7381786 5500064 1577720 -2118598 -3592003 -3014700 -1754762
4360 -1754762 -808897 -482424 -868754 -1981008 -3219519 -3221394 -1213800 1538233 3061429
4351 3061429 3755047 6144152 10528378 13183674 10950403 5719508 1820419 484359
4343 484359 -241287 -1391008 -2315757 -3369991 -5710208 -8138411 -7446782 -2869477 2294029
4334 2294029 4461746 3325627 1115774 140310 1483459 4404614 6559906 6162965 3970534
4325 3970534 1903390 367550 -1185011 -1796081 259882 4318756 7451256 8140746 7702948
4316 7702948 7693818 7954509 7672992 6523101 4272404 861963 -2741847 -5102792 -5852133
4307 -5852133 -5610795 -4815359 -3847408 -3468874 -3530128 -2314671 851420 3556863 3390865
4298 3390865 1998024 3033182 6681411 9442962 9330636 8197113 8446301 9959223 10782572
4289 10782572 9057082 4497771 -256699 -821991 3917489 9206804 9949536 7599408
4281 7599408 7689084 11437932 14488575 13971962 11917359 10658400 9517896 7891852 7565513
4272 7565513 9493352 11290722 10360155 7460471 5361494 5560213 7416986 8993893 8323122
4263 8323122 5631540 4187278 6651814 11002901 12974503 12077466 11610429 12889933 13718996
4254 13718996 13134505 13252143 15002144 16011425 14467906 11640559 8956467 5949799
4246 5949799 2794263 1601091 3301097 6009630 8051748 9927624 12003923 13077878
4238 13077878 12500458 11088757 9125487 6371827 4543761 6191637 10319314 12863491
4230 12863491 12478247 11992198 13189082 14361871 14228784 13808865 12957425 9795650 5505890
4221 5505890 4769019 8792190 12505348 11764020 9135122 9147255 11509975 12673824 11261909
4212 11261909 8725768 6882976 7234014 10451543 14721057 16946945 16679032 15999591 15176493
4203 15176493 12471013 8768072 7433073 8430623 7897049 5163570 4671789 8841102 14536327
4194 14536327 18836536 22635047 26073711 26307087 22765324 19177489 17701392 16490758
4186 16490758 15104024 16003111 18594819 18799853 16782616 17427259 20852793 21260038 18018978
4177 18018978 17928048 22551495 24092308 19096513 15177350 17743871 21308847 21283217 22729008
4168 22729008 28852861 32631849 29642761 27493701 31927541 35595252 32241762 29519764
4160 29519764 34788818 41151586 41854608 44729313 56078972 64865827 61740175 58648255
4152 58648255 68092081 79218223 79755528 83796624 106611779 131468723 142758141 172565301
4144 172565301 253904502 331171422 290730764 108150938 -95904179 -188876289 -168856725
4137 -168856725 -127985882 -117067599 -111073173 -87246688 -65778240 -64489150 -67381980
4130 -67381980 -57735393 -45633058 -44133691 -46023414 -41256562 -35487979 -35939317 -36656651
4122 -36656651 -31340299 -25865637 -26198090 -27041529 -23166064 -20079059 -23423736 -28432327
4114 -28432327 -29208038 -28777673 -31202598 -32784858 -29785106 -26804713 -28946268 -32407971
4106 -32407971 -30782217 -24983834 -19951499 -16737990 -14206259 -13674939 -15866042 -17358550
4098 -17358550 -15209297 -11427402 -8980366 -7557392 -6707430 -8403660 -12847249 -16338577
4090 -16338577 -16787549 -16851060 -18579343 -19800714 -18823989 -17639915 -17367726 -15768518 -12418179
4081 -12418179 -10790572 -11766301 -10940805 -6462966 -3633674 -6705317 -11448871 -11531349 -7845210
4072 -7845210 -5617735 -5819041 -5420707 -3738390 -2977467 -3893430 -5283880 -6509990 -7135737
4063 -7135737 -5846843 -2873823 -1460949 -3861886 -7916077 -10402458 -11509437 -13185696
4055 -13185696 -15458483 -17248515 -18535347 -19084091 -17537681 -14334291 -12655272 -13646269
4047 -13646269 -13752704 -10086765 -5485021 -4484171 -6822351 -8924701 -9723381 -10755571
4039 -10755571 -11833072 -10793213 -7281914 -3671319 -2295303 -3829932 -7761784 -12604778
4031 -12604778 -16360448 -18117439 -18319056 -17004757 -13873835 -10676586 -10484603 -13183559
4023 -13183559 -14796457 -12963907 -9813087 -7531953 -4950527 -1268691 597086 -1938053
4015 -1938053 -6597201 -9310906 -9378175 -8411123 -6900041 -5335121 -6033054 -9892169 -13531444
4006 -13531444 -13519611 -11430465 -10925025 -11932811 -11839480 -10602451 -10350215 -11249563 -11911477
3997 -11911477 -12678530 -14353413 -14715429 -10644156 -3305623 2606317 4523180 3635445 1667931
3988 1667931 -446571 -1374252 -487351 263413 -1144353 -3167742 -2987215 -1483775 -1982050
3979 -1982050 -4622272 -6244099 -5910098 -6337218 -9073102 -11847307 -11824949 -8866759 -4980907
3970 -4980907 -2757372 -4135167 -8180863 -10625532 -8520729 -4666504 -4088540 -6930139
3962 -6930139 -8939134 -8583727 -8765679 -10699960 -11064018 -7412012 -2489383 -396187 -1157234
3953 -1157234 -1703645 -444246 1321624 1464665 -905913 -4655508 -7415355 -8138812 -8577961
3944 -8577961 -10526464 -12159298 -9752538 -3117937 3428249 6077877 5124427 3136966
3936 3136966 2016423 2389096 3544173 3454305 1053341 -1412177 -838680 2052590 3646353
3927 3646353 3110976 3338817 5499141 6829382 5557037 4062271 4621842 5402513 3745532
3918 3745532 774743 -573791 -288553 -875074 -3279069 -5841986 -6628569 -4888556 -1198263
3909 -1198263 2092456 1840728 -2365668 -6626420 -6681745 -2701774 1630787 3894464 4726318
3900 4726318 5437543 6050782 5949793 4995853 3594646 2359365 1702746 1372430 796124
3891 796124 163442 334111 1215448 1273524 -543724 -3215726 -4789141 -4569505 -3683815
3882 -3683815 -3932680 -6104635 -8687716 -8641490 -4830362 -331589 616517 -2085790 -4354556
3873 -4354556 -3287051 -12888 3155035 5327209 5784737 3390996 -933736 -4044443
3865 -4044443 -4872429 -5966081 -8484449 -9058384 -5103156 -263664 38913 -3294159 -4305974
3856 -4305974 -665687 3762614 5303489 4820078 4444046 3928105 2281658 233560 -871861
3847 -871861 -677309 899052 3823683 6263867 5193491 356480 -4430907 -5692545 -4196147
3838 -4196147 -2801356 -2508650 -2932580 -4797766 -8775511 -12628128 -12790300 -9166819 -5786160
3829 -5786160 -5883269 -8313064 -9749301 -8767198 -6627780 -5266847 -5673460 -7422773 -8839318
3820 -8839318 -8317728 -6281493 -5039017 -5864904 -7200897 -6931977 -5491135 -5022536 -6030707
3811 -6030707 -6866609 -6552975 -6090425 -6390333 -6670379 -5742940 -3461116 -197182 3460059
3802 3460059 5665607 4099211 -552823 -3797517 -2353020 1349525 2231298 -858278
3794 -858278 -4545549 -6374310 -7395690 -8731532 -8814435 -5837053 -889863 3192240 4978786
3785 4978786 5142925 4959738 5180053 5751262 6015172 5690005 5565052 6187258 6286349 4313347
3775 4313347 1276505 -420359 -1111467 -3749922 -8633731 -11541486 -9291655 -4433881
3767 -4433881 -1618468 -1382579 -738570 1389068 2715072 1313163 -1952230 -4847204 -5670433
3758 -5670433 -3944962 -1030977 342564 -1033375 -2987529 -2890409 -1588829 -1965778 -4245551
3749 -4245551 -5820287 -5840947 -6715378 -9931358 -13092076 -12842286 -9054643 -4613226 -2196060
3740 -2196060 -2329829 -3531957 -3496158 -1199202 1416162 946907 -3542287 -9099213 -11982251
3731 -11982251 -11101060 -7906316 -4312468 -1675647 -615465 -688276 -930831 -1371873 -3010645
3722 -3010645 -5690299 -7398657 -6820495 -5362733 -5206300 -6264134 -6644163 -5516710 -3878285
3713 -3878285 -2718706 -2000425 -1542210 -1535207 -1825936 -1755719 -1161388 -755220 -1104109 -1851406
3703 -1851406 -2332503 -2440144 -2443716 -2306424 -1671446 -449602 978352 2330221 3986129
3694 3986129 6526530 9450835 10773958 8656242 3571810 -1697863 -4425604 -3881930
3686 -3881930 -1058411 2526398 5350454 6277258 5361301 3744064 2091035 -129128 -3019741
3677 -3019741 -4976566 -4531411 -2736339 -1760127 -1410703 571244 4361887 6854405 6097761
3668 6097761 4667500 6210324 10077658 12290962 11333348 9920396 10511805 11891035 11651146
3659 11651146 9939311 8696871 8328795 7144953 3876963 -578200 -3889743 -4127923
3651 -4127923 -1365716 1964606 3107951 2025052 1275224 2019725 1799397 -1900590 -7231185
3642 -7231185 -9666283 -7610105 -3840504 -1440128 -745556 -607992 -239120 874511 2701014
3633 2701014 3566154 1539268 -2199049 -3758173 -1650498 791262 -114825 -3604737 -6330004
3624 -6330004 -7175164 -7435916 -7289708 -5221503 -1175684 2073110 1561674 -2847162 -8262172
3615 -8262172 -10971031 -9448897 -6104582 -5246920 -8188366 -11355524 -10731332 -7094236 -4777097
3606 -4777097 -5854949 -7920950 -7706868 -4820961 -1354317 690241 991394 950419 2455317
3597 2455317 5930058 9741221 12056181 12503217 11221392 7743617 2554011 -1588639
3589 -1588639 -2351255 -1122515 -1070345 -2437856 -2610397 -705807 1009565 756656 -640910
3580 -640910 -2100463 -3963738 -6194985 -7419601 -7100291 -6459727 -5983172 -4275939 -870911
3571 -870911 2032891 2421916 1288019 931512 1984428 3499077 4335173 3224914 -512028
3562 -512028 -4847763 -5879065 -2634960 1147266 2082004 1518426 2250136 3379959 2139908
3553 2139908 -879083 -2441951 -1865117 -1484951 -2061722 -1655407 331603 1593475 567159
3544 567159 -1315819 -2262616 -2393055 -2104488 -661742 1936370 3663595 2730464 -266030
3535 -266030 -3678458 -6750929 -8975863 -9166549 -6950129 -4259928 -3798812 -6414315 -10780635
3526 -10780635 -14922084 -17325280 -17431213 -15855784 -13560550 -10592041 -6659821 -2935256
3518 -2935256 -1462318 -2257091 -2963891 -2296676 -1756222 -2653543 -3598728 -2810918 -1009977
3509 -1009977 203306 1165544 2831199 4101519 3390436 1801986 1540841 1788491 -275963
3500 -275963 -4283808 -6215244 -4110555 -971517 -478622 -2607398 -5146202 -6924578 -7544801
3491 -7544801 -6331450 -3924057 -2879399 -4152677 -4828252 -2200111 1551509 2159448 -373765
3482 -373765 -2032871 -1014446 393696 672581 1642849 4466051 6649913 5589026 2456978
3473 2456978 -125313 -2123167 -4777283 -6952088 -6303270 -3416764 -1387568 -1170955 -456682
3464 -456682 2140699 4572700 4360304 1991234 -200691 -1002799 -660986 554231 2465867
3455 2465867 4216118 4726307 3849015 2345886 930139 -266900 -1684770 -3946013 -6658239
3446 -6658239 -7480182 -3923965 2947260 8082531 7447515 2754555 -572250 177325 2459439
3437 2459439 2458604 -310980 -3210582 -3850436 -2103835 360138 1355710 -524294 -4674789
3428 -4674789 -8511668 -9598307 -7880750 -5222619 -2849710 -301588 2724264 4676376
3420 4676376 3569379 -240167 -3992915 -5462134 -4900426 -3726463 -2530951 -1330407
3412 -1330407 -774385 -1604463 -3244942 -4302335 -4401171 -4262072 -4006620 -2879605 -955804
3403 -955804 364619 151929 -1117092 -3049580 -6188192 -10265006 -13084513 -12811533 -10499398
3394 -10499398 -8770737 -8656420 -9212627 -9441693 -8728037 -6059295 -1252979 3012456 2928552
3385 2928552 -1814701 -7124584 -9274093 -8790412 -8339214 -8545118 -7949151 -6113105 -4504013
3376 -4504013 -4286433 -4926435 -5376837 -5545418 -6209241 -8147569 -11437288 -14949737 -16644468
3367 -16644468 -15243293 -11730737 -8424068 -6450704 -4968127 -3029653 -1162885 -436361
3359 -436361 -721637 -818497 -26893 1281347 2702709 4593878 7287526 9874799 10534346
3350 10534346 8429326 4912986 2271772 1320608 930579 128493 -304890 759037 2435850
3341 2435850 2316769 -528820 -4281593 -6594593 -7004174 -6417729 -5295017 -3619957 -2126148
3332 -2126148 -2071037 -3601484 -5329228 -5836686 -4979964 -3567432 -2367010 -1613117 -1051123
3323 -1051123 -402368 -27603 -681762 -1996926 -1945580 797185 4288120 4930879 1980969
3314 1980969 -1329459 -1861981 -1451 2010124 3212002 3525417 1803488 -2960682 -8799461
3305 -8799461 -11690459 -9916259 -5890514 -3243982 -3526649 -5996859 -8867941 -9988119
3297 -9988119 -7847002 -3142371 1431118 3741318 3886921 2961362 1415565 -486747 -1805602
3288 -1805602 -1930507 -1822981 -2839279 -4500294 -4747719 -2690278 -114392 331483 -1990310
3279 -1990310 -5208006 -7179374 -7577716 -7358400 -6776476 -5215189 -3176050 -2769233 -4862173
3270 -4862173 -6942580 -5865444 -2211802 350253 -26982 -1677534 -3132513 -5542254
3262 -5542254 -9616987 -12579075 -10928878 -5199978 469688 3040862 2850021 1663342
3254 1663342 660229 486806 1447775 3097395 4725638 6297466 7834665 8228173 6320123
3245 6320123 3176915 1490340 2281183 3848590 4615055 5286455 7051333 9139186 9881275
3236 9881275 9378171 9241718 9845140 9703068 8170602 7138829 8663917 11818736 13749619
3227 13749619 13837590 14764792 18330985 21829120 20700528 14382247 7472358 4747351 6589066
3218 6589066 9680146 10519827 7612751 2046854 -2723168 -3009032 1525160 6955446 8890870
3209 8890870 6654133 3009549 807236 929215 2409238 3124635 1140452 -3219644 -7187911
3200 -7187911 -8538467 -7980514 -7486281 -7367852 -6550850 -4732120 -2477917 600 2326706
3191 2326706 3028835 1226438 -1319530 -1995510 -822423 -74836 -784862 -1868872 -2507280
3182 -2507280 -2963039 -2928097 -1467593 941473 2428683 2244739 1361157 328351 -1371922
3173 -1371922 -3494814 -4708369 -4622763 -4172103 -3621099 -2344606 -992887 -1505419 -4224383
3164 -4224383 -7114969 -8468767 -8256248 -6491504 -2981283 645090 1671077 209627
3156 209627 -511809 989230 2491076 2567731 3478702 6973425 10415477 10425584 7961033
3147 7961033 6300429 5946940 5179678 4161437 4636081 6266487 6762587 5257012 2504856
3138 2504856 -1587648 -7158847 -11470993 -10711540 -5457688 -995629 -934894 -3207548 -3801519
3129 -3801519 -2078832 -523925 -769241 -1863414 -2101304 -1309773 -1023054 -2523032 -4904775
3120 -4904775 -5840308 -4564078 -2836317 -2064444 -1103345 1346453 3696113 3423442 1207935
3111 1207935 173481 1117908 1410434 -783027 -3743963 -4761735 -3568796 -2050677 -1699890
3102 -1699890 -2171438 -1718496 978284 4720718 6257894 4142873 1069027 347333 1221156
3093 1221156 666173 -920258 125116 4324393 7019059 4813759 688653 -242720 2193918
3084 2193918 3649898 1667823 -1377492 -1870591 667521 3520159 4079735 2490952 932736
3075 932736 484049 -315116 -2829437 -5357215 -4949018 -1823175 689548 963406 1003876
3066 1003876 2513404 3849111 2750541 -165282 -2767045 -4460201 -5663068 -5738144 -3846964
3057 -3846964 -955917 1104691 1885180 1903764 938095 -1397200 -4212513 -6360643 -8084014
3048 -8084014 -9796850 -10247730 -8224535 -5340974 -4432327 -5367722 -5241930 -3172077 -2196842
3039 -2196842 -5042209 -9824885 -11660937 -7920075 -890775 4485600 5114200 2291270
3031 2291270 -93662 10891 755933 -718045 -4300348 -7138867 -7221362 -5079929 -2157443
3022 -2157443 735986 3084613 4378404 4738998 4752317 4420922 3439610 2626831 3541541
3013 3541541 6130542 8208143 8139456 6860325 6241947 6401098 5758475 3218310 -656181
3004 -656181 -4271051 -6087628 -5534232 -3630156 -2387544 -2795446 -3527862 -2362362 1103729
2995 1103729 4748214 6096547 4814877 2840508 2271898 3393721 4745741 4811576 3352548
2986 3352548 1299814 -34640 454801 2961135 5923083 6570771 3490326 -1455813 -4793713
2977 -4793713 -5036339 -3589147 -2102129 -520436 1463318 2570945 1317422 -1320210
2969 -1320210 -2449479 -761416 1935707 3229329 2853894 2017499 1197642 216768 -117088
2960 -117088 1431896 3938110 4278630 971837 -3357962 -5062352 -4117296 -3663652 -5244383
2951 -5244383 -6811631 -5998983 -3270914 -627467 1146268 2297488 2364463 690802 -1606065
2942 -1606065 -2116826 -111193 2266243 2559342 1026456 229367 1762597 4163035 4514697
2933 4514697 1828719 -1886848 -4078348 -4280647 -3602801 -2512355 -642564 1481050 2220379
2924 2220379 582969 -3204411 -8859649 -15769541 -21199319 -21439226 -16312284 -10405639
2916 -10405639 -7829750 -7574707 -6310922 -3884948 -2777747 -3156653 -2259167 1009956 4165572
2907 4165572 4797130 3484698 1922900 498860 -824426 -1210918 -251668 851964 1006299
2898 1006299 1033715 2246001 4052013 4503844 2832950 268618 -1461468 -1657898 -933770
2889 -933770 -500528 -850498 -994160 232641 1964991 1705657 -1389393 -4858737 -5627060
2880 -5627060 -3431977 -543370 999034 656010 -1214467 -3631694 -5025707 -4496455 -3029746
2871 -3029746 -2291411 -2350091 -1927697 -938134 -1191974 -3874616 -7524999 -9595981 -9389723
2862 -9389723 -8360992 -7768837 -7182899 -5613293 -3179663 -886250 791176 2161479 3222142
2853 3222142 3250232 1787744 -728279 -3649520 -6569037 -8656663 -8712790 -6877378 -5256564
2844 -5256564 -5503156 -6614111 -6669903 -5858557 -5651906 -5603525 -3737851 -278999 1988557
2835 1988557 2052557 2496255 5279456 8258488 8364966 6387443 5756550 7620395 9905596
2826 9905596 10827175 10763890 10663785 10850759 11626858 13094324 14131280 13342803 11219927
2817 11219927 9535739 8464622 6451685 3427637 1771132 2857379 4713475 4846260
2809 4846260 3883299 4393521 6980848 9555779 10152030 8692789 6043814 3092862 1158430
2800 1158430 1649310 4206286 6082549 4645379 395675 -3372630 -4078933 -2387643 -920903
2791 -920903 -1009771 -1512848 -865355 585932 1056746 -118163 -1288317 -278850 2993768
2782 2993768 6206995 6966332 5141459 2699362 1442300 1373970 1430373 1225287 1322469
2773 1322469 1929857 2279971 1718931 724351 213354 201688 -275333 -2051890 -4949744
2764 -4949744 -7742883 -8791397 -7192624 -3702043 -172702 2114637 3070123 2821059 1317494
2755 1317494 -680276 -1687209 -1524143 -1789996 -2975177 -2819762 239671 3479772 2959832
2746 2959832 -404328 -1559485 1388584 4423519 3786646 1302855 736177 1643225 596841
2737 596841 -2965887 -5996590 -6553590 -5712473 -4447276 -1936213 1895996 4895638 5427600
2728 5427600 4763113 5173123 7043580 9238459 10975728 11823406 10948566 8083192 4625105
2719 4625105 2292510 1130463 166228 -521425 -47357 1116965 978055 -1446720 -4624602
2710 -4624602 -6170002 -5221181 -2652933 355367 3249568 5859286 7769816 8134666 6315033
2701 6315033 2908473 -233827 -1651397 -1804309 -2279809 -3557557 -4428773 -3776553 -1997213
2692 -1997213 -217367 1053457 1803168 1756196 770994 -178642 550170 3415443 6790256
2683 6790256 8459907 7962585 7010189 7374402 8734616 9225149 7998226 6245771 5175633
2674 5175633 4000078 1158722 -2974317 -6114132 -6873039 -6194785 -5651973 -5563715 -5358074
2665 -5358074 -4727077 -3778685 -2897201 -2864709 -4084780 -5335579 -4699758 -2336751 -650523
2656 -650523 -682910 -228222 2728432 6343699 7030976 4248613 791766 -1040743 -1136101
2647 -1136101 131771 2630937 5399596 7226985 8467975 10017867 10631532 8220047
2639 8220047 4122712 2618665 4918248 6951842 5107544 1179374 -886876 -500608
2631 -500608 346003 1115668 2395857 2990518 1179866 -1714523 -2703909 -1977805 -2675724
2622 -2675724 -5241258 -5686098 -1166514 5523043 9199959 8276653 5520959 4015792 4200051
2613 4200051 4410457 2993364 -6648 -2635124 -2852340 -853450 1125355 1548932 1128391
2604 1128391 1205334 1787717 2116406 2344112 3474343 5740199 7766677 7644236 4998701
2595 4998701 2048662 1870175 4833743 7562762 6848720 3971850 3113294 5717297 9032613
2586 9032613 10750428 12087001 14527592 16156285 14136485 9454490 6097060 5795732
2578 5795732 6302253 5199499 3012902 1606575 1363412 1360803 1301899 1832303 3151072
2569 3151072 4318068 4239672 3010957 2006367 2553740 4600867 6877175 8242723 8451606
2560 8451606 7729891 6460797 5509668 5854736 7240266 7998736 6978957 4972733 3486519
2551 3486519 2884325 2664529 2744212 3249301 3673290 3581511 3650367 4595150 5503528 4849018
2541 4849018 2952592 1740626 2031489 2728479 2795222 2210292 722473 -2177891 -5205134
2532 -5205134 -5311679 -1304732 4049130 7079196 7174112 6207088 5314316 4284761 3352129
2523 3352129 3271795 3620939 3002126 1300131 112594 426536 1222048 970137 -581221
2514 -581221 -2604836 -4104551 -4130680 -2206910 740498 2794341 3107469 2770634 3058055
2505 3058055 3834273 4504880 5376652 6745583 7534832 6550494 4679173 3996654 4625649
2496 4625649 4340523 1888191 -1022469 -2190170 -2048304 -2732253 -4683980 -5907136 -4732578
2487 -4732578 -1989026 127175 494714 -284478 -1209954 -2091607 -3301214 -4706885 -5333917
2478 -5333917 -4407157 -2595499 -1603777 -2143397 -2756725 -1343707 2207996 5529429 6071001
2469 6071001 3520770 -198224 -3006587 -4524559 -5962063 -8294970 -10778038 -11744148
2461 -11744148 -10964904 -10352436 -11485979 -13012495 -11784570 -6613762 255965 5611483
2453 5611483 8003009 7659252 5201210 1620947 -1469983 -3047326 -3738117 -4527133 -4927493
2444 -4927493 -3881876 -2114202 -1709528 -3080873 -4171819 -3413334 -1795861 -911546 -596016
2435 -596016 -243510 -1156102 -5168419 -11278752 -15988633 -17287545 -16262558 -14310376 -11040120
2426 -11040120 -6121879 -1177539 1975933 3564218 4527600 4269975 1943051 -1016655
2418 -1016655 -2286187 -2231764 -3348967 -6021679 -7742040 -7297795 -6777627 -7838653 -8615913
2409 -8615913 -6669375 -3081833 -964902 -1087198 -1671465 -1873023 -2725243 -4569428 -5919136
2400 -5919136 -5468745 -3608806 -1531034 -102951 273039 -26616 265408 1743676 2867610
2391 2867610 1656908 -1356557 -3708642 -4402416 -4558435 -4533781 -2929586 695379 4476091
2382 4476091 6865883 8551273 10301742 10907282 9215355 6696705 5711577 6017247 5146374
2373 5146374 2100946 -1026019 -1386231 1525993 5127714 5805620 2370696 -2194866 -3536631
2364 -3536631 -1067485 1082466 -760900 -5216138 -7939484 -7006254 -4262910 -2158355
2356 -2158355 -1351259 -1267246 -1200583 -631707 377511 1068642 1046238 998696 1498371 1860773
2346 1860773 1365062 756207 1017570 1289538 -322284 -4112206 -8241029 -10477270 -9505986
2337 -9505986 -5525199 -1017842 204419 -3212956 -8011250 -9880086 -8434209 -6649939
2329 -6649939 -6402245 -7189496 -8438060 -9862194 -9794141 -6558838 -1857262 432913 -619603
2320 -619603 -2245480 -2878400 -4124318 -6611308 -7708385 -5568776 -2225550 -230444 865014
2311 865014 2095730 2161489 199974 -1109842 876129 3906074 3736210 870868 64654
2302 64654 3101016 6070907 4750123 -430236 -5842739 -8586900 -7979955 -5325755 -3254805
2293 -3254805 -3640321 -5500780 -6495618 -6631965 -8295468 -12078742 -15029710 -14321971 -10756697
2284 -10756697 -7267470 -5568946 -5588977 -6581510 -7221417 -6024238 -3447453 -2348108 -4321517
2275 -4321517 -6571536 -4936258 237508 3936578 2861945 -494769 -1729718 -537351
2267 -537351 -256026 -2096116 -2882284 328259 5626719 8423922 7207881 4740604 3665575
2258 3665575 3453331 2564228 1359830 1045232 1189281 493957 -635635 -471211 1160842
2249 1160842 2423757 2332336 2266975 3689939 5666058 5894504 3582822 225382 -2275023
2240 -2275023 -3434471 -4059874 -4888413 -5779124 -6171690 -5842261 -4744303 -2457009 1200632
2231 1200632 4881964 6341217 5172599 3841012 4784480 7291415 8622883 7622869
2223 7622869 5706031 4700971 5327511 7470866 10083765 10836177 7904316 2603341 -1515654
2214 -1515654 -2752989 -2738539 -3256044 -3627048 -2475547 -305689 1404283 2486993 3695439
2205 3695439 4769458 4592748 2997639 1079597 -120925 -250751 658297 2018669 2522945
2196 2522945 1330796 -620851 -1446625 -419415 1557838 3418276 4869729 5750759 5354151
2187 5354151 2912486 -1450150 -6377809 -9898446 -10755754 -9436348 -7571418 -6119314
2179 -6119314 -4647383 -2637699 -690795 153463 -424690 -2209039 -5024571 -8270355 -10563208
2170 -10563208 -10849468 -9380999 -6787137 -3029561 1513362 4782758 4642174 1539226
2162 1539226 -1998657 -4437285 -6293579 -8211262 -9681565 -9904655 -8388388 -4570404
2154 -4570404 1363914 7023077 9316080 8224057 6965592 7267459 6767547 3059833 -1713482
2145 -1713482 -3143720 -411475 3045221 4425322 4264537 3885620 2963641 980490 -874964
2136 -874964 -963685 640093 2464973 3351688 2951137 1441949 -198405 -449101 1038703
2127 1038703 2527372 2160393 500592 -37596 1790392 4554278 5726958 4094724 610709
2118 610709 -2570781 -3895079 -3597523 -2993522 -2548730 -1360239 1115568 3834284 5447233
2109 5447233 5827528 5285505 3387901 156393 -2442141 -2269766 26029 1824230 2160429
2100 2160429 2470645 3742139 5294825 6730401 8552038 10126025 9718142 7762538 7324650
2091 7324650 9486709 10909770 8423169 3723096 575374 -672480 -2263822 -4112712
2083 -4112712 -3796189 -1221995 580152 -30568 -1234875 -1033769 298434 1998704 4263206
2074 4263206 6627041 7356810 5904612 3901654 2448260 527864 -2542264 -5271014
2066 -5271014 -6260044 -6319302 -6486391 -5736627 -2711256 1705266 5507677 8022098 9409135
2057 9409135 9085809 6757013 3933760 2292357 1415971 218737 -385542 1299968 4425613
2048 4425613 6031722 4863580 2614273 1152083 385227 -738130 -2618334 -4792932
2040 -4792932 -6283055 -6069894 -4088553 -1531000 505385 1889673 2224210 303712 -3546354
2031 -3546354 -6163780 -4994512 -1726435 139431 273055 872019 1830950 628690 -2571006
2022 -2571006 -3828674 -1004417 2994065 4584185 4279137 4737696 6393428 7689090 8025860
2013 8025860 7785073 6359358 2676645 -2501896 -6598034 -7585515 -5430051 -1635949 1829547
2004 1829547 3829000 4999788 6645469 8303934 7859397 4845800 1920023 1668490 3362703
1995 3362703 4429737 3943482 3027802 2759322 3250860 4072210 4289309 2945960 628283
1986 628283 -611117 -54558 469505 -384385 -1108666 -128627 846600 -830596 -4201691
1977 -4201691 -5702523 -4238619 -2121790 -941905 395501 2933326 5729579 7652180
1969 7652180 8923096 9863646 9826766 8194655 5062878 660552 -4294840 -7687792 -7668827
1960 -7668827 -5596145 -4994287 -6935694 -8809806 -8507105 -7250946 -6913623 -7002362 -6241418
1951 -6241418 -5111925 -4590549 -3873064 -1648737 1345485 3121239 3047084 1786428 -635910
1942 -635910 -4611262 -8998000 -11276532 -9996704 -6042239 -1487506 1995412 3927651
1934 3927651 5069502 6297091 6851750 4660401 -583732 -5734508 -7161446 -4783935
1926 -4783935 -1583000 399635 1782676 3658302 5500910 5892672 4347124 1931060
1918 1931060 489774 1102165 2770986 3114903 1138837 -1262297 -1570629 182009 1789189
1909 1789189 1980101 1656166 2079875 3240672 4301958 4662063 4317915 3824603 3846465
1900 3846465 4254515 4136095 3268641 2662062 2710766 2075241 -23346 -1665744 -677189
1891 -677189 1635993 1898992 -489237 -2791493 -3307092 -3203529 -3264991 -2011598 1345813
1882 1345813 4741697 6022100 5761419 5347363 4240442 1457304 -1764297 -3270453 -3002738
1873 -3002738 -2501646 -2202656 -1345142 61588 1218950 1985188 2483265 1921851 -104148
1864 -104148 -1679837 -320714 3393234 6170625 6207618 4964750 4395465 4430894 3939369
1855 3939369 2554476 786225 -466692 -93584 2279936 5225922 6702161 6492759 6067937
1846 6067937 6007088 5374342 3876120 2569681 1861137 923580 -72462 626979 3517089
1837 3517089 6522315 7906822 8317745 8307385 6358119 1917457 -1883531 -2019331 -639928
1828 -639928 -2431751 -7439881 -10640569 -9111561 -5555418 -3245339 -1283348 2466782
1820 2466782 6561618 7473587 4564067 583252 -2199155 -3842304 -5036967 -5945481 -6863717
1811 -6863717 -8029965 -8460561 -6665665 -2849858 1080111 3860901 5646516 6396493 5586764
1802 5586764 4088794 4052304 5638666 5943874 3027283 -706639 -1517310 453995 1690556
1793 1690556 502411 -1197637 -1554279 -1278652 -1374952 -858942 1426735 4397141 6040079
1784 6040079 6058211 5487672 4661479 3422427 2637487 3385865 4806283 4770903 2998995
1775 2998995 1736640 2675070 4523378 4447195 1139775 -3972260 -7848967 -8000402 -4567542
1766 -4567542 -667400 225111 -2264519 -5165359 -5516941 -3167918 -148646 1657927 1856603
1757 1856603 1529350 2277662 4426581 6052799 4955493 1760691 -427144 80929 1645815
1748 1645815 1977222 876356 -878387 -3486356 -7033734 -9775344 -9735621 -7452052 -5283562
1739 -5283562 -4460407 -4470253 -4741314 -5029321 -4555360 -2747907 -677801 80505 -220197 -241464
1729 -241464 -299387 -1978888 -4964919 -6848322 -6602219 -5675739 -4822542 -2622647 1344878
1720 1344878 4465612 4415804 2553059 1625397 1722579 1149465 67310 137476 951288 38664
1710 38664 -2965639 -4939064 -3401925 -36697 1558109 318237 -1816055 -3120934 -3858822
1701 -3858822 -4715459 -5184649 -4545904 -3515722 -3484690 -4235116 -3941482 -2042550 -650666
1692 -650666 -1736228 -4014524 -4606782 -3213319 -2242085 -2839531 -3617365 -4027531 -5848376
1683 -5848376 -9462180 -11553844 -9439836 -5583559 -4302449 -5283475 -4265834 200252
1675 200252 4675116 6085206 5335467 4361005 2971424 746268 -602653 627826 3252621
1666 3252621 4735240 4417185 3281239 1713645 -371410 -2032490 -2033626 -655465 877936
1657 877936 2156794 3070998 2335314 -1224324 -6098976 -8985404 -8533177 -6454831 -4712910
1648 -4712910 -3491541 -2469354 -2210242 -3164356 -4513323 -5108351 -4832133 -4285614 -3793207
1639 -3793207 -3320488 -2736868 -1646151 386857 2954049 4731662 4817979 3732514 2829596
1630 2829596 3197623 5146477 7923057 9753274 9198920 6933942 5249227 5314424 5915627
1621 5915627 5451909 3994023 2452724 872070 -1067641 -2612482 -2570459 -1123258 403169
1612 403169 1566728 3314217 6181220 8991717 9796246 7621961 3286726 -939379 -2672969
1603 -2672969 -1335054 1148869 2252235 1384201 -259584 -2069201 -4748186 -8271389
1595 -8271389 -10654326 -10038763 -7287157 -5149145 -4909315 -4998120 -3399482 -732247 -3911
1586 -3911 -3060281 -7918392 -10529593 -9224252 -6316179 -4684351 -4015299 -2017936 1383669
1577 1383669 3465098 2776812 1552904 2570479 5149283 6232425 4686811 2455177
1569 2455177 1421356 1018615 -317721 -2647022 -4596835 -5327376 -5254752 -4743719 -3094703
1560 -3094703 307229 4165329 5897277 4801207 3545330 4984860 7946075 8212831
1552 8212831 4143013 -722845 -1848209 1138296 4980889 7068442 7235848 6359540 5450336
1543 5450336 5704055 7231135 7853982 5361032 1061130 -1227363 -271429 783405 -1207263
1534 -1207263 -5166008 -7417940 -6143295 -2726416 358582 1580487 833751 -887021
1526 -887021 -2355753 -3110128 -3342479 -2978340 -1813039 -405651 609108 2108013 5531149
1517 5531149 10086660 13115184 13852072 14246064 14936353 13453547 8547275 3395010 1394048
1508 1394048 1071656 -1093593 -4514835 -5531914 -3792180 -2845812 -3959470 -3929480 -616616
1499 -616616 3306768 4514609 3894262 4504071 6675004 7793872 5876240 1396924 -3533284
1490 -3533284 -6344782 -5413815 -1678811 2033738 4171152 5597867 6879266 6695957 4621746
1481 4621746 3183566 4503417 6442608 5102462 394504 -3827829 -4953943 -4115955
1473 -4115955 -3342680 -2998566 -2856892 -3259153 -3766736 -2381767 2188507 8261917 12437895
1464 12437895 12804698 10238480 7069298 5245536 5412008 6756144 7443092 5865048 2324490
1455 2324490 -431739 636132 5229857 8939011 7698100 2847775 -246937 1007502
1447 1007502 3401102 2838114 -242196 -2570869 -3101593 -3364290 -4028968 -4395510 -4777901
1438 -4777901 -6077481 -6948793 -4729887 153953 3849254 4209063 3341884 3628528 4096483
1429 4096483 2881042 930409 655191 2347919 4311190 5499360 5911245 5292711 3623855
1420 3623855 2295469 2751793 4279444 4889562 4032107 2743613 1537539 77512 -1198186
1411 -1198186 -1101601 409484 2064979 3345590 5088770 7518924 9220058 8956336 7438515
1402 7438515 6436985 6914718 8683092 11072165 13090732 13508527 11788114 8917493 6695938
1393 6695938 6053115 6339252 6279418 5316181 3804471 2098770 49284 -2237305 -3714954
1384 -3714954 -3429631 -2078639 -1336491 -1387933 -517872 2086295 4465721 4126606 1268619
1375 1268619 -1568770 -2417472 -1128487 1518845 4262845 5395639 4234901 2460447
1367 2460447 2177884 2661379 1048856 -3355731 -7582622 -8705972 -7255455 -5743298 -5301477
1358 -5301477 -5213147 -4714512 -3811065 -2890901 -2561693 -3255690 -4218126 -3828552 -1885493 -471798
1348 -471798 -1200731 -2558629 -1681240 1786691 5374039 7098191 7330347 7216324 6907101
1339 6907101 5929461 4107962 1548245 -1403205 -3826344 -4746803 -4278019 -3367520 -2297906
1330 -2297906 -648822 982880 790919 -1807883 -4848554 -6126513 -5820937 -5507674 -5481473
1321 -5481473 -4724260 -3010439 -1267821 -27294 718167 204859 -2365322 -5296250 -5010326
1312 -5010326 -621579 4047087 4921584 2574427 359163 -975446 -3559990 -7577350
1304 -7577350 -9767063 -7956274 -4229111 -1780291 -860376 63577 1051944 1205904 1116335
1295 1116335 1883303 2245816 -374504 -5743560 -10261084 -11132464 -8997686 -5830998 -2384564
1286 -2384564 1285503 4598478 7008252 8552795 9078768 8273589 6999266 6770201 7116572
1277 7116572 5616372 1840447 -992680 -214506 2500036 3932200 4060116 4977853 6442949
1268 6442949 6169145 4202142 3278939 4283688 4824757 3573198 2795585 4502903 6660282
1259 6660282 5988819 3066181 1790944 4136923 7785305 9270161 7753910 5019128
1251 5019128 2850216 1425693 108685 -1011413 -1153760 -479931 -608520 -2466018 -4436231
1242 -4436231 -4367547 -3088655 -3688751 -6888878 -9538441 -8949364 -6538055 -5282557 -5387149
1233 -5387149 -4978431 -3976823 -4378765 -6743928 -8892564 -8669269 -6224919 -3071834 -477815
1224 -477815 684024 84848 -1199012 -1176235 833693 3376683 5002028 6262499 8528573
1215 8528573 11372571 12354104 9666584 4456187 102468 -923529 573648 1535479 50572
1206 50572 -2821358 -4867124 -5468574 -5677198 -6240015 -6784934 -6706056 -5704261 -3601743
1197 -3601743 -736794 1622905 2460036 2472681 3121666 4424786 5168651 5100764 5030189 4681866
1187 4681866 2705697 -476940 -2031373 -196907 3266958 5385710 5216931 3660957
1179 3660957 1794784 909893 2495705 6231367 9254565 9276772 7234492 5158990 3135161
1170 3135161 758211 -163698 2207418 5755393 6369073 3856736 2222007 3500167 5077486
1161 5077486 4512679 3491559 4703845 7494713 9232823 9118308 8201454 7159485 6422510
1152 6422510 7159821 9638566 11590213 10728755 8247018 7347711 8689323 9731248 8442667
1143 8442667 5156882 615381 -5038758 -10283518 -11693144 -7480978 -623706 3288900
1135 3288900 1383073 -3964853 -7722626 -6883029 -2740824 1085423 2551636 2656615 3167210
1126 3167210 4197737 4912650 5315750 5646146 4892854 2112189 -1147614 -2252439 -1530247
1117 -1530247 -2217303 -5412741 -7724946 -5717986 -558210 4015364 6652076 8559668
1109 8559668 9760806 8507707 4808987 1727832 1835173 4127562 5819005 5938082 5710026
1100 5710026 6152487 6809343 6741672 5613110 3660571 1493803 195226 815627 3171157
1091 3171157 5538790 6162866 4990326 3518675 3079871 3763128 4856889 5558935 5126795
1082 5126795 3242701 729442 -887814 -1176276 -1345333 -2165996 -2283016 1488 3875666
1073 3875666 6644109 6998993 5926640 4383929 2121415 -658995 -2494805 -2581065 -1931059
1064 -1931059 -1566471 -1027218 231975 1536231 2432334 3935473 6764171 9674586 11185248
1055 11185248 11592820 11528563 10125625 6902148 3885463 2938938 2244990 -1002219 -5135954
1046 -5135954 -5461339 -1518902 1395563 -512699 -4556538 -6062169 -4573240 -2756426
1038 -2756426 -1755048 -958436 -690424 -1708412 -2787419 -1824494 803516 2341643 1020972
1029 1020972 -2497523 -6481668 -8891462 -7476629 -1754127 5048454 8391153 7173310
1021 7173310 4256876 2264872 1108193 -46192 -868995 -897070 -423986 624893 2742205
1012 2742205 4690132 3509371 -1475174 -6341062 -6538081 -2314568 1896694 2999093
1004 2999093 2047440 1585812 2261973 2919599 2745269 2203070 2185343 2885663 3569732 3385586
994 3385586 2384373 1448998 1055772 681681 -20040 -81894 1664238 4492563 6016500
985 6016500 4913436 2481264 870374 577512 662297 929465 2440846 5485671 8302622
976 8302622 8960316 7933527 7420174 8058718 7823837 5001604 1120639 -442049 1656739
967 1656739 5486448 8273302 8771619 7230658 4582333 2344866 2077750 3814349 5641825
958 5641825 5730153 4306441 2840981 1883138 861206 -214032 -208123 1495563 3672774
949 3672774 4301832 2671808 -24539 -2128006 -3193869 -4107156 -5630525 -7104501 -6975303
940 -6975303 -4778658 -2208131 -1617980 -3415122 -5494999 -5615738 -3912094 -2431555 -2349590
931 -2349590 -2567674 -1478818 743875 2623754 3696591 4989142 7036443 8840524 9546012
922 9546012 9948446 11139383 12442782 12105139 9742331 6867446 5101328 4896389 5804944
913 5804944 6833290 6666208 4799685 2465930 1275989 1075515 501850 -537423 -758940
904 -758940 18820 408848 60496 484567 2065003 2379808 -571632 -4958393 -7049784
895 -7049784 -5641743 -2598419 243894 2512818 3913649 3669788 1935410 281902 58057
886 58057 1016650 1860167 1569180 146331 -1492551 -2531289 -3405175 -5218957 -7556833
877 -7556833 -8104633 -5613964 -2113434 -518749 -848008 -703382 1006817 2967287 4018696
868 4018696 4647771 5384696 5512692 4247986 2016677 -151861 -1638777 -2195353 -1669607
859 -1669607 -182867 1787604 3420080 3494175 1343887 -1405720 -1618037 1197631 3110761
850 3110761 657688 -3872619 -5431560 -3669360 -3136643 -5737207 -7682743 -5786420 -2516911
841 -2516911 -1800929 -3175232 -3739105 -3460430 -4500315 -6585638 -6965291 -4658268 -1523964
832 -1523964 911550 2960964 4989659 6559675 7607174 8405159 8219820 5982749 2424838
823 2424838 -375037 -1696372 -2552797 -3278833 -2826958 -945864 822521 1057218 -10756
814 -10756 -1323619 -2048180 -1623415 -282584 271205 -1580820 -4795461 -6482653 -5848131
805 -5848131 -5279309 -6416432 -7133045 -4329738 1406190 6000779 6559777 4265915 2396423
796 2396423 2643663 4063388 5045019 5261942 5230224 4667840 2620985 -558608 -2783061
787 -2783061 -2697590 -1402709 -538296 68351 1134734 1556865 -190466 -2905052 -3740386
778 -3740386 -2474927 -1825867 -2983394 -3798630 -2552827 -627875 401588 1757137 5050196
769 5050196 8768156 9986095 8578333 7074452 6768592 6413027 4857966 2944922 2275979
760 2275979 3380099 5335451 6272924 4494895 349083 -3115451 -2715269 1408669 5908712
751 5908712 7906124 7472562 6230050 4746665 2350363 -868486 -3012040 -2118676 1141844
742 1141844 3446700 2251066 -1324228 -4060785 -4528587 -3837267 -2928375 -1503710 -77424
733 -77424 -440393 -2684859 -4062862 -2659471 -182858 1016578 1674743 3634229 5873233
724 5873233 5896691 4104638 3211120 3699314 3485415 2210033 2083689 3646429 4338283
715 4338283 2773201 1160112 1576635 2789241 3033547 3286955 5085980 7316018 8204561
706 8204561 8778521 10985575 13460406 12771458 8784477 5485991 5808569 8304006 9907966
697 9907966 9755995 8959536 8263988 7422735 6061393 4092204 1713381 -487918 -1967160
688 -1967160 -3015750 -4409727 -6038958 -6730540 -5819677 -4180448 -3296799 -3795495 -5003369
679 -5003369 -5411846 -3777262 -687594 1143447 -554690 -4633653 -7521008 -7458906 -6129870
670 -6129870 -5508467 -5051090 -3363562 -989660 396432 535162 329927 -218422 -1678885
661 -1678885 -3144623 -2803394 -735450 967549 1310680 1532311 2422352 2709299 1465078
652 1465078 172892 489104 1337018 437523 -2013494 -3419904 -2385848 -292414 893386
643 893386 686460 -397253 -1858583 -3114025 -3479062 -2853807 -1738892 -445988 860997
634 860997 1490711 902183 94324 742817 2599153 3425795 2184253 578767 442537
625 442537 1297000 1900589 2624495 4367686 6218542 6354992 4773081 3156447 2295088
616 2295088 1522358 634039 433803 1090396 1695966 1939097 2640746 3984239 4651010 3613225
606 3613225 1718446 592485 714678 1307225 1498788 975305 29890 -488386 268426
597 268426 2215506 4322944 5710708 6260466 6063354 4968967 2943960 333252 -2364618
588 -2364618 -4498854 -5255313 -4484549 -3358665 -3145358 -3470285 -3070874 -2135833 -2163389 -3234062
578 -3234062 -3385781 -1522818 877104 2095546 2478449 2934189 2753357 933827 -1411368
569 -1411368 -2172226 -1270100 -523259 -649706 -357364 1321254 3427290 4334226 3474626
560 3474626 1433829 -727814 -1941335 -1750314 -808749 -274603 -659816 -1622370 -2511619
551 -2511619 -2579567 -1283348 784174 1964852 1624015 1423000 3072802 5442476 5663800
542 5663800 2825015 -1203546 -4394832 -6049272 -5778346 -3376106 -171373 1755837 2464208
533 2464208 4081857 7018579 8769962 7943135 6865907 7840440 8945055 6661075 1458427
524 1458427 -2528986 -3040472 -1768071 -702580 476851 2324387 3652139 3428687 2838265
515 2838265 3529173 4960516 5353676 4596391 4343902 5388805 6665623 7286555 8151617
506 8151617 10536835 13772860 15497532 14337937 11508014 9197137 7897252 6249920
498 6249920 3442743 502047 -1419943 -2873714 -4934770 -6953340 -7246767 -5929115 -5136722
489 -5136722 -5851467 -6210985 -4077330 11390 3727485 5775718 6474048 6413244 6180315
480 6180315 6853730 8922081 10751228 9849895 5965605 1489670 -1479346 -2960946 -3651593
471 -3651593 -3518327 -2811220 -2782479 -3818679 -4013178 -1423787 2824071 5466341 4979634
462 4979634 2908637 1222907 -1035 -1619494 -3447233 -4336259 -3750630 -2454415 -1667682
453 -1667682 -1852215 -2302180 -1926409 -527907 977272 1912567 2868331 4596972 6327890
444 6327890 6453081 4988828 4064889 5355308 7945390 9502500 8994592 7590797 7239280
435 7239280 8844856 11534512 13344956 12914866 10753820 8625603 7735321 7940858 8428288
426 8428288 8256263 6516684 3435390 1465473 3442641 8761918 13081161 13223416 10954282
417 10954282 10167179 11609899 12769486 12295056 11652469 11929622 11627355 9101838 5480011
408 5480011 3316999 3145637 3039996 1477366 -726086 -1679402 -719856 1121631 2512480
399 2512480 3027744 3027528 2999575 3385653 4509250 5957405 6386849 4945878 2759990 1741842
389 1741842 1822232 1003570 -1251023 -2641238 -1454341 452205 340865 -960302 -90880
380 -90880 3727277 7449709 8481980 7636465 6961765 6897809 6861731 6807216 6704087 5830256
370 5830256 3999051 2412488 2028068 2082326 1462407 526744 169606 -65079 -1336184
361 -1336184 -3359802 -4318401 -2888330 509244 4210120 6273607 5407846 1946055 -2188804
352 -2188804 -5068637 -6045277 -5255449 -2905108 97515 1864091 1340457 -87729 -178604
343 -178604 1233241 2216870 1588381 419041 344755 1386824 2089108 1408729 -53077
334 -53077 -880448 -862560 -1597511 -4211165 -6840941 -6098172 -1557745 2988764 3965736 2150143
324 2150143 804107 1153272 1936253 2452548 3326539 4286717 3721282 1130905 -1808728
315 -1808728 -3334979 -3350953 -2661609 -1874456 -1471623 -1563320 -1163843 812946 3379552 3909254
305 3909254 1481273 -1718795 -3244775 -3216677 -3222467 -3704485 -3818062 -3006483 -1370716 939702
295 939702 3479792 5052534 4629928 2614381 419139 -1027063 -1786001 -2265915 -2703121
286 -2703121 -3057190 -2976796 -2164462 -1062110 -647451 -1183838 -1798612 -1749051 -1384459 -1240304
276 -1240304 -931802 144914 1487510 1822328 623193 -1392669 -3140691 -3954566 -3665820
267 -3665820 -2521878 -1070726 225002 1266028 2064189 2378878 1781195 32978 -2472242
258 -2472242 -4462383 -4435797 -2215050 528599 2190547 3212119 4808405 6114291 4678618
249 4678618 221127 -4228136 -6010189 -5810729 -5610966 -5496362 -4449810 -2930375 -2313109
240 -2313109 -2436056 -1921319 -656648 85628 -54551 -48743 524026 773905 130974 -899198
230 -899198 -2007113 -3621230 -5651544 -6988788 -6833506 -5468987 -3341760 -554996 2261584
221 2261584 3796465 3500831 2353431 1692043 2078317 3543718 5788825 7657600 7644786
212 7644786 5696402 3488121 2176429 963693 -1183471 -3517824 -4540374 -4250150 -3824179
203 -3824179 -3398492 -1775980 1407063 4527490 5667644 4766005 3455432 3099785 3509781
194 3509781 3533378 2548260 1206832 748691 1633450 2852375 2592427 -241313 -4804475
185 -4804475 -8506461 -8863621 -5605799 -815240 3216872 5857809 7553845 8188730 7115784
176 7115784 4577944 1890353 -16848 -1300900 -2190763 -2204065 -880938 1343891 3429368
167 3429368 4418636 3716514 1452458 -1118250 -2385325 -2103107 -1777107 -2878506 -5175908
158 -5175908 -7193061 -7735889 -6569684 -4197273 -1505335 749477 2469064 3942315 5053096
149 5053096 5391521 5121242 4795703 4228484 2758178 949724 573668 2129870 3806142
140 3806142 4012581 3653319 4444400 6108242 7074519 7248621 7972006 9289679 9275640 6693165
130 6693165 2899594 315886 -128739 563719 895675 217728 -932230 -1425768 -647058
121 -647058 882600 2038461 2047926 879783 -690279 -1111922 898368 4540055 6972712
$$ [...]
##END NTUPLES=NMR SPECTRUM
##END=
