##TITLE=31Pdec_DE-88rm_3h
 , 64 sc
 2.4.2025
##JCAMPDX= 6.0         $$ Bruker NMR JCAMP-DX V2.0
##DATA TYPE= NMR SPECTRUM
##DATA CLASS= NTUPLES
##ORIGIN= UXNMR, Bruker Analytische Messtechnik GmbH
##OWNER= root
$$ XWIN-NMR		Version 3.5
$$ Wed Apr  2 14:15:23 2025 Russian Standard Time (UT+4h)  she@DPX200
##.OBSERVE FREQUENCY= 81.013821
##.OBSERVE NUCLEUS= ^31P
##.ACQUISITION MODE= SIMULTANEOUS
##.ACQUISITION SCHEME= undefined
##.AVERAGES= 64
##.DIGITISER RES= 17
##SPECTROMETER/DATA SYSTEM= spect
##.PULSE SEQUENCE= zgpg30
##.SOLVENT NAME= CDCl3
##.SHIFT REFERENCE= (INTERNAL, CDCl3, 0, 198.062)
##AUDIT TRAIL= $$ (NUMBER, WHEN, WHO, WHERE, WHAT)
$$ ##TITLE= Audit trail, XWIN-NMR		Version 3.5
$$ ##JCAMPDX= 5.01
$$ ##ORIGIN= Bruker BioSpin GmbH
$$ ##OWNER= she
$$ F:/spectra/data/she/nmr/P31/2/pdata/1/auditp.txt
$$ ##AUDIT TRAIL=  $$ (NUMBER, WHEN, WHO, WHERE, WHAT)
(   1,<2025-04-02 14:12:35.17 +0400>,<she>,<DPX200>,
      <created by zg, POWCHK disabled, PULCHK disabled
       configuration hash MD5:
       00 E9 B6 7A A2 85 ED C7 34 08 36 98 17 FE 4E 26
       data hash MD5: 32K
       BD 06 67 5C E5 0C 9E 43 2D 06 05 60 07 CB 64 82>)
(   2,<2025-04-02 14:13:11.20 +0400>,<she>,<DPX200>,
      <Start of raw data processing
       efp BC_mod = 2 LB = 1.5 FT_mod = 6 PKNL = 1 PHC0 = 1357.451 PHC1 = 267.4942 SI = 64K 
       data hash MD5: 64K
       4E CE 46 0D 3F 75 F3 52 77 1B A1 57 A5 6E 73 F5>)
(   3,<2025-04-02 14:13:36.53 +0400>,<she>,<DPX200>,
      <pk PHC0 = -65.93635 PHC1 = 173.4 
       data hash MD5: 64K
       80 2A 1F 98 2E 06 96 59 EF 62 19 5C 42 4B FA 00>)
(   4,<2025-04-02 14:13:39.95 +0400>,<she>,<DPX200>,
      <abs ABSG = 5 
       data hash MD5: 64K
       8F EC 00 A8 70 79 C8 F1 E4 B7 27 6E 95 59 86 D6>)
(   5,<2025-04-02 14:14:09.10 +0400>,<she>,<DPX200>,
      <pk PHC0 = 1.542262 PHC1 = 0 
       data hash MD5: 64K
       3D A8 9B FA 18 92 F6 15 67 A3 2D 45 76 4A 58 FB>)
(   6,<2025-04-02 14:14:45.15 +0400>,<she>,<DPX200>,
      <pk PHC0 = 143.2688 PHC1 = -466.4001 
       data hash MD5: 64K
       1A 49 F2 F3 97 3E 6A 36 A2 C1 E3 73 FD 91 1D D9>)
(   7,<2025-04-02 14:14:48.67 +0400>,<she>,<DPX200>,
      <abs ABSG = 5 
       data hash MD5: 64K
       AB 9A F8 85 31 0F C5 50 B0 2C C9 22 51 2E 50 38>)
$$ ##END=
$$ 
$$ hash MD5
$$ 55 7C 5D F9 93 45 43 F4 B5 47 31 88 15 27 EA 21
##$RELAX= 
##$RELAX= 
##$RELAX= 
##$RELAX= 
##$RELAX= 
##$RELAX= 
##$RELAX= 
##$RELAX= 
$$ Bruker specific parameters
$$ --------------------------
##$DU= <F:/spectra>
##$EXPNO= 2
##$NAME= <P31>
##$PROCNO= 1
##$TYPE= <nmr>
##$USER= <she>
##$AMP= (0..31)
100 100 100 100 100 100 100 100 100 100 100 100 100 100 100 100 100 100 
100 100 100 100 100 100 100 100 100 100 100 100 100 100 
##$AQSEQ= 0
##$AQ_mod= 1
##$AUNM= <au_zg>
##$AUTOPOS= <>
##$BF1= 81.014009
##$BF2= 200.13
##$BF3= 200.13
##$BF4= 200.13
##$BF5= 200.13
##$BF6= 200.13
##$BF7= 200.13
##$BF8= 200.13
##$BYTORDA= 1
##$CFDGTYP= 0
##$CFRGTYP= 5
##$CHEMSTR= <none>
##$CNST= (0..31)
$$ [...]
##$SUBNAM3= <"">
##$SUBNAM4= <"">
##$SUBNAM5= <"">
##$SUBNAM6= <"">
##$SUBNAM7= <"">
##$SUBNAM8= <"">
##$SUBNAM9= <"">
##$SW= 400.765351723535
##$SWIBOX= (0..15)
0 1 3 0 0 0 0 0 0 0 0 0 0 0 0 0 
##$SW_h= 32467.5324675325
##$TD= 32768
##$TD0= 1
##$TE= 0
##$TE2= 300
##$TE3= 300
##$TEG= 300
##$TL= (0..7)
0 120 53 12 22 120 120 120 
##$TP= (0..7)
150 150 150 150 150 150 150 150 
##$TP07= 0
##$TPNAME0= <>
##$TPNAME1= <>
##$TPNAME2= <>
##$TPNAME3= <>
##$TPNAME4= <>
##$TPNAME5= <>
##$TPNAME6= <>
##$TPNAME7= <>
##$TPOAL= (0..7)
0.5 0.5 0.5 0.5 0.5 0.5 0.5 0.5 
##$TPOFFS= (0..7)
0 0 0 0 0 0 0 0 
##$TUNHIN= 0
##$TUNHOUT= 0
##$TUNXOUT= 0
##$USERA1= <user>
##$USERA2= <user>
##$USERA3= <user>
##$USERA4= <user>
##$USERA5= <user>
##$V9= 5
##$VALIST= <valist>
##$VCLIST= <CCCCCCCCCCCCCCC>
##$VD= 0
##$VDLIST= <DDDDDDDDDDDDDDD>
##$VPLIST= <PPPPPPPPPPPPPPP>
##$VTLIST= <TTTTTTTTTTTTTTT>
##$WBST= 1024
##$WBSW= 4
##$XGAIN= (0..3)
0 0 0 0 
##$XL= 0
##$YL= 0
##$YMAX_a= 53003
##$YMIN_a= -62464
##$ZGOPTNS= <>
##$ZL1= 120
##$ZL2= 120
##$ZL3= 120
##$ZL4= 120
##$ABSF1= 198.0616
##$ABSF2= -202.7028
##$ABSG= 5
##$ABSL= 3
##$ALPHA= 0
##$AQORDER= 0
##$ASSFAC= 0
##$ASSFACI= 0
##$ASSFACX= 0
##$ASSWID= 0
##$AUNMP= <proc_1d>
##$AZFE= 0.1
##$AZFW= 0.5
##$BCFW= 0
##$BC_mod= 2
##$BYTORDP= 0
##$COROFFS= 0
##$CY= -3
##$DATMOD= 1
##$DC= 0
##$DFILT= <>
##$DTYPP= 0
##$F1P= 0
##$F2P= 0
##$FCOR= 1
##$FTSIZE= 65536
##$FT_mod= 6
##$GAMMA= 0
##$GB= 0
##$INTBC= 1
##$INTSCL= 9.790993e-09
##$ISEN= 30
##$LB= 1.5
##$LEV0= 0
##$LPBIN= 0
##$MAXI= 10000
##$MC2= 0
##$MEAN= 0
##$ME_mod= 0
##$MI= 50
##$NCOEF= 0
##$NC_proc= -6
##$NLEV= 6
##$NOISF1= 182.463
##$NOISF2= 159.3651
##$NSP= 0
##$NTH_PI= 0
##$NZP= 0
##$OFFSET= 198.0616
##$PC= 4
##$PHC0= 1436.326
##$PHC1= -25.50589
##$PH_mod= 1
##$PKNL= yes
##$PPARMOD= 0
##$PSCAL= 0
##$PSIGN= 0
##$REVERSE= no
##$SF= 81.0140089999434
##$SI= 65536
##$SIGF1= 159.3651
##$SIGF2= -187.1042
##$SINO= 113.3802
##$SIOLD= 16384
##$SREGLST= <1H.CDCl3>
##$SSB= 0
##$STSI= 65536
##$STSR= 0
##$SW_p= 32467.5324675325
##$SYMM= 0
##$S_DEV= 0
##$TDeff= 32768
##$TDoff= 0
##$TI= <>
##$TILT= no
##$TM1= 0
##$TM2= 0
##$TOPLEV= 0
##$USERP1= <user>
##$USERP2= <user>
##$USERP3= <user>
##$USERP4= <user>
##$USERP5= <user>
##$WDW= 1
##$XDIM= 65536
##$YMAX_p= 373362126
##$YMIN_p= -5381905
$$ End of Bruker specific parameters
$$ ---------------------------------
##NTUPLES= NMR SPECTRUM
##VAR_NAME=  FREQUENCY,     SPECTRUM/REAL,   SPECTRUM/IMAG
##SYMBOL=    X,             R,               I
##VAR_TYPE=  INDEPENDENT,   DEPENDENT,       DEPENDENT
##VAR_FORM=  AFFN,          ASDF,            ASDF
##VAR_DIM=   65536,         65536,           65536
##UNITS=     HZ,            ARBITRARY UNITS, ARBITRARY UNITS
##FACTOR=    0.49542278885378, 1,            1
##FIRST=     16045.7642231865, 0,            0
##LAST=      -16421.768244346, 0,            0
##MIN=       -16421.768244346, -5381905,     0
##MAX=       16045.7642231865, 373362126,    0
$$ Real data points
##PAGE= N=1
##DATA TABLE= (X++(R..R)), XYDATA
$$ [...]
47733F2923j49353N81978Q80288J63728q45726j046927l80123K31820K01411q0415
47723c80396m4548J87306J57250p1730j1819L76697N09668L7842o01136p79055
47713f19921m81261j86615j82427l36516m10027k90601N108K98312K77686j80311
47703b106573p17222p35214k7437R00084J213911N56094m80311q42897j93981
47694b433546N89947M60707m20146r02194m03750M69205R93868J178859J153322
47685F86272N94130n02883j193104o81584L91611P42996K24492k04070r1912L4982
47675I30j36213j74559J37883L07193L1635k17498j7679K96935K70683P6194Q8299
47664F63803J88301K3117l93452p70833r33458q17017m18753J9443K08559L73782
$$ plain form
47733 62923 -86430 495548 1375836 1539564 693838 -353089 -733212 -501392 -299981 -380396
47723 -380396 -424944 -237638 -80388 -152118 -163937 212760 722428 760270 159134 -619921
47713 -619921 -1101182 -1287797 -1470224 -1806740 -2216767 -2507368 -2502260 -2203948 -1926262 -2106573
47703 -2106573 -2823795 -3559009 -3586446 -2686362 -1472451 -916357 -1396668 -2239565 -2433546
47694 -2433546 -1843599 -1382892 -1803038 -2705232 -3108982 -2639777 -1645909 -467050 686272
47685 686272 1280402 777519 -415585 -1097169 -705558 37438 261930 57860 -34052 930
47675 930 -135283 -309842 -171959 135234 166869 -50629 -68308 228627 499310 575504 663803
47664 663803 852104 875221 481769 -289064 -1222522 -2039539 -2458292 -2438849 -2230290 -1856508
47654a856508J027199J929282K023715Q79245n30286j113811j055643j153162
47646A50031j370896j026524p1571P80082J062346Q80893L84846k63255n28357
47637b405j0096P04569N82861l74225j059154q28146k63512o1315j8035L46261
47627i83197Q27571Q52275L65328j53109l27216j30508K77206N78188L73603l70874
47617A309267j073384j080152m19271K57784M54874K95723J78849K05615J41211
47608B70516j11750k53376j227L72297K87656l05661p59640o00249j44563Q2388
47598a163609J09762K17167K72433K2610k38506m3325L60349K89718k39128m93091
47588i05620k28938n5167l28636n16006r4902N89271Q87171P46642N43617M25939
$$ plain form
47654 -1856508 -829309 1099973 3123688 4002933 3472647 2358836 1303193 150031
47646 150031 -1220865 -2247389 -2318960 -1538878 -476532 404361 789207 525952 -2405
47637 -2405 -12501 692068 1274929 900704 -158450 -986596 -1250108 -1311423 -1329458 -983197
47627 -983197 -155626 696649 1061977 908868 581652 451144 728350 1306538 1680141 1309267
47617 1309267 235883 -844269 -1263540 -1005756 -550882 -255159 -76310 129305 270516
47608 270516 158766 -94610 -95837 276460 564116 258455 -501185 -1101434 -1245997 -1163609
47598 -1163609 -1053847 -836680 -564247 -541637 -780143 -823468 -463119 -173401 -412529 -905620
47588 -905620 -1134558 -1189725 -1518361 -2034367 -2129269 -1539998 -652827 93815 637432 1063371
47578A063371L10202K17947J83844N8016k76867o93445j009653j119243q49815
47569b115643j21912O39786Q01078M08341J70478L09220J61172o46655j376097
47560a770232j184253l50263K39614L65652M57991O49476O48550M03681K06525
47551c33259J95317K74434M07490N41239M34432R047l59681l32001r3382N7295
47541H00931K03743M00374K48925m62855j143112j148248p48343n68180m96402
47532b913167o1971M77850M68768M8572n2116K41772L45201J32854k5529k26442
47522a564208q07758j208533m46840J078514J698189Q00460l17177m67156p5330
47513a309839N8799J55276O10876R19070N79530J65844L33207N70857J44153m37748
$$ plain form
47578 1063371 1373573 1591520 1775364 1833380 1556513 863068 -146585 -1265828 -2115643
47569 -2115643 -2237555 -1597769 -796691 -388350 -217872 91348 252520 -394135 -1770232
47560 -1770232 -2954485 -3304748 -3065134 -2699482 -2241491 -1592015 -943465 -539784 -333259
47551 -333259 -137942 136492 543982 1085221 1519653 1528700 1169019 837018 743636 800931
47541 800931 1004674 1405048 1653973 1191118 48006 -1100242 -1848585 -2416765 -2913167
47532 -2913167 -2975138 -2497288 -2028520 -1979948 -2032064 -1790292 -1445091 -1312237 -1337766 -1564208
47522 -1564208 -2371966 -3580499 -4027339 -2948825 -1250636 -450176 -767353 -1234509 -1309839
47513 -1309839 -1251040 -1095764 -484888 434182 1013712 1179556 1512763 2083620 2227773 1790025
47503A790025k02505N80447Q24830L90445N9346m5718o15605j661138k161541
47494a041414j515102l22063N76763R49724Q13001J40364o75289q64420k55927
47485b194363L84862L84175q043j65556M9398L49782N14693M39175N4056m43724
47475f35545n62443m5445P49976J214154J059765M41558k43452n67803l59344
47466A051421Q2057K54944P240l86535o63667p73268o53076k04490M15251Q12803
47456e7320P78912M36574k3814m41518n75109l25256o1853k47957o94385p11935
47446a923661j14808M69794M75967O4837k90833l61039o0812O27231J291388J215282
47436A393346L19472n01909m82564J3792J39094j98743m00711k02488P3803J73867
$$ plain form
47503 1790025 1587520 2167967 2992797 3383242 3442588 3396870 2781265 1120127 -1041414
47494 -1041414 -2556516 -2878579 -2301816 -1352092 -539091 -398727 -1074016 -1938436 -2194363
47485 -2194363 -1809501 -1425326 -1433369 -1598925 -1549527 -1199745 -685052 -245877 -191821 -635545
47475 -635545 -1197988 -1243433 -493457 720697 1780462 2222020 1978568 1410765 1051421
47466 1051421 1133478 1388422 1395662 1009127 345460 -427808 -1080884 -1285374 -870123 -57320
47456 -57320 721592 1158166 1134352 692834 117725 -207531 -269384 -517341 -1211726 -1923661
47446 -1923661 -2038469 -1568675 -1092708 -1027871 -1318704 -1679743 -1740555 -1113324 178064 1393346
47436 1393346 1712818 1210909 728345 742137 881231 682488 281777 79289 153092 326959
47426C26959J50426k5764m61292q86706q00817k17166K50889K38211Q2943J91323
47416a150994L95534L00333n5588k94513k80827k14568j97641o7323K53238M99714
47406h12635L49032j33282n03251m37123j09905M8576n6052l7496M01286R19940
47396c70910Q38495r123r78128j295171q61361k19688J33418J82596J99391L59424
47386b021057O07379P27400M84832j29830p15178p26347j08352N13330N28415
47377h39408J01328q5809K12004N08052L29674j32123l39985r3156L52622O37508
47367F50707N51653J37470k59570k61093K7167M7170m22752q58292p23668k57297
47357a368505l6742p9871K903K01726J93013J13921M08256Q41237N79902m40152
$$ plain form
47426 326959 477385 451621 -9671 -896377 -1697194 -1914360 -1663471 -1425260 -1342317 -1150994
47416 -1150994 -755460 -455127 -510715 -805228 -1086055 -1300623 -1498264 -1565587 -1312349 -812635
47406 -812635 -463603 -596885 -1100136 -1537259 -1647164 -1598588 -1654640 -1692136 -1290850 -370910
47396 -370910 467585 458462 -519666 -1814837 -2676198 -2895886 -2762468 -2579872 -2380481 -2021057
47386 -2021057 -1413678 -686278 -201446 -331276 -1046454 -1772801 -1881153 -1367823 -839408
47377 -839408 -738080 -823889 -611885 -103833 225841 93718 -246267 -339423 13199 650707
47367 650707 1202360 1339830 1080260 819167 846334 893504 470752 -387540 -1111208 -1368505
47357 -1368505 -1405247 -1485118 -1482215 -1280489 -1087476 -973555 -565299 275938 855840 415688
47347D15688j098855n85630M07004O81234J84788j52181R1596L87768K75363j875
47337F04900r7197j49089l70044m83789r4521N30638N73420k82246j273971j394242
47327b436141o39209M3456R1885L4917N13753J155122J119305M68991J12152L70453
47317H34684M99063p5129q23183r16148l71039J57914L18682K61263J92696K02325
47307B81128L24742M32996K97454r600j14825K3054l3064l99969n23716j03809
47297A74391K49308o0768n85235n20470K3448L39323L44406M72010N75454R4397
47287A106264o63540n99419M80125J289689P58530n06634j115024o71155L2696
47278A11532K55627P0410l6429J51396L88316K97913j19840l65398k9789N40681
$$ plain form
47347 415688 -683167 -1268797 -861793 -180559 4229 -147952 -56356 331412 606775 604900
47337 604900 507703 358614 -11430 -495219 -589740 -59102 514318 232072 -1041899 -2436141
47327 -2436141 -3075350 -3031894 -2940009 -2905092 -2391339 -1236217 -116912 352079 464231 834684
47317 834684 1333747 1258618 435435 -480713 -851752 -693838 -375156 -113893 78803 281128
47307 281128 605870 1038866 1336320 1326720 1211895 1234949 1201885 801916 278200 174391
47297 174391 423699 362931 -222304 -742774 -719326 -380003 -35597 436413 1011867 1106264
47287 1106264 442724 -156695 323430 1613119 2371649 1865015 749991 78836 111532
47278 111532 367159 437569 401140 552536 940852 1238765 1118925 753527 723738 1264419
47268A264419N33813k89969j209189j367870p08991J09569N16941N35503N55423
47259f0351P27496O77189J027r68052j319936p32804L892Q5604j75643J2601N82244
47248a166733P96345N32311L56238L77371J07582m12090m46874J47520N23665
47239H15335J97949j64963Q6314N34547M99127J22080j07740k46577n22352o46933
47229E66787l16087P9596M1776j54754L8230M29822L87304j33314o18919q20430
47219d99989q25167n68932j6440M04152K92725j0403N5993K88454Q5847l92842
47209a186602l70986K77072Q04896P27035L46054J8193l10130o23158o15347k24009
47199a156982J94984M35207O57634Q92738Q59517M33784j74168p64843j181539
$$ plain form
47268 1264419 1798232 1508263 299074 -1068796 -1777787 -1668218 -1151277 -615774 -60351
47259 -60351 667145 1344334 1345361 377309 -942627 -1675431 -1671539 -1585935 -1761578 -1748977 -1166733
47248 -1166733 -370388 161923 518161 895532 1003114 591024 144150 291670 815335
47239 815335 1013284 848321 934635 1469182 1968309 2090389 1982649 1736072 1213720 566787
47229 566787 250700 330296 372072 217318 255548 685370 1072674 939360 320441 -499989
47219 -499989 -1325156 -1894088 -1910528 -1506376 -1213651 -1224054 -1168061 -879607 -793760 -1186602
47209 -1186602 -1557588 -1280516 -475620 251415 597469 615662 305532 -317626 -932973 -1156982
47199 -1156982 -961998 -526791 130843 1023581 1883098 2316882 2142714 1377871 196332
47190A96332j067752k62238N83185N71084j59390n41297j38682L06676K04484
47181c07598M0981M00882Q75719P01753n7355o88894q17576n89955j94940K04113
47171d32870K97337o6079n35128o12259k06793M05194Q83065Q67885J80550o92354
47161H8548q20008n377P41873M84982l29611n36719J05978P32488O83420K30310
47151A375884o1367m3742Q6705R9721j55320n94169q25867n73106j35564o8854
47141h95679m33792p40801o17007j56272L69171P64022Q83320P20333N31754N50427
47131I75476O07012L71303j06172m81147o58745p88582p67285k97290M68526Q70404
47121A93500N42970j29087n55568n87647m35085k81719k10145k45594k79192j53937
$$ plain form
47190 196332 -871420 -1133658 -550473 20611 -138779 -680076 -818758 -512082 -307598
47181 -307598 -266617 134265 1009984 1711737 1654382 965488 147912 -442043 -636983 -432870
47171 -432870 -135533 -201612 -736740 -1348999 -1555792 -1150598 -267533 600352 780902 88548
47161 88548 -731460 -736837 5036 490018 160407 -376312 -270334 462154 1145574 1375884
47151 1375884 1314517 1270775 1357480 1457201 1301881 707712 -118155 -691261 -826825 -895679
47141 -895679 -1329471 -2070272 -2687279 -2843551 -2474380 -1710358 -827038 -106705 425049 975476
47131 975476 1582488 1953791 1847619 1366472 707727 -80855 -848140 -1145430 -676904 193500
47121 193500 736470 607383 51815 -535832 -970917 -1252636 -1462781 -1708375 -1987567 -2141504
47111b141504O8502J75552J97597L90915P16382P41179K93464j56342j00321K95328
47101D80752M55927K04853q1479q2819M5886l6227l55458n84757m90006k76303
47091g19631l21379n68599m79687J86598Q32438P01018l5547m29437n8186M08170
47081d84242K04577m52735p11219k25996M66031O40528J76970l53114l15120K29293
47071h25027N14377O7816m95325k35643O41060R03121J00186o66448l51024M97215
47061A50308O79172J88807j0961K75669K13959n15672j054905o46246K95296Q76089
47051D51516Q34645M74948J9920m52361p67905p90193o08491l67496j33669j5456
47041a354542o9150n1291K60175M92384R6022n84129n44841K72154O34773j17304
$$ plain form
47111 -2141504 -2073002 -1897450 -1699853 -1308938 -592556 148623 442087 285745 185424 480752
47101 480752 936679 1141532 1060053 977234 1023120 986893 631435 46678 -443328 -719631
47091 -719631 -1041010 -1609609 -2089296 -1902698 -1070260 -369242 -404789 -834226 -892412 -484242
47081 -484242 -279665 -732400 -1443619 -1669615 -1203584 -563056 -386086 -739200 -1054320 -825027
47071 -825027 -310650 -242834 -738159 -973802 -332742 570379 670565 4117 -346907 150308
47061 150308 829480 1018287 1007326 1282995 1496954 981282 -73623 -719869 -424573 451516
47051 451516 1286161 1761109 1781029 1328668 560763 -229430 -837921 -1205417 -1339086 -1354542
47041 -1354542 -1423692 -1474983 -1214808 -722424 -626402 -1210531 -1755372 -1483218 -848445 -965749
47031i65749r08475n78751K36114J86959m92302l68931P41406J396877Q20094
47022F7242p680j05577O3356k33044n56999j63155N05350M01251m50911r62140
47012a442307n26473L34651Q55026Q25262M74979J14358n6232j18427k95262m05278
47002b39703R5701J086533J407980L22697j148888j404029m75674J30738k55069
46993d79714o80472l64103R0985m7367l42596j04386K76155J4161o07214o02281
46983b846832J46541P32957O03342J79431R144O1681N5562j00790l63862n90232
46973b113058m61884J48543P35907O36625j5301l94625j32279K74695L57029K97512
46963f66836L69983M09012K54992J48603K04634M0331n08279q26923l98319J86430
$$ plain form
47031 -965749 -1874224 -2452975 -2216861 -2029902 -2522204 -2891135 -2149729 -752852 67242
47022 67242 59562 -46015 17341 -215703 -772702 -935857 -430507 -29256 -480167 -1442307
47012 -1442307 -1968780 -1634129 -779103 46159 521138 635496 579264 460837 165575 -239703
47002 -239703 -144002 942531 2350511 2673208 1524320 120291 -355383 -224645 -479714
46993 -479714 -1160186 -1524289 -1433304 -1480671 -1823267 -1927653 -1651498 -1637337 -2244551 -2846832
46983 -2846832 -2700291 -1967334 -1363992 -1184561 -1175417 -1113736 -1058174 -1158964 -1522826 -2113058
46973 -2113058 -2574942 -2426399 -1690492 -1053867 -1069168 -1463793 -1596072 -1321377 -964348 -666836
46963 -666836 -296853 112159 367151 515754 720388 760719 252440 -574483 -972802 -786372
46953g86372l5108q72265j153158m51872K97439K00993l88206n39134k1039O24302
46943c124420Q91505P01952K71524O299K67956Q61986J046675M58066k91624m38324
46933F51595j80297l11533r12521j172416n90662L41288Q80026Q61493N11079
46924G8052k9577n83180p57994l48909L04908P03245P21248N00559R9142l90539
46914B96955o29557l82411M2205J05688k47897n32434l61441J28341M95059M28178
46904f57314J042l55699k29282K80024O00371L89040l8031j99199q9141m358P453
46893b95094J04841K40692K17745L2548k03411n06930p97328o82038R005O88097
46883a191873O25157l0667m85646m55304l62869m07767k40057K81422P50234Q79552
$$ plain form
46953 -786372 -821480 -1693745 -2846903 -3298775 -3001336 -2800343 -3188549 -3727683 -3748722 -3124420
46943 -3124420 -2232915 -1530963 -1259439 -1253140 -985184 -123198 923477 1381543 1089919 651595
46933 651595 471298 159765 -752756 -1925172 -2515834 -2174546 -1294520 -433027 78052
46924 78052 48475 -534705 -1292699 -1641608 -1336700 -633455 87793 588352 687494 296955
46914 296955 -332602 -715013 -672808 -567120 -815017 -1347451 -1708892 -1580551 -1085492 -657314
46904 -657314 -656272 -1011971 -1241253 -961229 -360858 28182 -9849 -209048 -298189 -302547 -295094
46893 -295094 -190253 50439 268184 300732 97321 -409609 -1206937 -1888975 -1879970 -1191873
46883 -1191873 -566716 -597383 -1083029 -1538333 -1901202 -2308969 -2549026 -2267604 -1517370 -637818
46873f37818Q60394Q17363N48102O8639k05891j07526M6280Q8044K18723L67565
46863B063875J06524m71592o21985j37765J82836j83968o16216m60372j56282
46854b94945l61165p10426m80557J16643L73354L15798L96266M06709j10027p10644
46844a058994n78050K4619J40403j61893J19363J020654J302484M36612m68329
46835G76869l52920L52985O91925N53293K93649j19730p03678r13950m12431J59095
46825C25107L9154m49917m19775J69712M80750P5343n35881o78222k89749J82400
46815a101078K93535m2153m70806n04399n8767M43280O21347N40084L94618J10785
46805B26446m39145j029120j192012o84567K70666J106188J297038Q52131L58828
$$ plain form
46873 -637818 222576 1039939 1588041 1656680 1450789 1343263 1389543 1477587 1696310 2063875
46863 2063875 2170399 1698807 1076822 939057 1121893 937925 321709 -138663 -294945
46854 -294945 -656110 -1366536 -1847093 -1730450 -1357096 -1041298 -645032 -238323 -348350 -1058994
46844 -1058994 -1637044 -1612425 -1472022 -1633915 -1514552 -493898 808586 1245198 776869
46835 776869 423949 776934 1468859 2022152 2315801 2196071 1492393 578443 166012 325107
46825 325107 364261 -85656 -505431 -335719 145031 220374 -315507 -993729 -1283478 -1101078
46815 -1101078 -807543 -849696 -1320502 -1824901 -1883668 -1440388 -819041 -278957 115661 226446
46805 226446 -212699 -1241819 -2433831 -3118398 -2847732 -1741544 -444506 407625 766453
46796G66453K55668K34784j77493o81036n75093L0271K78173p9032l65688k47391
46786e60384k36820n17796l98733L75429Q44200K87031m72611l00997M68136O76113
46776A63568J83058j69830o0169O2904k942n3319j44521l75607k54086N93314
46766e7630J322120P69490o40753j250593n06014M24276N86173L80291L25797
46757A353157Q9641n07344p24310q6182N79798K75869o56265j077831o28908O3118
46747a319257M02673L34166P0690j24989p9327L9822o8426j90674K39138J047702
46737C51518J195089K72757o89118o61937j10138j03939n89905o86993k82245
46728a304911p7411j92506K5891O89108J017974O36504K12194L36920O04086L67304
$$ plain form
46796 766453 1022121 1256905 1079412 398376 -176717 -146446 131727 52695 -312993 -560384
46786 -560384 -797204 -1315000 -1713733 -1338304 -494104 -207073 -679684 -980681 -512545 163568
46776 163568 346626 176796 116627 179531 176589 123270 -21251 -396858 -650944 -57630
46766 -57630 1264490 2033980 1393227 142634 -363380 60896 647069 1027360 1353157
46757 1353157 1442798 935454 211144 124962 704760 980629 324364 -753467 -1382375 -1319257
46747 -1319257 -916584 -582418 -511728 -636717 -716044 -676222 -744648 -935322 -696184 351518
46737 351518 1546607 1819364 1130246 468309 358171 254232 -335673 -1022666 -1304911
46728 -1304911 -1382322 -1574828 -1548937 -859829 158145 794649 1006843 1343763 1947849 2315153
46718B315153k33717o11606o25743n57187n14547l89794j96054k3388J60024L11253
46708c65606J50877m04724q67494p02255r1197L19691L61458M60218P61560P80102
46698D02630K31371l48334l41325k3518j33421o51143p80137k25751K88790J27944
46688a452894l18356l45687k9583R6064N5722K82328O34601M72799k22561o56225
46678a483792l65862J81287M15448L68508K17254j31769n35546m20235K91277
46669a463430P13371K01912n47410m83048J73086L08162l10155p49821m24037
46660b581370J76394M87346O23469P27537M78569j40511l35323M35935J367674
46651A239720J155995k24622j406427j360839n44408l7722r6604p4429M42139
$$ plain form
46718 2315153 2081436 1469830 844087 286900 -227647 -617441 -813495 -836883 -676859 -365606
46708 -365606 -214729 -619453 -1486947 -2189202 -2280399 -1960708 -1599250 -1139032 -377472 402630
46698 402630 634001 285667 -55658 -79176 -212597 -863740 -1643877 -1869628 -1580838 -1452894
46688 -1452894 -1771250 -2116937 -2146520 -2050456 -1994734 -1712406 -1077805 -605006 -827567 -1483792
46678 -1483792 -1849654 -1668367 -1252919 -884411 -667157 -798926 -1334472 -1754707 -1463430
46669 -1463430 -750059 -548147 -1095557 -1578605 -1405519 -1097357 -1407512 -2157333 -2581370
46660 -2581370 -2404976 -1917630 -1294161 -566624 -88055 -228566 -563889 -127954 1239720
46651 1239720 2395715 2171093 764666 -596173 -1140581 -1178303 -1274907 -1349336 -907197
46642i07197R98925R36142L11761j97353k06188m0789j53960m70291n64539k63393
46632e56882K16546N66066N42805L5217o65656q53198j72674O86348O67844k22530
46622B43886q25184m01317L65843M14150k17912o43043n14009l40073m45396m09844
46612b772899J58129Q70981J040824O04441J29720K0651J07328N2128j44476j93371
46602a26544P0993M71660O56936M22654j07030n60075n92723j75526L39893M98287
46592H98525J84433k27209k89035n1042j8319m30831q24239o09805L9416L23576
46582a004530q6899n53107l63932K46279M58128M6894l75477l19903n7503p3139
46572b083189l25741l88334m3197N70443J180770J478036J211752N00420j45562
$$ plain form
46642 -907197 91728 1027870 1339631 1142278 936090 895301 741341 271050 -293489 -556882
46632 -556882 -340336 225730 768535 803752 138096 -715102 -887776 -201428 466416 243886
46622 243886 -581298 -982615 -616772 -202622 -420534 -1063577 -1577586 -1917659 -2363055 -2772899
46612 -2772899 -2614770 -1743789 -702965 -98524 31196 51847 159175 211303 66827 -126544
46602 -126544 -55551 416109 1073045 1495699 1388669 828594 235871 60345 400238 898525
46592 898525 1082958 855749 566714 515672 497353 66522 -757717 -1367522 -1328106 -1004530
46582 -1004530 -1091429 -1644536 -2008468 -1762189 -1304061 -1257167 -1632644 -1952547 -2010050 -2083189
46572 -2083189 -2408930 -2797264 -2840461 -2270018 -1089248 388788 1600540 2100960 1955398
46563A955398l97616m90115p33427r49915q30015n55760m73804l45030L45385
46554b474899J341755J665806R27341q9330m62230j66903K68344N53526O20633
46545B184043L33029k17569m98868k06120J46644r5232o80423p54939j44514L52346
46535D18397R7904n31457p32443l39523P9240N2459k21245k31457J16526M09625
46525h81974L95631L95058P28201J015780O33873k05286n42681k0601N71139M60185
46515B549325p8458l81726m48732o16832o97237l01589K64159L33902L746M8270
46505F74828O57862J063495O35589k85351r16068r04498m65738m6055j1765l32474
46495F9825m88025k1942P84356J139738O57023k88531j060693j273652r11016
$$ plain form
46563 1955398 1557782 1067667 334240 -615675 -1445690 -2001450 -2475254 -2820284 -2474899
46554 -2474899 -1133144 532662 1460003 1370673 908443 741540 1009884 1563410 2184043
46545 2184043 2517072 2299503 1800635 1594515 1741159 1645927 965504 210565 66051 418397
46535 418397 516301 -15156 -747599 -1087122 -1007882 -955423 -1176668 -1408125 -1291599 -881974
46525 -881974 -486343 -91285 636916 1652696 2286569 2081283 1538602 1518001 2089140 2549325
46515 2549325 2470867 2089141 1640409 1023577 326340 24751 288910 622812 626558 674828
46505 674828 1332690 2396185 3031774 2746423 1830355 925857 460119 414064 402299 69825
46495 69825 -418200 -440142 344214 1483952 2140975 1852444 791751 -481901 -1392917
46486a392917l30226k9207m0082J88829Q52448J158938L99914p13192q13980J43819
46476e75656Q13963M71592o5821J02456O62709Q35464N45960J81228j55222n16412
46466B300261p41714p07401n15088j52232M56933Q74501M54091m64541o51594
46457H53216K02655Q13507J87467q30601q90744j45754K56506L2252j63912j10785
46447B03807j95772m03484k82479J33723L64159L62989M39752M40817L589m86432
46437E80669k66538M80488P63775L36733Q534J90854K44999l17352r87599j154925
46427a20362j005322r32136p48521j34923O22469R36030O66781J84298n2403K29033
46417c55056Q74340J190011N62730o36401j319889j042618m48429j16903K37712
$$ plain form
46486 -1392917 -1723143 -1752350 -1792432 -1603603 -751155 407783 807697 94505 -719475 -575656
46476 -575656 238307 709899 644078 746534 1409243 2244707 2790667 2971895 2816673 2300261
46466 2300261 1558547 851146 336058 183826 640759 1515260 1969351 1504810 853216
46457 853216 1055871 1869378 2056845 1226244 335500 189746 446252 478504 314592 203807
46447 203807 8035 -395449 -677928 -544205 -180046 182943 622695 1063512 1067101 580669
46437 580669 314131 794619 1558394 1895127 1903661 2094515 2339514 2022162 1034563 -120362
46427 -120362 -1125684 -2057820 -2806341 -2941264 -2318795 -1382765 -715984 -531686 -584089 -355056
46417 -355056 519284 1709295 2272025 1635624 315735 -726883 -1175312 -1292215 -1054503
46408a054503R17775J364814R26067L352m38022k75271k90359q26576j172845
46399h45568n81534O24746J385703J133118L26047k20520k20896L5247K60494
46390A896837L81085K35265l55598r93505q05546L54449J355080J159386K99720
46381C527173O9256N68663P03301O5559m48478j84628K98267L24254J22337J02085
46371E147789L2128l10552m73842j12897K60603J22437j32218M1428K80991J268
46361D857135m34503l16480Q3398l0667m77294l20995M60189P92557J88515n18617
46351D283238m76850J05362N95786Q16767Q21929N08696m5064m04236l54611j84208
46341E666809r4441J08300M26852M27690J3029j97141J92972O11871L90668j14651
$$ plain form
46408 -1054503 -136728 1228086 2154153 2157505 1719483 1444212 1153853 327277 -845568
46399 -845568 -1427102 -802356 583347 1716465 2042512 1821992 1601096 1636343 1896837
46390 1896837 2277922 2513187 2157589 1164084 358538 712987 2068067 3227453 3527173
46381 3527173 3596429 4165092 4868393 4933952 4485474 4300846 4599113 4923367 5045704 5147789
46371 5147789 5179917 4869365 4395523 4282626 4543229 4665666 4533448 4574876 4855867 4857135
46361 4857135 4422632 4106152 4189550 4158883 3681589 3360594 3820783 4613340 4801855 4283238
46351 4283238 3806388 3911750 4507536 5324303 6146232 6654928 6609864 6205628 5851017 5666809
46341 5666809 5572368 5680668 6107520 6535210 6548239 6351098 6544070 7155941 7546609 7431958
46331G431958p2330M73115O77627K32255k42853k60815j44530l20738n46625k89822
46321F937242M81424J282980J659035J451588P75391L0057k95431j60266r7447
46312A2064573m58234q12675o05403j42784j78346n91997m32602M63437R08691
46303A0214660Q6835j036610j042581j95685P337q17667j422943r15968L7798
46294D915176M83844N11377O08836O26024K41497k16296k68778r3260o8533l0981
46284F708906K40484L34234j19033n72863l53551R2802j56603r02191j068531
46275D203654m37296J07261J28438J79535N45680O72768L12122J02349L78818
46266F193329M11348l75149j235170j068426j2856P96992P39401K19800j21591
$$ plain form
46331 7431958 7359628 7832743 8510370 8742625 8499772 8238957 8094427 7773689 7227064 6937242
46321 6937242 7418666 8701646 10360681 11812269 12587660 12617717 12322286 12162020 12064573
46312 12064573 11606339 10793664 10188261 10045477 9867131 9275134 8842532 9305969 10214660
46303 10214660 10301495 9264885 8222304 8026619 8033956 7216289 5793346 4877378 4915176
46294 4915176 5399020 5910397 6519233 7145257 7386754 7170458 6901680 6808420 6739887 6708906
46284 6708906 6949390 7283624 7164591 6591728 6238177 6330979 6174376 5272185 4203654
46275 4203654 3766358 3873619 4002057 4181592 4727272 5400040 5712162 5814511 6193329
46266 6193329 6604677 6229528 4994358 3925932 3913076 4710068 5449469 5669269 5547678
46257E547678o3196K53577N34425N02116J48007k51242m81660n39305l96550k6628
46247E227222K65838O9997m31287n89752l06220k03051n04074n74085m2983M65204
46237C376809L77881J31570K75988L85000j42707q15843p07326M1024N00978M48359
46227C871733M32109N57982L87191o953m2088K62229K85710m665j6077J86172
46217E913343j90661j128479j464373o47643L49511N85699N11774Q80966J254691
46208F064828P05559o00355j583138j643211j017138j17518O53126P86771K11414
46199C460338l33682k32997M0205k78940q77413q18835j18688K76760M2562j61753
46189I97557k6477j10824o39852q76380l19075L71529M05374J27935M01206J164711
$$ plain form
46257 5547678 5484482 5738059 6272484 6774600 6922607 6671365 6189705 5650400 5253850 5227222
46247 5227222 5493060 5563057 5131770 4542018 4235798 4032747 3528673 2954588 2911605 3376809
46237 3376809 3754690 3886260 4162248 4547248 4404541 3588698 2881372 2922396 3423374 3871733
46227 3871733 4303842 4861824 5249015 5242062 5199974 5462203 5747913 5743248 5727171 5913343
46217 5913343 5722682 4594203 3129830 2482187 2831698 3417397 3929171 4810137 6064828
46208 6064828 6770387 6170032 4586894 2943683 1926545 1809027 2462153 3248924 3460338
46199 3460338 3126656 2893659 2933864 2654924 1777511 958676 839988 1116748 1159310 997557
46189 997557 971080 860256 220404 -655976 -975051 -603522 -198148 -70213 330993 1495704
46179A495704J475555Q26410k63715r46509q50872k47294K24145J01077l33039
46170A481462k76064M50280Q74960J06580j198232j435758j52583J292729J471984
46161B615358N81136j29361q8996J57916O8283j17746M4167L43760J12385q16077
46151B770825j727204j764948q73761J85043O85447N89844L37446K36002K42509
46142F81203K04138Q6395l0388l9854J02859L04553M06431M07452M79910O26240
46132C228939N11598p9208p39957p89155j60861M17624L07282k65611n54536k42010
46122A634105K30999K66210j69272n29188l53160J79931M94105L67319J72177
46113B293226K49226L64703J13379l91805o71941n55119k06942L42697J051839
$$ plain form
46179 1495704 2971259 3797669 3533954 2587445 1736573 1489279 1713424 1814501 1481462
46170 1481462 1205398 1655678 2530638 2637218 1438986 3228 -149355 1143374 2615358
46161 2615358 3196494 3067133 2978137 3136053 3204336 3086590 3130757 3474517 3586902 2770825
46151 2770825 1043621 -721327 -1595088 -1410045 -724598 -134754 202692 438694 681203
46142 681203 885341 971736 941348 901494 1004353 1308906 1715337 2122789 2602699 3228939
46132 3228939 3740537 3661329 2921372 2132217 1971356 2388980 2696262 2430651 1876115 1634105
46122 1634105 1865104 2131314 1962042 1432854 1079694 1259625 1753730 2121049 2293226
46113 2293226 2542452 2907155 3020534 2628729 1956788 1401669 1194727 1537424 2589263
46104B589263J332402N24408r12282j572551q97694M4873J63674j15304K20418
46095A377207R98405J165841N00853j66841l54048m18588n78814n11630j65403
46086A846982j60j00565M7586N43987P40032L47089k5832K8404p934n18895q59203
46075B041491l98703K93503L37680K1300K41283Q61947Q60680L103p77396p51967
46065B732921j46725N81802J229184J414007O78281o01397j277288q54217q9234
46056C667334K54215M24905Q69770J202027Q30468P9059k41148q1457q5971m06891
46046F512311m91225j44745L5104l58247p80825n00412K64465N84142J17720l91494
46036D846794j15098P66130J342192J157993O50522L77369L10929J70926L0470
$$ plain form
46104 2589263 3921665 4446073 3533791 1961240 1063546 1108419 1272093 1156789 1377207
46095 1377207 2375612 3541453 4042306 3875465 3521417 3102829 2524015 2012385 1846982
46086 1846982 1846822 1746257 1793843 2337830 3077862 3424951 3399119 3427523 3419589 2900694 2041491
46075 2041491 1642788 1936291 2273971 2295271 2536554 3398501 4259181 4262284 3484888 2732921
46065 2732921 2586196 3167998 4397182 5811189 6489470 5888073 4610785 3756568 3667334
46056 3667334 3921549 4346454 5216224 6418251 7248719 7327778 7086630 7005173 6919202 6512311
46046 6512311 6021086 5876341 5911445 5553198 4772373 4271961 4536426 5120568 5238288 4846794
46036 4846794 4731696 5497826 6840018 7998011 8648533 9025902 9336831 9507757 9538227
46027I538227J15906K65334J57332j7350K82678J052438J580143J381891Q14052
46018A5170651N07316O17162R22388J286946J675043J966337K065883K038926
46010B6250652J982728J997469K358785L324844M622886N605809O172083P008536
46002E9323792Q545227J0215280J1314278J2135375J3509708J5426482J6802743
45995A47272885J6548050J4250032R894791L680882l597624j0451046j5373963
45988A62224007j7649750j7594948j6225052j4566630j3017845j1399522r668878
45981F2101382q202929p138650n972855m381842l003632k653944l042407l112996
45973B4592127k538540j994112j926036j947894j648659j187603q13529n03161
$$ plain form
46027 9538227 9654133 9919467 10076799 10059449 10342127 11394565 12974708 14356599 15170651
46018 15170651 15677967 16295129 17217517 18504463 20179506 22145843 24211726 26250652
46010 26250652 28233380 30230849 32589634 35914478 40537364 46143173 52315256 59323792
46002 59323792 67869019 78084299 89398577 101533952 115043660 130470142 147272885
45995 147272885 163820935 178070967 187965758 191646640 188049016 177597970 162224007
45988 162224007 144574257 126979309 110754257 96187627 83169782 71770260 62101382
45981 62101382 53898453 46759803 40786948 36405106 33401474 30747530 27705123 24592127
45973 24592127 22053587 20059475 18133439 16185545 14536886 13349283 12535754 12032593
45965A2032593l31086n03907p90296o56745k20576k38719q16871j056400m87641
45956F930352J03695k1819l63185j93757Q5045k52701p73912n40405J64812J98518
45946E336643m87418p22768j16996K63651k86318r08485n77960L16843P28899
45937C546091N44146M15326M88885L26562r6797k58440R197K45259J42010k2136
45927E340103M3187J30393j02034n78161q95988p81281k62988M21311R07772Q58641
45917E080955K77127l74864n75172k89738k284j65230p14834j170231j128004
45908I37725o02948L4262L60670K14223j47672k23994K28230Q44085R69880L81608
45898B996069m82462j046335j117927q01009k17760M13413O91803M20956l3202
$$ plain form
45965 12032593 11701507 11197600 10407304 9750559 9529983 9291264 8474393 7417993 6930352
45956 6930352 7034047 7012228 6649043 6455286 6540331 6287630 5513718 4973313 5138125 5336643
45946 5336643 4849225 4126457 4009461 4273112 3986794 3078309 2500349 2817192 3546091
45937 3546091 4090237 4505563 4994448 5321010 5224213 4965773 4974970 5220229 5362239 5340103
45927 5340103 5383290 5513683 5411649 4833488 3937500 3156219 2893231 3314542 4222314 5080955
45917 5080955 5358082 4983218 4408046 4118308 4116024 3950794 3235960 2065729 937725
45908 937725 334777 369039 729709 943932 796260 572266 800496 1644581 2614461 2996069
45898 2996069 2513607 1467272 349345 -451664 -669424 -256011 435792 856748 823546
45889H23546j35665J35689L55760L25245K51577K61479K09741Q5625J41132L92251
45879B846380M12186o3066o51407q01523n14082k32632k01268k98142l78537l97896
45869b79987k42430J84877O64341P61702L37052k56273n49403l64325J57847O90446
45859A103847Q39766M23984k12403m20374j4900L89391J28491n64790p93933k06216
45849F72863N01338N20005l5863m47095m40666l37408k67011N1865N83579P21708
45839A523315J89618l53607j86427L87275M94676R10l75754k00305J55638K38363
45829A873702J05891k0614j38702k28719j10715J86386L23248J58144n3417j73952
45819A921252m05374p17775o13164Q9471P07036M97403k97739p63818m59351K37518
$$ plain form
45889 823546 687881 823570 1179330 1504575 1756152 2017631 2227372 2312997 2454129 2846380
45879 2846380 3258566 3195500 2544093 1742570 1228488 995856 794588 496446 117909 -279987
45869 -279987 -522417 -337540 326801 1088503 1425555 1169282 619879 255554 413401 1103847
45859 1103847 1943613 2367597 2155194 1734820 1719920 2109311 2237802 1673012 879079 672863
45849 672863 1174201 1694206 1658343 1211248 770582 433174 166163 218028 801607 1523315
45839 1523315 1712933 1359326 1172899 1560174 2054850 2055760 1680006 1479701 1635339 1873702
45829 1873702 1979593 1958979 1820277 1591558 1480843 1667229 1990477 2148621 2095204 1921252
45819 1921252 1515878 798103 184939 274410 981446 1478849 1181110 417292 -42059 195459
45809A95459P45053P67841L21090k77676n36313k82779Q8317J64932O5336P9310
45799A330570J09030j6246l44M71791R69537P66800j8870n20973l96848k01763
45789B492684l12119k89461K66815Q81520P80582n2199q67896j006670m47206
45780A446050L09725O58621L50753k81188o77474o54657m42390j88637J64209
45771F85012M94467N00142K40477J90945N15089P29527L98192k31352o20435o39967
45761B262097n43161n11489n46606n94701n17973j61619L39522N75135L77675
45752F78880N2700p4529j3127J43201L90819N34372K35047l55021n41282o7022
45742I84038M10126L17823N1096J90152M19686J32788l24018j18396N33322N14389
$$ plain form
45809 195459 940512 1708353 2029443 1751767 1215454 932675 1020992 1185924 1251260 1330570
45799 1330570 1439600 1423354 1423010 1894801 2864338 3631138 3612268 3091295 2694447 2492684
45789 2492684 2180565 1891104 2157919 3039439 3820021 3767822 2899926 1893256 1446050
45780 1446050 1755775 2414396 2765149 2483961 1806487 1151830 709440 520803 685012
45771 685012 1179479 1679621 1920098 2111043 2626132 3355659 3753851 3522499 2902064 2262097
45761 2262097 1718936 1207447 660841 66140 -451833 -613452 -273930 301205 678880
45752 678880 731580 657051 643924 787125 1177944 1712316 1947363 1592342 1051060 984038
45742 984038 1394164 1711987 1763083 1953235 2372921 2505709 2181691 2063295 2596617 3111006
45732C111006l66825q98790k84518O22908O53928O1183n0952M72418P10306K41381
45722D272045k09799Q344M49937L32131k18196l94262J3278K99412p0006o64477
45712C818407p29697j95974M07028P54668R11051Q68460N24524J46501K34679
45703F739647P25444Q94347L71715k30357j14679O52806J329290J450144J170939
45694A2989296Q68204Q01803J022358J283666J208673Q11076O10150R38337J435039
45685B1968602J570498J337138J009288N73563q0548o99259r61075j008170j145173
45676B2564864j264410j148271j059420j354861j759666j762737j508331j469041
45668A1238127j441613q60987m4458L57q10968j315455p74420J24467M34523K02798
$$ plain form
45732 3111006 2744181 1845391 1560873 2183781 2837709 2898892 2847940 3320358 4030664 4272045
45722 4272045 4062246 4070590 4520527 4852658 4634462 4240200 4253478 4552890 4482884 3818407
45712 3818407 3088710 2892736 3299764 4054432 4965483 5833943 6358467 6504968 6739647
45703 6739647 7465091 8359438 8731153 8500796 8386117 9038923 10368213 11818357 12989296
45694 12989296 13857500 14659303 15681661 16965327 18174000 18985076 19595226 20533563 21968602
45685 21968602 23539100 24876238 25885526 26459089 26378541 25679282 24718207 23710037 22564864
45676 22564864 21300454 20152183 19092763 17737902 15978236 14215499 12707168 11238127
45668 11238127 9796514 8935527 8891069 8891426 8080458 6765003 5990583 6115050 6549573 6752371
45658F752371n9765l36456p81747j079596r16590o50289p75079j054866q55737
45649B42246j02743O59995R55801O78641L702n61247l87643M94350J147247P96309
45639C926658j46136o80276n38734k58065j54665K5474M40441Q01568Q45780O83551
45629D945596N02376K63991j27995n51948o92340l28554L43737P09372K97507
45620E361742n96358j159956j019828n74028k84992j52686p7377j41178k02184
45611A153155J57276Q27700R65516J74755p23845q09657l61176j99171k64734
45602I19819J10337Q34285J071100N77808L5229m0718J18331J30596r1909n49874
45592C115004j127917j378015j007677m74393l50280l02665L48916J234033J257922
$$ plain form
45658 6752371 6692606 6356150 5574403 4494807 3578217 2927928 2152849 1097983 242246
45649 242246 139503 799498 1755299 2433940 2437642 1876395 1488752 1983102 3130349 3926658
45639 3926658 3780522 3100246 2561512 2303447 2148782 2174256 2614697 3416265 4262045 4945596
45629 4945596 5447972 5711963 5583968 5032020 4339680 4011126 4354863 5064235 5361742
45620 5361742 4765384 3605428 2585600 2011572 1726580 1573894 1496517 1355339 1153155
45611 1153155 1310431 2138131 3103647 3278402 2554557 1744900 1383724 1184553 919819
45602 919819 1030156 1864441 2935541 3513349 3548578 3507860 3626191 3756787 3664878 3115004
45592 3115004 1987087 609072 -398605 -872998 -1223278 -1525943 -1177027 57006 1314928
45583A314928L57581l10962j64077Q8012j07941k64780k6065J9566m73526p06201
45573b73465k2317Q16872P50943R3586o7147L82949N98800K19325k90536n69979
45563A639031o69242n38360q5437L35427K88444N657J5637J88276j7126m96078
45553F66229o21282l74766l66645o25474l90032N83994J435158J376782P07329
45544B391293J38006k20454o09678q91478p34031k52785J04550J87606K36932
45535C49961M27015O32865O30667L79894J61828M06614J124056J552870Q57370
45526F523140o95240j779076j514893m44694L46574N46469N16427L74177l0331
45517C842553m49576m08721p8194j79925q12292j113937m99314M11688O70028
$$ plain form
45583 1314928 1672509 1361547 1197470 1285482 1177541 912761 886696 906262 432736 -273465
45573 -273465 -295782 521090 1272033 1365619 1298472 1681421 2280221 2499546 2209010 1639031
45563 1639031 969789 431429 345992 681419 969863 975520 991157 1179433 1162307 666229
45553 666229 44947 -329819 -696464 -1321938 -1711970 -1127976 307182 1683964 2391293
45544 2391293 2529299 2308845 1699167 807689 73658 -179127 -74577 113029 349961
45535 349961 776976 1409841 2040508 2420402 2582230 2988844 4112900 5665770 6523140
45526 6523140 5827900 4048824 2533931 2089237 2435811 2982280 3498707 3872884 3842553
45517 3842553 3392977 2984256 2906062 2726137 1913845 799908 300594 712282 1382310
45508A382310L16554J13971K56124J89795k64754m56350R4499Q73078J045075
45499C550302N25946j36161n94664q19333o38502P5096P90255O87108j42416n97423
45489B700208o4137O67851N79047o6780k26482K22976K98687m88930j287734j093010
45479A241696j17223O16895O52220M46295N11824P92548R60354R16494Q22107
45470F843210Q32808R23661R11208O82343M80001P75169J597005K184488J798905
45461A7028798Q85073P99864K063253L432089L321295J811493M58210J75684K28462
45452C0204221l53138j239548j463827j084624j160654k094047k940416k709544
45444A7158423j664333q31515o93849r38524j208365j441284j483542r85753M1794
$$ plain form
45508 1382310 1698864 1812835 2068959 2258754 1994000 1537650 1632149 2505227 3550302
45499 3550302 4076248 3940087 3345423 2526090 1887588 1962684 2752939 3440047 3297631 2700208
45489 2700208 2636071 3303922 3882969 3816189 3589707 3812683 4111370 3622440 2334706 1241696
45479 1241696 1124473 1741368 2393588 2839883 3351707 4144255 5104609 6021103 6843210
45470 6843210 7676018 8599679 9510887 10193230 10673231 11448400 13045405 15229893 17028798
45461 17028798 17913871 18713735 20776988 24209077 27530372 29341865 29800075 29975759 30204221
45452 30204221 29851083 28611535 27147708 26063084 24902430 22808383 19867967 17158423
45444 17158423 15494090 14662575 13968726 13030202 11821837 10380553 8897011 7911258 7953052
45435G953052R32451R71531J81635p54989j282599j396247j273689q62046j17328
45426D351771N76538O86729K54591p8156Q4405M01177L70013Q839l58546o21345
45416E676016p61341n66325r548L72954J28574l04089j66911L83349M70153p8778
45406E144054m56091k16181P9920m8903k05918J6521K04257j18049n68486n31894
45396C299230j63025L747l7009k4491j31024n37660p23324j32861P38007R24101
45386C215691M76831L32485P41255Q96771K99690m80440p26647m68683j13014
45377D173939J67922L49020L83056L61695L90051K10639m94158j355660j524865
45368B661639p78304J97269P64614R45977R47818P81456N60639M97438M01799
$$ plain form
45435 7953052 8885503 9857034 10038669 9283680 8001081 6604834 5331145 4469099 4351771
45426 4351771 4928309 5615038 5869629 5791473 5875878 6277055 6647068 6655907 6297361 5676016
45416 5676016 4914675 4348350 4338802 4711756 4840330 4536241 4369330 4752679 5222832 5144054
45406 5144054 4687963 4471782 4551702 4502799 4296881 4313402 4517659 4399610 3831124 3299230
45396 3299230 3136205 3139952 3102943 3078452 2947428 2409768 1686444 1553583 2291590 3215691
45386 3215691 3692522 4025007 4766262 5663033 5962723 5482283 4755636 4286953 4173939
45377 4173939 4341861 4690881 5073937 5435632 5825683 6036322 5542164 4186504 2661639
45368 2661639 1883335 2080604 2845218 3791195 4739013 5520469 6081108 6578546 6980345
45359F980345j23290q25631r40053l88610M6510L1462J50164O26338O90534n1786
45349F195983o68234k87508M33299L49342l49311n74172j20687K41168J88915
45340E408795J36574K11320J10486j3389L45305R51310R43310K57536j64899M6205
45330H232553J5724q50043j635637j133094L14859J178470P54208l0007O8337
45321F915370J059773J774855J253242j41437j075684p15478L48262Q78851N13921
45312A0811675K0174L3092J80635j96276r42532j254969p54890R2505O02123N45052
45302I136589J84938n4638R9785N48265Q25033N33225j36245n15120k31898K88699
45292A0678633L16439k85826r19934j000048n36321J13133P11256J108817J076781
$$ plain form
45359 6980345 6857055 6031424 5091371 4702761 4749271 4780733 4930897 5557235 6247769 6195983
45349 6195983 5527749 5240241 5673540 6022882 5673571 5099399 4978712 5219880 5408795
45340 5408795 5545369 5756689 5867175 5853786 6199091 7150401 8093711 8351247 8186348 8232553
45330 8232553 8248277 7398234 5762597 4629503 4944362 6122832 6877040 6847033 6915370
45321 6915370 7975143 9749998 11003240 10861803 9786119 9070641 9418903 10297754 10811675
45312 10811675 10831849 10864941 11045576 10849300 9906768 8651799 7896909 7989414 8591537 9136589
45302 9136589 9321527 9266889 9366674 9914939 10739972 11273197 11136952 10621832 10389934 10678633
45292 10678633 10995072 10709246 9789312 8789264 8252943 8366076 9077332 10186149 11262930
45283A1262930N98901J26005N4638R6263k73678q48187q96780l74621n0326j60636
45273I534509Q4597J037121J585645O33037j008852j457039l06121Q93197Q37658
45264A1833752M195m47190l19110k17749l91190n23914m27664k84745k47320k35668
45254H743397j48305P118J81974K92059K10929n6752k46326o7734M27863Q70138
45244A0214361J004552R85818J132921J469735J721220J809958K046954K557800
45236B2943319K817424K277867J293160P02172M71579l56368k059147l527526
45228B4562480l778268l284214k931155k486178j315850k3762J35143o90870r93264
45219I194062j83362N68349K02289p60020j211534q80782j23092P69511J371689
$$ plain form
45283 11262930 11861831 11987836 12042474 12138737 11865059 11016872 10120092 9745471 9695145 9534509
45273 9534509 9619106 10656227 12241872 12874909 11866057 10409018 10102897 10996094 11833752
45264 11833752 11837947 11390757 11071647 10853898 10462708 9938794 9511130 9226385 8979065 8743397
45254 8743397 8595092 8602210 8784184 9076243 9287172 9230420 8984094 8916360 9344223 10214361
45244 10214361 11218913 12204731 13337652 14807387 16528607 18338565 20385519 22943319
45236 22943319 25760743 28038610 29331770 30033942 30505521 30149153 28090006 24562480
45228 24562480 20784212 17499998 14568843 12082665 10766815 10743053 10878196 10187326 9194062
45219 9194062 9010700 9579049 9781338 9021318 7809784 6929002 6805910 7575421 8947110
45210H947110J092929O9994o49942n00117k05086m85039p96680l15609N59224
45201G716784Q16749M43313K41670L62716K35833j44161q5517M80800O46912j11991
45191A0603108j078173j278388p12904j13462R5038J23591L32094P63204J096656
45182I830764R32180K10435o04413q81073l86233N41077J254170J181211K36339
45173A2314457r19811j308086o45070K81830N50997J45287l04015m74802n14637
45164I126150m73687k28479N0197n5025n71856r90964q98048m45240r6680j29474
45154E286894m23865n97475m03796q7531j24266m82771n31696N0779P30050R01586
45144D317909P65396Q41810J020389P92631J48874m79059r51395j369512j496362
$$ plain form
45210 8947110 10040039 10110033 9460091 8959974 8754888 8269849 7473169 7157560 7716784
45201 7716784 8533533 8976846 9218516 9581232 9817065 9672904 9587387 10068187 10715099 10603108
45191 10603108 9524935 8246547 7533643 7420181 7515219 7638810 7970904 8734108 9830764
45182 9830764 10762944 10973379 10368966 9487893 9101660 9642737 10896907 12078118 12314457
45173 12314457 11394646 10086560 9441490 9723320 10274317 10419604 10115589 9640787 9126150
45164 9126150 8652463 8423984 8474181 8419156 7847300 6856336 5958288 5513048 5416368 5286894
45154 5286894 4863029 4265554 3861758 3774227 3649961 3167190 2635494 2686273 3416323 4317909
45144 4317909 5083305 5925115 6945504 7738135 7887009 7407950 6456555 5087043 3590681
45135C590681j010330j99598L71210P35288J239211J575429J112320J43916k87783
45126G270344N8902L47060J48177O2499M63630P62008N17661K72189N65289J017940
45116A1485699J152192J290162J786944K107830J615180O92130J27696j35547
45108B0122286o55135j268572j269075o45679j83935l27643p45917j054625j224748
45099A2746957j201392q02955j69016K11100P3187l70505p63706q54668n17356
45090H351646O6448L54942J9628n14743n35960M0135O44849Q33393O38930K64425
45080A0163693j08296k84241k58979l22704n36474l71574N17215J401291J186139
45071A1386070j7163q98892p09791j69462k27198o69815o07626J18511P47821
$$ plain form
45135 3590681 2580351 2380753 2751963 3487251 4726462 6301891 7414211 7558127 7270344
45126 7270344 7329246 7676306 7824483 7886982 8350612 9112620 9630281 9902470 10467759 11485699
45116 11485699 12637891 13928053 15714997 17822827 19438007 20130137 20257833 20122286
45108 20122286 19467151 18198579 16929504 16283825 16099890 15772247 15026330 13971705 12746957
45099 12746957 11545565 10742610 10573594 10784694 10857881 10487376 9723670 8869002 8351646
45090 8351646 8418094 8773036 8792664 8277921 7741961 7782096 8426945 9260338 9899268 10163693
45080 10163693 10055397 9771156 9512177 9189473 8652999 8281425 8798640 10199931 11386070
45071 11386070 11368907 10470015 9760224 9590762 9363564 8693749 8086123 8204634 8952455
45062H952455P03499K79982R1180K27043K55405n4990l47258j86302K63025M42513
45052A0626552K39190J33620L79964N75153L62473M8580N6131K16444J56232k4930
45042A2769409p4092j59215m00624k54767P04513J685458J455435J65644p07951
45033A5183810l82860L42848M99069J92071j9230p0373j15428j7013L13264O24451
45023A6550609Q07764J078817J324120J000877J60971k01979N20835J542652J716470
45014B4501136J043943M40278M54163R08321J402626J527400R88344J47875n814
45005C1408272R11208J947376K009774J276040O22588K05512l64263q54598o22783
44996C6539126J38829N09157K33625q228J92630N13860P99368J397960K294186
$$ plain form
45062 8952455 9655954 9935936 10027116 10254159 10509564 10454574 10107316 9921014 10184039 10626552
45052 10626552 10865742 10999362 11379326 11954479 12316952 12365532 12421663 12638107 12794339 12769409
45042 12769409 12695317 12536102 12135478 11880711 12585224 14270682 15726117 15891761 15183810
45033 15183810 14800950 15143798 15642867 15834938 15815708 15745335 15629907 15612894 15926158 16550609
45023 16550609 17358373 18437190 19761310 20762187 20923158 20721179 21242014 22784666 24501136
45014 24501136 25545079 25985357 26439520 27347841 28750467 30277867 31266211 31414086 31408272
45005 31408272 32319480 34266856 36276630 37552670 38175258 38380770 38016507 37161909 36539126
44996 36539126 36677955 37187112 37420737 37412509 37605139 38118999 38918367 40316327 42610513
44987D2610513K818351K634288K261330K247749K537797K983415L697974M464839
44979F6256256M568898L817127L121057L446873M665799O013888P211070Q461340
44971A07562308R708596J0635990J1287241J2066607J3105843J4107053J4894188
44964A93367826J5771391J7173014J9073843K0825977K1616604K1134438J9674368
44957C28637461J7462243J4154465R406142L701815j990357p284811j2362895
44950C51724063j6898545j9936118k1155671k1396277k1436213k1038484j9789382
44943B10073373j8106795j6639873j5297263j3716910j2161829j1026394r913165
44936A13211144q247494o509268n732185n884041n859520n120927m223854l536071
$$ plain form
44987 42610513 45428864 48063152 50324482 52572231 55110028 58093443 61791417 66256256
44979 66256256 70825154 74642281 77763338 81210211 85876010 91889898 99100968 107562308
44971 107562308 117270904 127906894 139194135 151260742 164366585 178473638 193367826
44964 193367826 209139217 226312231 245386074 266212051 287828655 308963093 328637461
44957 328637461 346099704 360254169 369660311 373362126 371371769 364086958 351724063
44950 351724063 334825518 314889400 293733729 272337452 250901239 229862755 210073373
44943 210073373 191966578 175326705 160029442 146312532 134150703 123124309 113211144
44936 113211144 104963650 98454382 92722197 86838156 80978636 75857709 71633855 68097784
44928F8097784k626541j399126p19640j116292j671620j147833K76633J321159
44920F1014524J403106J237849J649236K567575L440733M066304M647064N325927
44912H5352318O026929O676331P325147P997180Q523503Q611240Q098747P150943
44904A45762338O216994N786979O100642O960124P815224Q164359P898543P088045
44896B01793248N440006K349468k237709p290743j1413372j3971070j5175351
44889A59494477j5277677j4271004j2426298j0527729r245588q559897q026548
44882H1159736p376643o663423o033905n564486n205197m775963m139495l415850
44874C7984774k854947k494459k183900j948082j988117k227714k223783j750010
$$ plain form
44928 68097784 65471243 64072117 63352477 62236185 60564565 59416732 59693365 61014524
44920 61014524 62417630 63655479 65304715 67872290 71313023 75379327 80026391 85352318
44912 85352318 91379247 98055578 105380725 113377905 121901408 130512648 138611395 145762338
44904 145762338 151979332 157766311 163866953 170827077 178642301 186806660 194705203 201793248
44896 201793248 207233254 209582722 207345013 200054270 188640898 174669828 159494477
44889 159494477 144216800 129945796 117519498 106991769 97746181 89186284 81159736
44882 81159736 73783093 67119670 61085765 55521279 50316082 45540119 41400624 37984774
44874 37984774 35129827 32635368 30451468 28503386 26515269 24287555 22063772 20313762
44866B0313762j190528j080625j419371j678895j418674p35177j48083q8567m17085
44857A2136757m92052R5331R17558J136806N14896l66347r18663j127939j178910
44848A0717437r92027m76857Q1257K55922n7727o19662j076342j084014n28431
44839F219556J87891M36521J57658m6455J41558K48718j28460n25698l26433J70078
44829F534934K11272j43483j28351M07998P11145L30089k19209l39112j77420
44820G187863j25670j18801r0q6157o75856j270503j011548J13553J112345J185037
44810F310173O21614K72842M70897Q04264Q08134N30406L44108M07335M83405
44801A1053178K70327k25588p16651r73989j032326j034647r79373p51104m04962
$$ plain form
44866 20313762 19123234 18042609 16623238 14944343 13525669 12790492 12642409 12553842 12136757
44857 12136757 11644705 11740036 12657594 13794400 14309296 13942949 13024286 11896347 10717437
44848 10717437 9725410 9248553 9329810 9585732 9528005 8908343 7832001 6747987 6219556
44839 6219556 6407447 6843968 7001626 6955171 7096729 7345447 7216987 6691289 6364856 6534934
44829 6534934 6746206 6602723 6474372 6882370 7593515 7923604 7704395 7365283 7187863
44820 7187863 7062193 6943392 6943302 6857145 6181289 4910786 3899238 4012791 5125136 6310173
44810 6310173 6931787 7204629 7675526 8479790 9287924 9818330 10162438 10569773 11053178
44801 11053178 11323505 11097917 10381266 9407277 8374951 7340304 6360931 5609827 5204865
44792E204865k54783n05549q54692p25327m404P11499Q49029O07039N86014Q23326
44782F437017P58396K14815k08764l8947L24061K48376j48352k68275k3758J40467
44772G435036J42840M38246J123375J543253J201767N99748O37311J393848K020194
44763A6535618J844947J144397O21643M22579L0369q87001j875526k175316j638795
44754A4022915q66399m53544m23686m85065n13705n65649o45805p04341p08788
44745H655933n53616j14934M05061M55575k19965j094741j348858p61990J36214
44736E558679O79240N78169l192n67517n96097n8447M55043L58757k53980p56703
44726E393952o69406l3965O56196P41037l6731j011743j085539p0505R52092J043754
$$ plain form
44792 5204865 4950082 4444533 3589841 2864514 2860110 3571609 4420638 5027677 5613691 6437017
44782 6437017 7195413 7410228 7201464 7162517 7486578 7734954 7586602 7318327 7294569 7435036
44772 7435036 7577876 8016122 9139497 10682750 11884517 12484265 13121576 14515424 16535618
44763 16535618 18380565 19524962 20146605 20569184 20599553 19712552 17837026 15661710 14022915
44754 14022915 13156516 12702972 12279286 11794221 11280516 10714867 10069062 9364721 8655933
44745 8655933 8102317 7987383 8392444 8848019 8628054 7533313 6184455 5422465 5558679
44736 5558679 6237919 6816088 6812896 6245379 5649282 5590835 6045878 6404635 6150655 5393952
44726 5393952 4724546 4690581 5346777 6087814 6051083 5039340 3953801 3883296 4835388 5879142
44716E879142N89059M58803O28725N14384J84222J71630L58333J47594l65780
44707H566112m68073l1160L85471N85839Q11177Q35920K25484m94645l12634M78417
44697A0581908M74459n32832j084596m55415K13084O5917N4758J006200J795591
44688A2119074J142886o7472j74153N28464N00365k45102k23091Q45982J529279
44679A5956232J025812J83876j51572j48229N7797Q08575J752867J718099N06545
44670B1710002m56872p8598R28698J362094J259043J317287J450516J070336L25537
44661B8888043N561L70881Q56051Q78790M09098k03647n95336o43332n48303n27606
44651B8890200m27115J5117N37979N20070j42337q81337j286194j473915j528030
$$ plain form
44716 5879142 6468201 6927004 7555729 8070113 8254335 8425965 8784298 8931892 8566112
44707 8566112 8098039 8066879 8452350 9038189 9849366 10685286 10910770 10416125 10103491 10581908
44697 10581908 11056367 10523535 9438939 8983524 9196608 9262525 9317283 10323483 12119074
44688 12119074 13261960 13194488 13020335 13548799 14049164 13804062 13580971 14426953 15956232
44679 15956232 16982044 17165920 17014348 16866119 16923916 17732491 19485358 21203457 21710002
44670 21710002 21253130 21174532 22103230 23465324 24724367 26041654 27492170 28562506 28888043
44661 28888043 28893604 29264485 30120536 30999326 31408424 31204777 30609441 29966109 29417806 28890200
44651 28890200 28463085 28478202 29016181 29536251 29393914 28512577 27226383 25752468 24224438
44642B4224438j296095r39179q94832j022306o44214J86013M19604l80729j107310
44633A8545390o41961M38619P15579l4906p35294o73391k54255j25138l97736
44624A6836907q02951r59589m69309O61932J700501J851491J252658P75402Q74042
44615B1721084J230117J554252K040169K766140L252893L106035K774123L110502
44607D1555315M169180M872771M135630K090892j70953j983908l623647n227458
44599D5817822n962307n078132l355007k418688k649150k854973k217805j421956
44591A9859804j354279j729625j769848j440208j182882j039447q27175o69986
44583I846354o50977m75755j40405k72408j043311j480846q17433J90163M20112
$$ plain form
44642 24224438 22928343 21989164 21094332 20072026 19427812 19613825 20033429 19652700 18545390
44633 18545390 17903429 18342048 19057627 19022721 18287427 17614036 17359781 17234643 16836907
44624 16836907 16033956 15074367 14605058 15266990 16967491 18818982 20071640 20847042 21721084
44615 21721084 22951201 24505453 26545622 29311762 32564655 35670690 38444813 41555315
44607 41555315 45724495 50597266 54732896 56823788 56652835 54668927 51045280 45817822
44599 45817822 39855515 34777383 31422376 29003688 26354538 23499565 21281760 19859804
44591 19859804 18505525 16775900 15006052 13565844 12382962 11343515 10516340 9846354
44583 9846354 9195377 8719622 8579217 8306809 7263498 5782652 4965219 5155382 5575494
44574E575494K07712O52885J580569J731809Q35068l6251k55248l46777o60227
44565I285034p10241k65702J04699N7465L284J89828K67136J51836K65039M99424
44555I847802R6812r06944j297606m58977N87550P68962N22141P59001J230909
44546A1149650J131743O24383N05847Q01316Q71777O30254N79792Q59838J230296
44537A8384896J773844K633890L271627L038678K401756K560769L825676N338404
44529D3229540O447786P367217Q334051R102911R501434R521651Q560859N612113
44521A07677562P90001m171464p601467r404658j0296322j0323556r130198p233568
44513E0306330n883145n560948n458351m680745l352349k221485j645093j375971
$$ plain form
44574 5575494 5783206 6436091 8016660 9748469 10583537 10547286 10292038 9945261 9285034
44565 9285034 8574793 8309091 8413790 8471255 8474539 8664367 8931503 9083339 9348378 9847802
44555 9847802 9944614 9037670 7740064 7281087 7868637 8637599 9159740 9918741 11149650
44546 11149650 12281393 12905776 13411623 14212939 15084716 15714970 16294762 17154600 18384896
44537 18384896 20158740 22792630 26064257 29102935 31504691 34065460 37891136 43229540
44529 43229540 49677326 57044543 65378594 74481505 83982939 93504590 102065449 107677562
44521 107677562 108467563 104296099 96694632 87289974 76993652 66670096 57539898 50306330
44513 50306330 44423185 38862237 33403886 28723141 25370792 23149307 21504214 20128243
44505B0128243j121830r19941r60921j276950j681326j927529j870349j500219
44497H869178q89303j72785M16948O11116L28337j64933m38714l19491o9977p4291
44487H096085l90754p25488q15804o61862l49614J02176N44908O06119J45910
44478F551676l28878j69885M58942O23751j63071j190958j377212n69318L71806
44469D206853O30428J95369l67237n41498k29525K55333M99587M01713K31413
44460E282436K16356K61484K31312K54448M59435O21802M43639N4619j42123m0223
44450G643185J23169K18149L21989L97534K80999K8058q1109Q4570M32825Q97720
44440A0347089J408823J715429J703793J781063K345831K948329K776114K092951
$$ plain form
44505 20128243 19006413 18086472 17125551 15848601 14167275 12239746 10369397 8869178
44497 8869178 7979875 7807090 8224038 8835154 9163491 8998558 8559844 8240353 8170376 8096085
44487 8096085 7705331 6979843 6164039 5502177 5152563 5254739 5799647 6405766 6551676
44478 6551676 6222798 6052913 6511855 7135606 6972535 5781577 4404365 3835047 4206853
44469 4206853 4837281 5032650 4665413 4123915 3894390 4149723 4649310 5051023 5282436
44460 5282436 5498792 5760276 5991588 6246036 6705471 7327273 7770912 7825531 7683408 7643185
44450 7643185 7766354 7984503 8306492 8704026 8985025 9013083 8931974 9016544 9449369 10347089
44440 10347089 11755912 13471341 15175134 16956197 19302028 22250357 25026471 27119422
44432B7119422K260004L887140N825796O664348O455716O057990N367325L406168
44424F7043909L5281l518844o000986p137496p170419o293946m943535l893187
44416B8120777l501136l287114k665798j708658q35681j87799K73831M14622J35997
44407A6759041l04433n56149n37729k68708L03732R70045J176378P68487M46561
44398A8757225Q93664J746618K075646J655232J059797O69953L72296J91927L68570
44389B7790928O75877M74903l08484j001597j268859j620200k416848l083109
44381A9242611k887352j973790j050331m97691l12017m60745p00680m69043L89468
44372A1280430J128198R78610K17997k86286k72199j07817N5542L08361L80068
$$ plain form
44432 27119422 29379426 33266566 39092362 45756710 52212426 58270416 63637741 67043909
44424 67043909 67079190 63560346 57559360 50421864 43251445 36957499 32013964 28120777
44416 28120777 24619641 21332527 18666729 16958071 16122390 15934591 16208422 16623044 16759041
44407 16759041 16454608 15898459 15360730 15092022 15395754 16365799 17542177 18310664 18757225
44398 18757225 19650889 21397507 23473153 25128385 26188182 26858135 27230431 27422358 27790928
44389 27790928 28466805 28941708 28633224 27631627 26362768 24742568 22325720 19242611
44381 19242611 16355259 14381469 13331138 12833447 12521430 12060685 11360005 10890962 11280430
44372 11280430 12408628 13387238 13605235 13318949 13046750 12938933 12994475 13302836 13682904
44363A3682904o4053o16629n71604j60214l02416r97283j121982k58736M23721
44354A0013708j06187j058373r01363M21955J468647J311332N59168K34782M80349
44345A2424018P75850Q86814J051736J398635J642731J505889J212471J312651
44337B2210795K003793K842404L227285K950772K121306Q54779n96037j653233
44329C3961864j875483j550496j367135j545402j756553j810796j822078j703842
44321B0530079j193805n04565k61239n70676q03093n48024j22566J49676M24963
44312A7100750P07840N12999k43271o91750r2055J024901J547954J264095R13859
44303B2045322J002880J252183J170302O77886J89702K98621J143829J979724
$$ plain form
44363 13682904 13618851 13002222 12430618 12270404 11967988 10970705 9848723 9589987 10013708
44354 10013708 9907521 8849148 7947785 8369740 9838387 11149719 11708887 11943669 12424018
44345 12424018 13199868 14086682 15138418 16537053 18179784 19685673 20898144 22210795
44337 22210795 24214588 27056992 30284277 33235049 35356355 36211134 35615097 33961864
44329 33961864 32086381 30535885 29168750 27623348 25866795 24055999 22233921 20530079
44321 20530079 19336274 18831709 18570470 17999794 17196701 16648677 16526111 16675787 17100750
44312 17100750 17808590 18321589 18078318 17386568 17294513 18319414 19867368 21131463 22045322
44303 22045322 23048202 24300385 25470687 26148573 26338275 26636896 27780725 29760449
44295B9760449J893624J140338J002177J948209K874829K836552K505744K880776
44287D6842698L488335L279391K653047K947620M199744N088376N135739N305404
44279G8940354O100191O674988O487510O427808P405309Q884009R773224R968139
44271A40661532J0096674J0380194J0646295J1011984J1691620J2355650J2338029
44264B19181978J1333704R475945P008033M280347J743485m79811k734292n215262
44256B44594127p576752r490437j1143280j2724935j3845436j4035396j3537868
44249A62240023j3015382j2624275j1935853j0757396r542479q818107q459977
44242H7086554p783047o435804n089084m841685n697643o126693m821124k583333
$$ plain form
44295 29760449 31654073 32794411 33796588 35744797 38619626 41456178 43961922 46842698
44287 46842698 50331033 53610424 56263471 59211091 63410835 68499211 73634950 78940354
44279 78940354 85040545 91715533 98203043 104630851 112036160 120920169 130693393 140661532
44271 140661532 150758206 161138400 171784695 182796679 194488299 206843949 219181978
44264 219181978 230515682 239991627 246999660 251280007 253023492 252543681 249809389 244594127
44256 244594127 237017375 227526938 216383658 203658723 189813287 175777891 162240023
44249 162240023 149224641 136600366 124664513 113907117 104364638 95546531 87086554
44242 87086554 79303507 72867703 67778619 62936934 57239291 51112598 46291474 43708141
44234D3708141j494116k208694l185049k927106j874578j366638j665873j989070
44226B6997017j908952j697543j547699j354623j181983j214380j281347j042856
44218A5767634o29729n52196r41363j326992j224279o33664M0690L41402Q7501
44209A0929004m71605r11431j075542j049335p72568j68098L42411J56353m89303
44200F489886o19129k504L49377k39452r37585o87320J13601L16479j33306k91289
44190D358758J02722K80672j74279o92929o81474k53409K27027O03798P17689
44181D488575L73963k51882o53183n54980o9515N92776J078744P95712m20965
44172E379245j660928j745395o92596L37493N40795J55306l12650o61154o87079
$$ plain form
44234 43708141 42214025 40005331 36820282 33893176 32018598 30651960 28986087 26997017
44226 26997017 25088065 23390522 21842823 20488200 19306217 18091837 16810490 15767634
44218 15767634 15137905 14585709 13644346 12317354 11093075 10459411 10500101 10841503 10929004
44209 10929004 10457399 9545968 8470426 7421091 6648523 6480425 6822836 6979189 6489886
44200 6489886 5870757 5868253 6217630 5978178 5040593 4353273 4466874 4783353 4650047 4358758
44190 4358758 4461480 4742152 4567873 3874944 3193470 2940061 3167088 3770886 4488575
44181 4488575 4862538 4610656 3957473 3402493 3332978 3925754 5004498 5800210 5379245
44172 5379245 3718317 1972922 1280326 1617819 2158614 2313920 2001270 1340116 653037
44163F53037k00041M22928M90327K7473k27432m2960n277l20239l11029L57240
44153H44027Q96356N78509p8811j71703J58008J15553l10098l35759K58744O99789
44143B654615L68410l10730n04300q7137K89028J07825l95795o46396n21234m07347
44133E46939m80037l76420J33762N74827L88165j49693k88964M3810J90166j30379
44123D52176m27825l43616j99616l06870l82116j13514J97565P1868l80347n66239
44113a998534j36092O46063J133138Q42799p233n77302l52889J57342J78780j22910
44103b36838L576M89192M82947q0696j80433N55474J005219K37907r60929j232096
44093H3323n46733P3710J59939M7942o4277k54661k99199Q0791N23324M33326
$$ plain form
44163 653037 452996 875924 1366251 1393724 1166292 1123332 1118055 797816 486787 844027
44153 844027 1740383 2318892 2240081 2068378 2226386 2341939 2031841 1696082 1954826 2654615
44143 2654615 3023025 2712295 2207995 2120858 2409886 2517711 2121916 1475520 954286 546939
44133 546939 66902 -309518 -175756 399071 787236 637543 348579 392389 582555 452176
44123 452176 24351 -319265 -518881 -825751 -1207867 -1321381 -1123816 -1051948 -1432295 -1998534
44113 -1998534 -2134626 -1488563 -355425 487374 480141 -97161 -450050 -292708 -113928 -236838
44103 -236838 -233262 255930 738877 658181 477748 1033222 2038441 2276348 1315419 83323
44093 83323 -463410 -389700 -229761 -181819 -246096 -500757 -799956 -719165 -195841 237485
44083B37485k6209j51671J97615M92232M36112K06106j25503o02535q52954l89548
44073e78870M70863P92941L12766j83718j0586N60421R06811R28468Q95722Q44608
44063D939426N89945J74080o3254Q7382L46702J66634n54963j106491p14748L11460
44053D176173P86304K33385m44006l70651j4394k70105q72710q44836j80628J46479
44043B345011j88985m28684j15188J90388k6813l72747k54416K33200N92256N67399
44033B541421J79677l72872o12439j44722O49062Q82267L53315j74125j28881
44024C172703J39611J36154r78K4780M9758j43832l13910j80089O7347J40719
44014C092263J20681J44208R3996O060K52228Q28696J014693L41782n82077q74445
$$ plain form
44083 237485 211276 59605 257220 749452 1185564 1391670 1266167 663632 -189322 -578870
44073 -578870 -108007 684934 997700 813982 803396 1363817 2270628 3199096 4094818 4939426
44063 4939426 5529371 5703451 5640197 5727579 6074281 6240915 5685952 4579461 3864713 4176173
44053 4176173 4962477 5195862 4751856 4381205 4366811 4096706 3223996 2379160 2198532 2345011
44043 2345011 2156026 1727342 1612154 1802542 1775729 1402982 1148566 1381766 1974022 2541421
44033 2541421 2721098 2348226 1735787 1591065 2240127 3122394 3475709 3301584 3172703
44024 3172703 3312314 3448468 3447490 3472270 3522028 3378196 3064286 2884197 2951544 3092263
44014 3092263 3212944 3357152 3451148 3457208 3709436 4538132 5552825 5894607 5312530 4438085
44004D438085n79494l62150l66931j74870K99374O32487N66367K39836j93572
43995D499132o22140p40500l27323K94881O00858N83597O04048O32304K69093
43986E793950m70439j004247r15044l39988M13468J123574J478010J210411N66593
43977G856288J39211P8131o6999n67323j079117j203111j003729p05584l20185
43968C127582J04831K70206M3561k17863j47384P7508L8652k76124n18409n11797
43958A990763l47169o0699L73483P73673Q77392P55443P12426P28618M48847j01470
43948F151307k73080L24593J044372R03213k5683n74721j9365R40942J157070
43939I628648N09797k13971o30842j107617j747221j908105j191354k48156O0050
$$ plain form
44004 4438085 3858591 3496441 3129510 2954640 3254014 3886501 4452868 4692704 4499132
43995 4499132 3876992 3136492 2809169 3104050 3704908 4288505 4892553 5524857 5793950
43986 5793950 5323511 4319264 3404220 3064232 3477700 4601274 6079284 7289695 7856288
43977 7856288 7995499 8073630 8006631 7439308 6360191 5157080 4153351 3447767 3127582
43968 3127582 3232413 3502619 3546180 3328317 3180933 3258441 3297093 3020969 2502560 1990763
43958 1990763 1643594 1582895 1956378 2730051 3607443 4362886 5075312 5803930 6252777 6151307
43948 6151307 5878227 6202820 7247192 8150405 8124722 7550001 7530636 8471578 9628648
43939 9628648 10138445 9924474 9293632 8186015 6438794 4530689 3339335 3091179 3151229
43930C151229j05859Q4533P55058J111494O56217j38154o06545o79209n25630
43921C703134l0545P93786J319275R61371J34472k02454N8071K5976p22567j363209
43911D677310j072021l78493l72119r13793p61918M14055J293027P70126l62494
43902C293680n67679J86872N29864j25023p82351n71582p1640j83867n64384k31868
43892I12022P01338J032321K14692q48374j053313m36847J56955K76967K37870
43883A193631M87742J007624J359667J162520N01195j24787l25265k19761j50781
43874D891785j28790Q2101L64820K41859l45009p33569m04558K19239L40783p0242
43864D458419k95849J0705L41420J57764l15307m63276j12418L74219N93849L48079
$$ plain form
43930 3151229 3045370 3129903 3884961 4996455 5652672 5514518 4907973 4228764 3703134
43921 3703134 3672589 4466375 5785650 6747021 6881493 6679039 6737110 6763086 6040519 4677310
43911 4677310 3605289 3226796 2854677 1940884 1178966 1593021 2886048 3656174 3293680
43902 3293680 2726001 2912873 3442737 3317714 2535363 1963781 1892141 1708274 1143890 912022
43892 912022 1613360 2645681 2860373 2011999 958686 521839 678794 955761 1193631
43883 1193631 1681373 2688997 4048664 5211184 5712379 5587592 5262327 5042566 4891785
43874 4891785 4762995 4845096 5209916 5451775 5106766 4373197 3968639 4187878 4528661 4458419
43864 4458419 4162570 4173275 4514695 4672459 4357152 3893876 3781458 4155677 4749526 5097605
43854E097605l82442j266674j568948q04533N01960J206566Q48080J17850j64751
43845C584713m6148m2076k15043k35938j02073j21389k36505l3953M52222N79931
43835C583741M1665n56394m91435O9916L73539J90881Q2542N02388J073565J005766
43825E876174Q2683r75087j193387l67687O85586J003282N14489k5763r7536k174
43815E500580k06349n24447m13416J19981M49582K04747k65116m93529n61089
43806C810944q00031j078401q64268m4345P44530Q59534M69612K77557N45624
43797C920756Q30791P41433M88066M15201L79539L0775n20757q03872o58667l49712
43787D473553n5250K78995N66543N65823L37254K36890L17409K14820j87574m79232
$$ plain form
43854 5097605 4715163 3448489 1879541 1075008 1576968 2783534 3631614 3749464 3584713
43845 3584713 3538565 3496489 3281446 3045508 2943435 2822046 2585541 2551588 3003810 3583741
43835 3583741 3625406 3069012 2577577 2647493 3021032 3211913 3294455 3796843 4870408 5876174
43825 5876174 5958857 4983770 3790383 3422696 4108282 5111564 5626053 5600290 5502754 5500580
43815 5500580 5294231 4769784 4356368 4476349 4925931 5130678 4865562 4372033 3810944
43806 3810944 3010913 1932512 1068244 1023899 1768429 2627963 3097575 3375132 3920756
43797 3920756 4751547 5492980 5981046 6396247 6775786 6806561 6285804 5481932 4823265 4473553
43787 4473553 4418303 4697298 5263841 5829664 6166918 6403808 6721217 6936037 6748463 6269231
43777F269231l67050j31102j15466j96940j36482p6058k56621n25163n30393k16312
43767C717644J69719L41147O6549o21099j111597o67195M51350R30237N0561j178960
43757B148356j283563k56469O37802O63832K36828j24744m32775o65322m66864
43748D57081K40279R55337J195936R57816M71215k8696k43520l8054K48438K26658
43738D442490J15542L50770O64982L98875k86948n00672q4805O9211m57854q64224
43728C847367n18361q0614l62555q96313o97259J05464N12858K39647j0193K16867
43718B356908N62174O28501N06211L26164n4764o52398j116496j149374q50817
43709E56109m90777j95399N0053L05710O23696R10749Q95193M46113j49153m58303
$$ plain form
43777 6269231 5902181 5771079 5655613 5458673 5322191 5246133 4989512 4464349 3933956 3717644
43767 3717644 3887363 4228510 4295059 3673960 2562363 1895168 2346518 3276755 3327316 2148356
43757 2148356 864793 608324 1246126 1909958 2146786 2022042 1589267 923945 457081
43748 457081 697360 1652697 2848633 3806449 4277664 4248968 4005448 3967394 4215832 4442490
43738 4442490 4558032 4908802 5573784 5972659 5685711 5185039 5100234 5169445 4711591 3847367
43728 3847367 3329006 3248392 2885837 1989524 1292265 1397729 1910587 2150234 2140041 2356908
43718 2356908 2919082 3547583 4053794 4379958 4325194 3672796 2556300 1406926 556109
43709 556109 65332 -130067 -80014 225696 849392 1760141 2655334 3101447 2952294 2493991
43699B493991l77955j27560R4793K06440J44299l9934j18703J0008J17587J1789
43689B414755j02700L5709K64381K53636M9475p8271j43322k96705l32489N8768
43679B123237N81157N14745k64035r81928q95835j13931O74027R12266M81198
43670C030901l27256r29890q53992k28601L14336L12398j52033p14926j042613
43661e91676q85944k19028N93078J099397J268134J340025J246307P09357n5867
43652D503783m01582k02179q7049m06118o39997l17138J22628M1888l28154l21295
43642A964787J4615P7615j42993j9104N28035O91500r408q94743j022678m44161
43632G43465O741r5824l51862k53473J49093M21128L10518j7008k08022q5515
$$ plain form
43699 2493991 2116036 1988476 2083269 2289709 2434008 2394074 2275371 2285379 2402966 2414755
43689 2414755 2312055 2347764 2612145 2865781 2915256 2836985 2693663 2396958 2064469 2123237
43679 2123237 2704394 3219139 2955104 1973176 1077341 963410 1637437 2549703 3030901
43670 3030901 2703645 1773755 919763 691162 1005498 1317896 1165863 450937 -591676
43661 -591676 -1477620 -1696648 -1103570 -4173 1263961 2603986 3850293 4559650 4503783
43652 4503783 4102201 3900022 3812973 3406855 2766858 2449720 2572348 2614236 2286082 1964787
43642 1964787 1979402 2057017 1914024 1894920 2422955 3114455 3105047 2210304 1187626 743465
43632 743465 750206 654382 302520 49047 198140 619268 929786 912778 704756 619241
43622F19241K07052L90686L36672J25016j28520l80622n90225o62324n06793j01480
43612f91297M58253Q81454P83889J20025n46303n39833J03747O46277N77609J67817
43602A961638q4846j37350k01050k24832l8855K25450L34867L90350N71925O34413
43592C431710K58912k11038j03562M91730P58103M47767K79005O33579P33961
43583F720167j45107j316891j482711n39332L60365M24345L107k78720l26786
43574C418437k93151j73333O582Q0931M9446R8899K20161K43936K94067O47646
43564D593621J071063R61231L38293j3986K72269N38060J49655m80694n58420
43555F871092j02447K10083N7180l45577q35729j387176j691386j289270k12454
$$ plain form
43622 619241 826293 1216979 1553651 1678667 1550147 1169525 579300 -83024 -589817 -691297
43612 -691297 -233044 648410 1432299 1552324 1006021 466188 569935 1216212 1793821 1961638
43602 1961638 1876792 1739442 1538392 1313560 1274705 1500155 1835022 2225372 2797297 3431710
43592 3431710 3690622 3479584 3376022 3867752 4625855 5073622 5352627 5986206 6720167
43583 6720167 6575060 5258169 3775458 3236126 3596491 4020836 4023943 3745223 3418437
43574 3418437 3125286 2951953 2958535 3039466 3088912 3187811 3407972 3651908 3945975 4593621
43564 4593621 5664684 6625915 6964208 6950222 7222491 7760551 7910206 7429512 6871092
43555 6871092 6768645 6978728 7035908 6690331 5854602 4467426 2776040 1486770 1274316
43546A274316Q94712J337585Q65603j98941j067170j021558k14385L83218K19639
43537B473019p6813K70924Q76148P55508p3137n62141k01952L62426M91175M17421
43527D732578N62658P53054O38495L29878J16792p705j01608J4378L48728M67302
43517G854550J49540n8347M37930J255147J394168N59798n00812j025197j013469
43508I053308q17236n28103j59361k0818l60035p72189n40286L18115Q38795K84441
43498G296631q03753j212819n80639K39358L96380M6361j64405j30962k73685
43489D812467p07019r71547o48333R8080O89698P05088K78424k8347J16354L07686
43479D652551p6105p82130p19811N23538J801162J710959L77110q23171j024463
$$ plain form
43546 1274316 2169028 3506613 4372216 4173275 3106105 2084547 1870162 2253380 2473019
43537 2473019 2396206 2667130 3543278 4298786 4225649 3663508 3461556 3823982 4315157 4732578
43527 4732578 5295236 6048290 6686785 7016663 7133455 7125750 7024142 7038520 7387248 7854550
43517 7854550 8004090 7945743 8383673 9638820 11032988 11592786 11091974 10066777 9053308
43508 9053308 8236072 7707969 7548608 7527790 7167755 6395566 5855280 6173395 7012190 7296631
43498 7296631 6492878 5280059 4699420 4938778 5335158 5381519 5217114 5086152 4812467
43489 4812467 4105448 3133901 2485568 2583648 3273346 3978434 4256858 4228511 4344865 4652551
43479 4652551 4576446 3794316 3074505 3598043 5399205 7110164 7487274 6664103 5639640
43470E639640n43486J8780M11321M61906Q5314k72724j2578O13317O78339k0558
43460G059271o07036m88149j68417k08607k53929J78853O64068M94791j04241
43451F566604k67304K23936P10126O49374K13031j49402k70045k88041l64798
43442G023481m25690j74917M48346Q85033M81339n30856j154575r16064l82267
43433E253830j15257J07536N35186P14000K71414k31028j02821L43134L90109
43424G166103J86351L66675P42846N43712j45036l60604K07599P55686O65282
43415A0128614K52314j04630n91134j230829j433536r11336l30131l51210n94284
43406D833838k97555M16052P25957L42588k10358m92342o23170p43480o16714
$$ plain form
43470 5639640 5096154 5114934 5526255 5988161 6073475 5800751 5788173 6401490 7079829 7059271
43460 7059271 6452235 5964086 5795669 5587062 5333133 5511986 6176054 6670845 6566604
43451 6566604 6299300 6523236 7233362 7882736 8095767 7946365 7676320 7388279 7023481
43442 7023481 6597791 6422874 6871220 7756253 8237592 7706736 6552161 5636097 5253830
43433 5253830 5138573 5246109 5781295 6495295 6766709 6535681 6432860 6775994 7166103
43424 7166103 7352454 7719129 8461975 9005687 8860651 8500047 8707646 9463332 10128614
43415 10128614 10380928 10276298 9685164 8454335 7020799 6109463 5779332 5428122 4833838
43406 4833838 4536283 4952335 5678292 6020880 5810522 5318180 4695010 3951530 3334816
43397C334816r4377M39693N27275L46165M85419R82199J081268K81103p54577
43388F628984r14193j44912M66432K58061j34609P3879N17209L16683m23209p15091
43378E929234j76909M81780N78318K83858Q5804O4169K5084j07663l04240m78722
43368F380713l95663P3242N23566L52833l41226p34734l68608K55385M52202K41019
43358F438729J02422K40838M56416M82097J76660l79313q20694q21972n63959
43349E311224m79330m92898j01523O37681R18724L59008l28226l69097k5820n4
43339E429689k56792k32242J16797K86850J03572j07232j56050j39163j2252L19503
43329E352680N01518K0743r03648j384955j020079l79787j03356p7649J18374
$$ plain form
43397 3334816 3240439 3680132 4207407 4553572 5038991 6021190 7102458 7383561 6628984
43388 6628984 5714791 5569879 6036311 6294372 6159763 6233642 6750851 7067534 6644325 5929234
43378 5929234 5752325 6234105 6812423 7096281 7182085 7246254 7271338 7163675 6859435 6380713
43368 6380713 5985050 6058292 6581858 6934691 6593465 5858731 5490123 5745508 6197710 6438729
43358 6438729 6541151 6781989 7238405 7720502 7897162 7517849 6697155 5875183 5311224
43349 5311224 4831894 4338996 4237473 4875154 5793878 6152886 5824660 5455563 5429743 5429689
43339 5429689 5172897 4940655 5057452 5344302 5447874 5340642 5184592 5045429 5033177 5352680
43329 5352680 5854198 5874941 4971293 3586338 2566259 2186472 2083116 2005467 2123841
43320B123841M23300M10705o2113o93844j050613p88418J70943J358887J889182
43311C781870J283610Q1273p23965p76066n28579m10397l32409j57904j50094
43302B067339n45337r77554q34073j26072M59857M63986J97088J87821M45281
43293A338336N97636N35103N18352O95447Q45574O71805J56747m20773p25510
43284D212717o61431n05138o08897q66468p28236J3554P46558P58027K18440q2583
43274B496543J23352L24513J55678p3415k3929P7861j01977l76088l39418n3605
43264B209515M2739j64849k45355K05978R66093J298715P28682l26149r07441
43255C807928o34122j68490k45951o01098m65066J30761M08140J75288J22981
$$ plain form
43320 2123841 2547141 2957846 2895733 2201889 1151276 362858 533801 1892688 3781870
43311 3781870 5065480 5146753 4422788 3646722 3118143 2707746 2375337 2217433 2067339
43302 2067339 1522002 544448 -289625 -415697 44160 508146 705234 893055 1338336
43293 1338336 1935972 2471075 2989427 3684874 4530448 5202253 5359000 4938227 4212717
43284 4212717 3551286 3046148 2437251 1570783 842547 856101 1602659 2360686 2579126 2496543
43274 2496543 2619895 2944408 3100086 3026671 3002742 3080603 2978626 2602538 2263120 2209515
43264 2209515 2252254 2087405 1842050 2048028 3014121 4312836 5041518 4715369 3807928
43255 3807928 3173806 3005316 2759365 2158267 1693201 1823962 2232102 2407390 2530371
43246B530371N31468O77646P3098n88924m73626J01054K47573j40757m81321n28511
43236A948071m39338j61337L33401M88429j60274r11502n91971O48408J348556
43227B502443P92031k9500J131N45784N60114p3082n46967m24645r4450J4228
43217C247087o931R3647K71889L32594K92161L67917O55664R64957J029955Q14315
43207H063255M88708J30024l35012p91431q20925k10352N92256Q72229M48116
43198H436868k07024n91334o33986n66176o17086q36439j007566q05851k40192
43189B931214K42470L64440M56981Q52133J109764N30020o34031j236995o90327
43180C925669L10036P83143N89724J87748j80733n09291n85677j45166N92616
$$ plain form
43246 2530371 3061839 3739485 3812583 3223659 2750033 2851087 3098660 2957903 2476582 1948071
43236 1948071 1508733 1347396 1680797 2169226 2008952 1097450 505479 1153887 2502443
43227 2502443 3294474 3264974 3266105 3811889 4372003 4298921 3751954 3327309 3232859 3247087
43217 3247087 3240156 3333803 3605692 3938286 4230447 4598364 5254028 6218985 7248940 8063255
43207 8063255 8551963 8681987 8346975 7555544 6734619 6524267 7116523 7988752 8436868
43198 8436868 8229844 7638510 7004524 6438348 5821262 4984823 3977257 3171406 2931214
43189 2931214 3173684 3538124 3995105 4847238 5957002 6487022 5852991 4615996 3925669
43180 3925669 4235705 5018848 5608572 5796320 5615587 5106296 4520619 4375453 4968069
43171D968069R80370O11517k59268r49088r07451j79485N58908N71843j90912
43162E204503j036883j290977r20701l29115J75778M83208N05649K44261n1935
43153B983788q8474Q9818J29244j45262m16880j91107N76900J286077J249166
43144E473270M39046m66803q07572n23278J0284M33390N40898L01020P738J11825
43134E519818N68763O75163j2925r09210j093798n31621L2617J93834J69313Q3427
43124D695381j87030m12165j25174M66001N23953j54712p20529n06550P8426L47518
43114D005119K79024J20815k12123o75596p03008o0570M70932J38847n20679m26812
43104B415949L63232P64528L52592j16011j9135K41344L4194n23484q27409n83432
$$ plain form
43171 4968069 5948439 6559956 6300688 5351600 4444149 4264664 4823572 5395415 5204503
43162 5204503 4167620 2876643 1955942 1626827 1802605 2285813 2791462 3035723 2983788
43153 2983788 2895314 2985132 3114376 2969114 2552234 2361127 2938027 4224104 5473270
43144 5473270 5912316 5445513 4637941 4114663 4124947 4558337 5099235 5400255 5407993 5519818
43134 5519818 6088581 6763744 6750819 5841609 4747811 4216190 4248807 4442641 4611954 4695381
43124 4695381 4508351 4096186 3971012 4437013 4960966 4806254 4085725 3579175 3657601 4005119
43114 4005119 4284143 4404958 4192835 3517239 2814231 2753661 3224593 3363440 2842761 2415949
43104 2415949 2779181 3543709 3896301 3780290 3761155 4002499 4036693 3513209 2685800 2102368
43094B102368K86N06555N75111J62472l17388l90151j27427k1956k15836k95412
43084A978622l411L01488J84824k13128m09384k34857P4647L08752M78886O04776
43074C071215N74131L11301m4288k48451k39984k30950m13502o11128m22264J80488
43064A926568N99443K29493p34042j394263j129890k56778M03689M36342J15688
43055A96250j19189j63711r9637J69836P53921J300824J180472L47361m18386
43046C147741m92924k23099k53130m44333k25237K41674K13158l19633n17423
43037A126794j25739O3279l40210n01381K24520J002719O95220l48013q22406
43028I74783l71823J80350K57382P0605j69143n07943o80183k75743M10684O04237
$$ plain form
43094 2102368 2102654 2609209 3184320 3346792 3029404 2639253 2511826 2489870 2274034 1978622
43084 1978622 1975211 2276699 2461523 2248395 1839011 1604154 1678801 1987553 2466439 3071215
43074 3071215 3645346 3956647 3912359 3663908 3423924 3192974 2779472 2168344 1746080 1926568
43064 1926568 2526011 2755504 2021462 627199 -502691 -759469 -355780 80562 196250
43055 196250 77061 -86650 -186287 -16451 737470 2038294 3218766 3566127 3147741
43046 3147741 2654817 2431718 2178588 1734255 1509018 1750692 1963850 1644217 1126794
43037 1126794 1001055 1064334 724124 222743 447263 1449982 2145202 1797189 974783
43028 974783 602960 783310 1040692 1111297 942154 434211 -245972 -521715 -111031 493206
43018D93206K43602N9489L29175M91455K34424K5890K00930L82068K29090j1002
43008B678327j17034k90325n14365l27338K52638M09904j92480o10211N0683J132946
42998B472745J254934K52312p18846q71784o28873o83365j005452j060579n51960
42989a540868K84684Q93795Q50461K63326l31210n66853n04645k16564L92972
42980d74902J072208J142333M76179j9513L54513Q86493M74261n26974p28215
42971B656383O4660M33667m28746j377261j023328K25986R32383P49205N15645
42962B748594N32739J15215r25206j559192r48242K42965P42741L93813J22051
42953A465478L90188N93139J79106l85908k79685M62026R73275P13948J20027
$$ plain form
43018 493206 736808 796297 1125472 1616927 1851351 1877241 2078171 2460239 2689329 2678327
43008 2678327 2561293 2270968 1756603 1429265 1681903 2091807 1899327 1289116 1339799 2472745
42998 2472745 3727679 3979991 3261145 2389361 1760488 1077123 71671 -988908 -1540868
42989 -1540868 -1256184 -362389 488072 751398 420188 -146665 -651310 -867874 -474902
42980 -474902 597306 1739639 2215818 2196305 2550818 3437311 3911572 3384598 2656383
42971 2656383 2721043 3154710 2725964 1348703 325375 551361 1483744 2232949 2748594
42962 2748594 3281333 3396548 2471342 912150 -36092 206873 949614 1343427 1465478
42953 1465478 1855666 2448805 2627911 2242003 1962318 2424344 3397619 4111567 4231594
42944D231594l1925L77834O77648K22041q03421j513087j296022n22484o5516
42935A276662j93642l18711M9827N51531N36217N0859k33641O3064O78332J201243
42925C661741J414539J141040L07975o75564j106106q12261l91507l50118m10095
42916B779644n4538N66550P90891L96908q6921j20922J54132J93062j55732m28814
42906D034260k12396K07007J91328k76604m49738Q8657O70295M50995k64448m18941
42896D020415J56474M52491j09206p21986m74783J58960K4501q91323j322667
42887A292876m58072R77772J663752J185944K46621l27780l94254l37253l92636
42878C456970l47314N8543O15139P71036K79803m90246r31473p16250J4900P26679
$$ plain form
42944 4231594 4199669 4577503 5255151 5477192 4673771 3160684 1864662 1342178 1276662
42935 1276662 1083020 764309 814136 1365667 1901884 1952743 1719102 1782166 2460498 3661741
42925 3661741 5076280 6217320 6525295 5849731 4743625 3931364 3539857 3189739 2779644
42916 2779644 2725106 3291656 4082547 4479455 4392534 4271612 4425744 4618806 4463074 4034260
42906 4034260 3821864 4028871 4220199 3943595 3493857 3582514 4252809 4703804 4439356 4020415
42896 4020415 4176889 4629380 4520174 3798188 3323405 3482365 3506866 2615543 1292876
42887 1292876 834804 1812576 3476328 4662272 4908893 4581113 4186859 3849606 3456970
42878 3456970 3109656 3168199 3783338 4554374 4834177 4343931 3412458 2696208 2711108 3437787
42868C437787Q03581J51505n25577m75835P0702J74004m30292r08739n76815J55109
42858A875430N72916P14598R39223R98931M24449m72634q90532p24959o10105
42849B827317p52615n79643K15668J009158J041745M14142j21578j02665K33123
42840D184652L54807M9635l66718m37110j57012R464j71449k96946O3579O37418
42830C870320P91286M34719P0523J3336O8189J0235p4541j2036K44689O54106
42820F070826J035844J036262N00230j78065m41002k35281O5008K64697M34711
42811H553230N32488M62416M39899P54340J212514J356482J182715J077546J116270
42802A6687900J080706J106480J522026J988067J665537M91445n04568m95818
$$ plain form
42868 3437787 4241368 4392873 3867296 3391461 3462163 3636167 3205875 2297136 1720321 1875430
42858 1875430 2448346 3162944 4102167 5101098 5525547 5052913 4162381 3437422 2827317
42849 2827317 2074702 1495059 1710727 2719885 3761630 4175772 4054194 3951529 4184652
42840 4184652 4539459 4589094 4222376 3785266 3628254 3637718 3466269 3169323 3232902 3870320
42830 3870320 4661606 5096325 5166848 5180184 5248373 5258608 5184067 5172031 5416720 6070826
42820 6070826 7106670 8142932 8643162 8465097 8024095 7788814 7853822 8118519 8553230
42811 8553230 9085718 9548134 9988033 10742373 11954887 13311369 14494084 15571630 16687900
42802 16687900 17768606 18875086 20397112 22385179 24050716 24542161 24037593 23541775
42794B3541775K31556R85051J537042J873418J806857J393845J136900J226177
42786C3732621J134469N06441j27823j58596J08584k9530n87851j060269j333658
42777C2184388j674098k025713k058484j790784j518904j260033q99052p38283
42769B0219037j184182j931767k184205j753148j268084j157288j080993o39509
42761I019861o8338J58439K1202j51644k49772m69352r06019j325265j384815
42752D644297r94952m28660o7178k9370r7641o175L09168P38653J069814R97982
42742F135938L52541n65311j162289j219135j053731q73312m40456K88812P05606
42733B168663K96362m85333p20118k00873M77656Q30964Q54402O02834R7288l42222
$$ plain form
42794 23541775 23773331 24758382 26295424 28168842 29975699 31369544 32506444 33732621
42786 33732621 34867090 35373531 35245708 35087112 35195696 35166166 34578315 33518046 32184388
42777 32184388 30510290 28484577 26426093 24635309 23116405 21856372 20957320 20219037
42769 20219037 19034855 17103088 14918883 13165735 11897651 10740363 9659370 9019861
42761 9019861 8951523 9109962 9131164 8979520 8729748 8260396 7354377 6029112 4644297
42752 4644297 3649345 3220685 3153507 3124137 3026496 3020321 3329489 4068142 5137956 6135938
42742 6135938 6488479 5923168 4760879 3541744 2488013 1614701 1174245 1463057 2168663
42733 2168663 2465025 1979692 1259574 1058701 1536357 2367321 3221723 3824557 3921845 3579623
42723C579623l38646j10675k48429p35538q70566l64343J66874J42827j55406
42714A065721j41426J95414M62246N34843N41788M41702J16710k62908l93678
42705B560412k58834n6168J49091L43926K97085j86221p77747q32073j67365O86849
42695A758955J115044R97273N64038n765n90914r29671p51914j48618L96204M65729
42685B870361J38246j34016m5409K62498M34558L14357K3371k76133n06102n57268
42675B524463k77453K65405O41427M21542k84527q31647o93110j8109N77182O92923
42665C018096M45585J20052k03687n23870o34207k77925M23550R46776Q69535
42656D183905K89532k86376l80024R0935P37232J016632P62233L13650k2748m20833
$$ plain form
42723 3579623 3240977 3130302 2881873 2146335 1275769 911426 1078300 1221127 1065721
42714 1065721 924295 1119709 1581955 2116798 2658586 3100288 3216998 2954090 2560412
42705 2560412 2301578 2245410 2394501 2738427 3035512 2849291 2071544 1239471 1072106 1758955
42695 1758955 2873999 3871272 4435310 4429545 3838631 2908960 2157046 2008428 2404632 2870361
42685 2870361 3008607 2874591 2829182 3091680 3526238 3840595 3863966 3587833 3081731 2524463
42675 2524463 2247010 2512415 3153842 3575384 3290857 2459210 1766100 1747991 2325173 3018096
42665 3018096 3463681 3583733 3380046 2856176 2221969 1944044 2367594 3314370 4183905
42656 4183905 4473437 4187061 3807037 3897972 4635204 5651836 6414069 6727719 6704971 6284138
42646F284138j088165j584559j203841p9040P48796O25810O7161j30320r451j40663
42636C489866n80263p74010l48212N01957J315024J678538J413024Q08807M71744
42627G976475N80361O01037J61535k03071K00737J091775J616343J645958J780774
42618A5451924K150669K190261J721557J297209J174680Q42478j4744r00727j382793
42609B2530514j834761k646792l300344k996510j840757p15390k18217k99598
42601H678145o81684j028809r09788k21390M46123M29572q6707l14503K457K60818
42591F574234r3281q10182j194162r04255k29182K43078J47370l18847n82172
42582B832601l58361j4472l6550k97535k44899K37153O19747N01273J65512J04139
$$ plain form
42646 6284138 5195973 3611414 2407573 2328533 3077329 3703139 3770300 3639980 3630529 3489866
42636 3489866 2909603 2135593 1787381 2289338 3604362 5282900 6695924 7504731 7976475
42627 7976475 8556836 9157873 9319408 9116337 9317074 10408849 12025192 13671150 15451924
42618 15451924 17602593 19792854 21514411 22811620 23986300 24828778 24814034 23913307 22530514
42609 22530514 20695753 18048961 14748617 11752107 9911350 9195960 8977743 8678145
42601 8678145 7996461 6967652 6057864 5836474 6282597 6712169 6625462 6310959 6313416 6574234
42591 6574234 6480953 5670771 4476609 3572354 3343172 3586250 3733620 3414773 2832601
42582 2832601 2474240 2459768 2423218 2125683 1880784 2117937 2737684 3238957 3404469 3508608
42572C508608K82727K47414j44498m60960k55026L39539P64973P18429M62221
42563E463427L95660N09647M60337Q8521l86028o93817p93145p46362n44713j92536
42553C560991J84429M35275M93066L56311J16457J2626K20907N27974M82463j3723
42543F376776n28405o46125m12366p7927K63538N28413M68510K9424l38795j59144
42533E503899L82959O24515K69819l11047o44452o64097n61488m27397k49350
42524C923361j21400k35104o16440r59683q47426k17197M56020N85825P9610n97253
42514A450313r11398o60647M487O73202Q57047M45990k3495M8991M74324M81223
42504B840037j76408q91251j107930r00012m24387M10985J291969J334826L01286
$$ plain form
42572 3508608 3791335 4038749 3894251 3433291 3178265 3517804 4282777 5001206 5463427
42563 5463427 5859087 6368734 6829071 6917592 6531564 5837747 5044602 4298240 3753527 3560991
42553 3560991 3745420 4180695 4673761 5030072 5146529 5159155 5380062 5908036 6390499 6376776
42543 6376776 5848371 5202246 4789880 4711953 4975491 5503904 5972414 6001838 5663043 5503899
42533 5503899 5886858 6511373 6781192 6470145 5825693 5161596 4600108 4172711 3923361
42524 3923361 3801961 3566857 2950417 1990734 1143308 926111 1382131 1967956 2047566 1450313
42514 1450313 538915 -121732 -117245 555957 1413004 1858994 1835499 1884490 2358814 2840037
42504 2840037 2663629 1772378 664448 -235564 -659951 -248966 1043003 2377829 2679115
42495B679115p03652o14955Q0013K01260k43387k52400L48267O44482K91570Q7427
42485B517740M70796O63100K936q44791q69000j87679L53250N49147Q63487J337912
42475D856898J389041P52989l2568k64728J90749Q73229J152889P13489j02376
42466I529612m89183j7253P93396J070030P14329N32726J136466K064554K280270
42457A7614947J410083K15122k37006K83424J000488J045468L04001p05051j481136
42448A9450340j802792j608125j082458p69218j073501j619895j635985j083664
42440H774702p87940j146960j371066o02079O79835J165635M83312l52514m00302
42431F442623P492n7784p15585j161724q70755l39528l64358r09932j160987o83852
$$ plain form
42495 2679115 1975463 1360508 1440521 1641781 1398394 1145994 1494261 2138743 2430313 2517740
42485 2517740 2988536 3651636 3654572 2809781 1940781 1753102 2106352 2655499 3518986 4856898
42475 4856898 6245939 6998928 6966360 6701632 6892381 7765610 8918499 9631988 9529612
42466 9529612 9040429 9023176 9816572 10886602 11600931 12133657 13270123 15334677 17614947
42457 17614947 19025030 19240152 19003146 19286570 20287058 21332526 21636527 20931476 19450340
42448 19450340 17647548 16039423 14956965 14187747 13114246 11494351 9858366 8774702
42440 8774702 7986762 6839802 5468736 4866657 5546492 6712127 7195439 6842925 6442623
42431 6442623 6450115 6392331 5676746 4515022 3644267 3304739 2940381 2030449 869462 185610
42421A85610m5330J6566l34522l16048K64346P23142N48918J22830L8819K01394
42411A405725J24412j87154k66168P142K16172J04365n7055r519Q793l32159q17273
42400A97281q73044l69938J15626R7n43526p51187j65210Q34977J465819J348014
42390A258909P57313J85968j42264l10261m26537m23423j57422K98431N66361
42381A607075L54197q0234j47779K75375O09143L76611r5316j80254J32004L43104
42371C193926K75329J95555J99628J16204L7182K72081O57730N95633K662m33509
42361E112421k59160J05513R8844k09723n10315q26713j169147j139931n01115
42352G00674K67449N67632M77579L89057K70631m7561k45958M7079M56085L02411
$$ plain form
42421 185610 140280 156846 -177676 -493724 -229378 493764 1042682 1165512 1204331 1405725
42411 1405725 1530137 1342983 1076815 1083957 1300129 1404494 1347439 1337920 1346713 1014554 197281
42400 197281 -675763 -1045701 -930075 -929978 -1473504 -2224691 -2389901 -1554924 -89105 1258909
42390 1258909 2016222 2202190 2059926 1749665 1323128 899705 742283 1040714 1607075
42381 1607075 1961272 1881038 1733259 2008634 2617777 2994388 2899072 2718818 2850822 3193926
42371 3193926 3469255 3664810 3864438 3980642 4017824 4289905 4947635 5543268 5545930 5112421
42361 5112421 4853261 4958774 5057618 4847895 4337580 3510867 2341720 1201789 700674
42352 700674 968123 1535755 2013334 2402391 2673022 2625461 2379503 2426582 2882667 3185078
42342C185078l19370p09646o89084o99072p90798m36221M30000R90666N72158
42333A533711m46887j095876q12426J92935J185997J410335P35487j27080m23002
42324B153194k78192l12431n11235k82385L76001P15072M63468K53524M20851
42315B997867L59333k83632o81180j7067J059471J223516L56595l91279k80289
42306D343335K38587M55210K52179j50433n83933q17039o30502k57613k63368
42297B586423p44592j096809q32074k13289K13285L25427L04817J49493k13680
42288D79001n03599l03763K43229M28397q5317o40301l13386Q11844J560178J047420
42278B723703k00129q83104m90596K66933N67400M39728L62654M09220K97674
$$ plain form
42342 3185078 2865708 2156062 1466978 767906 -22892 -459113 -29113 961553 1533711
42333 1533711 1086824 -9052 -821478 -628543 557454 1967789 2703276 2576196 2153194
42324 2153194 1875002 1562571 1051336 768951 1144952 1860024 2323492 2577016 2997867
42315 2997867 3357200 3073568 2392388 2375321 3434792 4658308 5014903 4623624 4343335
42306 4343335 4581922 5037132 5289311 5138878 4554945 3737906 3107404 2849791 2586423
42297 2586423 1841831 745022 -87052 -300341 -87056 238371 543188 692681 479001
42288 479001 -24598 -328361 -85132 343265 257948 -382353 -695739 116105 1676283 2723703
42278 2723703 2523574 1640470 1149874 1416807 1984207 2423935 2786589 3195809 3493483
42269C493483M3676N183K84836N35126M62369J94651J2335l6161q9025k08599
42259D697874l25131l70245l55984l36368l37871l41487l47663m23919n87682
42250A271524o63015m54418j22142j19155n61574r03685n54812L08110Q78084
42241i21083O41953j04629o47655n16081K06771R58742J097638M95347k58859
$$ plain form
42269 3493483 3537159 3542342 3827178 4362304 4824673 5019324 5031659 4995498 4906473 4697874
42259 4697874 4372743 4002498 3646514 3310146 2972275 2630788 2283125 1859206 1271524
42250 1271524 608509 154091 31949 -87206 -648780 -1552465 -2107277 -1799167 -921083
42241 -921083 -279130 -383759 -1031414 -1547495 -1340724 -381982 715656 1211003 952144
$$ [...]
##END NTUPLES=NMR SPECTRUM
##END=
