##TITLE=31Pdec_DE-88m_TFA
CDCl3, 64 sc
 15.8.2025
##JCAMPDX= 6.0         $$ Bruker NMR JCAMP-DX V2.0
##DATA TYPE= NMR SPECTRUM
##DATA CLASS= NTUPLES
##ORIGIN= UXNMR, Bruker Analytische Messtechnik GmbH
##OWNER= root
$$ XWIN-NMR		Version 3.5
$$ Fri Aug 15 14:22:49 2025 Russian Standard Time (UT+4h)  she@DPX200
##.OBSERVE FREQUENCY= 81.013821
##.OBSERVE NUCLEUS= ^31P
##.ACQUISITION MODE= SIMULTANEOUS
##.ACQUISITION SCHEME= undefined
##.AVERAGES= 64
##.DIGITISER RES= 17
##SPECTROMETER/DATA SYSTEM= spect
##.PULSE SEQUENCE= zgpg30
##.SOLVENT NAME= DMSO
##.SHIFT REFERENCE= (INTERNAL, DMSO, 0, 198.062)
##AUDIT TRAIL= $$ (NUMBER, WHEN, WHO, WHERE, WHAT)
$$ ##TITLE= Audit trail, XWIN-NMR		Version 3.5
$$ ##JCAMPDX= 5.01
$$ ##ORIGIN= Bruker BioSpin GmbH
$$ ##OWNER= she
$$ F:/spectra/data/she/nmr/P31/2/pdata/1/auditp.txt
$$ ##AUDIT TRAIL=  $$ (NUMBER, WHEN, WHO, WHERE, WHAT)
(   1,<2025-08-15 14:22:02.06 +0400>,<she>,<DPX200>,
      <created by zg, POWCHK disabled, PULCHK disabled
       configuration hash MD5:
       00 E9 B6 7A A2 85 ED C7 34 08 36 98 17 FE 4E 26
       data hash MD5: 32K
       12 72 02 FF F1 B8 6A 7F 2D C6 04 83 74 AE 42 AE>)
(   2,<2025-08-15 14:22:05.00 +0400>,<she>,<DPX200>,
      <Start of raw data processing
       efp BC_mod = 2 LB = 1.5 FT_mod = 6 PKNL = 1 PHC0 = 1410.037 PHC1 = 24.09949 SI = 64K 
       data hash MD5: 64K
       C4 0B 05 14 C5 0A B4 13 24 4C 1B EE 77 7D 2E F9>)
(   3,<2025-08-15 14:22:18.89 +0400>,<she>,<DPX200>,
      <pk PHC0 = -0.4177158 PHC1 = 0 
       data hash MD5: 64K
       7F AF 78 BD 31 37 60 1F B9 0F B3 F6 DC 8F 52 CF>)
(   4,<2025-08-15 14:22:25.51 +0400>,<she>,<DPX200>,
      <abs ABSG = 5 
       data hash MD5: 64K
       86 7E 04 4C 48 19 7B 39 62 43 ED CA F4 00 C2 04>)
$$ ##END=
$$ 
$$ hash MD5
$$ 56 2F 6C 28 21 79 3B 4F 3E 55 4C D0 8A F5 11 EB
##$RELAX= 
##$RELAX= 
##$RELAX= 
##$RELAX= 
##$RELAX= 
##$RELAX= 
##$RELAX= 
##$RELAX= 
$$ Bruker specific parameters
$$ --------------------------
##$DU= <F:/spectra>
##$EXPNO= 2
##$NAME= <P31>
##$PROCNO= 1
##$TYPE= <nmr>
##$USER= <she>
##$AMP= (0..31)
100 100 100 100 100 100 100 100 100 100 100 100 100 100 100 100 100 100 
100 100 100 100 100 100 100 100 100 100 100 100 100 100 
##$AQSEQ= 0
##$AQ_mod= 1
##$AUNM= <au_zg>
##$AUTOPOS= <>
##$BF1= 81.014009
##$BF2= 200.13
##$BF3= 200.13
##$BF4= 200.13
##$BF5= 200.13
##$BF6= 200.13
##$BF7= 200.13
##$BF8= 200.13
##$BYTORDA= 1
##$CFDGTYP= 0
##$CFRGTYP= 5
##$CHEMSTR= <none>
##$CNST= (0..31)
1 1 145 1 1 1 1 1 1 1 1 1 1 1 1 1 1 1 1 1 1 1 1 1 1 1 1 1 1 1 1 1 
##$CPDPRG= <waltz16>
##$CPDPRG1= <>
##$CPDPRG2= <waltz16>
##$CPDPRG3= <>
##$CPDPRG4= <mlev>
##$CPDPRG5= <mlev>
##$CPDPRG6= <mlev>
##$CPDPRG7= <mlev>
##$CPDPRG8= <mlev>
##$CPDPRGB= <>
##$CPDPRGT= <>
##$D= (0..31)
0 1 0 0 0 0 0 0 0 0.06 0 0.03 2e-05 3e-06 0 0 0.0002 0 0 0 0 0 0 0 0 0 
0 0 0 0 0 0 
##$DATE= 1755253321
##$DBL= (0..7)
120 120 120 11 120 120 24 19 
##$DBP= (0..7)
150 150 150 150 150 150 150 150 
##$DBP07= 0
##$DBPNAM0= <>
##$DBPNAM1= <>
$$ [...]
##$SUBNAM3= <"">
##$SUBNAM4= <"">
##$SUBNAM5= <"">
##$SUBNAM6= <"">
##$SUBNAM7= <"">
##$SUBNAM8= <"">
##$SUBNAM9= <"">
##$SW= 400.765351723535
##$SWIBOX= (0..15)
0 1 3 0 0 0 0 0 0 0 0 0 0 0 0 0 
##$SW_h= 32467.5324675325
##$TD= 32768
##$TD0= 1
##$TE= 0
##$TE2= 300
##$TE3= 300
##$TEG= 300
##$TL= (0..7)
0 120 53 12 22 120 120 120 
##$TP= (0..7)
150 150 150 150 150 150 150 150 
##$TP07= 0
##$TPNAME0= <>
##$TPNAME1= <>
##$TPNAME2= <>
##$TPNAME3= <>
##$TPNAME4= <>
##$TPNAME5= <>
##$TPNAME6= <>
##$TPNAME7= <>
##$TPOAL= (0..7)
0.5 0.5 0.5 0.5 0.5 0.5 0.5 0.5 
##$TPOFFS= (0..7)
0 0 0 0 0 0 0 0 
##$TUNHIN= 0
##$TUNHOUT= 0
##$TUNXOUT= 0
##$USERA1= <user>
##$USERA2= <user>
##$USERA3= <user>
##$USERA4= <user>
##$USERA5= <user>
##$V9= 5
##$VALIST= <valist>
##$VCLIST= <CCCCCCCCCCCCCCC>
##$VD= 0
##$VDLIST= <DDDDDDDDDDDDDDD>
##$VPLIST= <PPPPPPPPPPPPPPP>
##$VTLIST= <TTTTTTTTTTTTTTT>
##$WBST= 1024
##$WBSW= 4
##$XGAIN= (0..3)
0 0 0 0 
##$XL= 0
##$YL= 0
##$YMAX_a= 20056
##$YMIN_a= -19185
##$ZGOPTNS= <>
##$ZL1= 120
##$ZL2= 120
##$ZL3= 120
##$ZL4= 120
##$ABSF1= 198.0616
##$ABSF2= -202.7028
##$ABSG= 5
##$ABSL= 3
##$ALPHA= 0
##$AQORDER= 0
##$ASSFAC= 0
##$ASSFACI= 0
##$ASSFACX= 0
##$ASSWID= 0
##$AUNMP= <proc_1d>
##$AZFE= 0.1
##$AZFW= 0.5
##$BCFW= 0
##$BC_mod= 2
##$BYTORDP= 0
##$COROFFS= 0
##$CY= -3
##$DATMOD= 1
##$DC= 0
##$DFILT= <>
##$DTYPP= 0
##$F1P= 0
##$F2P= 0
##$FCOR= 1
##$FTSIZE= 65536
##$FT_mod= 6
##$GAMMA= 0
##$GB= 0
##$INTBC= 1
##$INTSCL= 9.790993e-09
##$ISEN= 30
##$LB= 1.5
##$LEV0= 0
##$LPBIN= 0
##$MAXI= 10000
##$MC2= 0
##$MEAN= 0
##$ME_mod= 0
##$MI= 50
##$NCOEF= 0
##$NC_proc= -9
##$NLEV= 6
##$NOISF1= 182.463
##$NOISF2= 159.3651
##$NSP= 0
##$NTH_PI= 0
##$NZP= 0
##$OFFSET= 198.0616
##$PC= 4
##$PHC0= 1409.619
##$PHC1= 24.09949
##$PH_mod= 1
##$PKNL= yes
##$PPARMOD= 0
##$PSCAL= 0
##$PSIGN= 0
##$REVERSE= no
##$SF= 81.0140089999434
##$SI= 65536
##$SIGF1= 159.3651
##$SIGF2= -187.1042
##$SINO= 113.3802
##$SIOLD= 16384
##$SREGLST= <1H.CDCl3>
##$SSB= 0
##$STSI= 65536
##$STSR= 0
##$SW_p= 32467.5324675325
##$SYMM= 0
##$S_DEV= 0
##$TDeff= 32768
##$TDoff= 0
##$TI= <>
##$TILT= no
##$TM1= 0
##$TM2= 0
##$TOPLEV= 0
##$USERP1= <user>
##$USERP2= <user>
##$USERP3= <user>
##$USERP4= <user>
##$USERP5= <user>
##$WDW= 1
##$XDIM= 65536
##$YMAX_p= 429860383
##$YMIN_p= -159599251
$$ End of Bruker specific parameters
$$ ---------------------------------
##NTUPLES= NMR SPECTRUM
##VAR_NAME=  FREQUENCY,     SPECTRUM/REAL,   SPECTRUM/IMAG
##SYMBOL=    X,             R,               I
##VAR_TYPE=  INDEPENDENT,   DEPENDENT,       DEPENDENT
##VAR_FORM=  AFFN,          ASDF,            ASDF
##VAR_DIM=   65536,         65536,           65536
##UNITS=     HZ,            ARBITRARY UNITS, ARBITRARY UNITS
##FACTOR=    0.49542278885378, 1,            1
##FIRST=     16045.7642231865, 0,            0
##LAST=      -16421.768244346, 0,            0
##MIN=       -16421.768244346, -159599251,   0
##MAX=       16045.7642231865, 429860383,    0
$$ Real data points
##PAGE= N=1
##DATA TABLE= (X++(R..R)), XYDATA
$$ [...]
##PAGE= N=2
##DATA TABLE= (X++(I..I)), XYDATA
$$ plain form
7328 -9780945 -6130597 -3884830 -2862053 -3703967 -7023307 -10833368 -11667463 -8812574 -5741566
7319 -5741566 -6374260 -10569545 -13925470 -11798099 -3415629 7469265 15651788 18378149
7311 18378149 16473731 12050207 6134209 -667609 -6069595 -6656343 -1352351 6522015
7303 6522015 11501089 10216464 3521467 -4806780 -11163737 -14522063 -16133803 -16822150
7295 -16822150 -15410446 -11067848 -6399712 -5559794 -8629604 -10555896 -7563203 -2526146
7287 -2526146 -1240556 -4554584 -7452156 -6071684 -2663229 -2251711 -6207249 -10786456
7279 -10786456 -11555502 -8318400 -5522603 -7580029 -13586253 -17648500 -15574096 -10263589
7271 -10263589 -8474389 -12560852 -17783982 -18367608 -14167932 -10206844 -10958308 -16218869
$$ packed form
7328i780945L650348K245767J022777q41914l319340l810061q34095K854889L071008
7319e741566o32694m195285l355925K127371Q382470J0884894Q182523K726361
7311A8378149j904418m423524n915998o801818n401986n86748N303992P874366
7303F522015M979074j284625o694997q328247o356957l358326j611740o88347
7295a6822150J411704M342598M668136Q39918l069810j926292K992693N037057
7287b526146J285590l314028k897572J380472L408455M11518l955538m579207
7279a0786456p69046L237102K795797k057426o006224m062247K074404N310507
7271a0263589J789200m086463n223130n83626M199676L961088p51464n260561
$$ plain form
7263 -16218869 -21794678 -23368659 -20001387 -14094308 -7982517 -1817069 4057137 6490814
7255 6490814 2388058 -6328275 -13869608 -16825535 -16089336 -12784295 -6959996 -1521073
7247 -1521073 -2043482 -9171257 -15303449 -13159355 -4786883 1972249 3079862 -189289
7239 -189289 -6397451 -14615396 -21380742 -23148998 -21629430 -21205006 -21314820 -17532259 -10581138
7230 -10581138 -7247488 -10127905 -13137083 -10913928 -6956350 -7584323 -12220210 -15060233
7222 -15060233 -13614268 -10562993 -8818242 -8974790 -10495167 -12088427 -12111876 -10981789 -11107698
7213 -11107698 -12449697 -11832236 -9617097 -12057978 -21816624 -30981694 -30899482 -25148259 -23445713
7204 -23445713 -24875927 -18711666 -3292005 7857589 4363605 -6111728 -9246045 -3554083
$$ packed form
7263a6218869n575809j573981L367272N907079O111791O165448N874206K433677
7255F490814m102756q716333p541333k955927P36199L305041N824299N438923
7247a521073n22409p127775o132192K144094Q372472O759132J107613l269151
7239a89289o208162q217945o765346j768256J519568M24424j09814L782561O951121
7230a0581138L333650k880417l009178K223155L957578o27973m635887k840023
7222a5060233J445965L051275J744751j56548j520377j593260k3449J130087j25909
7213a1107698j341999O17461K215139k440881r758646r165070Q2212N751223J702546
7204b3445713j430214O164261J5419661J1149594l493984j0475333l134317N691962
$$ plain form
7196 -3554083 411594 -3759367 -12136483 -18983789 -23031086 -24383747 -22016971 -16644668
7188 -16644668 -11556857 -8499262 -5737315 -1474637 3297637 5978050 4140074 -3571210
7180 -3571210 -15301300 -24866404 -26316048 -20293214 -12925714 -8265052 -5472218 -3832368
7172 -3832368 -5559981 -10992262 -14969360 -12003619 -3226668 5153513 9260084 10473730
7164 10473730 11448509 11937703 9286528 1922237 -8065219 -15841860 -18102488 -16441367
7156 -16441367 -15019221 -14884448 -13164199 -8764283 -5595979 -7511715 -12471324 -15181338
7148 -15181338 -14076760 -11947970 -10295609 -7222429 -1786373 3001900 3353409 -1170347
7140 -1170347 -8101728 -14906955 -20019701 -22523237 -22371121 -20208612 -16104812 -9460536
$$ packed form
7196c554083L965677m170961q377116o847306m047297j352661K366776N372303
7188a6644668N087811L057595K761947M262678M772274K680413j837976p711284
7180c571210j1730090r565104j449644O022834P367500M660662K792834J639850
7172c832368j727613n432281l977098K965741Q776951Q380181M106571J213646
7164A0473730R74779M89194k651175p364291r987456p776641k260628J661121
7156a6441367J422146J34773J720249M399916L168304j915736m959609k710014
7148a5181338J104578K128790J652361L073180N436056M788273L51509m523756
7140a170347o931381o805227n112746k503536J52116K162509M103800O644276
$$ plain form
7132 -9460536 -1093035 5701077 7539180 4060187 -2030470 -7280882 -9176830 -6825155
7124 -6825155 -1838719 1706355 226621 -5381502 -9681988 -7968400 -1478261 3901455
7116 3901455 4513961 3013780 4121838 7653970 8840302 5713943 2313487 2351270 3257981
7107 3257981 591458 -4085477 -5275863 -2823569 -2823370 -7728403 -11586391 -8732431 -2435483
7098 -2435483 -162458 -3678481 -8975902 -13384404 -16916374 -18076575 -14734697 -9251414
7090 -9251414 -6714651 -7098642 -5034589 877057 4648451 2058885 -2404447 -2524084 291745
7081 291745 564815 -1550643 -1105770 2249506 2935666 -1277150 -4883424 -2416243 3999179
7072 3999179 8354689 8663611 7267475 5406374 1743312 -4059270 -9687568 -12654208
$$ packed form
7132i460536Q367501O794112J838103l478993o090657n250412j895948K351675
7124f825155M986436L545074j479734n608123m300486J713588O490139N379716
7116C901455O12506j500181J108058L532132J186332l126359l400456L7783R06711
7107C257981k666523m676935j190386K452294J99m905033l857988K853960O296948
7098b435483K273025l516023n297421m408502l531970j160201L341878N483283
7090i251414K536763l83991K064053N911646L771394k589566m463332j19637K815829
7081B91745K73070k115458M44873L355276O86160m212816l606274K467181O415422
7072C999179M355510L08922j396136j861101l663062n802582n628298k966640
$$ plain form
7064 -12654208 -12198662 -8438893 -2021889 4399281 6537168 2578947 -3617291 -5548873
7056 -5548873 -1075715 4752864 5036331 -1262198 -8164008 -9194873 -3678170 3820206
7048 3820206 8527147 8578793 4704579 -668236 -4293297 -4530992 -3408672 -4417353 -7989317
7039 -7989317 -11480986 -14243753 -19468518 -28511774 -35903708 -34151442 -23403433 -12714583
7031 -12714583 -10286825 -14753020 -17788906 -13693070 -4417702 3752917 5922053 994719
7023 994719 -8652751 -17880426 -20835535 -15518000 -6797043 -2294567 -3962669 -6169217
7015 -6169217 -4196826 -1718753 -5349957 -13161167 -14932182 -5631465 7122662 13041284
7007 13041284 12012016 11454715 14138574 15788692 14004990 12137505 12714347 13464196 12647438
$$ packed form
7064a2654208M55546L759769O417004O421170K137887l958221o196238j931582
7056e548873M473158N828579K83467o298529o901810j030865N516703P498376
7048C820206M706941N1646l874214n372815l625061k37695J122320j008681l571964
7039g989317l491669k762767n224765r043256p391934J752266J0748009J0688850
7031a2714583K427758m466195l035886M095836R275368Q170619K169136m927334
7023I94719r647470r227675k955109N317535Q720957M502476j668102k206548
7015f169217J972391K478073l631204p811210j771015R300717J2754127N918622
7007A3041284j029268n57301K683859J650118j783702j867485N76842P49849q16758
$$ plain form
6998 12647438 12558169 13902273 11937988 3430435 -6476460 -10257589 -8305327 -7202634
6990 -7202634 -9496029 -11754324 -12141663 -12797100 -13619943 -10656709 -3547710 1303264 -1070452
6981 -1070452 -7355635 -11353461 -12243166 -13023835 -14249384 -14611682 -15362430 -18529448 -21889269
6972 -21889269 -21048068 -16140374 -11549977 -9168658 -7004100 -4660749 -4538939 -6151717
6964 -6151717 -4769973 1549021 8208084 10555168 10058730 10305487 10512385 7702032 2844598
6955 2844598 -241949 -1005376 -2467669 -5633516 -7773492 -6695931 -3218313 1075174
6947 1075174 5144974 6859471 3575434 -3909762 -10522325 -11896392 -8575347 -4047839
6939 -4047839 -544154 1561118 1856477 -149802 -3338200 -4944094 -2954692 1736996
$$ packed form
6998A2647438q9269J344104j964285q507553r906895l781129J952262J102693
6990g202634k293395k258295l87339o55437q22843K963234P108999M850974k373716
6981a070452o285183l997826q89705p80669j225549l62298p50748l167018l359821
6972b1889269Q41201M907694M590397K381319K164558K343351J21810j612778
6964f151717J381744O318994O659063K347084m96438K46757K06898k810353m857434
6955B844598l086547p63427j462293l165847k139976J077561L477618M293487
6947A075174M069800J714497l284037p485196o612563j374067L321045M527508
6939d047839L503685K105272K95359k006279l188398j605894J989402M691688
$$ plain form
6931 1736996 5951416 7368591 6963537 7364980 8666012 7883963 3999596 1223896 4107059
6922 4107059 10610051 13889469 11021821 6273143 4948594 7390506 10162162 9937127
6914 9937127 4985174 -3796778 -11740886 -13766922 -10727937 -8656480 -9596554 -8041206
6906 -8041206 -368646 7136743 6039476 -1590020 -5766687 -2876955 324595 -1904169
6898 -1904169 -6190543 -6475330 -2786617 614216 1796919 1529343 -116769 -3328423 -6463371
6889 -6463371 -8027499 -9440063 -12658689 -16395564 -18017398 -18024144 -18860967 -19850583 -17546015
6880 -17546015 -11825195 -7658001 -8787706 -12558891 -13690672 -11383718 -9629260 -10974964
6872 -10974964 -13056913 -12396085 -9474086 -7871061 -9032591 -10214049 -8272307 -3676939
$$ packed form
6931A736996M214420J417175m05054M01443J301032p82049l884367k775700K883163
6922D107059O502992L279418k867648m748678j324549K441912K771656k25035
6914I937127m951953q781952p944108k026036L038985K071457r40074J555348
6906h041206P672560P505389j097267p629496m176667K889732L201550k228764
6898a904169m286374k84787L688713L400833J182703k67576j646112l211654l134948
6889f463371j564128j412564l218626l736875j621834o746q36823r89616K304568
6880a7546015N720820M167194j129705l771185j131781K306954J754458j345704
6872a0974964k081949O60828K921999J603025j161530j181458J941742M595368
$$ plain form
6864 -3676939 592038 2709991 2676326 509703 -3337815 -5933262 -3726287 1986615 4233708
6855 4233708 -2367294 -14850478 -24733224 -26847479 -23421502 -20201486 -20777895 -24428946
6847 -24428946 -27246400 -24968889 -16506447 -5511075 2364835 4112256 979980 -3758114
6839 -3758114 -7486741 -9393704 -10575830 -12861932 -16290873 -18242825 -16496006 -12396689
6831 -12396689 -9072017 -7219075 -5134271 -2370564 -151922 1950089 5947895 10837030
6823 10837030 11915831 7098002 549428 -3155625 -5485692 -10227355 -15463383 -14957601
6815 -14957601 -7679447 -551157 284559 -3230247 -5193113 -3850535 -2163685 -2484199
6807 -2484199 -4446802 -7159382 -9842273 -10402378 -6816291 -703206 3356071 3246800 1561817
$$ packed form
6864c676939M268977K117953l3665k166623l847518k595447K206975N712902K247093
6855D233708o601002j2483184r882746k114255L425977L220016n76409l651051
6847b4428946k817454K277511Q462442J0995372P875910J747421l132276m738094
6839c758114l728627j906963j182126k286102l428941j951952J746819M099317
6831a2396689L324672J852942K084804K763707K218642K102011L997806M889135
6823A0837030J078801m817829o548574l705053k330067m741663n236028N05782
6815a4957601P278154P128290Q35716l514806j962866J342578J686850l20514
6807b484199j962603k712580k682891n60105L586087O113085M059277j09271j684983
$$ plain form
6798 1561817 944704 -246226 -5004523 -11943389 -15702640 -13242891 -7494852 -4159423
6790 -4159423 -6304653 -12361775 -17938751 -19177442 -15741356 -11158307 -9220445 -9821166
6782 -9821166 -9696975 -7420303 -5485408 -6339502 -8488434 -8636662 -6279379 -3668097 -1901129
6773 -1901129 259826 3476373 6092958 6147157 3591506 8626 -2383551 -1197616 4439529
6764 4439529 11551674 14727411 11792079 6753528 5076812 7093053 8638027 7776496
6756 7776496 7646136 11371613 16748376 18566979 15249968 10549221 8458993 8811709 9040223
6747 9040223 8246987 7189059 5168324 41268 -7743415 -13555747 -13204215 -8240066 -4747267
6738 -4747267 -7052663 -13978357 -20946452 -24240597 -23324977 -20599899 -19197192 -19917126 -20438128
$$ packed form
6798A561817o17113j190930m758297o938866l759251K459749N748039L335429
6790d159423k145230o057122n576976j238691L436086M583049J937862o00721
6782i821166J24191K276672J934895q54094k148932j48228K357283K611282J766968
6773a901129K160955L216547K616585N4199k555651l582880k392177J185935N637145
6764D439529P112145L175737k935332n038551j676716K016241J544974q61531
6756G776496j30360L725477N376763J818603l317011m700747k090228L52716K28514
6747I040223p93236j057928k020735n127056p784683n812332L51532M964149L492799
6738d747267k305396o925694o968095l294145R15620K725078J402707p19934n21002
$$ plain form
6729 -20438128 -18749286 -16708057 -17953294 -22372741 -25457168 -24095271 -20491254 -18894858
6721 -18894858 -20609122 -23741133 -25673737 -24096744 -18183600 -11172743 -9137928 -13809243
6713 -13809243 -18839415 -17334036 -11258180 -8156041 -9462788 -8571717 -1772080 5400302
6705 5400302 6289005 2453919 41417 335167 -566031 -4270970 -7455973 -6503806 -866313
6696 -866313 7867868 16419249 19615076 14210930 3955518 -2871853 -2401369 1451375
6688 1451375 3711173 4731261 7397329 10956134 11167394 5592076 -3760067 -12416863
6680 -12416863 -16355196 -13954959 -6991897 843153 7620840 14206506 20380436 22177960
6672 22177960 16306067 6353347 865595 4189293 11668104 15310499 12619410 8312139
$$ packed form
6729b0438128J688842K041229j245237m419447l084427J361897L604017J596396
6721a8894858j714264l132011j932604J576993N913144P010857K034815m671315
6713a3809243n030172J505379O075856L102139j306747Q91071O799637P172382
6705E400302Q88703l835086k412502K93750r01198l704939l185003R52167N637493
6696h66313Q734181Q551381L195827n404146j0255412o827371M70484L852744
6688A451375K259798J020088K666068L558805K11260n575318r352143q656796
6680a2416863l938333K400237O963062P835050O777687O585666O173930J797524
6672B2177960n871893r952720n487752L323698P478811L642395k691089m307271
$$ plain form
6664 8312139 8079770 12055080 14799496 11451545 3327652 -3459605 -4990091 -3572599
6656 -3572599 -3888149 -7052361 -10806892 -14204179 -18535257 -23304177 -24771083 -20476617
6648 -20476617 -13255983 -8676464 -9286161 -12753738 -15034781 -14233387 -11719386 -10211189
6640 -10211189 -10602344 -10719700 -8078594 -3843183 -2606874 -7572628 -16914528 -25326826
6632 -25326826 -28212525 -24365176 -16292054 -8614952 -4670729 -3835194 -3220056 -1988195
6624 -1988195 -1938053 -3505918 -4084078 -1831961 1358602 2711659 2260253 1640482 1394559
6615 1394559 1887809 4643572 9679743 13455127 13022780 10613496 10039662 9901584 5528638
6606 5528638 -2289604 -6062730 -1193401 7314792 10546003 5527911 -2790089 -7338031
$$ packed form
6664H312139k32369L975310K744416l347951q123893o787257j530486J417492
6656c572599l15550l164212l754531l397287m331078m768920j466906M294466
6648b0476617P220634M579519o09697l467577k281043Q01394K514001J508197
6640a0211189l91155j17356K641106M235411J236309m965754r341900q412298
6632b5326826k885699L847349Q073122P677102L944223Q35535O15138J231861
6624a988195N0142j567865n78160K252117L190563J353057m51406o19771k45923
6615A394559M93250K755763N036171L775384m32347k409284n73834j38078m372946
6606E528638p818242l773126M869329Q508193L231211n018092q318000m547942
$$ plain form
6598 -7338031 -4931866 1576966 5610758 3143147 -2216296 -2648007 4251728 12058483
6590 12058483 13436864 8578074 3392045 2008805 4039477 6978822 7834089 4008280
6582 4008280 -3695460 -9823711 -9587716 -4989095 -2217404 -3182118 -3457160 592068 6220584
6573 6220584 7766657 3503491 -2817309 -6058347 -4122438 709701 3873514 2489575
6565 2489575 -2429459 -8156150 -13803851 -19900009 -24801133 -24369883 -16589203 -4762677
6557 -4762677 5426264 11098880 13352278 14327593 14584798 13059682 8571343 1458068
6549 1458068 -5735895 -9653317 -9091125 -6539123 -5981971 -8810014 -12333566 -12927461 -10541740
6540 -10541740 -9095141 -11636677 -16080149 -17585211 -15006738 -12468453 -13471755 -15974333
$$ packed form
6598g338031K406165O508832M033792k467611n359443m31711O899735P806755
6590A2058483J378381m858790n186029j383240K030672K939345Q55267l825809
6582D008280p703740o128251K35995M598621K771691r64714k75042M049228N628516
6573F220584J546073m263166o320800l241038J935909M832139L163813j383939
6565B489575m919034n726691n647701o096158m901124M31250P780680J1826526
6557d762677J0188941N672616K253398R75315K57205j525116m488339p113275
6549A458068p193963l917422N62192K552002N57152k828043l523552n93895K385721
6540a0541740J446599k541536m443472j505062K578473K538285j003302k502578
$$ plain form
6532 -15974333 -15765840 -13198301 -13528628 -20674976 -32717718 -43337225 -45934074 -37432848
6524 -37432848 -21221602 -6386273 -726816 -3373998 -6611079 -5515034 -2727249 -2569029
6516 -2569029 -4266426 -4199638 -2380422 -2563090 -6464175 -11478905 -14673734 -16049276 -16557511
6507 -16557511 -15443704 -12038712 -8946361 -10224531 -15569762 -18977557 -15664338 -8940742
6499 -8940742 -6768128 -11398124 -16425441 -15974549 -12812442 -13414510 -17878621 -20279922 -18140187
6490 -18140187 -15570049 -15940464 -16900350 -15173424 -11866255 -9874574 -9545819 -10151933 -12454846
6481 -12454846 -16140771 -17507935 -13999981 -9184552 -8851981 -13146949 -16602130 -15412936
6473 -15412936 -10867643 -5867255 -1876687 377728 599535 -74162 -517145 -2268277 -7832852
$$ packed form
6532a5974333K08493K567539l30327p146348j2042742j0619507k596849Q501226
6524c7432848J6211246J4835329N659457k647182l237081J096045K787785J58220
6516b569029j697397O6788J819216j82668l901085n014730l194829j375542n08235
6507a6557511J113807L404992L092351j278170n345231l407795L313219O723596
6499h940742K172614m629996n027317M50892L162107o02068m464111k401301K139735
6490a8140187K570138l70415r59886J726926L307169J991681L28755o06114k302913
6481a2454846l685925j367164L507954M815429L32571m294968l455181J189194
6473a5412936M545293N000388L990568K254415K21807o73697m42983j751132n564575
$$ plain form
6464 -7832852 -16023456 -21976686 -22522743 -19116364 -15166606 -13022684 -13564045 -15589389 -15299055
6455 -15299055 -9824180 -1961155 2066077 319124 -3147379 -5013564 -6172656 -6561725
6447 -6561725 -2447691 6393034 11389180 3849415 -12642374 -24661969 -23827066 -14240175
6439 -14240175 -4968069 -655831 -1297075 -6048011 -13266522 -19340643 -21228257 -19508578
6431 -19508578 -16805361 -14083835 -10436784 -5799362 -1972728 -1107092 -4225410 -10492419
6423 -10492419 -16637704 -18081950 -12778324 -4002322 2278479 2961206 -558345 -5891228
6415 -5891228 -12293680 -18887673 -22729002 -21276560 -16166621 -12165357 -11865296 -12869368
6407 -12869368 -10804460 -4092281 4748160 11586205 13918032 12520700 10674572 11334257
$$ packed form
6464g832852q190604n953230n46057L406379L949758K143922n41361k025344K90334
6455a5299055N474875P863025M027232j746953l466503j866185j159092l89069
6447f561725M114034Q840725M996146p539765j6491789j2019595Q34903R586891
6439a4240175R272106M312238o41244m750936p218511o074121j887614J719679
6431a9508578K703217K721526L647051M637422L826634Q65636l118318o267009
6423a0492419o145285j444246N303626Q776002O280801O82727l519551n332883
6415e891228o402452o593993l841329J452442N109939M001264L00061j004072
6407a2869368K064908O712179Q840441O838045K331827j397332j846128O59685
$$ plain form
6399 11334257 14584883 18084149 19773724 19271568 16912913 13217012 9772387 8657700
6391 8657700 9761066 10400152 9089218 7836074 8600693 9331500 6692258 1717985 -964032
6382 -964032 358823 2395398 2146402 786122 518008 652405 -577944 -2434256 -2770416
6373 -2770416 -1544626 -697960 -1228133 -2583244 -4375640 -6498342 -7917287 -7692035 -7318148
6364 -7318148 -9717422 -15034650 -19331991 -18988622 -15352209 -13109996 -13913768 -13564181 -7469985
6355 -7469985 1592321 4216402 -4940187 -19058178 -25420649 -19732156 -10318646 -6844481
6347 -6844481 -9102569 -10313342 -8089071 -6662447 -8986203 -12119956 -12137441 -9593148 -7439867
6338 -7439867 -6199397 -4423323 -2674829 -3671491 -8073083 -12723452 -14586725 -14957993 -17597585
$$ packed form
6399A1334257L250626L499266J689575n02156k358655l695901l444625j114687
6391H657700J103366O39086j310934j253144P64619P30807k639242m974273k682017
6382i64032J322855K036575k48996j360280k68114J34397j230349j856312l36160
6373b770416J225790Q46666n30173j355111j792396k122702j418945K25252L73887
6364g318148k399274n317228m297341L43369L636413K242213q03772L49587O094196
6355g469985R062306K624081r156589j4117991o362471N688493R413510L474165
6347f844481k258088j210773K224271J426624k323756l133753j7485K544293K153281
6338g439867J240470J776074J748494r96662m401592m650369j863273l71268k639592
$$ plain form
6329 -17597585 -22760753 -25356349 -20637620 -10593425 -2550379 -1522012 -5911386 -10948196
6321 -10948196 -13943159 -15075939 -15299601 -15387546 -15561624 -14389828 -9670511 -2270535 2815154
6312 2815154 1846934 -2781919 -6074291 -7399105 -10048510 -14516131 -16832560 -14480997
6304 -14480997 -9884244 -6332816 -3951911 -1791598 -752033 -1777058 -3617948 -5116997
6296 -5116997 -7473597 -11121986 -12332837 -7056425 2270965 7712031 4644043 -3103695
6288 -3103695 -8076855 -7031725 -2723201 103031 -1504360 -7681951 -15784719 -20929327
6280 -20929327 -18675805 -9183236 1622078 6673495 4073389 -2136988 -7481949 -11348369
6272 -11348369 -14778588 -16469385 -14101835 -8818666 -4877551 -4295563 -4810014 -4085325 -2840374
$$ packed form
6329a7597585n163168k595596M718729J0044195Q043046J028367m389374n036810
6321a0948196k994963j132780k23662q7945j74078J171796M719317P399976N085689
6312B815154r68220m628853l292372j324814k649405m467621k316429K351563
6304a4480997M596753L551428K380905K160313J039565j025025j840890j499049
6296e116997k356600l648389j210851N276412R327390N441066l067988p747738
6288c103695m973160J045130M308524K826232j607391o177591q102768n144608
6280b0929327K253522R492569J0805314N051417k600106o210377n344961l866420
6272a1348369l430219j690797K367550N283169L941115N81988n14451P24689J244951
$$ plain form
6263 -2840374 -2058131 -147473 4111427 7850933 7036186 2465907 -656595 384184 2334473
6254 2334473 683052 -4355060 -8471160 -8752042 -6549902 -4974854 -5270065 -6552604 -8013895
6245 -8013895 -9646198 -10811192 -10135230 -8103449 -8092338 -12547404 -19013121 -22746986 -23156897
6236 -23156897 -24505500 -29422916 -34859669 -36238489 -33040862 -28154708 -23948530 -21457356
6228 -21457356 -21430353 -23147301 -23493428 -20278721 -15699177 -13588241 -13853151 -12796083 -8894011
6219 -8894011 -5103201 -4729256 -7521259 -10697206 -11846329 -10199438 -6947158 -4924109
6211 -4924109 -6173546 -9206611 -10342443 -8222351 -5174376 -3575054 -2913359 -1506989
6203 -1506989 607165 1801513 694187 -3147584 -9178672 -15463185 -19200639 -18824365
$$ packed form
6263b840374P82243J910658M258900L739506q14747m570279l122502J040779J950289
6254B334473j651421n038112m116100k80882K202140J575048k95211j282539j461291
6245h013895j632303j164994O75962K031781J1111m455066o465717l733865m09911
6236b3156897j348603m917416n436753j378820L197627M886154M206178K491174
6228b1457356K7003j716948l46127L214707M579544K110936k64910J057068L902072
6219h894011L790810L73945k792003l175947j149123J646891L252280K023049
6211d924109j249437l033065j135832K120092L047975J599322O61695J406370
6203a506989K114154J194348j107326l841771o031088o284513l737454L76274
$$ plain form
6195 -18824365 -15328500 -11105877 -7899079 -5901584 -4017396 -885451 3450224 6776236
6187 6776236 6509582 2347905 -3562725 -8701988 -11509504 -11596551 -10402552 -10908079 -14330548
6178 -14330548 -17405492 -15684127 -9729668 -5037239 -4952557 -6738334 -6263053 -3653847 -1690092
6169 -1690092 -680696 1734274 6111770 9234334 7395770 672508 -6446180 -8685056
6161 -8685056 -4972906 -102823 -423604 -7414456 -16429066 -21832315 -21866364 -18409461 -14420526
6152 -14420526 -12803265 -15412967 -20883232 -24556065 -22630852 -16091320 -9413932 -6006324
6144 -6006324 -5838655 -6740604 -6923763 -6588295 -7517183 -10635287 -14256788 -15973571 -15824117
6135 -15824117 -15662529 -15883296 -15609527 -15990450 -19470932 -24740201 -26341209 -21369567 -13239452
$$ packed form
6195a8824365L495865M222623L206798J997495J884188L131945M335675L326012
6187F776236k66654m161677n910630n139263k807516q7047J193999n05527l422469
6178a4330548l074944J721365N954459M692429Q4682j785777M75281K609206J963755
6169a690092J009396K414970M377496L122564j838564o723262p118688k238876
6161h685056L712150M870083l20781o990852r014610n403249l4049L456903L988935
6152a4420526J617261k609702n470265l672833J925213O539532O677388L407608
6144f006324J67669r01949j83159L35468r28888l118104l621501j716783J49454
6135a5824117J61588k20767K73769l80923l480482n269269j601008M971642Q130115
$$ plain form
6126 -13239452 -6747450 -2947277 -1290532 -2739281 -7076181 -10563608 -10440503 -9033648
6118 -9033648 -9622374 -11398001 -12669239 -15081541 -18915529 -18092719 -7771354 5145869
6110 5145869 7856913 -1960289 -13849750 -19343468 -20175094 -19589125 -15101734 -5441148
6102 -5441148 3001812 4053585 1230821 2040683 5898942 4967185 -4051479 -15302717
6094 -15302717 -21496948 -21672461 -20286107 -21530537 -25307316 -27316176 -23500692 -15445760
6086 -15445760 -9811758 -11013870 -16602224 -21574738 -24316004 -25567982 -24659935 -20840498
6078 -20840498 -16298835 -13622975 -11559946 -7210536 -1159770 3595186 6536360 8938939
6070 8938939 9291078 4634737 -3358820 -8786135 -9167140 -8298636 -10009949 -13179536 -14859711
$$ packed form
6126a3239452O492002L800173J656745j448749m336900l487427J23105J406855
6118i033648n88726j775627j271238k412302l833988Q22810J0321365J2917223
6110E145869K711044r817202j1889461n493718q31626N85969M487391R660586
6102e441148Q442960J051773k822764Q09862L858259r31757r018664j1251238
6094a5302717o194231j75513J386354j244430l776779k008860L815484Q054932
6086a5445760N634002j202112n588354m972514k741266j251978R08047L819437
6078b0840498M541663K675860K063029M349410O050766M754956K941174K402579
6070H938939L52139m656341p993557n427315l81005Q68504j711313l169587j680175
$$ plain form
6061 -14859711 -14656497 -13656917 -12023103 -10149189 -9925123 -12515270 -16409915 -19204077 -19759351
6052 -19759351 -17822565 -13897637 -10549684 -11010252 -14898525 -18124062 -18760314 -19662966 -22597290
6043 -22597290 -23340221 -17091799 -6683364 -283839 -1175304 -4322072 -3830159 165219
6035 165219 3599864 4135862 2343515 -675980 -4325592 -7996017 -11337661 -14665058 -17942463
6026 -17942463 -20022327 -20151944 -19571297 -19852323 -19652148 -15106799 -4720527 7179112
6018 7179112 13606603 11715395 5272221 10665 -2182197 -3464746 -5683077 -7941313
6010 -7941313 -8601520 -7689341 -6242793 -4602127 -2757495 -1703806 -3057673 -7501386 -14541556
6001 -14541556 -23323925 -32338149 -38583684 -38963292 -33442252 -25693717 -19509168 -15155106
$$ packed form
6061a4859711K03214R99580J633814J873914K24066k590147l894645k794162n55274
6052a9759351J936786L924928L347953m60568l888273l225537o36252r02652k934324
6043b2597290p42931O248422J0408435O399525q91465l146768M91913L995378
6035A65219L434645N35998j792347l019495l649612l670425l341644l327397l277405
6026a7942463k079864j29617N80647k81026K00175M545349J0386272J1899639
6018G179112O427491j891208o443174n261556k192862j282549k218331k258236
6010g941313o60207R12179J446548J640666J844632J053689j353867m443713p040170
6001a4541556q782369r014224o245535l79608N521040P748535O184549M354062
$$ plain form
5993 -15155106 -10181400 -3211367 4308167 9858326 11929641 10234388 5554216 419728
5985 419728 -1488919 1320901 5627158 6348621 2675264 -255170 2808873 10660426 16587589
5976 16587589 15737915 9937142 4728711 3077127 3327818 2821537 1757061 2476384 5568979
5967 5568979 8119801 6566981 765189 -5677869 -9038221 -8560735 -5738205 -1742948
5959 -1742948 3065274 7218342 7360713 1003809 -9743562 -18539325 -20375087 -16635680
5951 -16635680 -13107696 -12673048 -12070010 -7408677 -837195 1450334 -2659130 -8429678
5943 -8429678 -10329179 -7877304 -4171881 -1414186 10123 209548 11770 946741 2668831
5934 2668831 1875668 -3604062 -10901495 -15185185 -15697263 -15448125 -15399604 -12846109 -6403102
$$ packed form
5993a5155106M973706O970033P519534N550159K071315j695253m680172n134488
5985D19728j908647K809820M306257P21463l673357k930434L064043P851553N927163
5976A6587589q49674n800773n208431j651584K50691n06281j064476P19323L092595
5967E568979K550822j552820n801792o443058l360352M77486K822530L995257
5959a742948M808222M153068J42371o356904j0747371q795763j835762L739407
5951a6635680L527984M34648O03038M661333O571482K287529m109464n770548
5943h429678j899501K451875L705423K757695J424309J99425j97778R34971J722090
5934B668831p93163n479730p297433m283690n12078K49138M8521K553495O443007
$$ plain form
5925 -6403102 889704 5258879 6501439 6687145 6586682 5654898 4220782 3128293 1477759
5916 1477759 -2985918 -10568400 -18273658 -22933564 -24842659 -26714287 -29150230 -29305829
5908 -29305829 -25436404 -20883482 -20658582 -24765665 -28422493 -29144617 -29364218 -30342167 -28102469
5899 -28102469 -19240863 -7365758 1020635 4837801 7547018 9541829 7328066 345744
5891 345744 -6944498 -10877591 -11760194 -10237467 -5617355 195722 1973856 -2497089 -8867333
5882 -8867333 -11816701 -11050762 -9054411 -6119261 -1009708 5657824 11882869 16683492
5874 16683492 19766438 20443345 18834521 16415030 13775504 9931459 5197124 1913851
5866 1913851 519376 -2029742 -7639339 -13821139 -17302857 -17646124 -14864370 -7468838
$$ packed form
5925f403102P292806M369175J242560J85706j00463r31784j434116j092489j650534
5916A477759m463677p582482p705258m659906j909095j871628k435943j55599
5908b9305829L869425M552922K24900m107083l656828p22124k19601r77949K239698
5899b8102469Q861606J1875105Q386393L817166K709217J994811k213763o982322
5891C45744p290242l933093q82603J522727M620112N813077J778134m470945o370244
5882h867333k949368P65939J996351K935150N109553O667532O225045M800623
5874A6683492L082946O76907j608824k419491k639526l844045m734335l283273
5866A913851j394475k549118n609597o181800l481718l43267K781754P395532
$$ plain form
5858 -7468838 3400252 11503564 11773219 6637262 2054595 -130078 -1698025 -2977326
5850 -2977326 -3502402 -5419935 -10557887 -15579202 -15578480 -11393063 -7947291 -6451903 -4020468
5841 -4020468 -227082 2193765 3138680 5443811 8880570 9750932 7218153 4258201 1676556
5832 1676556 -2425991 -6113299 -3727753 4808898 11529600 10879242 6624211 4303814
5824 4303814 2792143 -1236826 -5449294 -5090151 -1335254 -270046 -4629395 -11310440
5816 -11310440 -16301862 -18027569 -16339116 -11821909 -6405967 -2675582 -2679964 -7752541 -17206520
5807 -17206520 -26231133 -28472479 -22948393 -15407066 -10755098 -7932207 -4982195 -4379069
5799 -4379069 -8408130 -13004934 -12262765 -7058117 -3425276 -3604720 -4284855 -2996427 -667960
$$ packed form
5858g468838J0869090Q103312K69655n135957m582667k184673j567947j279301
5850b977326n25076j917533n137952n021315P22M185417L445772J495388K431435
5841d020468L793386K420847R44915K305131L436759Q70362k532779k959952k581645
5832A676556m102547l687308K385546Q536651O720702o50358m255031k320397
5824D303814j511671m028969m212468L59143L754897J065208m359349o681045
5816a1310440m991422j725707J688453M517207N415942L730385m382n072577r453979
5807a7206520r024613k241346N524086P541327M651968K822891K950012O03126
5799d379069m029061m596804P42169N204648L632841j79444o80135J288428K328467
$$ plain form
5790 -667960 2130885 6166784 10272918 11953908 11856488 12882989 14123555 10816160 2049668
5781 2049668 -6286168 -8790621 -6908869 -5311167 -5332781 -5208623 -4429326 -4627348 -7260722
5772 -7260722 -12540980 -19483565 -25361674 -26603250 -22266649 -15821865 -11940693 -12065119
5764 -12065119 -13975859 -14696932 -12855395 -9140510 -5428813 -2953036 -1122191 1024387
5756 1024387 2650967 2300474 1059223 1820237 4624340 5588945 2177145 -2906585 -5360589
5747 -5360589 -4891550 -4359407 -4410339 -2200464 3890863 10314114 10534040 1215549 -13755669
5738 -13755669 -25710763 -28741869 -25140821 -22179864 -23415167 -25384522 -23759026 -19649877
5730 -19649877 -16973713 -15911924 -13333601 -9185258 -7845346 -11828157 -17907436 -21638850
$$ packed form
5790f67960K798845M035899M106134J680990r7420J026501J240566l307395q766492
5781B049668q335836k504453J881752J597702k1614J24158P79297j98022k633374
5772g260722n280258o942585n878109j241576M336601O444784L881172j24426
5764a2065119j910740p21073J841537L714885L711697K475777J830845K146578
5756A024387J626580l50493j241251P61014K804103R64605l411800n083730k454004
5747e360589M69039N32143n0932K209875O091327O423251K19926r318491j4971218
5738a3755669j1955094l031106L601048K960957j235303j969355J625496M109149
5730a9649877K676164J061789K578323M148343J339912l982811o079279l731414
$$ plain form
5722 -21638850 -22628144 -22598851 -21085593 -17087063 -13501582 -15209908 -22331593 -29337209 -31937023
5713 -31937023 -31123590 -28670682 -22701907 -11474862 922648 7231290 5112066 -735328
5705 -735328 -4543606 -4751403 -3398100 -3304748 -6424053 -12407093 -18061398 -20261259 -19649449
5696 -19649449 -19306535 -19986110 -19648852 -17764185 -16371199 -15963215 -14066117 -9456436 -4257509
5687 -4257509 -70032 4286286 8953920 10839990 8198325 3769122 15920 -4860571
5679 -4860571 -11753353 -15318250 -10052821 168042 5061599 337796 -8221912 -13198063
5671 -13198063 -12824916 -9223550 -4548524 -636293 1584047 4067141 9646883 16778836
5663 16778836 19869997 16393474 10154538 5605248 2363340 -2097783 -7307441 -10642453
$$ packed form
5722b1638850r89294K9293J513258L998530L585481j708326p121685p005616k599814
5713c1937023Q13433K452908N968775J1227045J2397510O308642k119224n847394
5705g35328l808278k07797J353303R3352l119305n983040n654305k199861O11810
5696a9649449L42914o79575L37258J884667J392986M07984J897098M609681N198927
5687d257509M187477M356318M667634J886070k641665m429203l753202m876491
5679d860571o892782l564897N265429J0220863M893557m723803q559708m976151
5671a3198063L73147L601366M675026L912231K220340K483094N579742P131953
5663A6778836L091161l476523o238936m549290l241908m461123n209658l335012
$$ plain form
5655 -10642453 -11571768 -11748425 -11335471 -8167892 -1563809 4755505 5760568 1702798 -476274
5646 -476274 4787076 12957157 13289635 2784398 -8913342 -11989768 -8611029 -6957748
5638 -6957748 -7848734 -5705998 -553514 636636 -4545287 -9703894 -9265916 -5066695 -906014
5629 -906014 2322502 3329494 -289225 -5828171 -5924117 250825 3592374 -1573246 -7996205
5620 -7996205 -6512110 -43251 2219433 -88828 997377 8425360 16430459 19572795
5612 19572795 17478923 10727788 -265793 -11310279 -16120796 -13689816 -9177840 -6955776
5604 -6955776 -7424757 -10233192 -14788345 -17426314 -14239249 -7624021 -4138234 -4788479 -3685373
5595 -3685373 1793693 5923065 3154326 -3340492 -5750099 -1095028 6547037 10922204
$$ packed form
5655a0642453r29315j76657M12954L167579O604083O319314J005063m057770k179072
5646d76274N263350Q170081L32478j0505237j1697740l076426L378739J653281
5638f957748q90986K142736N152484J190150n181923n158607M37978M199221M160681
5629i06014L228516J006992l618719n538946r5946O174942L341549n165620o422959
5620g996205J484095O468859K262684k308261J086205P427983Q005099L142336
5612A9572795k093872o751135j0993581j1044486m810517K430980M511976K222064
5604f955776m68981k808435m555153k637969L187065O615228L485787o50245J103106
5595c685373N479066M129372k768739o494818k409607M655071P642065M375167
$$ plain form
5587 10922204 8675417 2030176 -2174629 1222026 9507694 15171298 15222234 13167078
5579 13167078 11663792 9380131 6946726 9160756 17044075 23405127 21725339 15165869
5571 15165869 11005772 9660258 5760843 -1867436 -8039569 -8897167 -6240272 -3595618
5563 -3595618 -2425666 -2896230 -4427819 -4646117 -1317356 3703765 5525743 2102337 -3703161
5554 -3703161 -8456833 -11297021 -11849593 -8901139 -3614207 -891181 -3837698 -8503138
5546 -8503138 -8190081 -2842462 12736 -4607888 -11474813 -11073786 -1630140 8955651
5538 8955651 13376901 12688891 11660861 10494572 5756082 -2450994 -9656743 -13601150
5530 -13601150 -16869684 -21592611 -25673000 -26445441 -24606101 -21952474 -18196272 -12859914
$$ packed form
5587A0922204k246787o645241m204805L396655Q285668N663604N0936k055156
5579A3167078j503286k283661k433405K214030P883319O361052j679788o559470
5571A5165869m160097j345514l899415p628279o172133q57598K656895K644654
5563c595618J169952m70564j531589k18298L328761N021121J821978l423406n805498
5554c703161m753672k840188n52572K948454N286932K723026k946517m665440
5546h503138L13057N347619K855198m620624o866925M01027R443646J0585791
5538H955651M421250o88010j028030j166289m738490q207076p205749l944407
5530a3601150l268534m722927m080389p72441J839340K653627L756202N336358
$$ plain form
5522 -12859914 -7754018 -4475985 -1711658 1607187 2599425 -1844545 -8679783 -10610013
5514 -10610013 -4916120 3127713 6621319 4193756 30842 -884173 3237838 9629728
5506 9629728 12687579 8800309 335672 -6446724 -7770823 -5284439 -2834002 -2488661
5498 -2488661 -4163600 -6874729 -9237104 -10334815 -10984750 -12670425 -14734226 -14672508 -12079332
5489 -12079332 -9950665 -10534969 -12108668 -11948025 -10446307 -9536359 -8724387 -6306672 -3795624
5480 -3795624 -4963090 -9736220 -12897240 -10735853 -5858388 -2919841 -2302559 -1318959 346343
5471 346343 570752 -532223 -162374 2435610 4741374 5711642 7948746 12905309 17240886
5462 17240886 17001078 12937581 8286226 3155512 -5016495 -16310138 -27276476 -34766133
$$ packed form
5522a2859914N105896L278033K764327L318845R92238m443970o835238j930230
5514a0610013N693893Q043833L493606k427563m162914r15015M122011O391890
5506I629728L057851l887270q464637o782396j324099K486384K450437L45341
5498b488661j674939k711129k362375j097711o49935j685675k063801O1718K593176
5489a2079332K128667n84304j573699J60643J501718R09948Q11972K417715K511048
5480c795624j167466m773130l161020K161387M877465K938547O17282R83600J665302
5471C46343K24409j102975L69849K597984K305764R70268K237104M956563M335577
5462A7240886k39808m063497m651355n130714q172007j1293643j0966338p489657
$$ plain form
5454 -34766133 -37716819 -35746110 -29701915 -23599200 -21969267 -24306692 -25617869 -23520272
5446 -23520272 -21171882 -21597758 -22836778 -21338046 -17293292 -13604691 -11534037 -10248289
5438 -10248289 -9431494 -9941241 -12660531 -18155238 -26092012 -33708964 -36920659 -34794227
5430 -34794227 -30974594 -28784187 -27158290 -23627142 -18657097 -13926182 -8722791 -1950723
5422 -1950723 4061119 5992472 4616744 3177972 1652760 -2546951 -8492163 -11748452
5414 -11748452 -11358427 -11650355 -15277669 -19214107 -20115303 -19166654 -18431507 -16607126 -12617461
5405 -12617461 -9934227 -12070337 -15813650 -14520872 -7608322 -1515249 -693031 -2500465
5397 -2500465 -2559090 -839656 27161 -911358 -3131883 -6535560 -10133046 -10964810 -7644879
$$ packed form
5454c4766133k950686J970709O044195O102715J629933k337425j311177K097597
5446b3520272K348390m25876j239020J498732M044754L688601K070654J285748
5438a0248289Q16795n09747k719290n494707p936774p616952l211695K126432
5430c4794227L819633K190407J625897L531148M970045M730915N203391O772068
5422a950723O011842J931353j375728j438772j525212m199711n945212l256289
5414a1748452L90025k91928l627314l936438r01196R48649P35147J824381L989665
5405a2617461K683234k136110l743313J292778O912550O093073Q22218j807434
5397b500465n8625J719434Q66817r38519k220525l403677l597486q31764L319931
$$ plain form
5388 -7644879 -3416809 -2184841 -2740065 -1005760 2586854 2876468 -1978242 -7136837 -8164671
5379 -8164671 -7092112 -7663960 -8098717 -3819785 4063058 8307569 4112699 -5664732 -14511492
5370 -14511492 -18258059 -16575354 -11887282 -8077065 -7753672 -9730299 -11079699 -11536846
5362 -11536846 -12920132 -14369429 -12414337 -6906577 -2611582 -2805651 -5097826 -6000287
5354 -6000287 -5836806 -6193128 -6329880 -5948983 -8164207 -15087771 -22741640 -24949755 -20786208
5345 -20786208 -14251881 -8593290 -5372823 -6943176 -14066932 -21979439 -24595402 -22522346
5337 -22522346 -21359375 -22108514 -19755030 -12682421 -6823679 -7236398 -11022885 -12763629
5329 -12763629 -12797583 -15468421 -21805778 -28281529 -31409590 -30285210 -25855082 -20523011
$$ packed form
5388g644879M228070J231968n55224J734305L592614K89614m854710n158595j027834
5379h164671J072559n71848m34757M278932P882843M244511m194870r777431q846760
5370a4511492l746567J682705M688072L810217L23393j976627j349400m57147
5362a1536846j383286j449297J955092N507760M294995j94069k292175r02461
5354f000287J63481l56322j36752L80897k215224o923564p653869k208115M163547
5345b0786208O534327N658591L220467j570353p123756p912507k615963K073056
5337b2522346J162971p49139K353484P072609N858742m12719l786487j740744
5329a2763629l3954k670838o337357o475751l128061J124380M430128N332071
$$ plain form
5321 -20523011 -17330009 -17074224 -17345413 -16318104 -15787644 -18262979 -23002245 -27624614 -31808249
5312 -31808249 -36124752 -38588925 -36193582 -29668613 -23395147 -20283806 -19488208 -19456866 -20300137
5303 -20300137 -22020997 -22698425 -20153779 -14618633 -8924216 -6408019 -8364257 -12519774
5295 -12519774 -14349960 -11303309 -5584171 -1395899 72602 817899 1366401 -1066551
5287 -1066551 -8320054 -17391066 -22994687 -23019754 -19545497 -15085901 -9876822 -3079749 4806331
5278 4806331 11230998 12673586 6933701 -4156594 -14435905 -17887731 -14353790 -9388448
5270 -9388448 -7658808 -8267083 -7860502 -6096860 -5288419 -6091532 -7155662 -8724379 -12600135
5261 -12600135 -17591890 -18891732 -14272782 -8018008 -6053255 -9365781 -14681383 -19133057
$$ packed form
5321b0523011L193002K55785k71189J027309N30460k475335m739266m622369m183635
5312c1808249m316503k464173K395343O524969O273466L111341P95598L1342q43271
5303b0300137j720860o77428K544646N535146N694417K516197j956238m155517
5295a2519774j830186L046651N719138M188272J468501P45297N48502k432952
5287a066551p253503r071012n603621k5067L474257M459596N209079O797073P886080
5278D806331O424667J442588n739885j1090295j0279311l451826L533941M965342
5270i388448J729640o08275M06581J763642Q08441q03113j064130j568717l875756
5261a2600135m991755j299842M618950O254774J964753l312526n315602m451674
$$ plain form
5253 -19133057 -20954136 -17893344 -9701444 -1601689 -521470 -6788311 -13071436 -12896753
5245 -12896753 -7408305 -2368035 -1032599 -1802503 -1250040 2148638 6502726 8131747
5237 8131747 5655787 2286604 2232937 4883123 5028232 -500333 -8856540 -14887332 -16459653
5228 -16459653 -14554001 -10257333 -4252303 1394907 3370245 123108 -5697712 -8852128
5220 -8852128 -6765208 -3182098 -4573268 -11834751 -18142391 -17530587 -12944133 -11641695
5212 -11641695 -14616094 -16320135 -14433161 -13112555 -14664104 -14518048 -8651627 -1129192
5204 -1129192 984977 -2648304 -5995993 -5154546 -2120590 -832966 -3066061 -7891544
5196 -7891544 -12491614 -14140458 -13564111 -14873917 -19506086 -22057653 -15945168 -2380021
$$ packed form
5253a9133057j821079L060792Q191900Q099755J080219o266841o283125J74683
5245a2896753N488448N040270J335436p69904N52463L398678M354088J629021
5237H131747k475960l369183n3667K650186J45109n528565q356207o030792j572321
5228a6459653J905652M296668O005030N647210J975338l247137n820820l154416
5220h852128K086920L583110j391170p261483o307640O11804M586454J302438
5212a1641695k974399j704041J886974J320606j551549J46056N866421P522435
5204a129192K114169l633281l347689Q41447L033956J287624k233095m825483
5196g891544m600070j648844N76347j309806m632169k551567O112485J3565147
$$ plain form
5188 -2380021 10097153 14912962 12910370 8705673 5574298 4847044 6554703 8337924
5180 8337924 6107044 -1566806 -10638658 -15218621 -13897556 -11083061 -11759121 -15785795
5172 -15785795 -18081640 -14273977 -5394609 3354180 7590707 6609070 2359346 -2341603
5164 -2341603 -4813606 -4174246 -2733087 -3810002 -7447968 -10217786 -9956254 -8384986 -7929455
5155 -7929455 -8424272 -8711079 -9272807 -10995248 -12767087 -12383711 -8878913 -2640628 5281528
5146 5281528 12492524 15612406 13433003 8879831 6380706 7879538 11785292 14347677
5138 14347677 12066084 5304226 -280170 605842 5180298 5061987 -1955186 -8087361
5130 -8087361 -6959408 -3326193 -5784687 -13792024 -18742769 -16024183 -9423279 -4104027
$$ packed form
5188b380021J2477174M815809k002592m204697l131375p27254J707659J783221
5180H337924k230880p673850r071852m579963J321065K814495o76060m026674
5172a5785795k295845L807663Q879368Q748789M236527r81637m249724m700949
5164b341603k472003O39360J441159j076915l637966k769818K61532J571268M55531
5155g929455m94817k86807n61728j722441j771839L83376L504798O238285P922156
5146E281528P210996L119882k179403m553172k499125J498832L905754K562385
5138A4347677k281593o761858n584396Q86012M574456j18311p017173o132175
5130h087361J127953L633215k458494q007337m950745K718586O600904N319252
$$ plain form
5122 -4104027 -1176904 282775 769211 819373 416933 -2061629 -6966869 -10361311 -8063591
5113 -8063591 -1994800 2094806 2847837 4390605 9156795 14629876 17887660 18571153 16385712
5104 16385712 10535510 3272129 -486586 753249 2997535 2712271 1361172 1874137
5096 1874137 3605217 3188756 -1426279 -9156572 -16341915 -18851500 -15953490 -11990104
5088 -11990104 -11344354 -12256099 -9581643 -3391468 423760 -833755 -2591130 -481392
5080 -481392 3007872 2895561 -1187693 -6217222 -11142343 -16836299 -22447742 -25660400 -25883871
5071 -25883871 -24372430 -21808900 -18050421 -13609275 -9376037 -5463113 -2084803 -987828
5063 -987828 -4112297 -10733679 -17230243 -20165191 -19149686 -16318386 -13154066 -8818312
$$ packed form
5122d104027K927123J459679M86436N0162m02440k478562m905240l394442K297720
5113h063591O068791M089606P53031J542768M766190N473081L257784O83493k185441
5104A6385712n850202p263381l758715J239835K244286k85264j351099N12965
5096A874137J731080m16461m615035p730293p185343k509585K898010L963386
5088a1990104O45750r11745K674456O190175L815228j257515j757375K109738
5080d81392L489264j12311m083254n029529m925121n693956n611443l212658k23471
5071b5883871J511441K563530L758479M441146M233238L912924L378310J096975
5063i87828l124469o621382o496564k934948J015505K831300L164320M335754
$$ plain form
5055 -8818312 -2742153 2181474 2000581 -2359298 -5361166 -4685619 -4464000 -7767233 -10818719
5046 -10818719 -9679248 -7992555 -10920502 -14878179 -12221138 -4607682 -1910415 -7233150
5038 -7233150 -12821880 -13215181 -12693318 -15260296 -16279259 -10686269 -2633897 420321 -1485912
5029 -1485912 -2825290 -1749017 -483168 1018461 5254590 11661909 15950502 15107693
5021 15107693 10092186 4120693 281373 -472394 -382138 -2006735 -3752766 -1836559 2587370
5012 2587370 3516479 -523138 -2993791 1014212 7019171 7782857 3158586 -1792128 -4528208
5003 -4528208 -5563099 -4795313 -2734881 -2374552 -4649282 -5149738 -812622 3340728 564393
4994 564393 -6789605 -9608583 -4335614 3178705 6100192 3590596 -1109359 -5225696
$$ packed form
5055h818312O076159M923627j80893m359879l001868O75547K21619l303233l051486
5046a0818719J139471J686693k927947l957677K657041P613456K697267n322735
5038g233150n588730l93301N21863k566978j018963N592990Q052372L054218j906233
5029a485912j339378J076273J265849J501629M236129O407319M288593q42809
5021A5107693n015507n971493l839320p53767R0256j624597j746031J916207M423929
5012B587370R29109m039617k470653M008003O004959P63686m624271m950714k736080
5003d528208j034891P67786K060432L60329k274730n00456M337116M153350k776335
4994E64393p353998k818978N272969P514319K921487k509596m699955m116337
$$ plain form
4986 -5225696 -8058280 -10441988 -12685914 -12319007 -6489407 1911398 4912422 -327274
4978 -327274 -6334072 -4893200 2269923 7610262 8513899 7606746 5752271 2068827 -1069173
4969 -1069173 -349130 1962505 322058 -5710649 -11187267 -13211974 -13026886 -11482516 -8350719
4960 -8350719 -5823369 -7020734 -10884331 -13219561 -12154140 -8074429 -70158 11552177
4952 11552177 20646478 20061756 11176051 2576066 -715836 -716763 481696 4078398 9567342
4943 9567342 12640814 10653327 5978760 2211421 483277 500687 2020289 4587384 8016329
4934 8016329 12434169 15836751 14219172 7641690 3129911 6682634 14788339 18920172
4926 18920172 16237028 10873286 7236395 7383555 12217210 19340025 22201493 17170172
$$ packed form
4986e225696k832584k383708k243926L66907N829600Q400805L001024n239696
4978c27274o006798J440872P163123N340339R03637r07153j854475l683444l138000
4969a069173P20043K311635j640447o032707n476618k024707J85088J544370L131797
4960h350719K527350j197365l863597k335230J065421M079711Q004271J1622335
4952A1552177R094301n84722q885705q599985l291902r27J198459L596702N488944
4943I567342L073472j987487m674567l767339j728144J7410J519602K567095L428945
4934H016329M417840L402582j617579o577482m511779L552723Q105705M131833
4926A8920172k683144n363742l636891J47160M833655P122815K861468n031321
$$ plain form
4918 17170172 8925625 3616730 457458 -4072264 -8433797 -9452820 -8706469 -8019921
4910 -8019921 -4009847 4678907 11042615 10230847 9367668 15411973 20641699 14392454 2750747
4901 2750747 100628 5761474 6814776 1279080 -116501 5760520 10852330 12800204
4893 12800204 17490422 24299681 26481299 26173347 31002325 37193960 35849345 33152375
4885 33152375 41071960 51280262 46258710 34076013 39067007 58051635 64637711 60073485
4877 60073485 73587984 104125489 119425939 134073394 218101122 375917847 478346485
4870 478346485 396757902 175476453 -11764971 -66851328 -48380028 -46648749 -66535544
4863 -66535544 -68291256 -52035594 -45651064 -49441580 -44558677 -34132805 -34562142 -41224062
$$ packed form
4918A7170172q244547n308895l159272m529722m361533j019023P46351O86548
4910h019921M010074Q688754O363708q11768q63179O044305N229726o249245j1641707
4901B750747k650119N660846J053302n535696j395581N877021N091810J947874
4893A2800204M690218O809259K181618l07952M828978O191635j344615k696970
4885C3152375P919585J0208302n021552j2182697M990994J8984628O586076m564226
4877F0073485J3514499L0537505J5300450J4647455Q4027728J57816725J02428638
4870D78346485q1588583k21281449j87241424n5086357J8471300J731279j9886795
4863f6535544j755712J6255662O384530l790516M882903J0425872m29337o661920
$$ plain form
4855 -41224062 -37665971 -27478472 -26972624 -35130421 -37350089 -31825398 -28567249 -28408042
4847 -28408042 -24530441 -19574606 -21502688 -27196094 -28294287 -28302425 -35798197 -45029975 -41864903
4838 -41864903 -26962059 -15665642 -15293750 -18224221 -17912924 -17063781 -17846812 -16512784
4830 -16512784 -10873336 -4113393 601552 2386902 101242 -5537928 -9041475 -6431480
4822 -6431480 -2125540 -2662862 -6921566 -9952784 -12232020 -16291376 -18294462 -13144345
4814 -13144345 -5132308 -3104771 -6815631 -8282744 -5632653 -5328637 -10370438 -15671483
4806 -15671483 -16420958 -13324094 -8615302 -3650615 -943150 -2476091 -5945090 -7890682
4798 -7890682 -9245168 -12351327 -14935292 -13539982 -10457214 -10233898 -11886150 -12075233 -13013577
$$ packed form
4855d1224062L558091J0187499N05848q157797k219668N524691L258149J59207
4847b8408042L877601M955835j928082n693406j098193q138p495772r231778L165072
4838d1864903J4902844J1296417L71892k930471L11297Q49143p83031J334028
4830a6512784N639448O759943M714945J785350k285660n639170l503547K609995
4822f431480M305940n37322m258704l031218k279236m059356k003086N150117
4814a3144345Q012037K027537l710860j467113K650091L04016n041801n301045
4806a5671483p49475L096864M708792M964687K707465j532941l468999j945592
4798g890682j354486l106159k583965J395310L082768K23316j652252j89083r38344
$$ plain form
4789 -13013577 -18379905 -23766313 -21090144 -11497974 -4003098 -1580829 1229972 6213556
4781 6213556 7458412 1971932 -4980964 -8585707 -10660174 -13653572 -15426334 -13725501
4773 -13725501 -10396225 -8309311 -8694366 -12647419 -19774301 -24700645 -21613857 -13576646
4765 -13576646 -10346503 -15112786 -20556883 -20420833 -17415093 -16028232 -14750121 -10621214
4757 -10621214 -5888602 -4506098 -5803463 -6634767 -7154514 -10159437 -16282808 -22854877
4749 -22854877 -26370165 -24574238 -17879648 -9760598 -3941106 -938446 691302 820151
4741 820151 -1219007 -3482084 -3870181 -4645869 -9121189 -14691675 -15577286 -12394567 -11754241
4732 -11754241 -15218374 -16251272 -10839604 -4175108 -3003909 -7107880 -12252769 -16436113
$$ packed form
4789a3013577n366328n386408K676169R592170P494876K422269K810801M983584
4781F213556J244856n486480o952896l604743k074467k993398j772762J700833
4773a3725501L329276K086914l85055l953053p126882m926344L086788Q037211
4765a3576646L230143m766283n444097J36050L005740J386861J278111M128907
4757a0621214M732612J382504j297365q31304n19747l004923o123371o572069
4749b2854877l515288J795927O694590Q119050N819492L002660J629748J28849
4741H20151k039158k263077l88097p75688m475320n570486q85611L182719O40326
4732a1754241l464133j032898N411668O664496J171199m103971n144889m183344
$$ plain form
4724 -16436113 -19121245 -18728475 -15266275 -12470414 -13979369 -19578610 -26716148 -32583309
4716 -32583309 -33990120 -29617230 -23360307 -20586985 -20531063 -18498881 -16164625 -21276945
4708 -21276945 -34167185 -43183725 -38976862 -26426090 -16661878 -13471475 -13555886 -14155948
4700 -14155948 -13546354 -9124419 -2057164 701006 -4090517 -9139860 -6795754 -1299019
4692 -1299019 -1972316 -7956184 -9952563 -5338999 -882897 -60018 2001048 8275184 13315263
4683 13315263 11107805 3075995 -5597828 -12364436 -16310548 -15394240 -9065634 -1125772
4675 -1125772 3251378 1900119 -4123742 -12023176 -17651800 -17642292 -13294052 -9934087 -10592341
4666 -10592341 -12642307 -12404919 -10418020 -9663265 -10647225 -11262316 -10614733 -10183392 -11117390
$$ packed form
4724a6436113k685132L92770L462200K795861j508955n599241p137538n867161
4716c2583309j406811M372890O256923K773322N5922K032182K334256n112320
4708b1276945j2890240r016540M206863J2550772R764212L190403q4411o00062
4700a4155948O09594M421935P067255K758170m791523n049343K344106N496735
4692a299019o73297n983868j996379M613564M456102Q22879K061066O274136N040079
4683A3315263k207458q031810q673823o766608l946112R16308O328606P939862
4675a125772M377150j351259o023861p899434n628624R508M348240L359965o58254
4666a0592341k049966K37388J986899P54755r83960o15091O47583M31341r33998
$$ plain form
4657 -11117390 -12615533 -13710952 -14982540 -17029488 -18085465 -15342313 -9251638 -4246980
4649 -4246980 -3102552 -2437669 2587657 10005300 12426401 7585112 1936977 742921
4641 742921 35629 -6045882 -13911828 -13971080 -4397151 5822068 8798477 6457757 4748249
4632 4748249 4389746 1582182 -4991528 -12010565 -15438250 -13929427 -9116390 -4813040
4624 -4813040 -5432111 -12788720 -23745643 -32162246 -33938514 -30000934 -24367724 -19874418
4616 -19874418 -16333831 -12671176 -9726827 -9886188 -14275522 -21418297 -28453985 -32497478
4608 -32497478 -31349498 -25096245 -17345941 -12698818 -12242849 -13341914 -13980255 -14609443 -15420415
4599 -15420415 -15579402 -16454742 -21270384 -28982728 -32823711 -28856028 -22387047 -21189188
$$ packed form
4657a1117390j498143j095419j271588k046948j055977K743152O090675N004658
4649d246980J144428O64883N025326P417643K421101m841289n648135j194056
4641G42921p07292o081511p865946n9252R573929J0219219K976409k340720j709508
4632D748249l58503k807564o573710p019037l427685J508823M813037M303350
4624d813040o19071p356609j0956923q416603j776268L937580N633210M493306
4616a9874418L540587L662655K944349j59361m389334p142775p035688m043493
4608c2497478J147980O253253P750304M647123M55969j099065o38341o29188q10972
4599a5420415j58987q75340m815642p712344l840983L967683O468981J197859
$$ plain form
4591 -21189188 -25147907 -27693862 -25233853 -19672735 -13307089 -7250730 -4111426 -6030258
4583 -6030258 -9949358 -10683613 -8991866 -10420234 -15402855 -17522056 -13878621 -10210083
4575 -10210083 -11677729 -14615820 -12838041 -7666905 -5627082 -8761152 -12885298 -14089084
4567 -14089084 -12007821 -7422936 -1216548 4295560 6804797 7040036 7361120 7568594 5386296
4558 5386296 1118282 -1708940 -1190290 496070 686558 -246216 -423797 580889 1966289
4549 1966289 3247302 3781552 1895419 -3587109 -11335298 -18494017 -23370685 -25821143
4541 -25821143 -25462173 -21615385 -15548127 -10712538 -9213490 -9354150 -8462013 -6914651 -6674693
4532 -6674693 -6458601 -2279952 5828232 11316392 8515850 238581 -5797043 -6888119
$$ packed form
4591b1189188l958719k545955K460009N561118O365646O056359L139304j918832
4583f030258l919100p34255J691747j428368m982621k119201L643435L668538
4575a0210083j467646k938091J777779N171136K039823l134070m124146j203786
4567a4089084K081263M584885O206388N512108K509237K35239L21084K07474k182298
4558E386296m268014k827222N18650J686360J90488r32774j77581J004686J385400
4549A966289J281013N34250j886133n482528p748189p158719m876668k450458
4541b5821143L58970L846788O067258M835589J499048j40660Q92137J547362K39958
4532f674693K16092M178649Q108184N488160k800542q277269o035624j091076
$$ plain form
4524 -6888119 -7421876 -11039169 -15243975 -15625190 -11981970 -7552951 -4327972 -1911149 174849
4515 174849 1648398 2450210 2478647 670719 -3605711 -8189697 -9226660 -5538580 -637019
4506 -637019 659885 -3004548 -8877449 -13522128 -15722040 -16160509 -15667606 -14553584 -12787899
4497 -12787899 -9857799 -5093114 754774 4940818 5330779 3145202 1179136 -296282
4489 -296282 -3065578 -6272739 -6025459 -1507011 2152412 271173 -4998511 -8562347 -10237170
4480 -10237170 -13660676 -18524783 -19769127 -15429075 -9976121 -7428058 -5375741 590560
4472 590560 8996487 12732455 6788764 -6258868 -18246945 -22040854 -17144146 -9870643
4464 -9870643 -7528222 -11966452 -19054649 -23588594 -23276332 -19085390 -14411680 -13380069
$$ packed form
4524f888119n33757l617293m204806l81215L643220M429019L224979K416823K085998
4515A74849J473549Q01812K8437j807928m276430m583986j036963L688080M901561
4506f37019J296904l664433n872901m644679k199912m38469M92903J114022J765685
4497a2787899K930100M764685N847888M186044L89961k185577j966066j475418
4489b96282k769296l207161K47280M518448L659423j881239n269684l563836j674823
4480a0237170l423506m864107j244344M340052N452954K548063K052317N966301
4472E90560Q405927L735968n943691j3047632j1988077l793909M896708P273503
4464i870643K342421m438230p088197m533945L12262M190942M673710J031611
$$ plain form
4456 -13380069 -16659690 -18929184 -14238063 -4583086 893125 -3173870 -12078093 -17672518
4448 -17672518 -17355879 -13662638 -8758049 -3420281 1009359 3697285 5726533 7216225
4440 7216225 5165495 -2178799 -10952494 -15886744 -16971946 -17199785 -15679695 -9504450
4432 -9504450 -2176297 -2700479 -13498134 -24996816 -26298221 -17332703 -6539973 97474
4424 97474 2986902 4106764 3692367 2012043 426531 -663333 -2690759 -6856403 -12619790
4415 -12619790 -18380358 -22119906 -21678957 -16771244 -11176595 -10471058 -16125221 -23366016
4407 -23366016 -26178535 -23200202 -17661952 -13238625 -11706937 -13089231 -15433296 -15146389
4399 -15146389 -10451159 -4630797 -3105840 -6835941 -11573690 -14561447 -18281618 -24986888
$$ packed form
4456a3380069l279621k269494M691121R654977N476211m066995q904223n594425
4448a7672518L16639L693241M904589N337768M429640K687926K029248J489692
4440G216225k050730p344294q773695m934250j085202k27839J520090O175245
4432i504450P328153n24182j0797655j1498682j301405Q965518J0792730O637447
4424I7474K889428J119862m14397j680324j585512j089864k027426m165644n763387
4415a2619790n760568l739548M40949M907713N594649P05537n654163p240795
4407b3366016k812519K978333N538250M423327J531688j382294k344065K86907
4399a5146389M695230N820362J524957l730101m737749k987757l720171o705270
$$ plain form
4391 -24986888 -30796150 -29621687 -21627562 -13250211 -8797703 -6407369 -3450366 -1590634
4383 -1590634 -3546867 -7793523 -10409304 -11192459 -14087883 -20653064 -25982599 -23620658
4375 -23620658 -13844492 -4581780 -2987585 -7840182 -12560599 -14603860 -17661870 -23458216
4367 -23458216 -26399918 -20930050 -11057175 -6350591 -9211068 -12514465 -10761397 -6973993
4359 -6973993 -5747928 -5662532 -3491963 -1406520 -3958680 -10307905 -15107354 -15861016 -14256896
4350 -14256896 -11216267 -6300577 -2142301 -3574552 -10470861 -16222445 -15998920 -12785998
4342 -12785998 -12189542 -14252389 -14076631 -8850273 -672179 6885771 11643444 12151099 7598196
4333 7598196 51783 -5579046 -6493233 -6061860 -10016329 -18141462 -22966883 -19074495 -11163164
$$ packed form
4391b4986888n809262J174463P994125Q377351M452508K390334K957003J859732
4383a590634j956233m246656k615781p83155k895424o565181n329535K361941
4375b3620658R776166R262712J594195m852597m720417k043261l058010n796346
4367b3458216k941702N469868R872875M706584k860477l303397J753068L787404
4359f973993J226065Q5396K170569K085443k552160o349225m799449p53662J604120
4350a4256896L040629M915690M158276j432251o896309n751584K23525L212922
4342a2785998N96456k062847J75758N226358Q178094P557950M757673N07655m552903
4333G598196p546413n630829r14187M31373l954469q125133m825421L892388P911331
$$ plain form
4324 -11163164 -8578547 -12504550 -13969242 -6656339 3086862 3523104 -7671902 -20759570
4316 -20759570 -25408652 -20400086 -11646505 -4884756 -2164995 -2646397 -4416690 -6336930
4308 -6336930 -8838077 -11980599 -13210867 -9511848 -2196448 3062863 2150270 -3592053
4300 -3592053 -10261324 -15635111 -18887509 -18637863 -14264590 -8260088 -4700122 -5261035 -8153683
4291 -8153683 -10666474 -11365851 -10110930 -7473782 -4474468 -2076061 -854932 -1565568 -5382457
4282 -5382457 -12452201 -20339954 -25052590 -24170206 -18858780 -12928414 -10078151 -11528132
4274 -11528132 -15561999 -19152492 -20120409 -17863513 -12806418 -6335853 -1063957 663068
4266 663068 -667230 -2101669 -2143834 -2619779 -4930176 -6214931 -2436048 5029223 9342058
$$ packed form
4324a1163164K584617l926003j464692P312903R743201M36242j1195006j3087668
4316b0759570m649082N008566Q753581O761749K719761m81402j770293j920240
4308f336930k501147l142522j230268L699019P315400N259311r12593n742323
4300c592053o669271n373787l252398K49646M373273O004502L559966n60913k892648
4291h153683k512791o99377J254921K637148K999314K398407J221129p10636l816889
4282e382457p069744p887753m712636Q82384N311426N930366K850263j449981
4274a1528132m033867l590493r67917K256896N057095O470565N271896J727025
4266F63068j330298j434439m2165m75945k310397j284755L778883P465271M312835
$$ plain form
4257 9342058 6014519 -1802991 -7560859 -8660221 -7287716 -5697702 -3961533 -2161207
4249 -2161207 -1697950 -3355491 -6004475 -8292577 -10272359 -12553201 -15018827 -16961270
4241 -16961270 -17304688 -14518972 -8196409 -1270617 1656651 -523618 -4152241 -6226665
4233 -6226665 -8479735 -13479312 -19103850 -20745060 -17897856 -14726828 -14483036 -17051233
4225 -17051233 -21831570 -28751539 -35452320 -37536362 -33698606 -27722053 -23426188 -20116713
4217 -20116713 -14987375 -7859898 -1533016 1005932 -1579074 -7938300 -13600648 -13975289
4209 -13975289 -9486447 -5452665 -5143713 -5616325 -2911935 1117763 698558 -6169241 -14912350
4200 -14912350 -19143988 -16371878 -9389905 -3439578 -1585746 -2296711 -2571595 -3061204 -7001689
$$ packed form
4257I342058l327539p817510n757868j099362J372505J590014J736169J800326
4249b161207M63257j657541k648984k288102j979782k280842k465626j942443
4241a6961270l43418K785716O322563O925792K927268k180269l628623k074424
4233f226665k253070m999577n624538j641210K847204L171028K43792k568197
4225a7051233m780337o919969o700781k084042L837756N976553M295865L309475
4217b0116713N129338P127477O326882K538948k585006o359226n662348l74641
4209a3975289M488842M033782L08952m72612K704390M029698m19205o867799q743109
4200a4912350m231638K772110O981973N950327J853832p10965k74884m89609l940485
$$ plain form
4191 -7001689 -13429057 -15915617 -11065727 -4581148 -4498851 -10653435 -15453259 -13824034 -7670422
4182 -7670422 -862185 5207070 9665623 9889985 4461204 -2899019 -5423230 -785640
4174 -785640 4512877 920979 -12588404 -25313263 -26560203 -18609586 -13004430 -15091291
4166 -15091291 -18985680 -18488766 -15210891 -12900409 -11111645 -9052996 -9312045 -12797765
4158 -12797765 -15873426 -17135965 -20317406 -25386607 -24779268 -15137141 -4386776 656870
4150 656870 4350497 10603441 12457995 6056794 2852513 10766494 16459473 11470039
4142 11470039 24930686 93119913 193405702 247597799 209753147 121293473 56194853
4135 56194853 36670761 31545668 17379653 2909641 -1987410 -5483169 -14347278 -20840325
$$ packed form
4191g001689o427368k486560M849890O484579Q2297o154584m799824J629225O153612
4182g670422O808237O069255M458553K24362n428781p360223k524211M637590
4174g85640N298517l591898j3509383j2724859j246940P950617N605156k086861
4166a5091291l894389M96914L277875K310482J788764K058649k59049l485720
4158a2797765l075661j262539l181441n069201O07339R642127J0750365N043646
4150F56870L693627O252944J854554o401201l204281P913981N692979m989434
4142A1470039J3460647O8189227J00285789N4192097l7844652q8459674o5098620
4135E6194853j9524092n125093j4166015j4470012m897051l495759q864109o493047
$$ plain form
4127 -20840325 -19169894 -16747920 -19592521 -20993224 -13812215 -2718211 4021837 5834617
4119 5834617 6047291 4901822 2705761 3002182 6798746 9405050 7756492 5581878 7294820
4110 7294820 11623889 14374464 12760303 5239981 -6990826 -16601854 -15194718 -4465381
4102 -4465381 4332011 4625987 1204252 204566 867348 1365565 4155956 9376618 10525615
4093 10525615 4087638 -2735789 -1776944 3736813 5029953 2194373 3563941 11992598
4085 11992598 20157165 20396271 13014105 3554962 -3488797 -6931149 -8162502 -9346776
4077 -9346776 -10937132 -11527142 -11158256 -12380480 -15867978 -17784136 -14757109 -9246923 -6516211
4068 -6516211 -8038245 -11110135 -13233977 -13780325 -13136657 -13188558 -16552436 -22283335 -24790015
$$ packed form
4127b0840325J670431K421974k844601j400703P181009J1094004O740048J812780
4119E834617K12674j145469k196061K96421L796564K606304j648558k174614J712942
4110G294820M329069K750575j614161p520322j2230807r611028J407136J0729337
4102d465381Q797392K93976l421735r99686O62782M98217K790391N220662J148997
4093A0525615o437977o823427R58845N513757J293140k835580J369568Q428657
4085A1992598Q164567K39106p382166r459143p043759l442352j231353j184274
4077i346776j590356n90010L68886j222224l487498j916158L027027N510186K730712
4068f516211j522034l071890k123842n46348O43668n1901l363878n730899k506680
$$ plain form
4059 -24790015 -20428638 -12619435 -6802910 -3437585 -618504 -384027 -6031585 -14825172
4051 -14825172 -20109338 -20507822 -20804671 -23216276 -23982507 -20240289 -14742340 -11206357 -9346908
4042 -9346908 -7349678 -6070311 -8064498 -14250256 -22844585 -29876430 -30776738 -24495049
4034 -24495049 -16369597 -13531235 -16900982 -21144043 -22565096 -22285870 -20863584 -15879007
4026 -15879007 -7893999 -3158101 -5493851 -9554805 -7707326 -899191 3146342 1053456
4018 1053456 -2817597 -3915840 -2847269 -2133067 -2379071 -3491780 -5992808 -9218496 -11291398
4009 -11291398 -12616572 -16353376 -23381874 -29752052 -31728691 -30887952 -31231290 -33177584
4001 -33177584 -33664997 -30952163 -26139938 -20780225 -16094796 -13973564 -15534870 -18879015
$$ packed form
4059b4790015M361377P809203N816525L365325K819081K34477n647558q793587
4051a4825172n284166l98484k96849k411605p66231L742218N497949L535983J859449
4042i346908J997230J279367j994187o185758q594329p031845r00308O281689
4034b4495049Q125452K838362l369747m243061j421053K79226J422286M984577
4026a5879007P985008M735898k335750m060954J847479O808135M045533k092886
4018A053456l871053j098243J068571P14202k46004j112709k501028l225688k072902
4009a1291398j325174l736804p028498o370178j976639Q40739l43338j946294
4001c3177584m87413K712834M812225N359713M685429K121232j561306l344145
$$ plain form
3993 -18879015 -21269505 -23224470 -27083539 -31797920 -33338974 -30829799 -27747324 -25700688
3985 -25700688 -21938092 -15584686 -11373174 -12978134 -16679570 -16853676 -14838059 -16500572
3977 -16500572 -22702011 -28271174 -29891364 -28851338 -25472359 -17154755 -4330183 6757031
3969 6757031 10475478 7562492 1818891 -5439333 -14170991 -21439061 -22704751 -17155174
3961 -17155174 -9229961 -4447184 -4614211 -6893884 -7050782 -3852938 -27125 1585163
3953 1585163 1479610 1634091 2074354 2023895 2586218 4251162 3253002 -4128046 -13935522
3944 -13935522 -17379429 -12400546 -6246318 -4619820 -4830617 -2921417 -785728 -1041903
3936 -1041903 -768984 2846872 4794803 -2291480 -16873376 -29336925 -33068491 -29085314
$$ packed form
3993a8879015k390490j954965l859069m714381j541054K509175L082475K046636
3985b5700688L762596O353406M211512j604960l701436j74106K015617j662513
3977a6500572o201439n569163j620190J040026L378979Q317604J2824572J1087214
3969F757031L718447k912986n743601p258224q731658p268070j265690N549577
3961a7155174P925213M782777j67027k279673j56898L197844L825813J612288
3953A585163j05553J54481M40263n0459N62323J664944r98160p381048r807476
3944a3935522l443907M978883O154228J626498k10797J909200K135689k56175
3936a041903K72919L615856J947931p086283j4581896j2463549l731566L983177
$$ plain form
3928 -29085314 -21078806 -12350382 -7437843 -10120977 -18030350 -23942616 -24066663 -21446203
3920 -21446203 -20337210 -21080732 -21623669 -20408922 -16268159 -8627610 425881 6616908
3912 6616908 7608452 5327253 3614370 4823518 8501597 11694739 10864890 5238728 -2192747
3903 -2192747 -8311142 -13007728 -16933818 -18607160 -16978875 -14711105 -14878220 -16149848
3895 -16149848 -15699863 -15180473 -18275187 -23168863 -23658912 -18246257 -12189156 -9356471 -7909143
3886 -7909143 -5927472 -5323973 -6914393 -6746111 -1642205 4988891 6834005 1994738 -6073673
3877 -6073673 -12486383 -13457492 -7955540 84974 3682574 105492 -5651929 -7380235
3869 -7380235 -5387152 -4473366 -6153786 -7052736 -4689807 -1071633 701591 1148578 3800966
$$ packed form
3928b9085314Q006508Q728424M912539k683134p909373n912266j24047K620460
3920b1446203J108993p43522n42937J214747M140763P640549R053491O191027
3912F616908R91544k281199j712883J209148L678079L193142q29849n626162p431475
3903b192747o118395m696586l926090j673342J628285K267770j67115j271628
3895a6149848M49985N19390l094714m893676m90049N412655O057101K832685J447328
3886g909143J981671O03499j590420J68282N103906O631096J845114m839267q068411
3877f073673o412710r71109N501952Q040514L597600l577082n757421j728306
3869g380235J993083R13786j680420q98950K362929L618174J773224M46987K652388
$$ plain form
3860 3800966 9997369 15476233 13726500 3476914 -8629376 -14709276 -14032347 -12555571
3852 -12555571 -15055291 -20554227 -24885711 -24528960 -18305091 -8903478 -2665412 -4102656
3844 -4102656 -10583978 -16174729 -19991256 -25533550 -32081950 -33675759 -28334084 -21555569
3836 -21555569 -17876499 -15544909 -13173134 -14739589 -22499488 -30746017 -33089946 -31562643
3828 -31562643 -32103624 -34840459 -35470749 -33019605 -29433199 -24412256 -17847110 -14660840
3820 -14660840 -18852779 -24097969 -19306779 -4242826 8717900 10370899 4788590 915286
3812 915286 946849 1164768 -991723 -5409984 -11512407 -17870128 -21586575 -21048133 -17968309
3803 -17968309 -15109585 -13757838 -14378641 -17046894 -19670499 -18420183 -12062265 -4243827
$$ packed form
3860C800966O196403N478864j749733j0249586j2106290o079900O76929J476776
3852a2555571k499720n498936m331484L56751O223869R401613O238066j437244
3844d102656o481322n590751l816527n542294o548400j593809N341675O778515
3836b1555569L679070K331590K371775j566455p759899q246529k343929J527303
3828c1562643n40981k736835o30290K451144L586406N020943O565146L186270
3820a4660840m191939n245190M791190J5063953J2960726J652999n582309l873304
3812I15286L1563K17919k156491m418261o102423o357721l716447N38442L079824
3803a7968309K858724J351747o20803k668253k623605J250316O357918P818438
$$ plain form
3795 -4243827 53536 -975733 -5724153 -11586898 -16538203 -19604609 -20523219 -18495148
3787 -18495148 -12453821 -4305973 -49863 -4061875 -12960292 -18859809 -18333821 -14359651
3779 -14359651 -10195404 -6535148 -4939393 -8082021 -14619726 -19104100 -19572031 -20342886
3771 -20342886 -24332383 -27586415 -25563723 -20598580 -18133989 -18507882 -17620313 -13954938
3763 -13954938 -10010897 -7475456 -5263010 -2497214 -257116 65184 -1765800 -4892432
3755 -4892432 -7823908 -9834944 -12564117 -17996925 -23913143 -24793707 -19415124 -13707731
3747 -13707731 -12664788 -13217378 -9925638 -4514500 -3483926 -7763660 -11380516 -10621422
3739 -10621422 -8428792 -8382038 -9764165 -10813289 -12292745 -14970334 -16877289 -15784991
$$ packed form
3795d243827M297363j029269m748420n862745m951305l066406r18610K028071
3787a8495148O041327Q147848M256110m012012q898417n899517N25988L974170
3779a4359651M164247L660256J595755l142628o537705m484374m67931p70855
3771b0342886l989497l254032K022692M965143K464591l73893Q87569L665375
3763a3954938L944041K535441K212446K765796K240098L22300j830984l126632
3755d892432k931476k011036k729173n432808n916218q80564N378583N707393
3747a3707731J042943n52590L291740N411138J030574m279734l616856P59094
3739a0621422K192630M6754j382127j049124j479456k677589j906955J092298
$$ plain form
3731 -15784991 -11991889 -6650348 126854 7398088 12102224 12151325 9140137 5886594
3723 5886594 2913716 -482775 -3212686 -3141952 -548728 1124353 -1687420 -9360317 -18248493
3714 -18248493 -22931308 -20698805 -14647730 -11113587 -13220729 -18151560 -21255695 -20944610
3706 -20944610 -18519559 -15430735 -12812833 -12233344 -14398998 -17398444 -17789254 -13294311
3698 -13294311 -4037996 7323944 15706813 16183202 8993544 577919 -2954078 -2150938
3690 -2150938 -1283218 -752020 3040672 10143337 14301453 10187646 247348 -8333330 -11287978
3681 -11287978 -9294808 -4336481 2377077 9078823 13119389 13259760 11153082 9711936
3673 9711936 10121052 10378679 6945025 -1142963 -9666492 -12541700 -8720715 -3782548 -2899143
$$ packed form
3731a5784991L793102N341541O777202P271234M704136M9101l011188l253543
3723E886594k972878l396491k729911P0734K593224J673081k811773p672897q888176
3714a8248493m682815K232503O051075L534143k107142m930831l104135L11085
3706b0944610K425051L088824K617902N79489k165654k999446l90810M494943
3698a3294311R256315J1361940Q382869M76389p189658q415625l531997Q03140
3690b150938Q67720N31198L792692P102665M158116m113807r940298q580678k954648
3681a1287978J993170M958327O713558O701746M040566J40371k106678j441146
3673I711936M09116K57627l433654q087988q523529k875208L820985M938167Q83405
$$ plain form
3664 -2899143 -4308541 -2634075 2899982 7509855 7841003 5760134 4117529 2549226
3656 2549226 -287221 -3256498 -4435172 -4502905 -5652390 -8016369 -9475266 -8424476 -4872718
3647 -4872718 476254 6257859 10058445 9971479 6596798 2316373 -1030882 -2838596 -3197643
3638 -3197643 -3038424 -3553243 -3880748 -1069368 5261755 9992360 7737952 78410 -6337534
3629 -6337534 -8533468 -9634766 -12161096 -14045084 -13622853 -14026233 -18683573 -25216113 -27876965
3620 -27876965 -24719909 -18997117 -14443760 -12349197 -12668237 -14817039 -17090309 -17656125
3612 -17656125 -16573806 -15372881 -14873736 -14855026 -15171027 -15365583 -13850595 -9569326 -4114068
3603 -4114068 -315510 752822 -397075 -3601011 -8106690 -10816136 -9212665 -5969606
$$ packed form
3664b899143j409398J674466N534057M609873L31148k080869j642605j568303
3656B549226k836447k969277j178674o7733j149485k363979j458897J050790L551758
3647d872718N348972N781605L800586q6966l374681m280425l347255j807714l59047
3638c197643J59219n14819l27505K811380O331123M730605k254408p659542o415944
3629f337534k195934j101298k526330j883988M22231m03380m657340o532540k660852
3620b7876965L157056N722792M553357K094563l19040k148802k273270n65816
3612a7656125J082319J200925M99145J8710l16001j94556J514988M281269N455258
3603d114068L798558J068332j149897l203936m505679k709446J603471L243059
$$ plain form
3595 -5969606 -6666936 -12047315 -16343992 -14841138 -9470674 -4726067 -1481660 1998279
3587 1998279 5562084 7323199 6721220 4107488 -1411642 -10216202 -19057666 -23285566
3579 -23285566 -22063693 -18225888 -13260973 -6231542 1914448 7170787 7492853 5688720
3571 5688720 4970365 4386566 1518117 -2426994 -3646147 -1000387 2796528 5023299 5331242
3562 5331242 4128199 1107627 -3629047 -8509601 -11495422 -11533000 -8992267 -5576566 -3555342
3553 -3555342 -3771429 -4450520 -3369523 -1258871 -1506365 -6055745 -12912650 -18290682 -20284758
3544 -20284758 -20071985 -20261582 -22024148 -23047511 -19109160 -9454392 91456 2232694
3536 2232694 -3211318 -8701205 -7885222 -2157336 3138116 5734389 6852913 7170056 6165724
$$ packed form
3595e969606o97330n380379m296677J502854N370464M744607L244407L479939
3587A998279L563805J761115o01979k613732n519130q804560q841464m227900
3579b3285566J221873L837805M964915P029431Q145990N256339L22066j804133
3571E688720p18355n83799k868449l945111j219153K645760L796915K226771L07943
3562E331242j203043l020572m736674m880554k985821l7578K540733L415701K021224
3553c555342k16087o79091J080997K110652k47494m549380o856905n378032j994076
3544b0284758K12773j89597j762566j023363L938351R654768R545848K141238
3536B232694n444012n489887Q15983N727886N295452K596273J118524L17143j004332
$$ plain form
3527 6165724 4497002 3677701 3595404 2892363 1556588 930397 1593562 3299246 6191062
3518 6191062 9770755 11714424 10513452 8260261 7590258 6991358 3261504 -2150322 -4421259
3509 -4421259 -3272984 -3861829 -8053174 -10728906 -8217113 -5057603 -7327161 -13156539
3501 -13156539 -15822988 -13997113 -12726518 -14813818 -16991108 -15638509 -11840189 -9189991
3493 -9189991 -9540502 -11860936 -12856120 -8635776 1187078 10870001 13396517 8530416 2688821
3484 2688821 383660 9647 -703778 -227081 2454720 3381821 -1568678 -9756742 -14676124
3475 -14676124 -14681613 -13958559 -15040366 -15501226 -13374924 -11168488 -11639879 -12885725 -11186302
3466 -11186302 -6983540 -4542229 -6180612 -9768138 -12080403 -12123128 -10500565 -7706880
$$ packed form
3527F165724j668722q19301q2297p03041j335775o26191O63165J705684K891816
3518F191062L579693J943669j200972k253191o70003n98900l729854n411826k270937
3509d421259J148275n88845m191345k675732K511793L159510k269558n829378
3501a3156539k666449J825875J270595k087300k177290J352599L798320K650198
3493i189991l50511k320434r95184M220344R822854R682923K526516m866101n841595
3484B688821k305161l74013p13425M76697K681801R27101m950499q188064m919382
3475a4676124n489P23054j081807m60860K126302K206436m71391j245846J699423
3466a1186302M202762K441311j638383l587526k312265m2725J622563K793685
$$ plain form
3458 -7706880 -4475659 -2622338 -3982287 -8519671 -14036172 -17697570 -17851063 -14861825
3450 -14861825 -10444375 -6098775 -2543812 -864123 -2875089 -8702372 -14839409 -17185130
3442 -17185130 -16258542 -16789139 -21225746 -26274482 -27409442 -24265644 -19455744 -14612297
3434 -14612297 -10604154 -9459444 -12076259 -15174284 -14706394 -11845328 -11218686 -13102736
3426 -13102736 -12316885 -6344807 180778 1922734 60805 -396587 2081513 4617073
3418 4617073 4863625 3522336 2341093 1955651 1564326 -449773 -4692385 -8805582 -9291957
3409 -9291957 -6495149 -5143756 -7830295 -10691245 -8715776 -3172639 -29486 -2395146
3401 -2395146 -8315038 -15001955 -21012629 -24402155 -23032999 -17839444 -12654453 -9648615
$$ packed form
3458g706880L231221J853321j359949m537384n516501l661398j53493K989238
3450a4861825M417450M345600L554963J679689k010966n827283o137037k345721
3442a7185130R26588n30597m436607n048736j134960L143798M809900M843447
3434a4612297M008143J144710k616815l098025M67890K861066O26642j884050
3426a3102736P85851N972078O525585J741956j861929m57392K478100K535560
3418D617073K46552j341289j181243l85442l91325k014099m242612m113197m86375
3409i291957K796808J351393k686539k860950J975469N543137L143153k365660
3401b395146n919892o686917o010674l389526J369156N193555N184991L005838
$$ plain form
3393 -9648615 -7266986 -3255723 2646705 9336087 14862396 15782052 9277826 -2305709
3385 -2305709 -11487805 -12553440 -7469148 -3447878 -5339417 -11499848 -16637527 -17702186
3377 -17702186 -16579320 -16817943 -18240255 -16630909 -9680675 -1147560 3102795 1812653
3369 1812653 -1373110 -3153935 -3271207 -2762184 -2605490 -3863606 -6422926 -7921310 -6611826
3360 -6611826 -4612717 -5206178 -7731654 -8960836 -8934354 -10818171 -14745389 -16757822 -15107195
3351 -15107195 -12956297 -13000588 -13724305 -13196419 -12548885 -13112649 -13658414 -13080859 -12581650
3342 -12581650 -12794997 -12097801 -10168572 -9559966 -10991117 -11034593 -8035977 -6580670 -11616155
3333 -11616155 -20866239 -27489837 -28152111 -24464336 -18774751 -13052306 -10062876 -10798222
$$ packed form
3393i648615K381629M011263N902428O689382N526309R19656o504226j1583535
3385b305709r182096j065635N084292M021270j891539o160431n137679j064659
3377a7702186J122866k38623j422312J609346O950234Q533115M250355j290142
3369A812653l185763j780825j17272N09023J56694j258116k559320j498384J309484
3360f611826J999109n93461k525476j229182K6482j883817l927218k012433J650627
3351a5107195K150898m4291p23717N27886O47534n63764n45765N77555M99209
3342a2581650k13347O97196J929229O08606j431151m3476K998616J455307n035485
3333a1616155r250084o623598o62274L687775N689585N722445K989430p35346
$$ plain form
3325 -10798222 -11629299 -8193772 -1396796 3943332 5086217 2444126 -3258545 -10234419
3317 -10234419 -13729579 -10368343 -3783752 -612403 -1256964 -305502 3780805 5917317
3309 5917317 3068211 -523517 -193066 1856336 375698 -4885272 -9201854 -9525046 -7650106
3300 -7650106 -6966381 -8205263 -8755079 -5679425 406615 5036662 4667495 905316 -1986315
3291 -1986315 -2736375 -3347336 -4657425 -5516414 -6190262 -8087514 -9451065 -6362720 -88316
3282 -88316 1439234 -6864498 -19528594 -26141710 -22587080 -13548634 -5948715 -3389131
3274 -3389131 -5583911 -9465701 -10884743 -7816037 -2139780 2944257 6364973 8779131
3266 8779131 10322351 10723454 10310179 8866156 4937038 -1312401 -5909877 -4780255 879477
$$ packed form
3325a0798222q31077L435527O796976N340128J142885k642091n702671o975874
3317a0234419l495160L361236O584591L171349o44561R51462M086307K136512
3309E917317k849106l591728L30451K049402j480638n260970m316582l23192J874940
3300g650106O83725j238882n49816L075654O086040M630047l69167l762179k891631
3291a986315p50060o10961j310089q58989o73848j897252j363551L088345O274404
3282h8316J527550q303732j2664096o613116L554630R038446P599919K559584
3274c389131k194780l881790j419042L068706N676257N084037L420716K414158
3266H779131J543220M01103m13275j444023l929118o249439m597476J129622N659732
$$ plain form
3257 879477 5752602 6739095 5349122 3650210 1005534 -3616937 -8236116 -9039542 -4695942
3248 -4695942 1717327 5229461 3035256 -3704820 -11302611 -16125792 -16100732 -11322137 -4650840
3239 -4650840 -809578 -2467308 -6754808 -7697868 -3025565 3149243 5351084 2544623
3231 2544623 -2397265 -7046331 -11049901 -14501072 -16899831 -17560980 -15772512 -11075867
3223 -11075867 -4548843 933222 3050407 2183984 337117 -1160078 -1843232 -1222535 766082
3214 766082 3151279 4932094 5767636 4794297 624380 -5636108 -9246930 -6605713 -226036
3205 -226036 4030226 4246157 3743253 4789502 4495476 -1007587 -10215534 -16414163 -14169905
3196 -14169905 -4834317 4419055 7000518 2711879 -2836277 -4568987 -2768496 -1120038
$$ packed form
3257H79477M873125R86493j389973j698912k644676m622471m619179q03426M343600
3248d695942O413269L512134k194205o740076p597791m823181K5060M778595O671297
3239d650840L841262j657730m287500r43060M672303O174808K201841k806461
3231B544623m941888m649066m003570l451171k398759o61149J788468M696645
3223a1075867O527024N482065K117185q66423j846867j497195o83154O20697J988617
3214G66082K385197J780815Q35542r73339m169917o260488l610822K641217O379677
3205b26036M256262K15931n02904J046249k94026n503063r207947o198629K244258
3196a4169905R335588R253372K581463m288639n548156j732710J800491J648458
$$ plain form
3188 -1120038 -1630942 -3271362 -4597916 -5459074 -6434618 -8652911 -13865086 -22287921 -30153278
3179 -30153278 -31881325 -25721339 -15665032 -7230279 -3059804 -2977141 -5715506 -8904437
3171 -8904437 -9404167 -6262456 -2820454 -3767413 -9727959 -15893806 -16412817 -9686067 632727
3162 632727 9295018 13771113 14996592 14415549 11676138 6320376 569072 -2158076 -1940640
3153 -1940640 -3024589 -8065772 -13609325 -14005790 -9089423 -4876785 -6048943 -10669293
3145 -10669293 -14255152 -16752225 -22096322 -31340553 -39720399 -41784633 -36978310 -28572936
3137 -28572936 -19371472 -10858623 -4818379 -2556912 -2974251 -4097239 -6136756 -10305086
3129 -10305086 -15140067 -17458376 -17011032 -16483158 -16534346 -15191854 -13104324 -14101198 -18003834
$$ packed form
3188a120038n10904j640420j326554q61158r75544k218293n212175q422835p865357
3179c0153278j728047O159986J0056307Q434753M170475Q2663k738365l188931
3171h904437m99730L141711L442002r46959n960546o165847n19011O726750J0318794
3162F32727Q662291M476095J225479n81043k739411n355762n751304k727148K17436
3153a940640j083949n041183n543553l96465M916367M212638j172158m620350
3145a0669293l585859k497073n344097r244231q379846k064234M806323Q405374
3137b8572936R201464Q512849O040244K261467m17339j122988k039517m168330
3129a0305086m834981k318309M47344N27874n1188J342492K087530r96874l902636
$$ plain form
3120 -18003834 -18266695 -11033603 -1982345 1143662 -989692 -2490924 -2710388 -5823386
3112 -5823386 -11278167 -13011437 -9267941 -5705112 -6282716 -7621797 -5717641 -2464888
3104 -2464888 -1287378 -890242 1892576 6119151 8016072 6380617 3441655 1958932
3096 1958932 3663172 8230939 11781834 9436399 1749218 -4788526 -6314603 -6661483
3088 -6661483 -10370662 -15061579 -15790940 -13239820 -11459022 -10283396 -6762030 -2247669
3080 -2247669 -620341 -128155 4994701 13639381 16347019 7851893 -5131874 -12463229
3072 -12463229 -12014618 -8872345 -7639711 -9923918 -16008642 -24187099 -30117025 -30585758
3064 -30585758 -26951959 -22692671 -19481804 -17660897 -17662902 -18149967 -15723197 -9983902 -6113891
$$ packed form
3120a8003834k62861P233092R051258L126007k133354j501232k19464l112998
3112e823386n454781j733270L743496L562829n77604j339081J904156L252753
3104b464888J177510L97136K782818M226575J896921j635455k938962j482723
3096A958932J704240M567767L550895k345435p687181o537744j526077l46880
3088f661483l709179m690917p29361K551120J780798J175626L521366M514361
3080b247669J627328M92186N122856Q644680K707638q495126j2983767p331355
3072a2463229M48611L142273J232634k284207o084724q178457n929926m68733
3064c0585758L633799M259288L210867J820907k005m87065K426770N739295L870011
$$ plain form
3055 -6113891 -8374394 -13559613 -15591533 -14443411 -14898023 -17714796 -18496631 -15836122 -14336864
3046 -14336864 -17413243 -22224288 -24562975 -24590542 -24621884 -24677534 -23486911 -21091821 -17360687
3037 -17360687 -10731231 -1954790 3611056 1966770 -2933871 -3455547 1462956 5455664
3029 5455664 4683049 3261971 6211265 11331084 12214694 6947919 -561647 -6968698 -12630559
3020 -12630559 -17614116 -18854792 -14218824 -7009401 -2870543 -2925019 -3439240 -2584752 -3737779
3011 -3737779 -9952826 -18168813 -22421660 -21365319 -18901479 -17949984 -17700350 -17440324 -18600641
3002 -18600641 -21014751 -21127686 -17039449 -12232214 -10636317 -10528486 -7660275 -2630965
2994 -2630965 -40585 -827885 -755199 2611483 6282611 7034087 5906117 4863503 2560083
$$ packed form
3055f113891k260503n185219k031920J148122m54612k816773p81835K660509J499258
3046a4336864l076379m811045k338687k7567l1342n5650J190623K395090L731134
3037a7360687O629456Q776441N565846j644286m900641n21676M918503L992708
3029E455664p72615j421078K949294N119819Q83610n266775p509566o407051n661861
3020a2630559m983557j240676M635968P209423M138858n4476n14221Q54488j153027
3011c737779o215047q215987m252847J056341K463840R51495K49634K60026j160317
3002a8600641k414110j12935M088237M807235J595897J07831K868211N029310
2994b630965K590380p87300P2686L366682L671128P51476j127970j042614k303420
$$ plain form
2985 2560083 -3103349 -10471499 -15599079 -17104981 -17008567 -17731597 -20422480 -25040335 -29622782
2976 -29622782 -30217588 -24053727 -12934149 -2081136 4196857 4934266 1858439 -2088073
2968 -2088073 -4346393 -4406476 -3662475 -3172984 -2722248 -2524991 -3894356 -7189456 -11031142
2959 -11031142 -14384865 -16864310 -16257291 -9954296 -1142745 1242774 -6754110 -17308063
2951 -17308063 -20331452 -16715423 -15356144 -19017256 -21232691 -17636829 -12562984 -11970943
2943 -11970943 -16024579 -21350423 -25167556 -24515482 -16968712 -5645991 1379024 528983
2935 528983 -2518749 -950733 4714630 9982836 13253192 14287474 10375306 670855
2927 670855 -8357084 -8640141 -783994 6940847 9049754 7044235 4158762 1841706 1541372
$$ packed form
2985B560083n663432p368150n127580j505902R6414p23030k690883m617855m582447
2976b9622782n94806O163861J1119578J0853013O277993P37409l075827l946512
2968b088073k258320o0083P44001M89491M50736J97257j369365l295100l841686
2959a1031142l353723k479445O07019O302995Q811551K385519p996884j0553953
2951a7308063l023389L616029J359279l661112k215435L595862N073845N92041
2943a1970943m053636n325844l817133O52074P546770J1322721P025015q50041
2935E28983l047732J568016N665363N268206L270356J034282l912168r704451
2927F70855r027939k83057P856147P724841K108907k005519k885473k317056l00334
$$ plain form
2918 1541372 4160509 6560473 3693523 -4052404 -9885258 -8815322 -3242428 1287730
2910 1287730 2409820 1108105 -1195878 -3171815 -3332237 -1665677 -491449 -2188616
2902 -2188616 -6673821 -11615721 -14379077 -13989217 -12298903 -12472543 -14872088 -15910382 -13242802
2893 -13242802 -10064352 -10527530 -12656801 -11092320 -6418120 -5673711 -12206001 -20620001
2885 -20620001 -24238814 -22601410 -18739832 -14168360 -10771115 -13139577 -23110460 -34037510
2877 -34037510 -36055562 -26903517 -13765574 -4814734 -2442915 -4465669 -7995913 -10834531
2869 -10834531 -11609760 -10398049 -8669653 -7981679 -8671932 -9487783 -8609294 -5944295 -4048802
2860 -4048802 -5078277 -7320753 -7599221 -7017160 -10134569 -17043577 -20848905 -16221798 -6774112
$$ packed form
2918A541372K619137K399964k866950p745927n832854J069936N572894M530158
2910A287730J122090j301715k303983j975937j60422J666560J174228j697167
2902b188616m485205m941900k763356L89860J690314j73640k399545j038294K667580
2893a3242802L178450m63178k129271J564481M674200P44409o532290q414000
2885b0620001l618813J637404L861578M571472L397245k368462r970883j0927050
2877c4037510k018052R152045J3137943Q950840K371819k022754l530244k838618
2869a0834531p75229J211711J728396O87974o90253q15851Q78489K664999J895493
2860d048802j029475k242476k78468N82061l117409o909008l805328M627107R447686
$$ plain form
2851 -6774112 -820 2105622 2917657 4090760 3997499 2478586 2175575 4551642 8103327
2842 8103327 10819814 11427821 8337280 601676 -9668444 -18293795 -22524559 -21966601
2834 -21966601 -17507604 -11879658 -9315245 -10965690 -12410762 -10037463 -7990384 -12942827
2826 -12942827 -22802208 -27495432 -22062523 -12547684 -6895912 -6261210 -8309892 -12951713
2818 -12951713 -20067145 -26094433 -27934507 -27181067 -26271202 -23707415 -17720185 -11613388
2810 -11613388 -9980630 -11464269 -10732206 -6705782 -3599730 -4025156 -6067708 -7797932
2802 -7797932 -10223975 -14531329 -19918338 -25361476 -30542770 -34072145 -33737544 -29691707
2794 -29691707 -24825546 -20906367 -16768060 -11284416 -5510325 -579826 3918025 7707251
$$ packed form
2851f774112O773292K106442Q12035J173103r3261j518913l03011K376067L551685
2842H103327K716487O08007l090541p735604j0270120q625351m230764N57958
2834b1966601M458997N627946K564413j650445j445072K373299K047079m952443
2826a2942827r859381m693224N432909R514839N651772O34702k048682m641821
2818a2951713p115432o027288j840074P53440R09865K563787N987230O106797
2810a1613388J632758j483639P32063M026424L106052m25426k042552j730224
2802g797932k426043m307354n387009n443138n181294l529375L34601M045837
2794b9691707M866161L919179M138307N483644N774091M930499M497851L789226
$$ plain form
2786 7707251 8356261 4480028 -1055281 -3609436 -1913495 1111270 2271425 1101686
2778 1101686 -1010681 -3088003 -5216465 -7542717 -9264846 -8939276 -6050149 -2112129
2770 -2112129 391568 257922 -1802703 -4658607 -7740243 -10068690 -9590737 -5074027 1331821
2761 1331821 4773814 1961927 -5390475 -12091294 -14565945 -13757078 -12650233 -12124360 -10800723
2752 -10800723 -8441689 -7136200 -8371841 -11045564 -13902856 -18157751 -25285120 -32996737
2744 -32996737 -36095757 -31997168 -23913446 -17838704 -16992594 -19403785 -20489427 -17998523
2736 -17998523 -14370964 -13501177 -15422212 -16179577 -13582952 -10383713 -9792009 -10442733 -8992946
2727 -8992946 -5821792 -4206967 -4816868 -5243530 -4781947 -5285216 -6759076 -6558461 -4298188
$$ packed form
2786G707251O49010l876233n535309k554155J695941L024765J160155j169739
2778A101686k112367k077322k128462k326252j722129L25570K889127L938020
2770b112129K503697j33646k060625k855904l081636k328447M77953M516710O405848
2761A331821L441993k811887p352402o700819k474651Q08867J106845N25873J323637
2752a0800723K359034J305489j235641k673723k857292m254895p127369p711617
2744c2996737l099020M098589Q083722O074742Q46110k411191j085642K490904
2736a7998523L627559Q69787j921035p57365K596625L199239N91704o50724J449787
2727h992946L171154J614825o09901m26662M61583n03269j473860K00615K260273
$$ plain form
2718 -4298188 -3370059 -5670515 -8720191 -10255035 -11705698 -14178326 -14948749 -12115005 -9545941
2709 -9545941 -11970799 -16780343 -16193027 -7715238 2154523 5684957 1832269 -4669721
2701 -4669721 -8852623 -8469326 -4148198 846831 2175660 -1931825 -8365359 -11693369
2693 -11693369 -9661269 -5696302 -5074635 -8517504 -11164290 -9317614 -6350431 -8304515
2685 -8304515 -14104315 -15213392 -6985099 4433593 10202200 9709214 8388926 7853434
2677 7853434 4831555 -1111646 -5652341 -6538082 -6546987 -7688875 -7403013 -3102530 3491416
2668 3491416 9222497 13357253 16025726 15978513 12848852 9238414 7745893 7720127 7138571
2659 7138571 5679712 3725669 399355 -4867646 -10300951 -13440480 -13612337 -11563429
$$ packed form
2718d298188R28129k300456l049676j534844j450663k472628p70423K833744K569064
2709i545941k424858m809544N87316Q477789R869761L530434l852688o501990
2701d669721m182902L83297M321128M995029J328829m107485o433534l328010
2693a1693369K032100L964967O21667l442869k646786J846676K967183j954084
2685h304515n799800j109077Q228293J1418692N768607m92986j320288n35492
2677G853434l021879n943201m540695q85741q905j141888K85862M300483O593946
2668C491416N731081M134756K668473m7213l129661l610438j492521k5766n81556
2659G138571j458859j954043l326314n267001n433305l139529j71857K048908
$$ plain form
2651 -11563429 -8756843 -8175175 -12583238 -19800711 -23148968 -19759969 -15176911 -15746591
2643 -15746591 -19555360 -20061954 -16401277 -13759046 -14161613 -13611306 -9827118 -6887344 -8973706
2634 -8973706 -13630586 -14979175 -11297853 -6107063 -2947966 -1889175 -1011234 596123
2626 596123 1969343 2032777 1803156 3774515 8260176 11722573 10769839 6858102 4356347
2617 4356347 4424604 3998366 1114521 -2089913 -2804544 -1101948 1324304 3465732 4623392
2608 4623392 4227381 3724623 6195691 11850672 15830257 12995248 3830839 -6282520
2600 -6282520 -12445303 -13105322 -9177055 -3030072 2116541 4131154 3576528 2252291 673851
2591 673851 -1644797 -4076133 -4752539 -2360823 3166857 11163361 19796452 25490276 24834590
$$ packed form
2651a1563429K806586N81668m408063p217473l348257L388999M583058n69680
2643a5746591l808769n06594L660677K642231m02567N50307L784188K939774k086362
2634h973706m656880j348589L681322N190790L159097J058791Q77941J607357
2626E96123J373220O3434k29621J971359M485661L462397r52734l911737k501755
2617D356347O8257m26238k883845l204434p14631J702596K426252K141428J157660
2608D623392l96011n02758K471068N654981L979585k835009r164409j0113359
2600f282520o162783o60019L928267O146983N146613K014613n54626j324237j578440
2591F73851k318648k431336o76406K391716N527680P996504Q633091N693824o55686
$$ plain form
2582 24834590 17912540 8889456 2702607 1165923 1872603 502433 -5084628 -12254085
2574 -12254085 -15692152 -12899756 -6824212 -2019932 737987 4166934 9286120 12828920
2566 12828920 10628670 2118306 -9454438 -20086996 -27001671 -28462862 -23921897 -15465768
2558 -15465768 -7901836 -5347344 -7188655 -8640331 -6097964 -1024827 2196496 1030722
2550 1030722 -3756740 -9853090 -14405454 -14386870 -9034317 -2023646 1530988 659761 -1437272
2541 -1437272 -3003631 -5667368 -9612839 -11025562 -7409499 -2321565 -889573 -2506219
2533 -2506219 -2160004 1679990 4560054 1936932 -5462905 -12975365 -16399716 -14441425
2525 -14441425 -8934793 -3648766 -1379109 -1328347 -340448 2829716 5568823 4366133 -938375
$$ packed form
2582B4834590o922050r023084o186849j536684P06680j370170n587061p169457
2574a2254085l438067K792396O075544M804280K757919L428947N119186L542800
2566A2828920k200250q510364j1572744j0632558o914675j461191M540965Q456129
2558a5465768P563932K554492j841311j451676K542367N073137L221323j165774
2550A030722m787462o096350m552364J8584N352553P010671L554634q71227k097033
2541a437272j566359k663737l945471j412723L616063N087934J431992j616646
2533b506219L46215L839994K880064k623122p399837p512460l424351J958291
2525a4441425N506632N286027K269657N0762R87899L170164K739107j202690n304508
$$ plain form
2516 -938375 -6521356 -8290692 -6235331 -4637683 -7188319 -12436345 -15808941 -15828459 -15428455
2507 -15428455 -16366871 -15969855 -11887603 -6902332 -5244673 -6174093 -5405542 -1820078 1535905
2498 1535905 2841323 3617330 4840375 4718053 1687103 -3066531 -7152658 -8959806 -7791930
2489 -7791930 -4432102 -1734857 -2016041 -3737821 -3641710 -2031324 -2193867 -4177549 -3644449
2480 -3644449 1329495 6520814 7419049 5392433 4541313 4803208 2031198 -5853537 -15612865
2471 -15612865 -21365709 -19038046 -9305252 2074642 7874036 5333144 -1711444 -7387833
2463 -7387833 -9352486 -8911503 -7338854 -4106302 1662547 9229233 15700039 17597389
2455 17597389 14197080 9180188 7025386 7584598 6601772 2070862 -2749003 -3760059
$$ packed form
2516i38375n582981j769336K055361J597648k550636n248026l372596j9518M00004
2507a5428455r38416L97016M082252M985271J657659r29420P68551L585464L355983
2498A535905J305418P76007J223045j22322l030950m753634m086127j807148J167876
2489g791930L359828K697245k81184j721780R6111J610386j62543j983682N33100
2480c644449M973944N191319Q98235k026616q51120K61895k772010p884735r759328
2471a5612865n752844K327663R732794J1379894N799394k540892p044588n676389
2463g387833j964653M40983J572649L232552N768849P566686O470806J897350
2455A7597389l400309n016892k154802N59212r82826m530910m819865j011056
$$ plain form
2447 -3760059 -748649 3689654 7303191 8758628 7769268 6313764 6890582 7734022 3135665
2438 3135665 -8547156 -20055348 -22101877 -13686130 -2720624 2376962 -540359 -7364416
2430 -7364416 -12076259 -12037184 -10203856 -10574372 -11510437 -7478091 1755885 9112722 9915942
2421 9915942 7829745 7343375 6646422 3490907 1784443 4781565 7214001 3275246 -2203019
2412 -2203019 -1217642 2330029 -2261615 -13520517 -17993897 -11374552 -5280833 -7869948
$$ packed form
2447c760059L011410M438303L613537J455437r89360j455504N76818Q43440m598357
2438C135665j1682821j1508192k046529Q415747J0965506N097586k917321o824057
2430g364416m711843L9075J833328l70516r36065M032346R233976P356837Q03220
2421I915942k086197m86370o96953l155515j706464K997122K432436l938755n478265
2412b203019R85377L547671m591644j1258902m473380O619345O093719k589115
$$ [...]
##END NTUPLES=NMR SPECTRUM
##END=
