##TITLE=31Pdec_DE-88_oil_TFA
 CDCl3, 64 sc
 4.4.2025
##JCAMPDX= 6.0         $$ Bruker NMR JCAMP-DX V2.0
##DATA TYPE= NMR SPECTRUM
##DATA CLASS= NTUPLES
##ORIGIN= UXNMR, Bruker Analytische Messtechnik GmbH
##OWNER= root
$$ XWIN-NMR		Version 3.5
$$ Fri Apr  4 16:23:37 2025 Russian Standard Time (UT+4h)  she@DPX200
##.OBSERVE FREQUENCY= 81.013821
##.OBSERVE NUCLEUS= ^31P
##.ACQUISITION MODE= SIMULTANEOUS
##.ACQUISITION SCHEME= undefined
##.AVERAGES= 64
##.DIGITISER RES= 17
##SPECTROMETER/DATA SYSTEM= spect
##.PULSE SEQUENCE= zgpg30
##.SOLVENT NAME= DMSO
##.SHIFT REFERENCE= (INTERNAL, DMSO, 0, 198.062)
##AUDIT TRAIL= $$ (NUMBER, WHEN, WHO, WHERE, WHAT)
$$ ##TITLE= Audit trail, XWIN-NMR		Version 3.5
$$ ##JCAMPDX= 5.01
$$ ##ORIGIN= Bruker BioSpin GmbH
$$ ##OWNER= she
$$ F:/spectra/data/she/nmr/P31/2/pdata/1/auditp.txt
$$ ##AUDIT TRAIL=  $$ (NUMBER, WHEN, WHO, WHERE, WHAT)
(   1,<2025-04-04 16:22:38.39 +0400>,<she>,<DPX200>,
      <created by zg, POWCHK disabled, PULCHK disabled
       configuration hash MD5:
       00 E9 B6 7A A2 85 ED C7 34 08 36 98 17 FE 4E 26
       data hash MD5: 32K
       B7 FC 12 02 1F 75 4B D2 C7 A0 7F 7F DF F1 E0 05>)
(   2,<2025-04-04 16:22:40.90 +0400>,<she>,<DPX200>,
      <Start of raw data processing
       efp BC_mod = 2 LB = 1.5 FT_mod = 6 PKNL = 1 PHC0 = 1371.507 PHC1 = 201.0943 SI = 64K 
       data hash MD5: 64K
       60 E0 93 7F FD 72 5B 08 9A 84 4B 8D EE B9 6B 8D>)
(   3,<2025-04-04 16:22:59.35 +0400>,<she>,<DPX200>,
      <pk PHC0 = -116.115 PHC1 = 321.2 
       data hash MD5: 64K
       22 6B 81 E7 73 BC 73 43 C4 F3 73 01 A1 3E BE B1>)
(   4,<2025-04-04 16:23:05.48 +0400>,<she>,<DPX200>,
      <abs ABSG = 5 
       data hash MD5: 64K
       4B 98 14 74 ED 1C EF A7 32 81 6F 10 EE 34 2B 06>)
$$ ##END=
$$ 
$$ hash MD5
$$ 0A 5F CA D7 1A 75 FB 7C 0A 0F CD 2B D0 A9 5B 16
##$RELAX= 
##$RELAX= 
##$RELAX= 
##$RELAX= 
##$RELAX= 
##$RELAX= 
##$RELAX= 
##$RELAX= 
$$ Bruker specific parameters
$$ --------------------------
##$DU= <F:/spectra>
##$EXPNO= 2
##$NAME= <P31>
##$PROCNO= 1
##$TYPE= <nmr>
##$USER= <she>
##$AMP= (0..31)
100 100 100 100 100 100 100 100 100 100 100 100 100 100 100 100 100 100 
100 100 100 100 100 100 100 100 100 100 100 100 100 100 
##$AQSEQ= 0
##$AQ_mod= 1
##$AUNM= <au_zg>
##$AUTOPOS= <>
##$BF1= 81.014009
##$BF2= 200.13
##$BF3= 200.13
##$BF4= 200.13
##$BF5= 200.13
##$BF6= 200.13
##$BF7= 200.13
##$BF8= 200.13
##$BYTORDA= 1
##$CFDGTYP= 0
##$CFRGTYP= 5
##$CHEMSTR= <none>
##$CNST= (0..31)
1 1 145 1 1 1 1 1 1 1 1 1 1 1 1 1 1 1 1 1 1 1 1 1 1 1 1 1 1 1 1 1 
##$CPDPRG= <waltz16>
##$CPDPRG1= <>
##$CPDPRG2= <waltz16>
##$CPDPRG3= <>
##$CPDPRG4= <mlev>
##$CPDPRG5= <mlev>
##$CPDPRG6= <mlev>
##$CPDPRG7= <mlev>
##$CPDPRG8= <mlev>
##$CPDPRGB= <>
##$CPDPRGT= <>
##$D= (0..31)
0 1 0 0 0 0 0 0 0 0.06 0 0.03 2e-05 3e-06 0 0 0.0002 0 0 0 0 0 0 0 0 0 
0 0 0 0 0 0 
##$DATE= 1743769357
##$DBL= (0..7)
120 120 120 11 120 120 24 19 
##$DBP= (0..7)
150 150 150 150 150 150 150 150 
##$DBP07= 0
##$DBPNAM0= <>
##$DBPNAM1= <>
$$ [...]
##$SUBNAM3= <"">
##$SUBNAM4= <"">
##$SUBNAM5= <"">
##$SUBNAM6= <"">
##$SUBNAM7= <"">
##$SUBNAM8= <"">
##$SUBNAM9= <"">
##$SW= 400.765351723535
##$SWIBOX= (0..15)
0 1 3 0 0 0 0 0 0 0 0 0 0 0 0 0 
##$SW_h= 32467.5324675325
##$TD= 32768
##$TD0= 1
##$TE= 0
##$TE2= 300
##$TE3= 300
##$TEG= 300
##$TL= (0..7)
0 120 53 12 22 120 120 120 
##$TP= (0..7)
150 150 150 150 150 150 150 150 
##$TP07= 0
##$TPNAME0= <>
##$TPNAME1= <>
##$TPNAME2= <>
##$TPNAME3= <>
##$TPNAME4= <>
##$TPNAME5= <>
##$TPNAME6= <>
##$TPNAME7= <>
##$TPOAL= (0..7)
0.5 0.5 0.5 0.5 0.5 0.5 0.5 0.5 
##$TPOFFS= (0..7)
0 0 0 0 0 0 0 0 
##$TUNHIN= 0
##$TUNHOUT= 0
##$TUNXOUT= 0
##$USERA1= <user>
##$USERA2= <user>
##$USERA3= <user>
##$USERA4= <user>
##$USERA5= <user>
##$V9= 5
##$VALIST= <valist>
##$VCLIST= <CCCCCCCCCCCCCCC>
##$VD= 0
##$VDLIST= <DDDDDDDDDDDDDDD>
##$VPLIST= <PPPPPPPPPPPPPPP>
##$VTLIST= <TTTTTTTTTTTTTTT>
##$WBST= 1024
##$WBSW= 4
##$XGAIN= (0..3)
0 0 0 0 
##$XL= 0
##$YL= 0
##$YMAX_a= 6291
##$YMIN_a= -14796
##$ZGOPTNS= <>
##$ZL1= 120
##$ZL2= 120
##$ZL3= 120
##$ZL4= 120
##$ABSF1= 198.0616
##$ABSF2= -202.7028
##$ABSG= 5
##$ABSL= 3
##$ALPHA= 0
##$AQORDER= 0
##$ASSFAC= 0
##$ASSFACI= 0
##$ASSFACX= 0
##$ASSWID= 0
##$AUNMP= <proc_1d>
##$AZFE= 0.1
##$AZFW= 0.5
##$BCFW= 0
##$BC_mod= 2
##$BYTORDP= 0
##$COROFFS= 0
##$CY= -3
##$DATMOD= 1
##$DC= 0
##$DFILT= <>
##$DTYPP= 0
##$F1P= 0
##$F2P= 0
##$FCOR= 1
##$FTSIZE= 65536
##$FT_mod= 6
##$GAMMA= 0
##$GB= 0
##$INTBC= 1
##$INTSCL= 9.790993e-09
##$ISEN= 30
##$LB= 1.5
##$LEV0= 0
##$LPBIN= 0
##$MAXI= 10000
##$MC2= 0
##$MEAN= 0
##$ME_mod= 0
##$MI= 50
##$NCOEF= 0
##$NC_proc= -8
##$NLEV= 6
##$NOISF1= 182.463
##$NOISF2= 159.3651
##$NSP= 0
##$NTH_PI= 0
##$NZP= 0
##$OFFSET= 198.0616
##$PC= 4
##$PHC0= 1255.392
##$PHC1= 522.2943
##$PH_mod= 1
##$PKNL= yes
##$PPARMOD= 0
##$PSCAL= 0
##$PSIGN= 0
##$REVERSE= no
##$SF= 81.0140089999434
##$SI= 65536
##$SIGF1= 159.3651
##$SIGF2= -187.1042
##$SINO= 113.3802
##$SIOLD= 16384
##$SREGLST= <1H.CDCl3>
##$SSB= 0
##$STSI= 65536
##$STSR= 0
##$SW_p= 32467.5324675325
##$SYMM= 0
##$S_DEV= 0
##$TDeff= 32768
##$TDoff= 0
##$TI= <>
##$TILT= no
##$TM1= 0
##$TM2= 0
##$TOPLEV= 0
##$USERP1= <user>
##$USERP2= <user>
##$USERP3= <user>
##$USERP4= <user>
##$USERP5= <user>
##$WDW= 1
##$XDIM= 65536
##$YMAX_p= 183401265
##$YMIN_p= -240467179
$$ End of Bruker specific parameters
$$ ---------------------------------
##NTUPLES= NMR SPECTRUM
##VAR_NAME=  FREQUENCY,     SPECTRUM/REAL,   SPECTRUM/IMAG
##SYMBOL=    X,             R,               I
##VAR_TYPE=  INDEPENDENT,   DEPENDENT,       DEPENDENT
##VAR_FORM=  AFFN,          ASDF,            ASDF
##VAR_DIM=   65536,         65536,           65536
##UNITS=     HZ,            ARBITRARY UNITS, ARBITRARY UNITS
##FACTOR=    0.49542278885378, 1,            1
##FIRST=     16045.7642231865, 0,            0
##LAST=      -16421.768244346, 0,            0
##MIN=       -16421.768244346, -240467179,   0
##MAX=       16045.7642231865, 183401265,    0
$$ Real data points
##PAGE= N=1
##DATA TABLE= (X++(R..R)), XYDATA
$$ [...]
$$ plain form
6749 5612728 8720715 11381322 12020905 9945526 6988359 5430288 5457973 6074843 7073089
6740 7073089 8191335 7737163 4602329 791856 -672915 211434 1089913 1230952 1663135
6731 1663135 1643959 -1203831 -6397792 -9701591 -8282334 -4036203 -257263 2369890 4621866
6722 4621866 6034010 5765855 4652454 4252514 4854218 6021955 7990401 10918648 13740151
6713 13740151 15227706 15388312 14702200 13094968 10828376 9123128 8486766 7612080 5442218
6704 5442218 3208077 2780463 3969197 5134266 5606910 5749274 5381628 4106409 2788403
6695 2788403 2795036 3804221 4002715 2546190 441429 -1045020 -1537327 -1094806 20007
6686 20007 911900 672557 -189473 -53749 1566466 3013937 2356553 -428919 -3853086
$$ packed form
6749E612728L107987K660607O39583k075379k957167j558071K7685O16870R98246
6740G073089J118246m54172l134834l810473j464771Q84349Q78479J41039M32183
6731A663135j9176k847790n193961l303799J419257M246131L778940K627153K251976
6722D621866J412144k68155j113401l99940O01704J167737J968446K928247K821503
6713A3740151J487555J60606o86112j607232k266592j705248o36362q74686k169862
6704E442218k234141m27614J188734J165069M72644J42364l67646j275219j318006
6695B788403O633J009185J98494j456525k104761j486449m92307M42521J114813
6686B0007Q91893k39343q62030J35724J620215J447471o57384k785472l424167
$$ plain form
6677 -3853086 -6983320 -10093259 -13069145 -14096614 -11050072 -4362733 2413523 5724575
6669 5724575 5353165 3994481 3926871 4988700 5534260 4309161 1443454 -1486924 -2598510
6660 -2598510 -1872673 -1679403 -3767958 -6396039 -6476919 -4166303 -2693110 -3483159 -4406257
6651 -4406257 -3649011 -2188685 -918432 1487642 5372539 7489062 4891237 -195259
6643 -195259 -2634160 -626874 3091289 5507256 6022889 5475792 5171556 6559331 9470864
6634 9470864 11254177 10209127 9059274 11720916 16976800 19146760 15523227 9311195
6626 9311195 4000109 -1191957 -7751412 -13036438 -12805953 -7331204 -1670781 125851
6618 125851 -1255593 -2739203 -2991452 -3192588 -4494558 -5873949 -5181006 -2287050 -131380
$$ packed form
6677c853086l130234l109939k975886j027469L046542O687339O776256L311052
6669E724575l71410j358684o7610J061829N45560j225099k865707k930378j111586
6660b598510P25837J93270k088555k628081q0880K310616J473193p90049r23098
6651d406257P57246J460326J270253K406074L884897K116523k597825n086496
6643a95259k438901K007286L718163K415967N15633n47097l04236J387775K911533
6634I470864J783313j045050j149853K661642N255884K169960l623533o212032
6626I311195n311086n192066o559455n285026K30485N474749N660423J796632
6618A25851j381444j483610k52249k01136j301970j379391O92943K893956K155670
$$ plain form
6609 -131380 -1509684 -5410857 -8191800 -8291172 -7830296 -9013355 -10856679 -10670948 -7460537
6600 -7460537 -2634516 1733313 4334884 5108442 5156607 5564807 5874168 4716927 2364396
6591 2364396 1213870 2841720 5775170 7158890 5610299 1707205 -2974085 -6327242
6583 -6327242 -6703174 -4723890 -2853183 -2039145 -443540 3009016 5834853 5168924 2206473
6574 2206473 547478 1038537 1386164 398810 -889098 -2546453 -6445118 -12228152 -15811870
6565 -15811870 -14232032 -9849566 -7372888 -8156316 -9712977 -9809024 -8635507 -7245016 -5915394
6556 -5915394 -4354510 -2285637 251006 2349302 2443731 225152 -2094549 -1923815 352731
6547 352731 1636036 31406 -2834653 -4092634 -3219021 -2314020 -3062597 -4347992 -3482335
$$ packed form
6609a31380j378304l901173k780943r9372M60876j183059j843324J85731L210411
6600g460537M826021M367829K601571P73558M8165M08200L09361j157241k352531
6591B364396j150526J627850K933450J383720j548591l903094m681290l353157
6583f327242l75932J979284J870707Q14038J595605L452556K825837o65929k962451
6574B206473j658995M91059L47627r87354j287908j657355l898665n783034l583718
6565a5811870J579838M382466K476678p83428j556661r6047J173517J390491J329622
6556e915394J560884K068873K536643K098296R4429k218579k319701J70734K276546
6547C52731J283305j604630k866059j257981Q73613R05001p48577j285395Q65657
$$ plain form
6538 -3482335 238500 3958375 4159746 953053 -1897803 -1659103 268431 1062301 640348
6529 640348 973342 2212135 2210622 -10564 -2811389 -4580939 -5636427 -6502147 -6317449
6520 -6317449 -4399795 -1884430 -289090 454977 1168639 1617935 991673 -461138 -1521399
6511 -1521399 -1347153 -18644 1606615 2171777 1143803 310026 2164449 5929907 7420275
6502 7420275 4441718 5057 -2070481 -2367159 -3554905 -4968163 -3722334 -319755
6494 -319755 1345394 -225014 -2410786 -3148814 -3393220 -3882608 -3338665 -1508433 -524354
6485 -524354 -1405799 -2411366 -2656954 -3907655 -6499721 -7004234 -2997200 2796130 6319367
6476 6319367 7424649 7951997 7415259 4754174 2091138 2047581 2832345 829080 -2916949
$$ packed form
6538c482335L720835L719875K01371l206693k850856K38700J927534P93870m21953
6529F40348L32994J238793j513k221186k800825j769550j055488q65720J84698
6520f317449J917654K515365J595340P44067P13662M49296o26262j452811j060261
6511a521399J74246J328509J625259N65162j027974q33777J854423L765458J490368
6502G420275k978557m436661k075538k96678j187746j413258J245829L402579
6494c19755J665149j570408k185772p38028k44406m89388N43943J830232R84079
6485e24354q81445j005567k45588j250701k592066n04513M007034N793330L523237
6476F319367J105282N27348n36738k661085k663036m3557P84764k003265l746029
$$ plain form
6467 -2916949 -3914409 -1683306 -770764 -3642762 -7501285 -9493239 -10354551 -10849669 -9029332
6458 -9029332 -4033178 778014 1754860 -324999 -2255070 -2927788 -3064442 -2449576 -632468
6449 -632468 916609 443249 -1059193 -1224820 -98228 278123 -274188 299252 2306930
6440 2306930 2884583 51752 -3825973 -4606112 -1466746 2378765 3791056 2781661 994490
6431 994490 -1313120 -5149599 -10068675 -13438363 -13196487 -10118610 -6379805 -2988262 -16629
6422 -16629 1613815 644766 -2314362 -4899471 -5638260 -5178854 -4805126 -5122653 -6269602
6413 -6269602 -7895090 -8760034 -7889466 -6227283 -5459095 -5185013 -3474094 -598363 451690
6404 451690 -1601664 -3912844 -3573088 -2156050 -3604604 -8456283 -12678844 -12405514 -8178398
$$ packed form
6467b916949r97460K231103R12542k871998l858523j991954q61312m95118J820337
6458i029332M996154M811192R76846k079859j930071o72718j36654O14866J817108
6449f32468J549077m73360j502442j65627J126592L76351n52311N73440K007678
6440B306930N77653k832831l877725p80139L139366L845511J412291j009395j787171
6431I94490k307610l836479m919076l369688K41876L077877L738805L391543K971633
6422a6629J630444r69049k959128k585109p38789M59406L73728l17527j146949
6413f269602j625488q64944Q70568J662183P68188K74082J710919K875731J050053
6404D51690k053354k311180L39756J417038j448554m851679m222561K73330M227116
$$ plain form
6395 -8178398 -4067651 -3422000 -5705703 -7205351 -4987491 -167494 3323636 3164434 830191
6386 830191 -759576 -525943 304286 -15758 -1891754 -3500008 -2010844 2926960 7444230
6377 7444230 7455187 4185876 2661295 4213279 4205342 -1006823 -8376261 -12310011 -11752212
6368 -11752212 -9682675 -7571437 -4286362 273041 4068683 5524611 4591441 1389690
6360 1389690 -3663537 -8486562 -10609488 -10041854 -8874508 -8152909 -7285145 -6408366 -6864306
6351 -6864306 -8840630 -10575034 -10563388 -9089171 -7214667 -5572492 -4305767 -3042217 -1096562
6342 -1096562 1165936 1826663 -136725 -2624675 -2685579 -556485 783543 -89347 -1467027
6333 -1467027 -1325189 439849 2855364 4990836 5929025 5349712 4284519 3726449 2835029
$$ packed form
6395h178398M110747O45651k283703j499648K217860M819997L491130j59202k334243
6386H30191j589767K33633Q30229l20044j875996j608254J489164M937804M517270
6377G444230J0957l269311j524581J551984p937n212165p369438l933750N57799
6368a1752212K069537K111238L285075M559403L795642J455928r33170l201751
6360A389690n053227m823025k122926N67634J167346P21599Q67764Q76779m55940
6351f864306j976324j734404J1646J474217J874504J642175J266725J263550J945655
6342a096562K262498O60727j963388k487950o0904K129094J340028q72890j377680
6333a467027J41838J765038K415515K135472R38189n79313j065193n58070q91420
$$ plain form
6324 2835029 487740 -1917885 -1852580 240799 1077843 -875775 -3723322 -5589966 -6868611
6315 -6868611 -8103525 -8460902 -7617754 -6701340 -6084745 -4711672 -2885470 -2971839 -5543863
6306 -5543863 -7528220 -6550059 -4815237 -5886055 -9310130 -11416594 -10397877 -7749178
6298 -7749178 -5208650 -2980559 -1013720 298856 1186433 2577290 4551695 5882107
6290 5882107 5602811 4283148 3349400 3484341 3917868 3428053 2216352 2242157 4763636
6281 4763636 8036584 9058649 7480140 5785539 5374074 4942067 3665798 3280300 5076958
6272 5076958 7034388 6389411 3542358 929101 -721482 -2218489 -2835150 -644141 3738145
6263 3738145 6529228 5136942 1456329 -406095 1239572 4277220 5519267 4034673
$$ packed form
6324B835029k347289k405625O5305K093379Q37044j953618k847547j866644j278645
6315f868611j234914l57377Q43148R16414O16595J373073J826202q6369k572024
6306e543863j984357R78161J734822j070818l424075k106464J018717K648699
6298g749178K540528K228091J966839J312576Q87577J390857J974405J330412
6290E882107k79296j319663r33748J34941M33527m89815j211701K5805K521479
6281D763636L272948J022065j578509j694601m11465m32007j276269l85498J796658
6272E076958J957430o44977k847053k613257j650583j497007o16661K191009M382286
6263C738145K791083j392286l680613j862424J645667L037648J242047j484594
$$ plain form
6255 4034673 1697151 776567 1502974 2474550 2996876 3765472 5130369 6203888 6354045
6246 6354045 6152979 5896719 4599486 1784551 -888527 -1331553 354187 2262500 3011634
6237 3011634 2536682 1322266 74430 -441851 -225216 -36567 14636 591072 1106401
6228 1106401 -446008 -4137626 -6609578 -5163865 -1661716 264586 439321 1534763
6220 1534763 4271554 6665126 7729323 8499190 9148393 8413311 6583418 5925630 6976424
6211 6976424 7217018 4943914 2112170 1679322 3975413 7174067 9614473 10162241 7946187
6202 7946187 3541875 -648742 -2653787 -2714166 -1904281 -407436 1492289 2145935 241367
6193 241367 -2854454 -4162804 -2352705 1160937 4019992 4823141 3640288 1673393 255829
$$ packed form
6255D034673k337522r20584P26407R71576N22326P68596J364897J073519J50157
6246F354045k01066k56260j297233k814935k673078m43026J685740J908313P49134
6237C011634m74952j214416j247836n16281K16635J88649N1203N76436N15329
6228A106401j552409l691618k471952J445713L502149J926302J74735J095442
6220A534763K736791K393572J064197P69867O49203p35082j829893o57788J050794
6211F976424K40594k273104k831744m32848K296091L198654K440406N47768k216054
6202G946187m404312m190617k005045o0379Q09885J496845J899725O53646j904568
6193B41367l095821j308350J810099L513642K859055Q03149j182853j966895j417564
$$ plain form
6184 255829 -418708 -1206505 -2336120 -2813976 -2282194 -2335777 -4579741 -7994444 -9714977
6175 -9714977 -8273992 -4909633 -1833724 -368918 -712909 -2278465 -3931804 -4748408 -4820631
6166 -4820631 -4745371 -4393686 -3074719 -967917 712009 1450443 2371104 4596905 7218023
6157 7218023 7863473 5310636 942311 -2457754 -3020696 -1067446 1360783 2205665 1155808
6148 1155808 -142792 -26198 1134930 1588925 935047 909265 2656298 4433416 3548017
6139 3548017 -12327 -3492032 -4627705 -3373096 -645417 2519785 4311746 3042633
6131 3042633 -230639 -1994219 -504520 2062117 3016951 2658011 2518210 2283063 1221382
6122 1221382 1083380 4140409 8919569 11270377 9843189 7480801 6701599 6735145 5925679
$$ packed form
6184B55829o74537p87797j129615m77856N31782n3583k243964l414703j720533
6175i714977J440985L364359L075909J464806l43991j565556j653339q16604p2223
6166d820631P5260L51685J318967K106802J679926P38434R20661K225801K621118
6157G218023O45450k552837m368325l400065n62942J953250K428229Q44882j049857
6148A155808j298600J16594J161128M53995o53878k5782J747033J777118q85399
6139C548017l560344l479705j135673J254609K727679L165202J791961j269113
6131C042633l273272j763580J489699K566637R54834l58940j39801k35147j061681
6122A221382j38002L057029M779160K350808j427188k362388p79202L3546q09466
$$ plain form
6113 5925679 4349669 2789880 1504155 1373589 3857866 7922829 9163728 4631865
6105 4631865 -2518651 -5729623 -2218650 4421397 8825360 9325905 8231714 7893214 7795354
6096 7795354 5773384 1414909 -2792729 -4132753 -2676877 -824086 -534971 -2110343
6088 -2110343 -4930819 -7750912 -8728087 -7145728 -5036804 -5044331 -6572486 -6372156 -3396123
6079 -3396123 -535902 -478776 -2229312 -3273737 -3113817 -2799350 -2632464 -2321047 -2152452
6070 -2152452 -2157955 -1225951 1100322 2918007 1992097 -1141982 -3822709 -4499028 -3806375
6061 -3806375 -2978215 -2743758 -3434840 -4809822 -5998434 -6514738 -6675897 -6236169 -3912619
6052 -3912619 326400 3801862 3872678 1271951 -1195584 -2453103 -3547550 -4947863 -5903114
$$ packed form
6113E925679j576010j559789j285725j30566K484277M064963J240899m531863
6105D631865p150516l210972L510973O640047M403963N00545j094191l38500r7860
6096G795354k021970m358475m207638j340024J455876J852791K89115j575372
6088b110343k820476k820093r77175J582359K108924p527j528155K00330K976033
6079c396123K860221N7126j750536j044425J59920L14467J66886L11417J68595
6070b152452n503R32004K326273J817685r25910l134079k680727o76319O92653
6061c806375Q28160K34457o91082j374982j188612n16304j61159M39728K323550
6052c912619M239019L475462P0816k600727k467535j257519j094447j400313r55251
$$ plain form
6043 -5903114 -6372700 -7263131 -8444647 -8513794 -6964136 -4976431 -3773044 -3673867 -4797725
6034 -4797725 -6926553 -8500246 -7655446 -4785976 -2405769 -1938261 -2236695 -1809325 -811825
6025 -811825 -59436 378180 679449 690129 636429 1061330 1274925 -480052 -4019257 -5872813
6015 -5872813 -2873937 3527190 8220165 7566320 2425124 -3549250 -7204821 -7563074 -5803599
6006 -5803599 -4331893 -4986137 -7357636 -9215575 -9069776 -7914424 -7807521 -9037745 -9728828
5997 -9728828 -8527951 -6585237 -5811213 -5846585 -4436667 -1030232 1692913 975098 -2430298
5988 -2430298 -5171274 -5236502 -3683938 -2708410 -3283549 -4829226 -6106813 -5976716 -3885190
5979 -3885190 -135488 4225809 7694955 8764944 7039991 4276164 3311369 5145310
$$ packed form
6043e903114m69586q90431j181516o9147J549658J987705J203387R9177j123858
6034d797725k128828j573693Q44800K869470K380207M67508k98434M27370R97500
6025h11825P52389M37616L01269J0680n3700M24901K13595j754977l539205j853556
6015e872813K998876O401127M692975o53845n141196n974374l655571l58253J759475
6006e803599J471706o54244k371499j857939J45799J155352J06903j230224o91083
5997i728828J200877J942714P74024l5372J409918L406435K723145p17815l405396
5988b430298k740976o5228J552564R75528n75139j545677j277587J30097K091526
5979c885190L749702M361297L469146J069989j724953k763827r64795J833941
$$ plain form
5971 5145310 7830522 9025025 8730545 8512903 9015519 9645920 10002700 10130357 9883922
5962 9883922 9433343 9797261 11378024 12618170 11802068 9552211 7660639 6175208 4011112
5953 4011112 1896257 1709403 2734978 1807519 -1768345 -4396074 -3011211 632537 2517450
5944 2517450 1361362 -1094322 -3381204 -5455828 -7086038 -7180657 -4966757 -812461 3993664
5935 3993664 7607815 8317447 5745834 1133184 -3911718 -8281684 -10849406 -10466340 -7392591
5926 -7392591 -3716004 -1400244 -640111 -656371 -911853 -800260 459900 2489896 3550825
5917 3550825 2881671 2002014 2352448 2957920 2193849 846341 1357428 4389329 7824909
5908 7824909 9061595 7202699 3562097 1121304 2479078 6723091 9266916 6751686
$$ packed form
5971E145310K685212J194503k94480k17642N02616O30401L56780J27657k46435
5962I883922m50579L63918J580763J240146q16102k249857j891572j485431k164096
5953D011112k114855j86854J025575r27459l575864k627729J384863L643748J884913
5944B517450j156088k455684k286882k074624j630210r4619K213900M154296M806125
5935C993664L614151P09632k571613m612650n044902m369966k567722L83066L073749
5926g392591L676587K315760P60133j6260k55482J11593J260160K029996J060929
5917C550825o69154q79657L50434O05472p64071j347508N11087L031901L435580
5908G824909J236686j858896l640602k440793J357774M244013K543825k515230
$$ plain form
5900 6751686 1401809 -1627516 -647728 1305633 1397724 386947 560278 2825410 6858679
5891 6858679 11924687 16242833 17466088 15440616 13118091 13108595 14366904 13867172 10709968
5882 10709968 6836802 4071767 2192775 194677 -1813128 -2682435 -1834574 -422164
5874 -422164 -679686 -3665125 -7552668 -8964672 -6595330 -2861300 -1139699 -1902218 -2682454
5865 -2682454 -1627468 300776 1085272 439462 -174604 251999 1253383 2121929 3019553
5856 3019553 4202593 4946543 4308816 2639038 1158762 72766 -1499591 -3291150 -3174886
5847 -3174886 101594 4632978 7369846 7616637 6768484 5226167 1945652 -2808382 -6697720
5838 -6697720 -8170496 -8008393 -6953227 -4056997 749320 4463327 4156855 1278902 -89340
$$ packed form
5900F751686n349877l029325R79788J953361R2091j010777J73331K265132M033269
5891F858679N066008M318146J223255k025472k322525r496J258309m99732l157204
5882A0709968l873166k765035j878992j998098k007805q69307Q47861J412410
5874d22164k57522k985439l887543j412004K369342L734030J721601p62519p80236
5865b682454J054986J928244P84496o45810o14066M26603J001384Q68546Q97624
5856C019553J183040P43950o37727j669778j480276j085996j572357j791559J16264
5847c174886L276480M531384K736868K46791q48153j542317l280515m754034l889338
5838f697720j472776J62103J055166K896230M806317L714007l06472k877953j368242
$$ plain form
5829 -89340 1090512 1902812 534864 -922824 -92490 1925580 2485817 1259698 -76820
5820 -76820 -707116 -860287 -13666 2514671 5366735 5923790 3574862 261848 -2412932
5811 -2412932 -4526901 -5980463 -5782915 -4245054 -3639608 -5129477 -6870542 -6857949 -5932036
5802 -5932036 -5901550 -6186135 -4888665 -2344999 -935161 -1601962 -2995267 -4073962 -5132209
5793 -5132209 -5928513 -5251589 -3226691 -2000373 -2999408 -5085960 -6435481 -6770284 -6727652
5784 -6727652 -6482871 -6201123 -6562179 -7471875 -7250495 -4510954 -248223 3038190 3761968
5775 3761968 1986682 -1358071 -4827820 -6696738 -6178395 -4298110 -2723226 -1964425 -1390597
5766 -1390597 -582399 189789 670487 1108974 1953210 3211713 4044939 3317693 1168944
$$ packed form
5829h9340J179852Q12300j367948j457688Q30334K018070N60237j226119j336518
5820g6820o30296j53171Q46621K528337K852064N57055k348928l313014k674780
5811b412932k113969j453562J97548J537861O05446j489869j741065J2593R25913
5802e932036L0486k84585J297470K543666J409838o66801j393305j078695j058247
5793e132209p96304O76924K024898J226318r99035k086552j349521l34803M2632
5784f727652K44781K81748l61056r09696K21380K739541M262731L286413P23778
5775C761968j775286l344753l469749j868918N18343J880285J574884P58801N73828
5766a390597Q08198P72188M80698M38487Q44236J258503Q33226p27246k148749
$$ plain form
5757 1168944 -429981 116898 1546108 1080340 -1749660 -4573044 -5756193 -6214901 -6883075
5748 -6883075 -6938853 -6078772 -6140238 -8278794 -10455134 -10116453 -7747130 -5266867 -2567958
5739 -2567958 1251814 4421905 3911766 133867 -3083176 -3566322 -2934061 -3214794 -4234435
5730 -4234435 -5233765 -6371582 -7305302 -6541727 -3771768 -1191308 -1024422 -2892168 -4679912
5721 -4679912 -4861230 -3150913 -234387 2130655 2061212 -123380 -1483946 303491 3848186
5712 3848186 5393456 3158407 -554244 -1866736 405453 3506638 4147958 2620779
5704 2620779 2093010 3754421 4989720 3714229 2013174 2721299 4324502 3097826 -548955
5695 -548955 -2196081 -206017 1873111 1031051 -922313 -866406 1062931 2871454 4032543
$$ packed form
5757A168944j598925N46879J429210m65768k830000k823384j183149m58708o68174
5748f883075n5778Q60081o1466k138556k176340L38681K369323K480263K698909
5739b567958L819772L170091n10139l777899l217043m83146O32261k80733j019641
5730d234435r99330j137817r33720P63575K769959K580460J66886j867746j787744
5721d679912j81318J710317K916526K365042o9443k184592j360566J787437L544695
5712C848186J545270k235049l712651j312492K272189L101185O41320j527179
5704B620779n27769J661411J235299j275491j701055P08125J603203j226676l646781
5695e48955j647126J990064K079128q42060j953364N5907J929337J808523J161089
$$ plain form
5686 4032543 4747092 3952284 866098 -2788344 -4495481 -3976726 -2762288 -1889410 -1616569
5677 -1616569 -2089647 -2686031 -2089095 -509847 -149901 -1844522 -3270422 -2549772 -1518704
5668 -1518704 -2751835 -5122031 -5321151 -2488264 1609508 5748267 9414201 10859016
5660 10859016 8576697 4399503 1791678 1064656 -623226 -4425592 -8050596 -9196201
5652 -9196201 -7900061 -5062036 -1390184 1682604 2738733 2707840 4039483 7042270 9446086
5643 9446086 9909226 9290515 8130402 5930848 3555333 3022021 3804202 2670927 -1244506
5634 -1244506 -4460965 -4172197 -2194481 -1634611 -2522266 -3423515 -4730196 -7161463 -9039580
5625 -9039580 -8359269 -6097642 -4399770 -2896960 -128926 2519025 2004059 -1513997 -4387295
$$ packed form
5686D032543P14549p94808l086186l654442j707137N18755J214438Q72878K72841
5677a616569m73078n96384N96936J579248L59946j694621j425900P20650J031068
5668a518704j233131k370196j99120K832887M097772M138759L665934J444815
5660A0859016k282319m177194k607825p27022j687882l802366l625004j145605
5652i196201J296140K838025L671852L072788J056129l0893J331643L002787K403816
5643I446086M63140o18711j160113k199554k375515n33312P82181j133275l915433
5634a244506l216459K88768J977716N59870q87655r01249j306681k431267j878117
5625i039580O80311K261627J697872J502810K768034K647951n14966l518056k873298
$$ plain form
5616 -4387295 -4388653 -3120893 -3046954 -4464970 -5989396 -6214782 -4617247 -2285322 -1487417
5607 -1487417 -2935473 -4261384 -3266396 -1584579 -2206768 -4243479 -3939998 -843243 1266991
5598 1266991 562056 71281 2425778 5460119 5854532 4137787 2834962 1956214 -168498
5589 -168498 -3125353 -5015305 -5947639 -7608034 -9694597 -9893606 -7528170 -4508180 -2296584
5580 -2296584 -330909 2069094 4384840 6056553 7082334 6980753 4966850 1688798
5572 1688798 -915151 -2045280 -2766071 -3860092 -4543980 -3808923 -1603056 1537792 4448111
5563 4448111 5020438 2176722 -1658837 -2682827 -836596 185371 -1014193 -1088870 2372822
5554 2372822 6296433 6556272 4144964 2948408 3468749 3302746 2597794 3946733 6849551
$$ packed form
5616d387295j358J267760P3939j418016j524426k25386J597535K331925P97905
5607a487417j448056j325911R94988J681817o22189k036711L03481L096755K110234
5598A266991p04935m90775K354497L034341L94413j716745j302825q78748k124712
5589a68498k956855j889952r32334j660395k086563j99009K365436L019990K211596
5580b296584J965675K400003K315746J671713J025781j01581k013903l278052
5572A688798k603949j130129p20791j094021o83888P35057K205867L140848K910319
5563D448111N72327k843716l835559j023990J846231J021967j199564p4677L461692
5554B372822L923611K59839k411308j196556N20341j66003p04952J348939K902818
$$ plain form
5545 6849551 7322610 4259904 1725725 2877827 5413731 5687119 4242263 4098919 5609915
5536 5609915 6206088 4227462 493847 -3236335 -5434109 -5254316 -3588140 -2790956 -3762051
5527 -3762051 -4440340 -3000181 -1190642 -2062782 -5282420 -7458083 -6897143 -5371396 -4837554
5518 -4837554 -4814873 -3873509 -1924243 -30104 905976 555682 -886791 -2766928 -4584308
5509 -4584308 -6380398 -7689176 -6791136 -2769019 1900869 3054968 -90385 -3397472
5501 -3397472 -2605052 1507183 4104094 1844289 -3744840 -8255996 -8763114 -5908802 -2311332
5492 -2311332 121541 819917 -567956 -4107455 -8117389 -9882989 -9207654 -9427542 -12796863
5483 -12796863 -16410267 -15585732 -10418551 -5645068 -4141341 -4155051 -3667652 -3774127 -5867942
$$ packed form
5545F849551M73059l062706k534179J152102K535904K73388j444856j43344J510996
5536E609915N96173j978626l733615l730182k197774J79793J666176P97184r71095
5527c762051o78289J440159J809539q72140l219638k175663N60940J525747N33842
5518d837554K2681R41364J949266J894139R36080l50294j442473j880137j817380
5509d584308j796090j308778Q98040M022117M669888J154099l145353l307087
5501c397472P92420M112235K596911k259805n589129m511156n07118K854312L597470
5492b311332K432873O98376j387873l539499m009934j765600O75335k19888l369321
5483a2796863l613404Q24535N167181M773483J503727j3710M87399j06475k093815
$$ plain form
5474 -5867942 -8455724 -9154139 -7788415 -5479200 -2700893 -323932 -370289 -3094242 -5194728
5465 -5194728 -3861256 -975064 -73777 -689540 264374 2333618 1545857 -2804387 -6024472
5456 -6024472 -4611026 -1170348 -136779 -1607501 -2544026 -1847330 -768252 323322 1936414
5447 1936414 2740529 455897 -4033389 -6552818 -4845582 -1601759 -926674 -3628471 -7411493
5438 -7411493 -10027894 -10432517 -8165739 -3908104 -208102 540332 -828945 -830952 2480292
5429 2480292 7109763 9438724 7913836 3893201 -173030 -2629453 -3417072 -3842170 -5241255
5420 -5241255 -7458099 -9100269 -9476169 -9283088 -8831531 -6892390 -2681166 1861312 3614646
5411 3614646 2089827 100049 247397 2105399 3582512 3948270 4358975 5733214 7054388
$$ packed form
5474e867942k587782o98415J365724K309215K778307K376961m6357k723953k100486
5465e194728J333472K886192R01287o15763R53914K069244p87761m350244l220085
5456f024472J413446L440678J033569j470722r36525O96696J079078J091574J613092
5447A936414Q04115k284632m489286k519429J707236L243823O75085k701797l783022
5438g411493k616401m04623K266778M257635L700002P48434j369277k007L311244
5429B480292M629471K328961j524888m020635m066231k456423p87619m25098j399085
5420e241255k216844j642170l75900J93081M51557J939141M211224M542478J753334
5411C614646j524819j989778J47348J858002J477113L65758M10705J374239J321174
$$ plain form
5402 7054388 6105462 1841250 -3957330 -7691919 -7177306 -3895292 -1513005 -2104653 -4353867
5393 -4353867 -5489093 -4288820 -1933452 -484473 -921130 -2447612 -3609893 -4159921 -5355993
5384 -5355993 -7883037 -10127720 -9747955 -6728803 -3411141 -1356841 135335 1781810
5376 1781810 2421984 889443 -1453398 -2072151 -880296 -623245 -3155730 -6760708 -8250232
5367 -8250232 -7090568 -6167240 -8137140 -11893779 -13656541 -11472727 -7462769 -4978257
5359 -4978257 -4618998 -4368035 -2960240 -1242221 -168734 540593 953508 -148569 -3517324
5350 -3517324 -7635325 -10060128 -10102831 -9182314 -8957007 -9887380 -11088697 -10827916 -7816646
5341 -7816646 -2915719 1017416 1901191 590724 -419160 346303 2846787 6555843 10372309
$$ packed form
5402G054388r48926m264212n798580l734589N14613L282014K382287n91648k249214
5393d353867j135226J200273K355368J448979m36657j526482j162281n50028j196072
5384e355993k527044k244683L79765L019152L317662K054300J492176J646475
5376A781810O40174j532541k342841o18753J191855K57051k532485l604978j489524
5367h250232J159664R23328j969900l756639j762762K183814M009958K484512
5359d978257L59259K50963J407795J718019J073487P09327M12915j102077l368755
5350c517324m118001k424803m2703R20517K25307r30373j201317K60781L011270
5341g816646M900927L933135Q83775j310467j009884P65463K500484L709056L816466
$$ plain form
5332 10372309 12189072 10500822 6495537 2999395 1255193 236724 -822995 -1200420
5324 -1200420 -724100 -1197273 -4210083 -8514615 -11201674 -11125904 -9708158 -8385113 -6802473
5315 -6802473 -4153572 -1055105 1128200 2197615 2914632 2996340 1037117 -2856469 -5959821
5306 -5959821 -5997528 -4288323 -3902999 -5221514 -5598869 -3555145 -839784 582304 1357607
5297 1357607 2981691 4933861 5537690 4651638 3589696 2910539 2000697 653650 -329506
5288 -329506 -117664 1416786 3643391 5229853 4961009 3219206 1710856 970484 -490440
5279 -490440 -3435329 -5991321 -6223591 -4981790 -3897018 -2059701 2295091 7699260 10445578
5270 10445578 9561233 7575085 6177148 4584521 2983181 3894435 8107068 12042407
$$ packed form
5332A0372309J816763j688250m005285l496142j744202j018469j059719l77425
5324a200420M76320m73173l012810m304532k687059P5770J417746J323045J582640
5315f802473K648901L098467K183305J069415P17017Q1708j959223l893586l103352
5306e959821l7707J709205L85324j318515l77355K043724K715361J422088P75303
5297A357607J624084J952170O03829q86052j061942o79157r09842j347047r83156
5288c29506K11842J534450K226605J586462k68844j741803j508350p40372j460924
5279d90440k944889k555992k32270J241801J084772J837317M354792N404169K746318
5270A0445578q84345j986148j397937j592627j601340R11254M212633L935339
$$ plain form
5262 12042407 11612155 6953328 1336759 -3013446 -5992810 -7950424 -9185739 -10245609
5254 -10245609 -10750840 -8666970 -2851099 3930307 6616929 3111268 -3221044 -6906104
5246 -6906104 -5695395 -2207860 -554694 -1853211 -3633298 -3629015 -2852576 -3756010 -6403770
5237 -6403770 -8442222 -8455091 -7184386 -5514984 -3645817 -2465435 -3070972 -4295785 -3557394
5228 -3557394 -1175670 -797711 -3996632 -7634238 -8732219 -8647909 -9369408 -8856157 -4398435
5219 -4398435 1466706 3294623 270061 -3142349 -4026695 -4121321 -5541545 -7616708 -9341587
5210 -9341587 -11350438 -13650696 -14304160 -12194267 -8792604 -5775495 -3284985 -1812755
5202 -1812755 -2918818 -6145355 -7945061 -6173575 -3377645 -2853358 -3396845 -1255037 3855649
$$ packed form
5262A2042407m30252m658827n616569m350205k979364j957614j235315j059870
5254a0245609n05231K083870N815871O781406K686622l505661o332312l685060
5246f906104J210709L487535J653166j298517j780087M283P76439r03434k647760
5237f403770k038452j2869J270705J669402J869167J180382o05537j224813P38391
5228c557394K381724L77959l198921l637606j097981Q4310p21499N13251M457722
5219d398435N865141J827917l024562l412410q84346r4626j420224k075163j724879
5210i341587k008851k300258o53464K109893L401663L017109K490510J472230
5202a812755j106063l226537j799706J771486K795930N24287n43487K141808N110686
$$ plain form
5193 3855649 8039684 8267199 5288581 1455332 -1796886 -3819555 -4194589 -3055980 -816425
5184 -816425 2387664 5762266 7087295 5041572 2009186 1941506 4974243 6767892 4229974
5175 4229974 -574991 -3843558 -5148269 -6745923 -9149704 -10188907 -8371504 -4965130
5167 -4965130 -2280719 -1444367 -2349751 -4486199 -7076206 -9219522 -10508563 -10977933 -10224348
5158 -10224348 -7453123 -2952956 1267498 3216932 2954252 2057801 1222983 -659081 -4677064
5149 -4677064 -9811965 -13348981 -13319914 -10151731 -5881284 -2122009 943689 3765128 6094979
5140 6094979 6831651 5270370 2267127 -275249 -1257834 -1324589 -1505784 -1380287 283540
5131 283540 2916035 3689640 916742 -3062379 -4212518 -1805171 870628 1152160 237218
$$ packed form
5193C855649M184035K27515k978618l833249l252218k022669l75034J138609K239555
5184h16425L204089L374602J325029k045723l032386o7680L032737J793649k537918
5175D229974m804965l268567j304711j597654k403781j039203J817403L406374
5167d965130K684411Q36352r05384k136448k590007k143316j289041m69370P53585
5158a0224348K771225M500167M220454J949434k62680q96451q34818j882064m017983
5149d677064n134901l537016K9067L168183M270447L759275L065698K821439K329851
5140F094979P36672j561281l003243k542376r82585o6755j81195J25497J663827
5131B83540K632495P73605k772898l979121j150139K407347K675799K81532r14942
$$ plain form
5122 237218 574147 1904529 2030354 580772 -328996 796040 2966219 4296061 3904811
5113 3904811 1800744 -1628925 -5229922 -7346271 -7454308 -6921626 -7450767 -9218600 -10993294
5104 -10993294 -11593547 -10835545 -9466254 -8501412 -8413826 -8970811 -10031036 -11917145 -14333247
5095 -14333247 -15663488 -14565516 -11757164 -8932883 -6565448 -4354741 -2880616 -2405828
5087 -2405828 -845289 3762227 8874284 9417176 4903995 465855 -805523 -2171186
5079 -2171186 -7159862 -13271161 -15558422 -13177226 -8249470 -1413738 6500892 11164599
5071 11164599 9313143 5228823 6228889 12021278 15102186 12311452 9039648 9796626
5063 9796626 11253623 8533220 3084260 -458003 -1461475 -2546297 -4298763 -5332280
$$ packed form
5122B37218L36929J330382J25825j449582r09768J125036K170179J329842l91250
5113C904811k104067l429669l600997k116349j08037N32682n29141j767833j774694
5104a0993294o00253P58002J369291R64842Q7586n56985j060225j886109k416102
5095a4333247j330241J097972K808352K824281K367435K210707J474125M74788
5087b405828J560539M607516N112057N42892m513181m438140j271378j365663
5079b171186m988676o111299k287261K381196M927756O835732P914630M663707
5071A1164599j851456m084320J000066N792389L080908k790734l271804P56978
5063I796626J456997k720403n448960l542263j003472j084822j752466j033517
$$ plain form
5055 -5332280 -5901342 -7249219 -8401999 -7341414 -4774224 -3499903 -4356840 -5570508 -5919887
5046 -5919887 -6109859 -6988874 -8277844 -9040458 -8208764 -5260612 -1481660 547840 41238
5037 41238 -671561 685245 3247488 4600016 3843016 1345177 -2767766 -7618700 -10527305
5028 -10527305 -9404258 -5360639 -1182945 1521031 2104504 -51013 -3838999 -5842938
5020 -5842938 -4394939 -2451219 -3233697 -4843841 -3217139 828133 2189901 -894299
5012 -894299 -4323900 -4254538 -1911978 -579029 -665068 115390 3144768 7000373 8653582
5003 8653582 6388238 2096258 -169356 920960 1978202 -275665 -3921337 -4631192
4995 -4631192 -2250004 -734733 -1893814 -3285008 -3014143 -2852694 -5020747 -8653843 -11142537
$$ packed form
5055e332280n69062j347877j152780J060585K567190J274321q56937j213668l49379
5046e919887j89972q79015j288970p62614Q31694K948152L778952K029500n06602
5037D1238p12799J356806K562243J352528p57000k497839m112943m850934k908605
5028a0527305J123047M043619M177694K703976N83473k155517l787986k003939
5020e842938J447999J943720p82478j610144J626702M045272J361768l084200
5012h94299l429601O9362K342560J332949q6039P80458L029378L855605J653209
5003H653582k265344m291980k265614J090316J057242k253867l645672p09855
4995d631192K381188J515271j159081j391194K70865J61449k168053l633096k488694
$$ plain form
4986 -11142537 -11160472 -9282506 -7105541 -6287102 -6988700 -7255153 -5596370 -3736066 -4582048
4977 -4582048 -7928600 -10843330 -12091910 -13256191 -15349871 -17239521 -17817377 -17152105 -15331502
4968 -15331502 -12806841 -11802118 -14353215 -18805519 -21220830 -20239547 -17468533 -13570335
4960 -13570335 -8133983 -3506494 -3892607 -9236556 -14207512 -14992628 -13339899 -12220840
4952 -12220840 -11417031 -9632890 -7502255 -5972399 -4409253 -2418050 -1120831 -979784
4944 -979784 -805075 -208843 -417361 -1640347 -2514353 -2863237 -3620239 -3454420 260024
4935 260024 5978287 8107118 4404065 -1160837 -4808140 -7447616 -10412441 -11700628
4927 -11700628 -9868008 -7522306 -7516297 -9148715 -10858534 -12795422 -14108503 -12157243 -7538031
$$ packed form
4986a1142537j7935J877966K176965Q18439p01598k66453J658783J860304q45982
4977d582048l346552k914730j248580j164281k093680j889650n77856O65272J820603
4968a5331502K524661J004723k551097m452304k415311R81283K771014L898198
4960a3570335N436352M627489l86113n343949m970956p85116J652729J119059
4952a2220840Q03809J784141K130635J529856J563146J991203J297219J41047
4944i79784J74709N96232k08518j222986q74006l48884p57002J65819L714444
4935B60024N718263K128831l703053n564902l647303k639476k964825j288187
4927a1700628J832620K345702O009j632418j709819j936888j313081J951260M619212
$$ plain form
4918 -7538031 -5395531 -8294508 -12193785 -13012217 -12575664 -14138396 -16569635 -17274711 -16743488
4909 -16743488 -16170315 -14750199 -13012214 -14027544 -17488913 -17993125 -13451100 -9420407
4901 -9420407 -10510179 -13840233 -16107101 -19925520 -26762808 -30876309 -27881855 -22653098
4893 -22653098 -20950359 -20228969 -17046491 -15879605 -20978404 -27153365 -29071955 -31607829
4885 -31607829 -39568200 -46207577 -45240313 -44566939 -52560498 -61225458 -61507962 -63815170 -80215637
4876 -80215637 -98756151 -106351145 -125432280 -182732261 -240467179 -212897784 -76630336
4869 -76630336 79163819 149398798 129017446 93080307 87662777 91773574 78228604
4862 78228604 57812618 49861089 48928046 41842274 32622702 30907467 32729805 29526212
$$ packed form
4918g538031K142500k898977l899277q18432M36553j562732k431239p05076N31223
4909a6743488N73173J420116J737985j015330l461369n04212M542025M030693
4901i420407j089772l330054k266868l818419o837288m113501K994454N228757
4893b2653098J702739P21390L182478J166886n098799o174961j918590k535874
4885c1607829p960371o639377R67264O73374p993559q664960k82504k307208j6400467
4876h0215637j8540514p594994j9081135n7299981n7734918K7569395J36267448
4869g6630336J55794155P0234979k0381352l5937139n417530M110797j3544970
4862G8228604k0415986p951529r33043p085772r219572j715235J822338l203593
$$ plain form
4854 29526212 24067767 23619166 26599582 27354289 26372826 26296190 24720405 19286078 13911246
4845 13911246 12893325 14181641 14169637 13638782 14051989 13745119 12337601 12994856 16134144
4836 16134144 17217444 14940373 14694021 19106874 22224657 18842314 13095381 11404722
4828 11404722 12676946 12276160 10704053 11212215 12743758 12304177 11416248 13553839 17278954
4819 17278954 18074949 15585608 13635356 14072919 15201971 15419564 14529407 12499075 10235304
4810 10235304 10147360 12794471 14720949 12866151 9385436 8784383 11765003 15034784 15936802
4801 15936802 14543529 12409724 11516000 13065856 15608690 16196638 14629822 13704524 13858765
4792 13858765 11527683 5351107 -71525 -213390 3057019 5059392 5074460 5343283 6045150
$$ packed form
4854B9526212n458445m48601K980416P54707r81463p6636j575785n434327n374832
4845A3911246j017921J288316j2004n30855M13207l06870j407518O57255L139288
4836A6134144J083300k277071k46352M412853L117783l382343n746933j690659
4828A1404722J272224m00786j572107N08162J531543m39581q87929K137591L725115
4819A7278954P95995k489341j950252M37563J129052K17593q90157k030332k263771
4810A0235304q7944K647111J926478j854798l480715o01053K980620L269781R02018
4801A5936802j393273k133805q93724J549856K542834N87948j566816r25298J54241
4792A3858765k331082o176576n422632j41865L270409K002373J5068K68823P01867
$$ plain form
4783 6045150 5840968 5518269 6803501 8876615 9675659 9268262 8798645 7941717 6557914
4774 6557914 6687224 9450020 12160818 12093155 10863354 11386720 12896336 12999968 12239272
4765 12239272 12217839 11579527 8678838 6146253 7641187 11775858 14471158 15673451 18077762
4756 18077762 20576254 19292037 14703941 11489035 10964931 9641636 6029371 3078287
4748 3078287 2556774 2470351 1791160 2670288 5797737 8047380 7116248 4823100 3736275
4739 3736275 3810957 4060907 4377936 4197535 2405670 -222910 -1475493 -1304860 -1689578
4730 -1689578 -2564749 -1945101 -615650 -1911134 -5600728 -7042220 -4383662 -1587135 -1724820
4721 -1724820 -2269819 -414396 1610559 696836 -1545099 -1845704 -847831 -1151620 -2368643
$$ packed form
4783F045150k04182l22699J285232K073114P99044m07397m69617q56928j383803
4774F557914J29310K762796K710798o7663j229801N23366J509616J03632p60696
4765A2239272k1433o38312k900689k532585J494934M134671K695300J202293K404311
4756A8077762K498492j284217m588096l214906n24104j323295l612265k951084
4748C078287n21513q6423o79191Q79128L127449K249643r31132k293148j086825
4739C736275P4682K49950L17029j80401j791865k628580j252583J70633l84718
4730a689578q75171O19648J329451j295484l689594j441492K658558K796527j37685
4721a724820n44999J855423K024955r13723k241935l00605R97873l03789j217023
$$ plain form
4712 -2368643 -2617208 -2812997 -4862652 -7153773 -6505958 -3782939 -3146240 -5869250 -8761331
4703 -8761331 -8941358 -6785459 -3695057 42234 4254068 7832530 9516956 8740869 5928103
4694 5928103 2908785 2061208 3657302 5266921 5371271 5917350 9020882 12731825 13086351
4685 13086351 9482332 5004453 1966056 253501 -63013 2181199 6719410 10961659
4677 10961659 12670052 11830542 9416314 6152422 3049695 1356418 1167179 1348252 1274053
4668 1274053 1337737 1461995 665547 -1184099 -2397887 -1155684 2297534 5548126 5971429
4659 5971429 3161398 -162816 -443137 2691509 5614084 5112979 2539589 1749958 3792641
4650 3792641 6081924 6685893 6805766 8241855 10527079 11812471 11198690 9029508 5892646
$$ packed form
4712b368643k48565j95789k049655k291121O47815K723019O36699k723010k892081
4703h761331j80027K155899L090402L737291M211834L578462J684426p76087k812766
4694E928103l019318q47577J596094J609619J04350N46079L103532L710943L54526
4685A3086351l604019m477879l038397j712555l16514K244212M538211M242249
4677A0961659J708393q39510k414228l263892l102727j693277j89239J81073p4199
4668A274053O3684J24258p96448j849646j213788J242203L453218L250592M23303
4659E971429k810031l324214k80321L134646K922575n01105k573390p89631K042683
4650C792641K289283O03969J19873J436089K285224J285392o13781k169182l136862
$$ plain form
4641 5892646 2497769 19910 -442314 1145919 3539991 5043089 4902938 4206213 4847133
4632 4847133 7067416 8799830 8373455 6966224 6893455 8140210 8546612 7313990 6232775
4623 6232775 6874302 8317806 8582229 7042562 4519667 2019482 378766 415534 2330037
4614 2330037 5080353 6977772 6983289 5389477 3520340 2794514 3658559 5223766 6085680
4605 6085680 5522357 3956340 2649486 2979780 5239669 7769432 8121107 5674084 2304480
4596 2304480 -38327 -1237615 -1731399 -930668 1479840 3884825 4374233 3336953 2575739
4587 2575739 2503864 2147261 1252949 232057 -1382280 -3948745 -5641370 -4231307 -952461
4578 -952461 471840 -827005 -1602694 413446 3264823 4260667 3871375 3846531 3662988
$$ packed form
4641E892646l394877k477859m62224J588233K394072J503098j40151o96725O40920
4632D847133K220283J732414m26375j407231p2769J246755M06402j232622j081215
4623F232775O41527J443504K64423j539667k522895k500185j640716L6768J914503
4614B330037K750316J897419N517j593812j869137p25826Q64045J565207Q61914
4605F085680n63323j566017j306854L30294K259889K529763L51675k447023l369604
4596B304480k342807j199288m93784Q00731K410508K404985M89408j037280p61214
4587B575739p1875l56603q94312j020892j614337k566465j692625J410063L278846
4578i52461J424301j298845p75689K016140K851377R95844l89292k4844j83543
$$ plain form
4569 3662988 1547712 -2177412 -5096551 -5410503 -3141675 388813 2939370 2542659 -59323
4560 -59323 -1489636 86431 2399415 2703754 2164551 3602949 6045312 5300334 150324
4551 150324 -5489463 -7621591 -6501820 -4539795 -2520394 -91440 1815815 1662734 -267365
4542 -267365 -2293961 -3973505 -6268574 -8806733 -8972313 -4987753 1180856 5444043 5805129
4533 5805129 3750793 1555467 -261898 -2117134 -3422178 -3104587 -1602845 -606998 -547846
4524 -547846 119120 2385062 4698888 4627973 1732930 -2370782 -6284881 -9786110 -12524041
4515 -12524041 -13180829 -10846603 -6722934 -3410540 -2114880 -1195984 1562731 5386727
4507 5386727 6732075 3966046 303759 22545 2565383 3223496 -73421 -3729744 -3647972
$$ packed form
4569C662988k115276l725124k919139l13952K268828L530488K550557l96711k601982
4560e9323j430313J576067K312984L04339n39203J438398K442363p44978n150010
4551A50324n639787k132128J119771J962025K019401K428954J907255j53081j930099
4542b67365k026596j679544k295069k538159j65580L984560O168609M263187L61086
4533E805129k054336k195326j817365j855236j305044L17591J501742R95847N9152
4524e47846O66966K265942K313826p0915k895043m103712l914099l501229k737931
4515a2524041o56788K334226M123669L312394J295660R18896K758715L823996
4507E386727J345348k766029l662287k81214K542838O58113l296917l656323Q1772
$$ plain form
4498 -3647972 -616575 1867091 2939369 4231731 5556130 4555213 1043157 -1603372
4490 -1603372 -776017 1967391 3393386 2686923 1307534 105897 -1298495 -2709537 -2891701
4481 -2891701 -1347757 630474 1312083 357717 -1177324 -2355550 -3351892 -4818474 -6610449
4472 -6610449 -7732674 -7800731 -7968338 -9543850 -11763577 -11978811 -8604327 -3176407 1301259
4463 1301259 3621159 5008559 6657036 7974983 7986840 7375359 7611518 8325409 7357251
4454 7357251 4117674 1293193 1680515 4266538 5310710 2954584 -1207728 -5108444
4446 -5108444 -8365077 -10652617 -10338479 -6747734 -2371159 -523893 -1284795 -1716654 30479
4437 30479 2689426 4147718 4007595 3161820 2126641 896908 -96423 85482 1774686
$$ packed form
4498c647972L031397K483666J072278J292362J324399j000917l512056k646529
4490a603372Q27355K743408J425995p06463j379389j201637j404392j411042j82164
4481b891701J543944J978231O81609r54366j535041j178226r96342j466582j791975
4472f610449j122225o8057j67607j575512k219727k15234L374484N427920M477666
4463A301259K319900J387400J648477J317947J1857o11481K36159P13891r68158
4454G357251l239577k824481L87322K586023J044172k356126m162312l900716
4446e108444l256633k287540L14138L590745M376575J847266p60902m31859J747133
4437C0479K658947J458292j40123q45775j035179j229733r93331J81905J689204
$$ plain form
4428 1774686 3855540 4488420 3042527 1084859 650311 1484289 1227008 -1085366 -3162082
4419 -3162082 -2485419 -76122 754530 -987113 -2698550 -1762667 1416095 4576773 6225631
4410 6225631 6121180 4327144 1108840 -2524840 -5069666 -5554053 -4362184 -3189419 -3753944
4401 -3753944 -5840399 -6952091 -4923446 -700975 2715978 4092826 5161838 7555883
4393 7555883 10215913 11045316 9902181 8257187 6395673 2858513 -2785213 -7932555
4385 -7932555 -8987257 -5295452 -174674 2330660 1241865 -1139606 -2124179 -814776
4377 -814776 2135878 5370645 7088891 6003853 2939974 268206 -1126263 -2848398
4369 -2848398 -5739905 -7433752 -5442404 -1480154 128433 -1982512 -4936019 -5906314
$$ packed form
4428A774686K080854O32880j445893j957668m34548Q33978k57281k312374k076716
4419c162082O76663K409297Q30652j741643j711437R35883L178762L160678J648858
4410F225631j04451j794036l218304l633680k544826m84387J191869J172765n64525
4401c753944k086455j111692K028645M222471L416953J376848J069012K394045
4393G555883K660030Q29403j143135j644994j861514l537160n643726n147342
4385g932555j054702L691805N120778K505334j088795k381471r84573J309403
4377h14776K950654L234767J718246j085038l063879k671768j394469j722135
4369b848398k891507j693847J991348L962250J608587k110945k953507r70295
$$ plain form
4361 -5906314 -4962167 -3237153 -1095669 881488 1641518 1732624 3369635 6925858 9510192
4352 9510192 8851066 6639694 5831599 6239273 5372074 2692510 368550 -45276 613912
4343 613912 1014097 1264945 2255756 3981750 5111052 4128458 1137217 -1519831 -1456232
4334 -1456232 556720 964636 -2121759 -6352093 -8317467 -7697627 -6266239 -4235868 -522011
4325 -522011 3847043 5885051 5052301 4766730 7782270 11834701 11984793 6612211 -706555
4316 -706555 -5222042 -5482857 -3515580 -1866608 -1507358 -2116301 -3079296 -3773381 -3720107
4307 -3720107 -3138741 -2765419 -2488495 -1000595 2083995 4599667 4057831 1120320 -1167832
4298 -1167832 -1556671 -1630360 -2231899 -1592802 1517110 5109815 6496116 5802346 4885791
$$ packed form
4361e906314R44147J725014K141484J977157P60030R1106J637011L556223K584334
4352I510192o59126k211372q08095M07674q67199k679564k323960m13826O59188
4343F13912M00185K50848R90811J725994J129302r82594k991241k657048O3599
4334a456232K012952M07916l086395m230334j965374O19840J431388K030371L713857
4325e22011M369054K038008q32750k85571L015540M052431J50092n372582p318766
4316g06555m515487k60815J967277J648972L59250o08943r62995o94085N3274
4307c720107N81366L73322K76924J487900L084590K515672n41836k937511k288152
4298a167832l88839p3689o01539O39097L109912L592705J386301o93770r16555
$$ plain form
4289 4885791 4155439 2800868 1258666 1078013 2609053 4617528 5902677 5899605 4378740
4280 4378740 2138863 1238229 2744396 4834642 4838990 2566346 -30744 -1639415 -2145860
4271 -2145860 -1367783 461673 1614474 728861 -650232 194509 3227168 5951171 7252354
4262 7252354 8136223 8760480 7867138 5602982 3864813 3076236 1571810 -838181 -1779472
4253 -1779472 -337805 706624 -1209247 -4595640 -6322397 -6048182 -5761266 -6190030 -6233344
4244 -6233344 -5373605 -4332831 -3320448 -1504368 1280180 3471612 3150322 247226 -2900290
4235 -2900290 -3536404 -1414269 634836 -143238 -3021102 -4647914 -3077325 475542 3886269
4226 3886269 6453350 8473193 9911230 10321811 9358971 7054448 4200894 2177949 1410091
$$ packed form
4289D885791p30352j354571j542202j80653J531040K008475J285149l072j520865
4280D378740k239877r00634J506167K090246M348k272644k597090j608671n06445
4271b145860P78077J829456J152801q85613j379093Q44741L032659K724003J301183
4262G252354Q83869O24257q93342k264156j738169p88577j504426k409991r41291
4253a779472J441667J044429j915871l386393j726757K74215K86916m28764m3314
4244f233344Q59739J040774J012383J816080K784548K191432l21290k903096l147516
4235b900290o36114K122135K049105p78074k877864j626812J570589L552867L410727
4226C886269K567081K019843J438037M10581r62840k304523k853554k022945p67858
$$ plain form
4217 1410091 494616 -1842602 -4650116 -6364217 -7654298 -10153579 -12826185 -12616174 -8955526
4208 -8955526 -4700821 -2058058 -528693 346783 -579529 -3438254 -5985643 -6601346 -6227648
4199 -6227648 -5702528 -3696876 605053 4899649 6181935 4393697 1742395 -463302
4191 -463302 -2602077 -5174752 -7737004 -9082800 -8392131 -6910232 -7516090 -10744850 -12607574
4182 -12607574 -9599647 -4722944 -3991232 -7291043 -8195486 -3748376 1342775 2286074 354894
4173 354894 -1366841 -3035269 -5313976 -6422664 -5710447 -5790348 -7564247 -7851046 -5733524
4164 -5733524 -5972547 -11382647 -16926700 -16804558 -12781668 -9989126 -9103661 -8372934 -8555711
4155 -8555711 -9896025 -9298953 -6482896 -6764918 -11243505 -12281459 -7306339 -7464018 -20553852
$$ packed form
4217A410091r15475k337218k807514j714101j290081k499281k672606K10011L660648
4208h955526M254705K642763J529365Q75476r26312k858725k547389o15703L73698
4199f227648N25120K005652M301929M294596J282286j788238k651302k205697
4191d63302k138775k572675k562252j345796O90669J481899o05858l228760j862724
4182a2607574L007927M876703P31712l299811r04443M447110N091151R43299j931180
4173C54894j721735j668428k278707j108688P12217p9901j773899k86799K117522
4164e733524k39023n410100n544053J22142M022890K792542Q85465P30727j82777
4155h555711j340314N97072K816057k82022m478587j037954M975120j57679j3089834
$$ plain form
4146 -20553852 -35554446 -40182248 -42953496 -53957121 -50718630 3531419 100548183 177253153
4138 177253153 183401265 136989111 92591617 74288823 65460335 51068674 37969187
4131 37969187 33315484 29861933 20987979 12505524 11112536 13774487 15601493 17915156
4123 17915156 22086777 24080705 21283690 17780340 17474027 17917380 15633214 12104387
4115 12104387 10072494 8765405 6991809 6650556 9136963 11943724 12514625 12281041 13575104
4106 13575104 15441265 15620908 14253917 12902308 12015954 11580045 12215423 13687812 14212324
4097 14212324 12829665 10729829 9162477 7996887 7155175 7289688 8269165 9091172 9712637
4088 9712637 10733378 11284941 10016953 8132662 8175641 9648476 9436994 6992599 5186702
$$ packed form
4146b0553852j5000594m627802k771248j1003625L238491N4250049R7016764P6704970
4138A77253153O148112m6412154m4397494j8302794q828488j4391661j3099487
4131C7969187m653703l453551q873954q482455j392988K661951J827006K313663
4123A7915156M171621J993928k797015l503350l06313M43353k284166l528827
4115A2104387k031893j307089j773596l41253K486407K806761N70901k33584J294063
4106A3575104J866161J79643j366991j351609q86354m35909O35378J472389N24512
4097A4212324j382659k099836j567352j165590q41712J34513R79477Q22007O21465
4088I712637J020741N51563j267988j884291M2979J472835k11482k444395j805897
$$ plain form
4079 5186702 5174631 4446996 1436146 -1625568 -2160453 -414708 2223916 4998404 6727114
4070 6727114 6230243 4913616 5593487 7863995 8394250 6700705 6179551 7998993 8800371
4061 8800371 6638865 4409271 4570744 5045244 3584193 1813315 1314078 -34210 -3610892
4052 -3610892 -5897667 -3530825 688600 1677016 -700309 -2961701 -3940617 -4339797 -2698812
4043 -2698812 2539970 8278054 9613158 6903510 4961195 5556660 5744718 3787532 1798363
4034 1798363 1577846 2135894 2646537 4206438 7169217 9640722 9989316 8670576 6812042
4025 6812042 5053627 4125021 4391214 4632794 3487721 2124804 3086646 6379600 9154585
4016 9154585 9510991 8362973 7428902 7641070 9506718 12475400 13710091 10130295 2503193
$$ packed form
4079E186702j2071p27635l010850l061714n34885J745745K638624K774488J728710
4070F727114m96871j316627O79871K270508N30255j693545n21154J819442Q01378
4061H800371k161506k229594J61473M74500j461051j770878m99237j348288l576682
4052c610892k286775K366842M219425R88416k377325k261392r78916l99180J640985
4043b698812N238782N738084J335104k709648j942315N95465J88058j957186j989169
4034A798363k20517N58048N10643J559901K962779K471505L48594j318740j858534
4025F812042j758415r28606K66193K41580j145073j362917R61842L292954K774985
4016I154585L56406j148018r34071K12168J865648K968682J234691l579796p627102
$$ plain form
4007 2503193 -4404777 -6392750 -3284702 1868974 5342915 4949563 1665727 -1233419
3999 -1233419 -2107996 -2820847 -4873145 -5858476 -3016204 1649487 4107165 4733705 6899846
3990 6899846 9877309 9214947 4863891 2684521 5718894 9708321 10413262 10121123 12694866
3981 12694866 16514841 17327921 15074928 12842613 11136263 8281802 5340721 5519519
3973 5519519 8588223 10268630 8097210 4490589 2823832 3206078 3570210 2941975 2019067
3964 2019067 1541847 1432754 1410584 1832917 3552465 6566413 9065839 8987026 6824789
3955 6824789 5515042 6744044 8750693 8855188 6824677 4405147 2747557 1864017 1686237
3946 1686237 2086489 2526579 2955623 4201561 6276900 7506860 6893265 6073274 6952865
$$ packed form
4007B503193o907970j987973L108048N153676L473941l93352l283836k899146
3999a233419q74577p12851k052298r85331K842272M665691K457678O26540K166141
3990F899846K977463o62362m351056k179370L034373L989427P04941k92139K573743
3981A2694866L819975Q13080k252993k232315j706350k854461k941081J78798
3973E519519L068704J680407k171420l606621j666757L82246L64132o28235r22908
3964B019067m77220j09093k2170M22333J719548L013948K499426p8813k162237
3955F824789j309747J229002K006649J04495k030511k419530j657590q83540j77780
3946A686237M00252M40090M29044J245938K075339J229960o13595q19991Q79591
$$ plain form
3937 6952865 8498613 8263804 6395813 5457813 6341786 6988939 5763407 3895692 3587338
3928 3587338 5286402 7818852 9972734 10924280 9935239 6720412 2087904 -2146858 -4062799
3919 -4062799 -2974643 -302543 1475814 1363345 654962 558366 238380 -1332755 -2794521
3910 -2794521 -2031680 47908 65685 -3016671 -6112496 -6137103 -3797609 -1710685 -533421
3901 -533421 864382 2399913 2461235 719441 -798574 -333971 1192900 1498448 -19463
3892 -19463 -1702631 -1909468 -731812 855774 2489780 4172467 5223331 4814305 3540106
3883 3540106 3147979 4249284 5440362 5425189 4950615 5527486 7022444 7932888 7713569
3874 7713569 7335902 7407361 7139589 5798563 4128640 3404897 3600025 3462091 2375619
$$ packed form
3937F952865J545748k34809j867991r38000Q83973O47153j225532j867715l08354
3928C587338J699064K532450K153882R51546r89041l214827m632508m234762j915941
3919d062799J088156K672100J778357j12469p08383r6596l19986j571135j461766
3910b794521P62841K079588J7777l082356l095825k4607K339494K086924J177264
3901e33421J397803J535531O1322j741794j518015M64603J526871L05548j517911
3892a9463j683168k06837J177656J587586J634006J682687J050864m09026j274199
3883C540106l92127J101305J191078j5173m74574N76871J494958R10444k19319
3874G713569l77667P1459k67772j341026j669923p23743J95128j37934j086472
$$ plain form
3865 2375619 1317019 1540998 2769342 3346261 2194524 -18297 -1917326 -2941146 -3265997
3856 -3265997 -2928548 -2073014 -1653398 -2567343 -4115855 -4604637 -3537472 -1827656 198334
3847 198334 3088105 6015748 6468211 3608142 135827 -1025537 -397982 -182517 -163176
3838 -163176 1784260 5498294 7808944 6697980 3912582 2306305 2185347 1601981 -635245
3829 -635245 -3443456 -4726677 -3512529 -784945 1740939 3547662 5391143 7240893
3821 7240893 7404740 4875740 1521702 165501 954538 1478331 315382 -1464932 -2461612
3812 -2461612 -2671599 -2624643 -2551293 -2958816 -4343317 -5725084 -5243538 -2997535 -1427516
3803 -1427516 -1769865 -2070644 -398431 1673592 1110630 -2005658 -4414536 -4014108 -1961191
$$ packed form
3865B375619j058600K23979J228344N76919j151737k212821j899029j023820l24851
3856c265997L37449Q55534M19616r13945j548512m88782J067165J709816K025990
3847A98334K889771K927643M52463k860069l472315j161364O27555K15465J9341
3838a63176J947436L714034K310650j110964k785398j606277j20958n83366k237226
3829f35245k808211j283221J214148K727584K525884J806723J843481J849750
3821G240893J63847k529000l354038j356201P89037N23793j162949j780314r96680
3812b461612k09987M6956P3350m07523j384501j381767M81546K246003J570019
3803a427516l42349l00779J672213K072023n62962l116288k408878M00428K052917
$$ plain form
3794 -1961191 -49272 1807141 4167760 5632560 3842755 -1040970 -5346620 -5388418 -1673241
3785 -1673241 1215443 -709887 -6597028 -11490273 -11104364 -5603396 1038480 4827269
3777 4827269 4842502 3049065 1519776 265699 -1899544 -4925701 -7250604 -8140469 -8693970
3768 -8693970 -9511422 -8912354 -5292870 -257617 2820677 3013351 2403805 2465895 2226245
3759 2226245 624364 -1429809 -2445568 -2280524 -1688961 -1125915 -748438 -545993 -37564
3750 -37564 988343 1339872 -296655 -2791437 -3446468 -1930988 -901929 -1824082 -2866559
3741 -2866559 -2341209 -1364573 -1056432 32163 2847164 4768136 3296250 992272 2553127
3732 2553127 7776449 11595137 11059977 8307689 6110359 4444350 2791419 2294144 3526426
$$ packed form
3794a961191J911919J856413K360619J464800j789805m883725m305650m1798L715177
3785a673241K888684j925330n887141m893245L85909N500968O641876L788789
3777D827269J5233j793437j529289j254077k165243l026157k324903q89865n53501
3768h693970q17452N99068L619484N035253L078294J92674o09546O2090k39650
3759B226245j601881k054173j015759J65044N91563N63046L77477K02445N08429
3750c7564J025907L51529j636527k494782o55031J515480J029059r22153j042477
3741b866559N25350R76636L08141J088595K815001J920972j471886k303978J560855
3732B553127N223322L818688n35160k752288k197330j666009j652931m97275J232282
$$ plain form
3723 3526426 4685652 4128748 2873350 2770453 3743746 4454337 4295599 3214614 878962
3714 878962 -2418062 -5074516 -5794815 -5008936 -3610889 -1385320 2116515 6147493 9389993
3705 9389993 11158464 11154371 9247644 6429874 4487038 3504139 1335991 -2809060 -5903637
3696 -5903637 -4457364 723949 5392242 6743493 5311281 2713935 -21897 -2103088
3688 -2103088 -3216430 -4194176 -5628200 -6258731 -4920832 -3495663 -5005245 -8873935 -11411164
3679 -11411164 -11467761 -11863120 -13813934 -13929750 -9583921 -4016404 -2231028 -3893392 -4551771
3670 -4551771 -2845714 -1911155 -3358328 -4296028 -2056920 1586377 3381937 3334674 3678816
3661 3678816 4589831 3945812 1141031 -1452578 -1599189 -179317 -59282 -2735846 -6905137
$$ packed form
3723C526426J159226n56904j255398j02897R73293P10591j58738j080985k335652
3714H78962l297024k656454p20299P85879J398047K225569L501835M030978L242500
3705I389993J768471m093j906727k817770j942836r82899k168148m145051l094577
3696e903637J446273N181313M668293J351251j432212k597346k735832k081191
3688b103088j113342r77746j434024o30531J337899J425169j509582l868690k537229
3679a1411164n6597l95359j950814j15816M345829N567517J785376j662364o58379
3670d551771J706057R34559j447173r37700K239108L643297J795560m7263L44142
3661C678816R11015o44019k804781k593609j46611J419872J20035k676564m169291
$$ plain form
3652 -6905137 -10052678 -10771515 -9353086 -6585921 -2808944 1418183 4472468 4831771 3214099
3643 3214099 2272312 3525982 5667883 6740174 6854632 7367426 8136221 7477385 4948374
3634 4948374 2552328 2495589 4699957 7097500 7689098 5949624 3002596 924460 1195320
3625 1195320 3238597 4950197 5078374 4493473 4631722 5405541 5495037 4265596 2412377
3616 2412377 749063 -812909 -2885509 -5751817 -9044062 -11805484 -12730464 -10895954
3608 -10895954 -6755494 -2255215 556684 1361001 1913706 4178240 7894171 10370570
3600 10370570 9275351 5503828 2458635 2237893 3451552 3546543 2480720 2664312 5255676
3591 5255676 8011843 7786652 4467885 1299092 1295004 4206618 7337737 8615602 8078475
$$ packed form
3652f905137l147541p18837J418429K767165L776977M227127L054285L59303j617672
3643C214099r41787J253670K141901J072291J14458N12794P68795o58836k529011
3634D948374k396046n6739K204368K397543N91598j739474k947028k078136K70860
3625A195320K043277J711600J28177n84901J38249P73819Q9496j229441j853219
3616B412377j663314j561972k072600k866308l292245k761422r24980J834510
3608a0895954M140460M500279K811899Q04317N52705K264534L715931K476399
3600A0370570j095219l771523l045193k20742J213659R4991j065823J83592K591364
3591E255676K756167k25191l318767l168793m088K911614L131119J277865n37127
$$ plain form
3582 8078475 6619557 4392512 1170101 -2197213 -3712304 -2044069 1931210 5689662
3574 5689662 7018748 5422549 2096098 -1074321 -2770772 -3072543 -3100588 -3531478 -3489377
3565 -3489377 -1335418 3267033 8416472 11455795 11299515 9007622 6193083 3492936
3557 3492936 958617 -702649 -409941 1558373 3120798 2464980 44104 -2255049 -3449873
3548 -3449873 -3978581 -4235317 -3935621 -3123414 -2581738 -2760871 -3260636 -3737553 -4172594 -3767391
3538 -3767391 -1110707 3423558 6842846 6802478 4760297 3928922 4750015 4794426 3096958
3529 3096958 1866044 2948378 5028822 6025520 6315645 7304072 8103412 6439753 2579381
3520 2579381 -385927 -737162 -240829 -1019335 -2522647 -3372707 -4386134 -7145933 -10417273
$$ packed form
3582H078475j458918k227045l222411l367314j515091J668235L975279L758452
3574E689662J329086j596199l326451l170419j696451l01771k8045m30890M2101
3565c489377K153959M602451N149439L039323j56280k291893k814539k700147
3557C492936k534319j661266K92708J968314J562425o55818k420876k299153j194824
3548c449873n28708k56736K99696Q12207N41676j79133m99765m76917m35041M05203
3538c767391K656684M534265L419288m0368k042181q31375Q21093M4411j697468
3529C096958j230914J082334K080444R96698K90125R88427P99340j663659l860372
3520B579381k965308l51235M96333p78506j503312q50060j013427k759799l271340
$$ plain form
3511 -10417273 -10967759 -8282591 -5748991 -6000092 -7395471 -6894521 -4479341 -2248164 -432195
3502 -432195 2528404 6142590 7397418 5143860 2233724 1633287 2620212 2920229 2723524
3493 2723524 3761109 5451989 5220852 2767661 1008453 1721345 2708140 966900 -3013923
3484 -3013923 -6052836 -6324813 -4634165 -2132661 1102401 4755070 7197840 6933508 4549089
3475 4549089 2290739 1723567 2356837 2641404 1844960 598321 -174949 -282482 22842
3466 22842 849433 2467997 4307981 4943317 3662687 1723853 1315728 3064119 4987310
3457 4987310 4332597 398138 -4743234 -8318744 -9296178 -8606911 -7429158 -5904181 -3497562
3448 -3497562 36984 4268624 8142648 10255732 9804541 7750338 6395225 7048226 8493291
$$ packed form
3511a0417273n50486K685168K533600k51101j395379N00950K415180K231177J815969
3502d32195K960599L614186J254828k253558k910136o00437R86925L00017j96705
3493B723524J037585J690880k31137k453191j759208P12892R86795j741240l980823
3484c013923l038913k71977J690648K501504L235062L652669K442770k64332k384419
3475D549089k258350n67172O33270K84567p96444j246639p73270j07533L05324
3466B2842Q26591J618564J839984O35336j280630j938834m08125J748391J923191
3457D987310o54713l934459n141372l575510r77434O89267J177753J524977K406619
3448c497562L534546M231640L874024K113084m51191k054203j355113O53001J445065
$$ plain form
3439 8493291 8528323 6728340 4828427 4492784 5616229 6952579 7560733 7215699 5970426
3430 5970426 3883880 1141947 -1704960 -3658792 -3730919 -1899922 475471 1641316 990067
3421 990067 -419612 -685046 1577466 6008531 10193805 11221473 8342783 3825802 660538
3412 660538 -167871 225163 282997 -1059186 -3989346 -6988199 -7303190 -3988440 214922
3403 214922 2004646 1914119 3104427 6015695 7362626 5290773 2507906 2499391 4973278
3394 4973278 7183269 7925096 7862006 7253961 5926778 4796850 5038250 5941306 5594198
3385 5594198 3647077 1732156 1228164 2082281 3547007 4478877 3320091 -167106 -3175153
3376 -3175153 -2116941 2750933 6919072 6832135 3931959 2326632 3702491 6007629 6474976
$$ packed form
3439H493291L5032j799983j899913l35643J123445J336350O08154l45034j245273
3430E970426k086546k741933k846907j953832p2127J830997K375393J165845o51249
3421I90067j409679k65434K262512M431065M185274J027668k878690m516981l165264
3412F60538q28409L93034N7834j342183k930160k998853l14991L314750M203362
3403B14922J789724r0527J190308K911268J346931k071853k782867q515K473887
3394D973278K209991P41827o3090o08045j327183j129928K41400R03056l47108
3385E594198j947121j914921n03992Q54117J464726R31870j158786l487197l008047
3376c175153J058212M867874M168139q6937k900176j605327J375859K305138M67347
$$ plain form
3367 6474976 4455305 1291875 -1445889 -3077660 -3623886 -3186481 -1983381 -945481 -1498228
3358 -1498228 -3995793 -6674219 -7027308 -4293568 -9277 3775513 6085253 6917718 6555595
3349 6555595 5386970 3842227 2179648 669509 8563 928892 3070261 4638776 3667958
3340 3667958 -187700 -5038245 -8082198 -7950734 -5774959 -3525749 -1537229 1339198
3332 1339198 5178275 8173469 9075361 8898880 9039418 9080885 8007255 6462134 6079019
3323 6079019 7351449 9633071 12226166 13989662 13438294 11343257 11398189 15203235 18195785
3314 18195785 14748229 6592965 1370745 2430194 5119014 4704381 2890338 3515061
3306 3515061 6012229 7031339 5705810 3680580 2123831 1839637 3860795 6567511
$$ packed form
3367F474976k019671l163430k737764j631771n46226M37405J203100J037900n52747
3358a498228k497565k678426l53089K733740M284291L784790K309740Q32465l62123
3349F555595j168625j544743j662579j510139o60946R20329K141369J568515r70818
3340C667958l855658m850545l043953J31464K175775K249210J988520K876427
3332A339198L839077K995194R01892j76481J40538M1467j073630j545121l83115
3323F079019J272430K281622K593095J763496n51368k095037N4932L805046K992550
3314A8195785l447556q155264n222220J059449K688820m14633j814043O24723
3306C515061K497168J019110j325529k025230j556749k84194K021158K706716
$$ plain form
3298 6567511 4966096 -2932575 -11316331 -12977518 -8833472 -5821586 -6490635 -6752944 -4094631
3289 -4094631 -1650680 -2293217 -4198338 -4981209 -5543487 -6694622 -6120293 -2410774 1272659
3280 1272659 1485673 -268647 -597097 -87388 -1571920 -4196563 -4306994 -1893723 -1193039
3271 -1193039 -3975546 -6580851 -5456527 -2134648 -198437 185785 1769055 5487305
3263 5487305 9008034 9987432 8781289 7313994 6451744 5436368 3636828 1990159 2080247
3254 2080247 3955397 5706523 5602891 3912553 2026286 654855 -75300 452929 2713022
3245 2713022 5523054 6787962 6016910 4754333 4180618 3653928 2210123 247318 -1096010
3236 -1096010 -1251335 -150823 2108794 4532308 5097140 2756007 -798817 -2637582 -1799594
$$ packed form
3298F567511j601415p898671q383756j661187M144046L011886o69049k62309K658313
3289d094631K443951o42537j905121p82871n62278j151135N74329L709519L683433
3280A272659K13014j754320l28450N09709j484532k624643j10431K413271P00684
3271a193039k782507k605305J124324L321879J936211L84222J583270L718250
3263E487305L520729R79398j206143j467295q62250j015376j799540j646669R0088
3254B080247J875150J751126j03632j690338j886267j371431p30155N28229K260093
3245B713022K810032J264908p71052j262577n73715n26690j443805j962805j343328
3236a096010j55325J100512K259617K423514N64832k341133l554824j838765Q37988
$$ plain form
3227 -1799594 45455 1093742 1368173 1825295 2567408 2758584 1817961 -17412 -2015110
3218 -2015110 -3159578 -2305249 950143 5352117 8711716 9881661 9322187 7426391 3573930
3209 3573930 -1912755 -5949830 -5123000 -125429 4339605 4894851 2825666 977669 -504984
3200 -504984 -3173857 -6636942 -8866080 -9563863 -10291046 -11194160 -10577407 -8412347 -7319872
3191 -7319872 -8565362 -9588542 -7580184 -3660679 -1271989 -1752495 -3704234 -5626273
3183 -5626273 -6743871 -5923591 -2401079 2311379 5354860 5629874 4309788 2326371 -645548
3174 -645548 -4429502 -7596543 -9133088 -9227309 -7930915 -4909065 -1234998 609495 -157874
3165 -157874 -1149145 93971 2917617 4981295 5459788 4914063 3148843 -326084 -4070095
$$ packed form
3227a799594J845049J048287K74431M57122P42113J91176r40623j835373j997698
3218b015110j144468Q54329L255392M401974L359599J169945n59474j895796l852461
3209C573930n486685m037075Q26830M997571M465034N55246k069185j847997j482653
3200e04984k668873l463085k229138o97783p27183r03114O16753K165060J092475
3191g319872j245490j023180K008358L919505K388690m80506j951739j922039
3183e626273j117598Q20280L522512M712458L043481K75014j320086j983417k971919
3174f45548l783954l167041j536545r4221J296394L021850L674067J844493p67369
3165a57874r91271J243116K823646K063678M78493n45725j765220l474927l744011
$$ plain form
3156 -4070095 -5436935 -3956812 -2026224 -1565173 -1714403 -786263 1041913 2398936 3110806
3147 3110806 4250735 5930557 6454733 4266469 93556 -3511196 -4750984 -4323119 -4328389
3138 -4328389 -5636066 -6927064 -6654329 -5301235 -4760532 -5640897 -6358617 -5336912 -3093377
3129 -3093377 -1256035 -184133 1212536 3434836 5468860 6311192 6294362 5972839 4496911
3120 4496911 602546 -4711932 -8000257 -6865799 -2935772 -229389 -756082 -2745698
3112 -2745698 -3305247 -1772958 112936 679878 181131 325826 2378762 5717180 8193174
3103 8193174 8131133 5975500 3641555 2353594 1760125 1164086 642602 521752 663074
3094 663074 956889 1713429 2739416 2862733 1551925 359801 1205516 3355206 3717137
$$ packed form
3156d070095j366840J480123J930588M61051j49230R28140J828176J357023P11870
3147C110806J139929J679822N24176k188264m172913l604752j239788M27865n270
3138d328389j307677j290998K72735J353094N40703q80365p17720J021705K243535
3129c093377J837342J071902J396669K222300K034024Q42332j6830l21523j475928
3120D496911l894365n314478l288325J134458L930027K706383n26693j989616
3112b745698n59549J532289J885894N66942m98747J44695K052936L338418K475994
3103H193174o2041k155633k333945j287961n93469n96039n21484j20850J41322
3094F63074K93815P56540J025987J23317j310808j192124Q45715K149690L61931
$$ plain form
3085 3717137 590065 -4090774 -6829907 -5965734 -2471837 1635326 4764084 6157322
3077 6157322 5851830 4457734 2799057 1768826 2215632 4229665 6478893 7160864 6036875
3068 6036875 4728768 4461343 4375455 2995684 734235 -296678 1122023 3957074 6248651
3059 6248651 6765296 4993306 638545 -5636795 -11249793 -12832697 -9229450 -3113958
3051 -3113958 1036034 793276 -2442220 -5195755 -4979343 -1929309 1562197 2509224 -367232
3042 -367232 -5087371 -7689328 -6025347 -2071708 326651 -298629 -1968357 -2126390 -376833
3033 -376833 1698457 2327543 919789 -1403732 -2525522 -1579551 -486023 -1906997 -5508896
3024 -5508896 -7936673 -7140567 -4994312 -4471224 -5752431 -6654602 -5720160 -3196718 117960
$$ packed form
3085C717137l127072m680839k739133Q64173L493897M107163L128758J393238
3077F157322l05492j394096j658677j030231M46806K014033K249228O81971j123989
3068F036875j308107k67425q5888j379771k261449j030913J418701K835051K291577
3059F248651N16645j771990m354761o275340n612998j582904L603247O115492
3051c113958M149992k42758l235496k753535K16412L050034L491506R47027k876456
3042c67232m720139k601957J663981L953639K398359o25280j669728j58033J749557
3033c76833K075290O29086j407754k323521j121790R45971J093528j420974l601899
3024e508896k427777P96106K146255N23088j281207r02171R34442K523442L314678
$$ plain form
3015 117960 3185150 4554429 3801931 2770976 3493384 5097089 4793409 1990349 -711968
3006 -711968 -1131044 -103396 372386 -201122 -1129129 -1908769 -1911295 15066 3935611 7586802
2996 7586802 8383388 6335109 3625019 1658154 52020 -1544278 -2412716 -2280331 -2588389
2987 -2588389 -4986401 -8887661 -11565612 -11005964 -8183562 -5988037 -5899147 -6331497 -4862499
2978 -4862499 -1734764 40171 -1499909 -4476994 -5346939 -3257214 -757841 -147752 -651111
2969 -651111 2566 2268762 4219338 3883193 1170442 -2434760 -5254669 -6377000 -5897011
2960 -5897011 -4489601 -2520410 259645 3728163 6547820 7362986 6785780 6803932 7668357
2951 7668357 6817939 2209925 -4238833 -8219461 -7719197 -4616990 -1825856 -639755 -1056344
$$ packed form
3015A17960L067190J369279p52498j030955P22408J603705l03680k803060k702317
3006g11968m19076J027648M75782n73508r28007p79640k526J926361L920545L651191
2996G586802P96586k048279k710090j966865j606134j596298q68438J32385l08058
2987b588389k398012l901260k677951N59648K822402K195525Q8890m32350J468998
2978d862499L127735J774935j540080k977085q69945K089725K499373O10089n03359
2969f51111O53677K266196J950576l36145k712751l605202k819909j122331M79989
2960e897011J407410J969191K780055L468518K819657Q15166n77206J8152Q64425
2951G668357q50418m608014o448758l980628N00264L102207K791134J186101m16589
$$ plain form
2942 -1056344 -2617599 -3931129 -3079699 35910 2896780 3252184 1770067 431076 -498051
2933 -498051 -1886783 -3016327 -2065087 539452 1725735 -296835 -3515478 -4675086 -3035933
2924 -3035933 -424061 1374021 1981866 1913030 1927996 2594652 3564099 3538665 1681977 -1253663
2914 -1253663 -3848105 -5630729 -7017151 -8025974 -8031069 -6794526 -5018298 -3727528 -3463358
2905 -3463358 -3962415 -4287457 -3595107 -2272585 -1908173 -3374175 -5239943 -5138172 -2830953
2896 -2830953 -896209 -1785141 -4815196 -6781033 -5323834 -1117875 3246776 5984402
2888 5984402 7379306 8582453 9746703 9867609 8449625 6690439 6356684 7551441 8291505
2879 8291505 6706574 3228540 -44771 -1995097 -3585089 -5950628 -8305013 -8806028
$$ packed form
2942a056344j561255j313530Q51430L115609K860870L55404j482117j338991r29127
2933d98051j388732j129544R51240K604539J186283k022570l218643j159608J639153
2924c035933K611872J798082O07845o8836J4966O66656R69447k5434j856688k935640
2914a253663k594442j782624j386422j008823n095J236543J776228J290770K64170
2905c463358m99057l25042O92350J322522L64412j466002j865768J01771K307219
2896b830953J934744q88932l030055j965837J457199M205959M364651K737626
2888E984402J394904J203147J164250J20906j417984j759186l33755J194757P40064
2879H291505j584931l478034l273311j950326j589992k365539k354385n01015
$$ plain form
2871 -8806028 -7136667 -4925114 -3513892 -2749304 -2515594 -3801132 -6800784 -9201358 -8440108
2862 -8440108 -5239898 -2791687 -2394456 -2115670 -325921 1742390 2299221 1932912 2305186
2853 2305186 3140950 2658617 488026 -1762921 -2705086 -2274881 -766865 1474657 3216428
2844 3216428 2971899 1110381 -140152 406662 1255033 404452 -1942685 -3951203 -4577660
2835 -4577660 -4275253 -3973731 -4596657 -6993588 -10790431 -13476188 -12341043 -7812934 -3548786
2826 -3548786 -2535778 -4174140 -5877644 -6263837 -5522351 -3720416 -702644 2475312 3880691
2817 3880691 3046246 1689577 1480560 2196302 2737147 2831724 2813007 2680508 2467964 2710767
2807 2710767 3354039 3013117 874798 -1214004 -494433 2723206 4654968 2414508 -2450096
$$ packed form
2871h806028J669361K211553J411222P64588K33710j285538k999652k400574P61250
2862h440108L200210K448211L97231K78786J789749K068311N56831l66309L72274
2853B305186Q35764m82333k170591k250947r42165M30205J508016K241522J741771
2844C216428k44529j861518j250533N46814Q48371q50581k347137k008518o26457
2835d577660L02407L01522o22926k396931l796843k685757J135145M528109M264148
2826c548786J013008j638362j703504l86193P41486J801935L017772L177956J405379
2817C880691q34445j356669k09017P15742N40845R4577j8717j32499k12544K42803
2807B710767O43272l40922k138319k088802P19571L217639J931762k240460m864604
$$ plain form
2798 -2450096 -5709501 -4992761 -1774474 729022 936689 152337 652944 2784664 4622356
2789 4622356 4784440 4423490 5225357 6390918 5512473 2163265 -1356941 -2974526 -2706357
2780 -2706357 -1448779 48321 682567 -210824 -862092 1684562 7106079 10935618 9777524
2771 9777524 5253629 1014126 -1831222 -3892008 -4317791 -1771863 2527347 5943014
2763 5943014 8081867 10420143 12675080 12627841 9739138 6140238 3550894 1685236 196227
2754 196227 -291695 129173 167963 -557577 -871237 -246530 313426 372697 913398 2038093
2744 2038093 1940574 -346404 -2948558 -3583965 -2645793 -2166936 -2749759 -3239787 -2841916
2735 -2841916 -1996376 -1318394 -822914 -300735 145426 120552 -376600 -88539 2913112 8650485
$$ packed form
2798b450096l259405P16740L218287K503496K07667p84352N00607K131720J837692
2789D622356J62084l60950Q01867J165561q78445l349208l520206j617585K68169
2780b706357J257578J497100O34246q93391o51268K546654N421517L829539j158094
2771I777524m523895m239503k845348k060786m25783K545928M299210L415667
2763E943014K138853K338276K254937m7239k888703l598900k589344j865658j489009
2754A96227m87922M20868L8790p25540l13660O24707N59956N9271N40701J124695
2744B038093r7519k286978k602154o35407R38172M78857n82823m90028L97871
2735b841916Q45540O77982M95480N22179M46161k4874m97152K88061L001651N737373
$$ plain form
2725 8650485 13938273 15500525 14093926 13273113 14020661 13433446 9586140 4713535 1772673
2716 1772673 449580 -986298 -1963702 -764970 1789649 2887562 1699540 252537
2708 252537 165306 606341 -35675 -1962909 -3943645 -4574924 -3404146 -1327533 384799
2699 384799 1742240 3778932 6223414 7091348 5795264 4842716 6443884 8910830 8913457
2690 8913457 6279592 3780530 2716730 1709177 -50898 -1266236 -951486 14274 608778
2681 608778 917561 891979 -172186 -2015189 -3089444 -2807616 -2393418 -2493959 -1755304
2672 -1755304 783738 3337244 3171251 97090 -3153141 -3680177 -776924 3851385 7438623
2663 7438623 8220349 6769932 4991819 3834232 2907987 2238748 2671907 3870091 3598241
$$ packed form
2725H650485N287788J562252j406599q20813P47548n87215l847306m872605k940862
2716A772673j323093j435878r77404J198732K554619J097913j188022j447003
2708B52537q7231M41035o42016j927234j980736o31279J170778K076613J712332
2699C84799J357441K036692K444482Q67934j296084r52548J601168K466946K627
2690H913457k633865k499062j063800j007553j760075j215338L14750R65760N94504
2681F08778L08783k5582j064165j843003j074255K81828M14198j00541P38655
2672a755304K539042K553506j65993l074161l250231n27036K903253M628309L587238
2663G438623P81726j450417j778113j157587r26245o69239M33159J198184k71850
$$ plain form
2654 3598241 335188 -4478227 -8078533 -9448593 -9557720 -9295469 -8543891 -7009535 -4856834
2645 -4856834 -2552476 -720341 70015 -199325 -1112417 -2632463 -4910189 -6917390 -6621107
2636 -6621107 -3594344 -394785 23792 -2382576 -5268666 -7042133 -8013507 -8827726 -9356113
2627 -9356113 -9235941 -8265912 -6117672 -2679005 1212548 4278977 6057727 6801702 6316317
2618 6316317 4081688 645617 -2312934 -3815014 -4677670 -6316769 -8965223 -11322906
2610 -11322906 -11563518 -8734736 -3765565 952251 3601607 4462922 4879612 5279818 5324482
2601 5324482 5442444 6423133 7485422 6782277 4411492 2904745 3637657 4679063 3771128
2592 3771128 1659029 330915 -566871 -2780104 -5697827 -6683034 -5272377 -4032953 -4466976
$$ packed form
2654C598241l263053m813415l600306j370060j09127K62251P51578J534356K152701
2645d856834K304358J832135P90356k69340r13092j520046k277726k007201K96283
2636f621107L026763L199559M18577k406368k886090j773467r71374q14219n28387
2627i356113J20172R70029K148240L438667L891553L066429J778750P43975m85385
2618F316317k234629l436071k958551j502080q62656j639099k648454k357683
2610a1322906k40612K828782M969171M717816K649356Q61315M16690M00206M4664
2601E324482J17962R80689J062289p03145k370785j506747P32912J041406r07935
2592C771128k112099j328114q97786k213233k917723r85207J410657J239424m34023
$$ plain form
2583 -4466976 -4916416 -3857105 -2547166 -2397975 -2073097 174468 3045587 4085076 3868508
2574 3868508 4983454 7270601 7617010 5062603 2897656 4262551 8023064 10506320
2566 10506320 9517488 5415658 58440 -3990216 -5004855 -4352302 -5567870 -9697866
2558 -9697866 -13273343 -12600971 -8342629 -3898509 -981921 868460 1971493 2478031 3507429
2549 3507429 5448360 6043449 3165131 -1255707 -3352579 -2896148 -3155157 -5245625 -6562359
2540 -6562359 -5585413 -4383076 -4864397 -5990363 -6519828 -7367992 -9131468 -10150018 -9397382
2531 -9397382 -8772516 -10093293 -12167944 -13291853 -14133781 -15231840 -14110786 -8621051 -1432450
2522 -1432450 2723036 3198602 2952842 2833174 816914 -2913821 -4688882 -2622329 383495
$$ packed form
2583d466976m49440J059311J309939J49191L24878K247565K871119J039489k16568
2574C868508J114946K287147L46409k554407k164947J364895L760513K483256
2566A0506320r88832m101830n357218m048656j014639O52553j215568m129996
2558i697866l575477O72372M258342M444120K916588J850381J103033N06538J029398
2549C507429J940931N95089k878318m420838k096872M56431k59009k090468j316734
2540f562359R76946J202337m81321j125966n29465q48164j763476j018550P52636
2531i397382O24866j320777k074651j123909q41928j098059J121054N489735P188601
2522a432450M155486M75566k45760j19668k016260l730735j775061K066553L005824
$$ plain form
2513 383495 799390 -1106255 -2935514 -3910280 -4643556 -4691304 -2767883 916210 4150562
2504 4150562 4788626 2805517 394383 16256 1892215 3632575 3008697 611183 -1195014
2495 -1195014 -1186863 325359 3136832 6886927 9514034 8697317 5324696 3087060 3825524
2486 3825524 5442824 5180478 2669251 -1174298 -5689963 -9389893 -9747733 -6195161 -1677217
2477 -1677217 658614 828738 405090 -624818 -3147348 -6453978 -8799934 -9506576 -8678616
2468 -8678616 -6196624 -3113162 -2415375 -5493906 -9043494 -8766356 -5396200 -3372010 -3786046
2459 -3786046 -2933972 1135999 4852498 4317818 1133796 -37049 2202147 5178612 6620396
2450 6620396 6920103 7018892 6574911 4999468 2799785 1037055 77793 -689181 -2098052
$$ packed form
2513C83495M15895j905645j829259r74766p33276m7748J923421L684093L234352
2504D150562O38064j983109k411134l78127J875959J740360o23878k397514j806197
2495a195014Q151J512222K811473L750095K627107q16717l372621k237636P38464
2486C825524J617300k62346k511227l843549m515665l699930l57840L552572M517944
2477a677217K335831J70124m23648j029908k522530l306630k345956p06642Q27960
2468h678616K481992L083462O97787l078531l549588K77138L370156K024190m14036
2459c786046Q52074M069971L716499n34680l184022j170845K239196K976465J441784
2450F620396K99707R8789m43981j575443k199683j762730r59262p66974j408871
$$ plain form
2441 -2098052 -4094016 -5302881 -4343039 -1902299 -552332 -1695403 -3641385 -3916532 -2663985
2432 -2663985 -2076507 -2808024 -2953910 -1095835 1337120 1846276 -49639 -2732974 -4924808
2423 -4924808 -6853717 -8863874 -9964766 -8606357 -4703772 -215699 2598879 3188435
2415 3188435 2609988 1762161 542860 -1143540 -2593632 -3272808 -3836732 -5132390 -6561950
2406 -6561950 -6578434 -4719197 -2095988 66283 1191453 673025 -1959091 -5566110 -7532209
2397 -7532209 -6452984 -3770643 -1837990 -1370043 -1817195 -3002347 -4701120 -5413466 -3581686
2388 -3581686 64673 3060854 4102103 3852835 3044925 1744854 720306 1307113 3033984
2379 3033984 3373612 1161685 -1385186 -1549957 400974 2266901 3225320 4168112 5527919
$$ packed form
2441b098052j995964j208865R59842K440740J349967j143071j945982k75147J252547
2432b663985N87478p31517j45886J858075K432955N09156j895915k683335k191834
2423d924808j928909k010157j100892J358409L902585M488073K814578N89556
2415C188435n78447q47827j219301j686400j450092o79176n63924j295658j429560
2406f561950j6484J859237K623209K162271J125170n18428k632116l607019j966099
2397g532209J079225K682341J932653M67947m47152j185152j698773p12346J831780
2388c581686L646359K996181J041249k49268q07910j300071j024548N86807J726871
2379C033984L39628k211927k546871j64771J950931J865927R58419R42792J359807
$$ plain form
2370 5527919 6736889 7451534 7573776 6474333 4071333 2366041 3708054 7318915 9660774
2361 9660774 8843836 6638524 5173788 3676806 223030 -4631368 -8112694 -8800521 -8113478
2352 -8113478 -7907795 -7952246 -6568733 -3051165 1465315 5358748 7833986 8613295 7320902
2343 7320902 4336602 1858756 2459808 6053858 9638126 10776522 9963039 8625635 6640946
2334 6640946 3716236 1661303 2525541 5131381 6276206 5267752 4502749 5379943 6573920
2325 6573920 6977547 7327234 7737439 6570842 3498506 1057922 1070075 1776001 790726
2316 790726 -1201866 -2218279 -2492934 -3305069 -3818427 -2323195 266941 1333043 510236
2307 510236 -231433 -109601 -50095 243430 2453314 6286714 8956633 9026111 8136009 7738970
$$ packed form
2370E527919J208970P14645J22242j099443k403000j705292J342013L610861K341859
2361I660774q16938k205312j464736j496982l453776m854398l481326o87827O87043
2352h113478K05683m4451J383513L517568M516480L893433K475238P79309j292393
2343G320902k984300k477846O01052L594050L584268J138396q13483j337404j984689
2334F640946k924710k054933Q64238K605840J144825j008454p65003Q77194J193977
2325F573920M03627L49687M10205j166597l072336k440584J2153P05926r85275
2316G90726j992592j016413k74655q12135n13358J495232K590136J066102q22807
2307E10236p41669J21832N9506K93525K209884L833400K669919O9478q90102l97039
$$ plain form
2297 7738970 6633013 3374222 -873284 -3772893 -4832053 -5425687 -6708598 -8714949
2289 -8714949 -10776491 -11861210 -11096663 -8621378 -5465091 -2518255 -353937 392780 -36727
2280 -36727 343241 3009420 5926619 5523970 2098109 147058 2185749 5467034 6708373
2271 6708373 6741752 7578063 7831625 5065680 829652 -1008326 -157310 133719 -1109551
2262 -1109551 -1155353 1214552 3143944 2184152 30897 -506128 315127 551250 226223
2253 226223 946596 3031747 5445070 7846574 10530001 12839128 13759413 13809777 14272753
2244 14272753 14567003 12537391 7869575 3270380 1204730 877379 -254464 -2843694
2236 -2843694 -4897767 -4417814 -1687706 1297322 3053903 3828221 4645341 5470040 4894723
$$ packed form
2297G738970j105957l258791m247506k899609j059160n93634j282911k006351
2289h714949k061542j084719P64547K475285L156287K946836K164318P46717m29507
2280c6727L79968K666179K917199m02649l425861j951051K038691L281285J241339
2271F708373L3379Q36311K53562k765945m236028j837978Q51016K91029j243270
2262a109551m5802K369905J929392r59792k153255n37025Q21255K36123l25027
2253B26223P20373K085151K413323K401504K683427K309127R20285N0364M62976
2244A4272753K94250k029612m667816m599195k065650l27351j131843k589230
2236b843694k054073M79953K730108K985028J756581P74318Q17120Q24699n75317
$$ plain form
2227 4894723 2048920 -1733373 -4143842 -4650291 -4735901 -5104832 -4242204 -953022 2895610
2218 2895610 4076482 2114834 -180479 -556208 56981 -477348 -2372194 -4020540 -4345962
2209 -4345962 -3737676 -3015811 -2553467 -2290388 -1809661 -579423 1169454 2106157 1200095
2200 1200095 -741341 -1867874 -1556977 -912822 -893997 -1016745 -474405 251429 -166599
2191 -166599 -1934460 -3356342 -2510174 476594 3480835 5012490 5996402 7944422 10031938
2182 10031938 9871854 7283529 4973871 4418929 3360889 -650236 -6125363 -9611661
2174 -9611661 -10400830 -10317579 -9839337 -7980721 -5806183 -6156527 -8976648 -10391319 -7978670
2165 -7978670 -4090304 -2256534 -2882304 -4255217 -5302670 -5370845 -3635747 -890289 287577
$$ packed form
2227D894723k845803l782293k410469n06449q5610l68931Q62628L289182L848632
2218B895610J180872j961648k295313l75729O13189n34329j894846j648346l25422
2209d345962O08286P21865M62344K63079M80727J230238J748877R36703r06062
2200A200095j941436j126533L10897O44155J8825j22748N42340P25834m18028
2191a66599j767861j421882Q46168K986768L004241J531655R83912J948020K087516
2182A0031938j60084k588325k309658n54942j058040m011125n475127l486298
2174i611661p89169Q3251M78242J858616K174538l50344k820121j414671K412649
2165g978670L888366J833770o25770j372913j047453o8175J735098K745458J177866
$$ plain form
2156 287577 -685698 -806108 1898880 4735544 4467554 2654490 2900025 4504415 3365937
2147 3365937 -1484439 -6554368 -8943036 -8710876 -6307085 -2000508 1639467 1234132 -2082312
2138 -2082312 -2989229 586142 4322336 4091871 1911994 2168200 4910878 6588538 5572523
2129 5572523 3449762 1870342 1126409 1281296 2256147 3199311 3603889 4356304 6094514
2120 6094514 7629124 7701583 6982353 6428602 5263593 3020090 2009431 4590772 8897280
2111 8897280 10619090 8702708 6034048 4572848 3363509 1936748 2019866 4204413 5801486
2102 5801486 4183386 402376 -2386978 -2660285 -1075195 1307449 3602218 4907326
2094 4907326 5224409 5969111 8177084 10651863 11072704 8661325 4946316 2251039 1910757
$$ packed form
2156B87577r73275j20410K704988K836664k67990j813064K45535J604390j138478
2147C365937m850376n069929k388668K32160K403791M306577L639975m05335l316444
2138b082312r06917L575371L736194k30465k179877K56206K742678J677660j016015
2129E572523k122761j579420p43933J54887R74851R43164M04578P52415J738210
2120F094514J534610P2459p19230n53751j165009k243503j010659K581341M306508
2111H897280J721810j916382k668660j461200j209339j426761Q3118K184547J597073
2102E801486j618100l781010k789354k73307J585090K382644K294769J305108
2094D907326L17083P44702K207973K474779M20841k411379l715009k695277l40282
$$ plain form
2085 1910757 3279908 4048856 2560344 334684 849499 4891819 8905140 9640394 8705166
2076 8705166 9832428 12729996 13122291 9119414 4064567 1629720 1096947 -69594 -1251368
2067 -1251368 325148 4419527 7073749 5726303 2361390 301574 -51337 -502279 -1485956
2058 -1485956 -1377339 862857 3989076 5673083 4511530 893769 -3225222 -5449658
2050 -5449658 -4754787 -2377064 -431131 149549 -217092 -980245 -1724488 -1697400 -535234
2041 -535234 645190 340781 -1141161 -2097079 -2014763 -1838624 -1386057 1159778 6098063
2032 6098063 10635840 12008889 10542363 8111534 5341366 2343325 701747 2165108
2024 2165108 5977257 9571807 11374544 11208767 8996163 5363301 2687033 2873516 4493411
$$ packed form
2085A910757J369151P68948j488512k225660N14815M042320M013321P35254r35228
2076H705166J127262K897568L92295m002877n054847k434847n32773j166541j181774
2067a251368J576516M094379K654222j347446l364913k059816l52911m50942r83677
2058a485956J08617K240196L126219J684007j161553l617761m118991k224436
2050e449658O94871K377723J945933N80680l66641p63153p44243K7088J162166
2041e35234J180424l04409j481942r55918Q2316J76139M52567K545835M938285
2032F098063M537777J373049j466526k430829k770168k998041j641578J463361
2024B165108L812149L594550J802737j65777k212604l632862k676268J86483J619895
$$ plain form
2015 4493411 4697594 3575904 3709015 5516309 6288297 4323460 919735 -2448039 -5693390
2006 -5693390 -7809472 -6467040 -1792794 2498580 3941417 4487600 6425354 8027415
1998 8027415 6546761 3286739 1893920 2963487 4091736 4480615 5677678 7818278
1990 7818278 8657470 6848274 3355503 -676769 -4644236 -6878171 -5583243 -2191979
1982 -2191979 -622081 -1903778 -2513355 299176 4399406 6184152 5574837 4867594 4575592
1973 4575592 3595755 2377669 2662236 4320791 5309694 4924046 4554604 4843917 4538756
1964 4538756 2866885 752261 -1307078 -4275637 -8032408 -9976309 -8396522 -5629270
1956 -5629270 -5117535 -6207512 -5021106 -633164 2829938 1558443 -3049176 -6778747
$$ packed form
2015D493411K04183j121690J33111J807294P71988j964837l403725l367774l245351
2006e693390k116082J342432M674246M291374J442837N46183J937754J602061
1998H027415j480654l260022j392819J069567J128249L88879J197063K140600
1990G818278Q39192j809196l492771m032272l967467k233935J294928L391264
1982b191979J569898j281697o09577K812531M100230J784746o09315p07243k92002
1973D575592r79837j218086K84567J658555R88903l85648l69442K89313l05161
1964D538756j671871k114624k059339k968559l756771j943901J579787K767252
1956e629270N11735j089977J186406M387942L463102j271495m607619l729571
$$ plain form
1948 -6778747 -7905965 -7766187 -7468314 -6893128 -6459419 -7074491 -8085246 -7694249 -5857964
1939 -5857964 -4459080 -4046162 -2970899 -797010 166476 -1462369 -3387551 -2936346 -1048840
1930 -1048840 -154743 183550 2031551 4520295 4471336 1656647 -347263 508596 1879082
1921 1879082 889454 -2052661 -4991437 -7249436 -8419392 -7015028 -2864910 939335
1913 939335 1491638 384918 1572999 5475723 8288724 7298643 3963946 959007 -1149518
1904 -1149518 -2849966 -3559389 -2688895 -1581091 -2154568 -4016596 -4920453 -4206451 -3847887
1895 -3847887 -5219101 -6414804 -4432059 673746 5660612 8195788 9203604 10289333
1887 10289333 10630782 8382955 4323571 1750843 2467605 4729647 5828007 5104856 3521406
$$ packed form
1948f778747j127218J39778K97873N75186M33709o15072j010755L90997J836285
1939e857964J398884M12918J075263K173889R63486j628845j925182M51205J887506
1930a048840Q94097L38293J848001K488744m8959k814689k003910Q55859J370486
1921A879082r89628k942115k938776k257999j169956J404364M150118L804245
1913I39335N52303j106720J188081L902724K813001r90081l334697l004939k108525
1904a149518j700448p09423Q70494J107804n73477j862028r03857P14002L58564
1895c847887j371214j195703J982745N105805M986866K535176J007816J085729
1887A0289333L41449k247827m059384k572728P16762K262042J098360p23151j583450
$$ plain form
1878 3521406 1728452 -81266 -1352150 -1539194 -755093 923777 3976747 8008628 10587983
1869 10587983 9309455 4995489 1288744 653314 1905270 2153601 213940 -2581129
1861 -2581129 -4374776 -4818959 -5117759 -6416784 -8407880 -9620201 -8857253 -5989369 -1683721
1852 -1683721 2704335 5075202 3976877 817459 -707100 1297850 4428736 5049468
1844 5049468 2956009 1142289 1487493 2855874 3506214 3161520 2030001 -261714 -3586341
1835 -3586341 -6561517 -8118321 -8865715 -9784736 -10377837 -9298202 -6332029 -2707821 275094
1826 275094 2049759 2468207 1609352 26190 -1324688 -1553241 -227033 2304771 4753578
1817 4753578 5629569 4683526 3248560 2630468 2541396 1774428 97811 -1420397 -1979970
$$ packed form
1878C521406j792954j809718j270884j87044P84101J678870L052970M031881K579355
1869A0587983j278528m313966l706745o35430J251956K48331j939661k795069
1861b581129j793647m44183k98800j299025j991096j212321P62948K867884M305648
1852a683721M388056K370867j098325l159418j524559K004950L130886O20732
1844E049468k093459j813720L45204J368381O50340l44694j131519k291715l324627
1835c586341k975176j556804p47394r19021n93101J079635K966173L624208K982915
1826B75094J774665M18448q58855j583162j350878k28553J326208K531804K448807
1817D753578Q75991r46043j434966o18092q9072p66968j676617j518208n59573
$$ plain form
1808 -1979970 -1977794 -1919067 -1242956 711706 2815801 2639838 -386239 -3313219 -2644221
1799 -2644221 1277522 4445792 4030866 1368693 -641110 -1304804 -1750224 -2286618 -2360452
1790 -2360452 -2274024 -2504477 -1726157 1756114 6392793 8083524 5539699 2475712 2938609
1781 2938609 6518373 9914341 11346187 11211937 9806000 6996903 3712752 1595413
1773 1595413 1215011 2053527 3733962 5661133 6142661 4016809 978852 145555 2103983
1764 2103983 4361567 5057909 5178633 6342720 8242836 9354219 8759727 6301560 2328004
1755 2328004 -1625370 -3316496 -2381684 -1330008 -2454844 -4746306 -5605881 -4761547 -4233661
1746 -4233661 -4684079 -4353613 -2288479 -303955 -312568 -1493126 -2012238 -2230858 -3737358
$$ packed form
1808a979970K176N8727O76111J954662K104095j75963l026077k926980O68998
1799b644221L921743L168270m14926k662173k009803o63694m45420n36394p3834
1790b360452Q6428k30453P78320L482271M636679J690731k543825l063987M62897
1781B938609L579764L395968J431846j34250j405937k809097l284151k117339
1773A595413l80402Q38516J680435J927171M81528k125852l037957q33297J958428
1764B103983K257584O96342J20724J164087J900116J111383n94492k458167l973556
1755B328004l953374j691126R34812J051676j124836k291462q59575Q44334N27886
1746d233661m50418L30466K065134J984524q613j180558n19112k18620j506500
$$ plain form
1737 -3737358 -5727029 -5164907 -1165255 3250232 5028442 4567283 3542839 1372024 -3148183
1728 -3148183 -7748194 -8014880 -3513066 568652 -493553 -5535345 -9957608 -11522788
1720 -11522788 -11341672 -10606727 -9266570 -7549483 -6176656 -4779951 -2191223 1221353
1712 1221353 3235348 2363509 -563229 -3691896 -5635632 -5505789 -3229887 -446306 579447
1703 579447 -218867 -463805 1188074 2940397 2485150 177240 -2129869 -4102492 -6520513
1694 -6520513 -8533772 -7913455 -4399675 -668017 908787 854104 984621 1720618 2400386
1685 2400386 3119398 4351006 5179319 4024929 1536828 755496 3093716 5627964 4380222
1676 4380222 -305655 -3874321 -3278751 -469165 769600 -468049 -2337961 -3636696
$$ packed form
1737c737358j989671N62122L999652M415487J778210m61159j024444k170815m520207
1728c148183m600011k66686M501814M081718j062205n041792m422263j565180
1720a1522788J81116P34945J340157J717087J372827J396705K588728L412576
1712A221353K013995q71839k926738l128667j943736J29843K275902K783581J025753
1703E79447p98314k44938J651879J752323m55247k307910k307109j972623k418021
1694f520513k013259O20317L513780L731658J576804n4683J30517P35997O79768
1685B400386P19012J231608Q28313j154390k488101p81332K338220K534248j247742
1676D380222m685877l568666N95570K809586J238765j237649j869912j298735
$$ plain form
1668 -3636696 -4713975 -5489029 -4956868 -3083210 -1318354 -545351 -32488 880517 1571714
1659 1571714 1573937 1805218 3026089 4144085 3619426 1897294 807158 837334 698814
1650 698814 -240420 -742902 306932 1927779 2252812 1190733 716595 2462983 5840583
1641 5840583 8752555 9499371 7710171 4230553 867442 -415375 610988 1384729 -1128181
1632 -1128181 -6471557 -10403264 -9633131 -5793856 -3318375 -4172081 -6338113 -7022392 -5432505
1623 -5432505 -2390856 796273 2485880 1436395 -1554635 -3786478 -3290866 -739902
1615 -739902 1541381 1662280 -666442 -3769077 -4817043 -2650092 76713 -410888 -3769080
1606 -3769080 -5505139 -3223173 -120680 -245039 -2795918 -4058096 -3140693 -2222423 -1927547
$$ packed form
1668c636696j077279p75054N32161J873658J764856P73003N12863R13005O91197
1659A571714K223K31281J220871J117996n24659j722132j090136L0176j38520
1650F98814r39234n02482J049834J620847L25033j062079m74138J746388L377600
1641E840583K911972P46816j789200l479618l363111j282817J026363P73741k512910
1632a128181n343376l931707P70133L839275K475481q53706k166032o84279J589887
1623e432505L041649L187129J689607j049485k991030k231843M95612K550964
1615g39902K281283J20899k328722l102635j047966K166951K726805m87601l358192
1606c769080j736059K281966L102493j24359k550879j262178R17403R18270K94876
$$ plain form
1597 -1927547 -264444 3393215 6479940 6598244 4443968 2155920 504140 -1026947
1589 -1026947 -2679517 -4260014 -5854461 -7718996 -9636364 -10745924 -9989649 -7108178
1581 -7108178 -3575481 -1761113 -2329365 -3392270 -3358140 -3301548 -4593479 -5481289 -3022240
1572 -3022240 1906903 4771497 3178486 -292573 -1979856 -1232505 530038 2212870
1564 2212870 2846864 1290573 -1890570 -3985896 -3381093 -1659442 -885748 -698006 -58123
1555 -58123 85309 -1476838 -3244998 -2628585 238488 2876764 3969891 3880318 2310345
1546 2310345 -1422506 -5617413 -6712329 -3553466 1038301 3857772 4549127 4336205 3387455
1537 3387455 921270 -2953031 -6576745 -7703274 -5129932 -76760 4371096 6233199
$$ packed form
1597a927547J663103L657659L086725J18304k154276k288048j651780j531087
1589a026947j652570j580497j594447j864535j917368j109560P56275K881471
1581g108178L532697J814368n68252j062905L4130N6592j291931q87810K459049
1572c022240M929143K864594j593011l471059j687283P47351J762543J682832
1564B212870O33994j556291l181143k095326O04803J721651P73694J87742O39883
1555e8123J43432j562147j768160O16413K867073K638276J093127q9573j569973
1546B310345l732851m194907j094916L158863M591767K819471O91355k12922r48750
1537C387455k466185l874301l623714j126529K573342N053172M447856J862103
$$ plain form
1529 6233199 6519274 6819238 6083419 2391737 -2539474 -4101282 -951451 2740220 2838851
1520 2838851 224138 -1877487 -2891924 -4303537 -5934162 -6141857 -4876612 -3542021
1512 -3542021 -2290630 -291089 1607301 1457580 -372481 -1303331 -634603 -628825 -2426858
1503 -2426858 -3706059 -2227436 592901 1969491 1982561 2934980 5222341 6333437 4152529
$$ packed form
1529F233199K86075K99964p35819l691682m931211j561808L149831L691671R8631
1520B838851k614713k101625j014437j411613j630625k07695J265245J334591
1512c542021J251391J999541J898390j49721j830061r30850O68728N778j798033
1503b426858j279201J478623K820337J376590J3070R52419K287361J111096k180908
$$ [...]
##END NTUPLES=NMR SPECTRUM
##END=
