##TITLE=31Pdec_DE-87rm_3h
 , 24 sc
 28.3.2025
##JCAMPDX= 6.0         $$ Bruker NMR JCAMP-DX V2.0
##DATA TYPE= NMR SPECTRUM
##DATA CLASS= NTUPLES
##ORIGIN= UXNMR, Bruker Analytische Messtechnik GmbH
##OWNER= root
$$ XWIN-NMR		Version 3.5
$$ Fri Mar 28 14:20:02 2025 Russian Standard Time (UT+4h)  she@DPX200
##.OBSERVE FREQUENCY= 81.013821
##.OBSERVE NUCLEUS= ^31P
##.ACQUISITION MODE= SIMULTANEOUS
##.ACQUISITION SCHEME= undefined
##.AVERAGES= 24
##.DIGITISER RES= 17
##SPECTROMETER/DATA SYSTEM= spect
##.PULSE SEQUENCE= zgpg30
##.SOLVENT NAME= CDCl3
##.SHIFT REFERENCE= (INTERNAL, CDCl3, 0, 198.062)
##AUDIT TRAIL= $$ (NUMBER, WHEN, WHO, WHERE, WHAT)
$$ ##TITLE= Audit trail, XWIN-NMR		Version 3.5
$$ ##JCAMPDX= 5.01
$$ ##ORIGIN= Bruker BioSpin GmbH
$$ ##OWNER= she
$$ F:/spectra/data/she/nmr/P31/2/pdata/1/auditp.txt
$$ ##AUDIT TRAIL=  $$ (NUMBER, WHEN, WHO, WHERE, WHAT)
(   1,<2025-03-28 14:18:25.64 +0400>,<she>,<DPX200>,
      <created by zg, POWCHK disabled, PULCHK disabled
       configuration hash MD5:
       00 E9 B6 7A A2 85 ED C7 34 08 36 98 17 FE 4E 26
       data hash MD5: 32K
       92 92 9F DA 64 59 AC 34 39 BB EC B0 54 13 60 94>)
(   2,<2025-03-28 14:18:31.76 +0400>,<she>,<DPX200>,
      <Start of raw data processing
       efp BC_mod = 2 LB = 1.5 FT_mod = 6 PKNL = 1 PHC0 = 1383.27 PHC1 = 102.2942 SI = 64K 
       data hash MD5: 64K
       F5 6E 36 E8 91 F3 4A 4A 33 C6 06 9D 0B A6 D9 C9>)
(   3,<2025-03-28 14:18:51.40 +0400>,<she>,<DPX200>,
      <pk PHC0 = 46.8607 PHC1 = -92.60001 
       data hash MD5: 64K
       1B 8D 2D C8 8A 22 F9 DF 8F 0F 38 1E 02 3B 22 74>)
(   4,<2025-03-28 14:18:56.90 +0400>,<she>,<DPX200>,
      <abs ABSG = 5 
       data hash MD5: 64K
       A2 D0 83 AE BF 2C C8 82 31 CC FA 62 CD 1B CB 6C>)
(   5,<2025-03-28 14:19:27.42 +0400>,<she>,<DPX200>,
      <pk PHC0 = 33.26503 PHC1 = -102 
       data hash MD5: 64K
       34 FC 48 FE 14 40 DE BF C0 6B 7D B5 A0 42 F4 5D>)
$$ ##END=
$$ 
$$ hash MD5
$$ 5E 1B C4 EA DE 49 4A 36 D2 B3 F3 66 C9 FF B5 58
##$RELAX= 
##$RELAX= 
##$RELAX= 
##$RELAX= 
##$RELAX= 
##$RELAX= 
##$RELAX= 
##$RELAX= 
$$ Bruker specific parameters
$$ --------------------------
##$DU= <F:/spectra>
##$EXPNO= 2
##$NAME= <P31>
##$PROCNO= 1
##$TYPE= <nmr>
##$USER= <she>
##$AMP= (0..31)
100 100 100 100 100 100 100 100 100 100 100 100 100 100 100 100 100 100 
100 100 100 100 100 100 100 100 100 100 100 100 100 100 
##$AQSEQ= 0
##$AQ_mod= 1
##$AUNM= <au_zg>
##$AUTOPOS= <>
##$BF1= 81.014009
##$BF2= 200.13
##$BF3= 200.13
##$BF4= 200.13
##$BF5= 200.13
##$BF6= 200.13
##$BF7= 200.13
##$BF8= 200.13
##$BYTORDA= 1
##$CFDGTYP= 0
##$CFRGTYP= 5
##$CHEMSTR= <none>
##$CNST= (0..31)
1 1 145 1 1 1 1 1 1 1 1 1 1 1 1 1 1 1 1 1 1 1 1 1 1 1 1 1 1 1 1 1 
##$CPDPRG= <waltz16>
##$CPDPRG1= <>
##$CPDPRG2= <waltz16>
##$CPDPRG3= <>
##$CPDPRG4= <mlev>
##$CPDPRG5= <mlev>
##$CPDPRG6= <mlev>
##$CPDPRG7= <mlev>
##$CPDPRG8= <mlev>
##$CPDPRGB= <>
##$CPDPRGT= <>
##$D= (0..31)
0 1 0 0 0 0 0 0 0 0.06 0 0.03 2e-05 3e-06 0 0 0.0002 0 0 0 0 0 0 0 0 0 
$$ [...]
##$SUBNAM3= <"">
##$SUBNAM4= <"">
##$SUBNAM5= <"">
##$SUBNAM6= <"">
##$SUBNAM7= <"">
##$SUBNAM8= <"">
##$SUBNAM9= <"">
##$SW= 400.765351723535
##$SWIBOX= (0..15)
0 1 3 0 0 0 0 0 0 0 0 0 0 0 0 0 
##$SW_h= 32467.5324675325
##$TD= 32768
##$TD0= 1
##$TE= 0
##$TE2= 300
##$TE3= 300
##$TEG= 300
##$TL= (0..7)
0 120 53 12 22 120 120 120 
##$TP= (0..7)
150 150 150 150 150 150 150 150 
##$TP07= 0
##$TPNAME0= <>
##$TPNAME1= <>
##$TPNAME2= <>
##$TPNAME3= <>
##$TPNAME4= <>
##$TPNAME5= <>
##$TPNAME6= <>
##$TPNAME7= <>
##$TPOAL= (0..7)
0.5 0.5 0.5 0.5 0.5 0.5 0.5 0.5 
##$TPOFFS= (0..7)
0 0 0 0 0 0 0 0 
##$TUNHIN= 0
##$TUNHOUT= 0
##$TUNXOUT= 0
##$USERA1= <user>
##$USERA2= <user>
##$USERA3= <user>
##$USERA4= <user>
##$USERA5= <user>
##$V9= 5
##$VALIST= <valist>
##$VCLIST= <CCCCCCCCCCCCCCC>
##$VD= 0
##$VDLIST= <DDDDDDDDDDDDDDD>
##$VPLIST= <PPPPPPPPPPPPPPP>
##$VTLIST= <TTTTTTTTTTTTTTT>
##$WBST= 1024
##$WBSW= 4
##$XGAIN= (0..3)
0 0 0 0 
##$XL= 0
##$YL= 0
##$YMAX_a= 27875
##$YMIN_a= -31066
##$ZGOPTNS= <>
##$ZL1= 120
##$ZL2= 120
##$ZL3= 120
##$ZL4= 120
##$ABSF1= 198.0616
##$ABSF2= -202.7028
##$ABSG= 5
##$ABSL= 3
##$ALPHA= 0
##$AQORDER= 0
##$ASSFAC= 0
##$ASSFACI= 0
##$ASSFACX= 0
##$ASSWID= 0
##$AUNMP= <proc_1d>
##$AZFE= 0.1
##$AZFW= 0.5
##$BCFW= 0
##$BC_mod= 2
##$BYTORDP= 0
##$COROFFS= 0
##$CY= -3
##$DATMOD= 1
##$DC= 0
##$DFILT= <>
##$DTYPP= 0
##$F1P= 0
##$F2P= 0
##$FCOR= 1
##$FTSIZE= 65536
##$FT_mod= 6
##$GAMMA= 0
##$GB= 0
##$INTBC= 1
##$INTSCL= 9.790993e-09
##$ISEN= 30
##$LB= 1.5
##$LEV0= 0
##$LPBIN= 0
##$MAXI= 10000
##$MC2= 0
##$MEAN= 0
##$ME_mod= 0
##$MI= 50
##$NCOEF= 0
##$NC_proc= -6
##$NLEV= 6
##$NOISF1= 182.463
##$NOISF2= 159.3651
##$NSP= 0
##$NTH_PI= 0
##$NZP= 0
##$OFFSET= 198.0616
##$PC= 4
##$PHC0= 1463.396
##$PHC1= -92.30582
##$PH_mod= 1
##$PKNL= yes
##$PPARMOD= 0
##$PSCAL= 0
##$PSIGN= 0
##$REVERSE= no
##$SF= 81.0140089999434
##$SI= 65536
##$SIGF1= 159.3651
##$SIGF2= -187.1042
##$SINO= 113.3802
##$SIOLD= 16384
##$SREGLST= <1H.CDCl3>
##$SSB= 0
##$STSI= 65536
##$STSR= 0
##$SW_p= 32467.5324675325
##$SYMM= 0
##$S_DEV= 0
##$TDeff= 32768
##$TDoff= 0
##$TI= <>
##$TILT= no
##$TM1= 0
##$TM2= 0
##$TOPLEV= 0
##$USERP1= <user>
##$USERP2= <user>
##$USERP3= <user>
##$USERP4= <user>
##$USERP5= <user>
##$WDW= 1
##$XDIM= 65536
##$YMAX_p= 279066050
##$YMIN_p= -25672367
$$ End of Bruker specific parameters
$$ ---------------------------------
##NTUPLES= NMR SPECTRUM
##VAR_NAME=  FREQUENCY,     SPECTRUM/REAL,   SPECTRUM/IMAG
##SYMBOL=    X,             R,               I
##VAR_TYPE=  INDEPENDENT,   DEPENDENT,       DEPENDENT
##VAR_FORM=  AFFN,          ASDF,            ASDF
##VAR_DIM=   65536,         65536,           65536
##UNITS=     HZ,            ARBITRARY UNITS, ARBITRARY UNITS
##FACTOR=    0.49542278885378, 1,            1
##FIRST=     16045.7642231865, 0,            0
##LAST=      -16421.768244346, 0,            0
##MIN=       -16421.768244346, -25672367,    0
##MAX=       16045.7642231865, 279066050,    0
$$ Real data points
##PAGE= N=1
##DATA TABLE= (X++(R..R)), XYDATA
$$ [...]
49137 -399898 -373209 -387082 -327482 -187176 -141006 -317038 -578517 -670074 -565536 -537088 -814628
49126 -814628 -1252548 -1443931 -1174796 -678404 -398607 -584043 -1174857 -1957804 -2657708 -2956575
49116 -2956575 -2689947 -2081086 -1568219 -1330035 -1193025 -1059977 -1109052 -1387351 -1547930 -1332277
49106 -1332277 -1057705 -1180005 -1513183 -1398765 -667129 71930 245379 -16769 -256864
49097 -256864 -330621 -338764 -225891 120008 492693 493040 41390 -523971 -890101 -1071125 -1224386
49086 -1224386 -1388280 -1500329 -1523935 -1450125 -1252300 -911074 -446069 91475 605734 946659
49076 946659 998334 798103 516482 321796 308357 504560 832427 1058762 917327 357478
49066 357478 -366677 -888070 -998638 -774778 -512996 -516700 -827534 -1138333 -1076007 -627518
49056 -627518 -203718 -208736 -602106 -964969 -966891 -683268 -446645 -458164 -602322 -635655 -499815
49045 -499815 -385059 -476013 -700098 -787465 -555802 -87798 342443 463721 181590 -330425
49035 -330425 -720741 -752906 -528581 -325180 -215607 8591 502229 1122214 1611135 1874796
49025 1874796 1954223 1875662 1708120 1630138 1683784 1544981 863428 -140496 -757520 -622296
49015 -622296 -179902 -82325 -344780 -433558 -83715 352890 429586 147629 -188987 -424124
49005 -424124 -612281 -742837 -665206 -331877 49904 205585 66327 -219471 -510212 -809476
48995 -809476 -1142355 -1371577 -1263718 -767207 -113895 433586 832122 1132744 1218337 905779
48985 905779 303776 -198211 -398965 -509670 -756120 -988656 -936956 -678115 -529012 -562245
48975 -562245 -588626 -609222 -871948 -1347737 -1543717 -1117996 -404708 428 -15671 -112074
48965 -112074 -133130 -288234 -675563 -1030427 -1094551 -940996 -769399 -616960 -428806 -187937
48955 -187937 185767 816311 1539724 1854323 1515138 974413 849847 1088252 1099391 678536
48945 678536 292552 333680 571339 611807 512666 572351 770400 822642 664748 511781
48935 511781 490738 531975 588897 663609 654203 513944 545648 1117204 1970831 2244990 1468948
48924 1468948 226660 -520665 -562095 -483288 -701406 -954227 -874215 -627603 -625343 -816823
48914 -816823 -701390 -62441 677832 1011503 977454 953245 982224 708752 18568 -640697
48904 -640697 -780782 -438768 27371 464428 892064 1104160 768934 -11700 -633131 -659348
48894 -659348 -306596 -88433 -199925 -446841 -604538 -612079 -493366 -288529 -57492 159534
48884 159534 374546 599863 811798 974501 1008100 758240 179323 -438783 -668588 -454415
48874 -454415 -181137 -122996 -117585 9868 15551 -404808 -1018628 -1239389 -865058 -266927
48864 -266927 167959 424769 607395 635286 405016 67803 -69662 120886 462416 660700
48854 660700 577660 336902 165407 136485 133250 68733 -6985 -83734 -267232 -503681 -429503
48843 -429503 203525 1030748 1304852 655467 -566930 -1674506 -2180601 -2040607 -1635195
48834 -1635195 -1507590 -1864499 -2323464 -2363577 -1979614 -1627321 -1575685 -1653835 -1649615 -1592454
48824 -1592454 -1551536 -1484590 -1404090 -1389085 -1314213 -889501 -142950 425718 390653 -96767
48814 -96767 -507626 -462121 28954 613819 800862 372700 -304160 -649282 -591169 -558032
48804 -558032 -699926 -641913 -220484 97947 -76023 -423524 -484893 -424400 -628742 -885703
48794 -885703 -677729 -131315 53199 -369059 -870354 -954451 -704952 -394640 -93840 109693
48784 109693 -25085 -511587 -957859 -1037088 -872985 -744867 -676832 -552126 -401221 -314149
48774 -314149 -216801 31121 396214 698065 821508 795788 713784 632336 508937 248571
48764 248571 -110410 -330403 -245671 -19557 74504 44434 78196 116316 -111581 -585274
48754 -585274 -893987 -764708 -388397 -86273 60145 96088 398 -190529 -294308 -223857
48744 -223857 -145741 -238334 -460687 -688318 -882371 -997427 -943263 -788400 -772537 -939677
48734 -939677 -985768 -684193 -264657 -131248 -346559 -611321 -645681 -413600 -72687 162152
48724 162152 219242 315477 718467 1290978 1545326 1287001 884704 684200 500614 37212
48714 37212 -481125 -544994 -91182 432671 683821 720036 679645 530621 241361 -37944
48704 -37944 -85591 176022 564828 703497 349726 -241999 -509035 -291104 -79211 -310038
48694 -310038 -726534 -826969 -676081 -744664 -1076336 -1186411 -829132 -375611 -300341 -643890
48684 -643890 -1064399 -1124547 -544343 465305 1147030 908519 104314 -349299 -151246 139629
48674 139629 99870 2064 120341 169588 -72010 -158990 342530 957702 825434 -48275
48664 -48275 -777907 -838161 -636502 -689260 -850861 -732411 -459977 -537143 -1107966 -1750039
48654 -1750039 -1986317 -1718352 -1133754 -455471 102125 341470 257930 125102 203831 391032
48644 391032 359159 48531 -227241 -245582 -175910 -252563 -412300 -500726 -579002 -686312 -538104
48633 -538104 71888 717549 744412 208868 -167256 -59236 66034 -166809 -400666 -196139
48623 -196139 206540 303892 129881 88042 253208 392523 482511 633037 617411 80867
48613 80867 -770259 -1242220 -1032972 -585904 -431502 -578352 -722041 -700811 -531590 -256622
48603 -256622 41251 236652 299383 298535 245637 134957 135629 448557 902878 1005825 548084
48592 548084 -89839 -399695 -301816 -78636 47623 77643 111485 236847 464084 673471
48582 673471 716319 614905 523614 460604 283049 -1041 -146353 -50804 675 -305208
48572 -305208 -854019 -1233545 -1238345 -1044268 -922092 -948094 -992674 -875833 -528448 -64452
48562 -64452 308582 449458 309768 -125508 -745343 -1189067 -1091925 -553906 -119769 -150447
48552 -150447 -444067 -635356 -686224 -712569 -589537 -139894 400016 535967 166737 -283703
48542 -283703 -465187 -495188 -607622 -722443 -633128 -440118 -486069 -876244 -1305090 -1435053
48532 -1435053 -1293759 -1178757 -1249350 -1364949 -1342026 -1219282 -1149315 -1121103 -976329 -695709
48522 -695709 -471154 -422573 -411981 -245289 83267 456437 782149 925190 660865 -58922
48512 -58922 -870966 -1277785 -1161671 -852651 -715499 -841329 -1091082 -1222421 -1008615 -490637
48502 -490637 -111278 -300181 -859299 -1079232 -623197 8094 146944 -157265 -281932 69731
48492 69731 526780 645898 469180 306223 251490 207078 217014 419084 669044 569945 32033
48481 32033 -473555 -474427 -120941 68303 -27802 -23903 295012 626470 661552 542804 498732
48470 498732 354031 -156304 -786061 -991610 -694866 -357188 -267201 -241137 -154324 -270160
48460 -270160 -749505 -1227600 -1272231 -1023923 -982546 -1275220 -1504898 -1313583 -798780 -315812
48450 -315812 -66947 33611 168901 333346 276201 -149706 -621095 -624464 -217730 -150392
48440 -150392 -910260 -1938117 -2245568 -1674496 -1044157 -1047143 -1491876 -1771312 -1636027 -1242512
48430 -1242512 -764038 -286749 63781 174315 88578 -36255 -56584 131716 539249 948188
48420 948188 992514 526799 -184482 -749937 -1003764 -992802 -792514 -490884 -212576 3203
48410 3203 229728 424909 350364 -80591 -528760 -561739 -177177 249978 475086 577083
48400 577083 674434 721941 632960 392325 15578 -407116 -613288 -353245 253142 755733
48390 755733 875338 796766 857948 1099232 1242556 1013705 393873 -354253 -843568 -850395
48380 -850395 -515553 -180228 -14040 62460 109772 78111 54074 291273 774182 1003902
48370 1003902 557580 -261114 -700065 -487160 -124847 -149026 -425249 -438276 -69065 277709
48360 277709 310383 269066 520838 946705 1031370 549990 -102619 -374593 -153376 242028
48350 242028 484726 444905 113233 -390151 -769064 -798911 -638322 -627442 -758798 -674564
48340 -674564 -277608 19636 -134512 -534174 -785236 -914979 -1241573 -1776394 -2138471 -2045750
48330 -2045750 -1591402 -1028577 -539439 -233220 -143102 -184474 -267830 -425586 -676069 -856889
48320 -856889 -816302 -688636 -723398 -911164 -1065333 -1204873 -1493539 -1795453 -1687801 -1040889
48310 -1040889 -276093 91711 -69973 -555198 -1038403 -1159955 -732538 -33371 389012
48301 389012 351412 193000 163667 32577 -439897 -994011 -1196550 -1033694 -816371 -673717
48291 -673717 -501439 -293269 -180053 -199206 -296724 -477892 -711799 -808454 -666418 -523016
48281 -523016 -661225 -972893 -1116270 -998173 -770391 -459705 5083 452270 573789 395959
48271 395959 259069 287223 267637 126908 111025 331147 498641 329131 -78908 -478658
48261 -478658 -833382 -1223392 -1603587 -1864135 -1977167 -1929761 -1686604 -1363649 -1240851 -1426613
48251 -1426613 -1680665 -1736080 -1622664 -1500376 -1365327 -1145383 -929905 -839775 -749504 -395170
48241 -395170 235535 800435 920696 513619 -167430 -737655 -947731 -819559 -532972 -219816
48231 -219816 52180 163624 9460 -309323 -561033 -683197 -798838 -906807 -823258 -512409
48221 -512409 -189950 32603 314392 718760 969893 812998 377051 -57967 -417453 -708900
48211 -708900 -804956 -665405 -556856 -713273 -962661 -1025917 -987202 -1084784 -1223021 -1139805
48201 -1139805 -923505 -876215 -939600 -771543 -380110 -143991 -143901 -31483 278120 334605 -139922
48190 -139922 -735029 -905792 -691968 -511971 -519491 -563189 -601137 -759253 -1048815 -1340345
48180 -1340345 -1583586 -1807589 -1943350 -1869803 -1613366 -1321972 -1073549 -864357 -732582 -732252
48170 -732252 -830118 -971054 -1175503 -1404788 -1406884 -937456 -163811 362578 258975 -261599
48160 -261599 -632692 -571449 -351893 -383344 -620909 -597638 -84271 531756 741907 604030
48150 604030 598636 886285 1125884 1075477 925410 846875 630337 96729 -456997 -623059
48140 -623059 -485038 -448764 -608881 -710749 -690025 -805253 -1156878 -1455065 -1432095 -1209721
48130 -1209721 -1069128 -1054219 -1006198 -880597 -831897 -985866 -1252134 -1422933 -1431524 -1438175 -1591186
48119 -1591186 -1759470 -1670342 -1329536 -1075856 -1099023 -1140889 -898796 -523594 -401444 -555545
48109 -555545 -621690 -410175 -160223 -170304 -444798 -785731 -1004668 -977170 -717632 -478243
48099 -478243 -549953 -876386 -1082293 -977671 -802811 -849440 -1072023 -1251030 -1343327 -1453851
48089 -1453851 -1589563 -1648556 -1573462 -1347422 -919679 -309006 277030 598763 641437 581564
48079 581564 524134 415844 217432 16769 -82551 -83726 -24492 164315 602767 1208714
48069 1208714 1599014 1411894 746063 99138 -217897 -401758 -720910 -987369 -804395
48060 -804395 -229720 227034 305845 295480 500879 781878 841272 669557 443181 221501
48050 221501 20192 -8118 243368 600911 809049 847553 827949 721887 454928 150670
48040 150670 7033 12944 28980 36342 44797 -103247 -495547 -816408 -646549 -87833 291463
48029 291463 176654 -184252 -444517 -548819 -543908 -390971 -189553 -269928 -773465 -1338459
48019 -1338459 -1466335 -1082120 -542734 -218841 -243595 -533649 -849511 -922656 -710463 -475852
48009 -475852 -485843 -710559 -940647 -1087973 -1200448 -1264462 -1196916 -1031623 -953743 -1092827
47999 -1092827 -1339553 -1396879 -1032553 -340167 258907 374119 18509 -474447 -868784 -1172623
47989 -1172623 -1379934 -1353226 -1081985 -803436 -686153 -601469 -401285 -220446 -267488 -474616
47979 -474616 -599310 -549539 -390497 -178678 -36563 -231722 -865776 -1577249 -1860729 -1623017
47969 -1623017 -1159010 -700711 -335762 -257668 -635862 -1211680 -1453392 -1207861 -830363 -604417
47959 -604417 -458422 -367815 -542666 -955886 -1132594 -778089 -267156 -99867 -154284 49455
47949 49455 516978 709249 278553 -534416 -1261747 -1621194 -1539881 -1106393 -597277 -295042
47939 -295042 -188937 -49395 181080 311745 246776 125915 39089 -118494 -364541 -470013
47929 -470013 -301586 -126933 -311682 -805677 -1175390 -1117357 -730198 -282473 72512 286369
47919 286369 309282 138846 -113631 -343379 -599668 -980646 -1390100 -1552698 -1327948 -876246
47909 -876246 -430080 -51821 232079 221995 -241650 -907724 -1290479 -1283778 -1287816 -1588599
47899 -1588599 -1918736 -1861015 -1437344 -1029293 -913141 -1139491 -1656235 -2214955 -2349491 -1868979
47889 -1868979 -1264809 -1182572 -1536674 -1625087 -1145196 -579800 -431425 -566383 -575662 -374003
47879 -374003 -125459 96491 242620 153545 -164843 -345012 -77582 433618 745475 739752
47869 739752 586496 306997 -218908 -859620 -1245869 -1246216 -1131246 -1172909 -1308535 -1311637 -1152582
47858 -1152582 -1087025 -1402566 -2048658 -2517876 -2263062 -1331153 -389936 25054 68621 192886
47848 192886 472559 654366 650860 559384 329046 -130525 -574847 -635516 -402947 -316524
47838 -316524 -424631 -267241 350133 947132 975518 444787 -292519 -989700 -1449658 -1383502
47828 -1383502 -719857 134539 654475 693671 452122 178603 101265 362293 733351 646601
47818 646601 -163399 -1232180 -1865009 -1867686 -1508264 -1021869 -541708 -301443 -433678 -657884
47808 -657884 -593278 -327152 -279276 -562740 -899843 -1147679 -1463155 -1892059 -2195985 -2185408
47798 -2185408 -1904837 -1445537 -905775 -543880 -573620 -759727 -634235 -190705 81406 -40924
47788 -40924 -217111 -194038 -223983 -521677 -801263 -776572 -701056 -907874 -1144012 -926334
47778 -926334 -351369 18066 -31169 -192248 -230175 -223416 -217542 -156994 -216074 -670950 -1304762
47767 -1304762 -1454292 -886569 -175628 93630 92088 343156 886672 1306117 1401929 1372203
47757 1372203 1378758 1349489 1244414 1161845 1085404 815795 289905 -250490 -554657 -664203
47747 -664203 -768576 -879249 -819256 -503920 -97773 137628 94575 -110787 -305399 -464565
47737 -464565 -707058 -1090713 -1507864 -1838368 -2087715 -2244129 -2119489 -1577769 -898812 -619268
47727 -619268 -896336 -1265852 -1200743 -711578 -188644 157151 390533 501474 337294 -66934
47717 -66934 -415205 -538420 -596548 -737411 -797865 -569602 -176903 78689 135024 151867
47707 151867 146787 -39147 -398187 -688763 -807892 -955071 -1273161 -1576447 -1651427 -1610718
47697 -1610718 -1649050 -1590299 -1061292 -130835 593184 659389 292057 11056 -44685 -135557
47687 -135557 -394147 -614504 -593730 -412359 -264388 -190024 -104788 17825 102622 45637
47677 45637 -230888 -725370 -1323659 -1900612 -2447488 -2956625 -3209826 -2956131 -2374594 -2023631
47667 -2023631 -2110825 -2135995 -1608721 -841463 -534941 -734659 -804427 -464954 -228218 -561377
47657 -561377 -1157835 -1412165 -1216421 -874097 -544054 -224250 -59458 -185227 -381823 -320005
47647 -320005 -81613 -26479 -196371 -282484 -187894 -183962 -422600 -689705 -784540 -807829 -907246
47636 -907246 -1014942 -1005427 -889912 -716492 -485444 -278821 -261691 -434020 -571913 -514156
47626 -514156 -324437 -115950 51790 47312 -267010 -725840 -907783 -653851 -286128 -163473
47616 -163473 -295008 -551057 -925166 -1334240 -1466472 -1169853 -788625 -782679 -1149682 -1503256
47606 -1503256 -1582467 -1418821 -1154047 -972293 -1060759 -1345523 -1417255 -1028823 -514988 -377737
47596 -377737 -603361 -783720 -789723 -850322 -990677 -903492 -500478 -154575 -188305 -453169
47586 -453169 -633632 -699288 -817647 -1008430 -1124540 -1089257 -978395 -899839 -882722 -859859
47576 -859859 -740052 -553962 -511478 -814889 -1406382 -1966065 -2148788 -1821060 -1199115 -798174
47566 -798174 -1009094 -1570604 -1725529 -1146579 -420426 -256339 -509180 -509280 -150289 23084
47556 23084 -217168 -442000 -358267 -286330 -545107 -922640 -1136077 -1337904 -1726267 -2042182
47546 -2042182 -1935138 -1548306 -1270244 -1112844 -803370 -368973 -179742 -425355 -885421
47537 -885421 -1209710 -1164837 -653960 231309 1162685 1752616 1782172 1226993 263382 -641149
47527 -641149 -955158 -676249 -443056 -722530 -1109476 -848096 82821 849665 722554 -204357
47517 -204357 -1261790 -1847010 -1775418 -1287710 -820402 -624779 -580112 -444787 -169493 151229
47507 151229 423848 458145 3647 -791272 -1223926 -797392 33048 374249 56507 -262720
47497 -262720 -133013 151112 174973 2332 -118171 -198507 -330209 -366039 -116953 291493
47487 291493 491732 219296 -480145 -1216215 -1409092 -760113 341577 1136615 1291516
47478 1291516 1112589 944345 746895 404112 48993 -158379 -257894 -260481 1736 545206
47468 545206 1048748 1275095 1407314 1666674 1850040 1588666 876821 19748 -771071 -1407733
47458 -1407733 -1723387 -1609736 -1264076 -968936 -708654 -327967 22325 -8150 -409668 -733737
47448 -733737 -675870 -441093 -391398 -565131 -723054 -715168 -595699 -417799 -114433 313197
47438 313197 594304 390721 -236309 -780849 -902167 -865322 -1054030 -1252646 -944017 -261510
47428 -261510 37040 -280095 -504214 -122494 303918 30820 -632726 -782389 -282947 202844
47418 202844 403093 720686 1246231 1399150 890869 310755 307155 756326 1206500 1635035
47408 1635035 2194503 2569065 2228530 1212215 139617 -548120 -942686 -1249376 -1409449
47399 -1409449 -1290187 -1008438 -878240 -1093706 -1543025 -1933722 -2095347 -2128593 -2196115 -2228338
47389 -2228338 -2011048 -1563361 -1199563 -1131269 -1216082 -1209338 -1056616 -813144 -519424 -349730
47379 -349730 -626849 -1378118 -2046704 -2017318 -1384372 -843811 -789665 -869082 -580493 -15811
47369 -15811 266363 -26248 -592776 -950665 -950984 -786911 -646149 -536574 -426136 -372284
47359 -372284 -427474 -517264 -516958 -407297 -277912 -213851 -239613 -322979 -372093 -300799 -172914
47348 -172914 -193985 -462999 -824986 -1070436 -1151945 -1070031 -723300 -113034 437191 571761
47338 571761 368437 240742 410025 733923 994961 1057097 809096 322654 18565 237123
47328 237123 637468 516542 -202531 -841721 -976520 -969001 -1196126 -1359672 -1066050 -609449
47318 -609449 -560306 -876452 -1037163 -881534 -730889 -768444 -837264 -835108 -839967 -841067 -753058
47307 -753058 -674548 -739621 -764891 -468898 -336 201925 53919 -133857 -239822 -418652
47297 -418652 -566705 -309486 285455 559238 146699 -458716 -592171 -278383 -6954 19862
47287 19862 -48346 -176711 -470549 -774689 -681925 -53043 729057 1148375 1078293 843323
47277 843323 812714 979009 977345 555761 -61011 -412915 -334331 -36066 279205 581636
47267 581636 778971 668908 262951 -135523 -337583 -487447 -715861 -866697 -790477 -646207
47257 -646207 -648298 -732731 -746966 -770265 -935268 -1073249 -852920 -211114 591493 1259755
47247 1259755 1593399 1453795 881810 197668 -258479 -466410 -645613 -928313 -1296900
47238 -1296900 -1725005 -2145520 -2369365 -2272819 -1988273 -1687823 -1290313 -659246 -3113 246812
47228 246812 -37641 -536692 -861231 -851651 -550445 -153628 30017 -150384 -465015 -623238
47218 -623238 -772243 -1310182 -2168855 -2701065 -2470071 -1824822 -1447638 -1568696 -1884493 -2075373
47208 -2075373 -2103747 -2040164 -1844539 -1418434 -812320 -315400 -263700 -683674 -1181897 -1316693
47198 -1316693 -1046041 -668439 -388024 -170875 -19378 -89359 -408327 -699064 -657043 -288308
47188 -288308 141245 391892 410853 317852 288344 343818 247034 -229687 -914310 -1330799
47178 -1330799 -1251981 -931113 -689700 -538719 -385004 -353723 -602335 -938626 -939920 -470041
47168 -470041 135680 446221 353626 76479 -141711 -260507 -396624 -615868 -843498 -1005402
47158 -1005402 -1152887 -1330077 -1406392 -1227062 -879413 -586781 -369852 -93068 147243 40911
47148 40911 -405778 -708317 -499470 -8334 300809 309714 188583 13808 -192387 -217757
47138 -217757 136961 672900 963674 876545 603564 233563 -315529 -919751 -1223674 -1137472
47128 -1137472 -1016347 -1145531 -1330497 -1248583 -991508 -946081 -1215409 -1454455 -1331721 -943093
47118 -943093 -638355 -548168 -462934 -199783 87402 125288 -40931 -69842 189740 498788
47108 498788 642485 780945 1136483 1521268 1506202 999638 365215 -22146 -75670 131946
47098 131946 498284 824911 869232 572930 95961 -392645 -778113 -877041 -528464 115534
47088 115534 630462 762603 653471 557652 541356 529696 431801 140695 -349154 -732894
47078 -732894 -593684 19948 487607 319495 -257166 -659617 -681715 -559060 -470910 -354818
47068 -354818 -185371 -94994 -145682 -216750 -198341 -136326 -144515 -309991 -687775 -1227834 -1696627
47057 -1696627 -1847765 -1714917 -1573978 -1552181 -1432949 -963384 -254981 258562 257298 -141438
47047 -141438 -510013 -540707 -335554 -253309 -483064 -834036 -971219 -780251 -443543 -232465
47037 -232465 -296714 -576232 -825137 -807516 -593484 -577209 -1035927 -1733286 -2163277 -2158073
47027 -2158073 -2005580 -1930505 -1753103 -1236839 -543932 -70481 70187 120771 248070 303683
47017 303683 91570 -341602 -799601 -1135934 -1219222 -900339 -265763 203231 57340 -529913
47007 -529913 -920806 -842222 -715221 -967887 -1358088 -1338241 -881698 -498735 -471727 -509969
46997 -509969 -266369 159081 413334 341142 65739 -198737 -264688 -55159 294567 537512
46987 537512 591995 575988 537686 379552 113261 -90573 -229229 -537723 -1040884 -1347974
46977 -1347974 -1170731 -779061 -623311 -741636 -902447 -1114596 -1547245 -2058775 -2265120
46968 -2265120 -2064153 -1709330 -1392035 -1136596 -1057349 -1252744 -1430024 -1149362 -554081 -340538
46958 -340538 -794216 -1358559 -1468006 -1333233 -1461810 -1780931 -1789410 -1374741 -907937 -571460
46948 -571460 -135592 482599 893309 728373 203184 -86265 157360 630830 783870 377237
46938 377237 -308510 -777216 -816856 -668132 -671480 -820924 -790010 -398304 89865 236259
46928 236259 -52037 -403182 -427182 -169464 27646 52592 140736 368639 355910 -203666
46918 -203666 -921588 -1084872 -605304 -105392 22067 95177 430397 692556 445494 -27659
46908 -27659 -67531 368889 670265 501390 181686 32544 -95428 -402401 -709278 -777658
46898 -777658 -720041 -743985 -756103 -601676 -504413 -835033 -1495318 -1930275 -1808466 -1374530
46888 -1374530 -1035866 -877593 -730970 -498491 -213860 95459 421382 701675 855695
46879 855695 846819 628609 135934 -522486 -955613 -809505 -229694 187980 11299 -568946
46869 -568946 -965802 -786541 -134803 563961 940056 955295 882338 959824 1066734 890071
46859 890071 436605 109063 116668 101762 -334306 -958082 -1181058 -895544 -551655 -405604
46849 -405604 -221343 136758 335901 103125 -286752 -415310 -301846 -212117 -161225 -22752
46839 -22752 70579 -124702 -524925 -814803 -875522 -759564 -405103 167424 511219 179553
46829 179553 -504783 -701558 -197560 278461 110514 -401061 -657232 -681470 -895707 -1293133
46819 -1293133 -1428863 -1143968 -773525 -579499 -409156 -87119 162591 -44224 -680608
46810 -680608 -1198732 -1083236 -451701 37460 -56754 -440567 -515968 -201882 11094 -182678
46800 -182678 -509881 -634122 -661924 -837476 -1053788 -1053083 -912861 -941094 -1198596 -1471204
46790 -1471204 -1622588 -1648345 -1494477 -1191241 -1062303 -1360475 -1732390 -1531822 -733241 -60907
46780 -60907 -65499 -522005 -938514 -1187260 -1301394 -1071233 -333912 561133 1062237 1113234
46770 1113234 1132796 1325161 1401172 1045277 340446 -376744 -846205 -976645 -818849 -562075
46760 -562075 -412256 -387431 -343254 -226347 -140378 -107162 58011 508962 1109001 1513953
46750 1513953 1466413 975405 289106 -281389 -601757 -792984 -981699 -1033330 -748338 -313494
46740 -313494 -244703 -744914 -1397732 -1708650 -1703289 -1720693 -1841845 -1883765 -1808077 -1716918 -1507288
46729 -1507288 -985804 -363208 -154388 -413249 -506483 53018 878561 1162075 629875 -284818
46719 -284818 -1034344 -1356835 -1214333 -744252 -295471 -200567 -443894 -741093 -913347 -968005
46709 -968005 -892895 -685085 -566392 -825491 -1378010 -1786342 -1803097 -1606478 -1408845 -1165227
46699 -1165227 -842426 -658447 -778269 -978323 -894047 -487209 -47447 165208 80137 -265053
46689 -265053 -727177 -1024625 -919108 -469288 -10144 121804 -162362 -610680 -747020 -259630
46679 -259630 626276 1331791 1568238 1572149 1584819 1436367 942357 419999 359051 701821
46669 701821 899198 667337 275939 43445 -56365 -175964 -338036 -546362 -839059 -1062893
46659 -1062893 -896610 -324639 167781 145488 -210473 -369642 -162761 78304 58208 -102881
46649 -102881 -115442 62994 207658 127358 -163962 -563331 -1016287 -1443209 -1630774 -1406685
46639 -1406685 -961611 -774055 -1041303 -1346462 -1146486 -515864 -110090 -360317 -974106
46630 -974106 -1336213 -1186231 -761535 -429452 -330373 -306844 -92744 375936 827342 934096
46620 934096 718144 521886 575543 779854 927668 912713 679183 224146 -264020 -528975
46610 -528975 -608794 -792972 -1099530 -1142827 -737887 -283144 -224433 -449054 -596149 -684126
46600 -684126 -945371 -1242944 -1217417 -931147 -778566 -745257 -393125 255909 470544 -176753
46590 -176753 -1055196 -1233057 -654704 -40180 163792 149200 116636 -125258 -730494 -1385492
46580 -1385492 -1591098 -1191042 -431060 364514 1006039 1433997 1671996 1762563 1665003 1264112
46570 1264112 557261 -219108 -743206 -880942 -757886 -586370 -482068 -452395 -515108 -766105
46560 -766105 -1259884 -1803197 -1984979 -1574943 -877015 -493997 -660761 -968398 -875963 -368361
46550 -368361 62616 16856 -413495 -813823 -849715 -493394 4786 328742 356254 201777
46540 201777 -33125 -410364 -901836 -1161161 -875621 -289403 2685 -174120 -400699 -358557
46530 -358557 -240631 -232539 -57959 529101 1158524 1287150 1009985 868354 973417 916860
46520 916860 534847 144459 -76693 -337180 -655093 -633735 -165713 149626 -236920 -1001569
46510 -1001569 -1357350 -1042434 -449363 33103 325313 400695 193014 -207330 -598638 -924819
46500 -924819 -1215839 -1317292 -1001296 -357921 212818 429747 313064 -41483 -583169 -1172842
46490 -1172842 -1601274 -1806784 -1868015 -1770811 -1425879 -938920 -594438 -499804 -473970 -350176
46480 -350176 -167462 -15699 69235 8511 -254280 -533756 -565395 -495262 -834219 -1683332
46470 -1683332 -2350273 -2125013 -1233187 -580902 -614941 -873940 -744032 -252338 119292 119168
46460 119168 -97825 -333695 -532815 -605646 -414004 -70645 36549 -239148 -487580 -273711
46450 -273711 162596 167212 -384924 -882878 -846680 -532244 -408713 -475415 -507852 -621494
46440 -621494 -1040337 -1487851 -1389952 -689934 17423 231682 38313 -197869 -260006 -129913
46430 -129913 52147 15523 -343402 -674270 -531401 -33899 225011 -33347 -498201 -843378
46420 -843378 -1102718 -1343057 -1444404 -1401786 -1397288 -1374560 -1018974 -388666 -38654 -208153
46410 -208153 -428150 -331442 -285950 -687880 -1157876 -1138436 -889733 -1094800 -1710669 -2035014
46400 -2035014 -1819578 -1484770 -1185328 -516101 585092 1380747 1232081 467105 -85869
46391 -85869 -95799 128311 234245 175541 78802 62093 162329 288411 285376 106734 -161855
46380 -161855 -450797 -719248 -829622 -645165 -303979 -166022 -412757 -904396 -1466825 -2042536
46370 -2042536 -2475922 -2480011 -2035672 -1587154 -1577552 -1906202 -2052795 -1663000 -851440 7197
46360 7197 635255 1015994 1290012 1502483 1487211 1084854 427137 -160378 -533071 -821682
46350 -821682 -1141442 -1424713 -1605883 -1754739 -1904361 -1911717 -1623662 -1083365 -496763 -96786
46340 -96786 -72178 -469608 -1084203 -1571982 -1740922 -1631585 -1299318 -688964 193870 1107266
46330 1107266 1657073 1547606 826060 -31492 -425972 -236241 10616 -186121 -638349
46321 -638349 -858170 -919544 -1327138 -2017026 -2188691 -1418266 -354812 107071 -111047 -487190
46311 -487190 -755259 -975764 -1037701 -740228 -306695 -246379 -635562 -982169 -911614 -621916
46301 -621916 -521545 -702666 -930829 -963781 -736500 -332442 128126 577402 957385 1097817
46291 1097817 797559 124964 -536210 -892450 -1020252 -1069834 -917691 -410940 203891 466050
46281 466050 287076 44138 75772 341665 597542 668092 512807 225427 11857 21916
46271 21916 191408 353399 444641 487453 488618 516123 722395 1074690 1224416 924131 438141
46260 438141 220912 303110 360554 310893 411803 735712 953864 770543 272325 -264554
46250 -264554 -662010 -858142 -885481 -908276 -1067422 -1249526 -1220096 -975187 -712014 -486467
46240 -486467 -209436 39143 57256 -92523 -119792 13920 38603 -124832 -222581 -141800
46230 -141800 -89858 -126846 33488 501356 899945 886587 636595 492322 451911 331632
46220 331632 124728 -150338 -652935 -1368930 -1815372 -1537825 -734146 6494 410601 581777
46210 581777 573437 387398 261550 429954 628491 349421 -369823 -891660 -816526 -447716
46200 -447716 -283235 -439726 -752473 -1077427 -1266513 -1151026 -809690 -626973 -840651 -1207169
46190 -1207169 -1331905 -1162436 -925552 -728589 -503194 -276119 -211840 -348862 -511332 -574977
46180 -574977 -670840 -988018 -1428195 -1595666 -1189577 -358490 399323 684661 499809 124207
46170 124207 -204327 -431364 -598008 -719059 -747100 -619020 -359065 -141324 -174429 -483159
46160 -483159 -867143 -1099752 -1089751 -855769 -499471 -238968 -266618 -475952 -537593 -380406
46150 -380406 -354551 -694991 -1059080 -929884 -337201 184138 285510 91675 -174264 -458623
46140 -458623 -710832 -828314 -905246 -1207125 -1714148 -1971067 -1612130 -827710 -115527 230682
46130 230682 193126 -167105 -676993 -971613 -795447 -373623 -207887 -473168 -847913 -985971
46120 -985971 -917523 -864288 -854804 -724331 -422055 -129515 -52089 -210147 -470423 -690870
46110 -690870 -785688 -731365 -594294 -514574 -590147 -803275 -1104075 -1477653 -1827025 -1908848
46100 -1908848 -1600236 -1172469 -1021256 -1110052 -1011751 -612667 -396034 -744632 -1272170 -1265671
46090 -1265671 -644937 -58425 -52789 -517898 -974668 -1070453 -737319 -189303 139535 -49541
46080 -49541 -501045 -599349 -114264 484191 602816 201024 -277970 -468172 -377013 -229069
46070 -229069 -192595 -245294 -241081 -124584 -46351 -176305 -464728 -728744 -888314 -920589 -706141
46059 -706141 -236438 105430 -123831 -798325 -1334382 -1476253 -1504155 -1557603 -1318412 -657615
46049 -657615 -71641 -28248 -271274 -264234 -22426 16514 -260210 -549581 -666980 -673207 -531279
46038 -531279 -112558 452119 839122 958983 950636 781641 271189 -465929 -1009861 -1149472
46028 -1149472 -1060684 -927169 -749393 -593220 -643016 -887207 -1086754 -1157771 -1238865 -1280461
46018 -1280461 -978352 -316193 205078 163579 -238109 -502401 -481581 -411735 -480868 -649090
46008 -649090 -804852 -871454 -804119 -623692 -403604 -169497 71321 186406 13488 -358476
45998 -358476 -660693 -857846 -1168545 -1566624 -1665982 -1342757 -1079799 -1336046 -1899037 -2276243
45988 -2276243 -2436471 -2654310 -2827866 -2555748 -1860308 -1261144 -1042082 -954292 -791515 -759775
45978 -759775 -1010704 -1228086 -1050363 -645091 -493587 -737651 -1058901 -1145600 -1002706 -797395
45968 -797395 -629791 -536548 -586827 -852645 -1266070 -1553793 -1427818 -936590 -538582 -645728
45958 -645728 -1124011 -1463415 -1450609 -1407315 -1674881 -2134055 -2407343 -2315052 -1930281 -1377248
45948 -1377248 -807415 -418843 -259477 -143660 11045 -57015 -554259 -1159366 -1360609 -1195526
45938 -1195526 -1194103 -1541271 -1772697 -1486471 -938781 -648614 -730565 -937753 -1115815 -1263326
45928 -1263326 -1312606 -1215811 -1174272 -1455172 -1981948 -2346536 -2224450 -1616765 -771460 -52738
45918 -52738 250015 226194 304865 627450 667860 -86646 -1231290 -1800955 -1532583 -1138496
45908 -1138496 -1162841 -1226680 -784681 -58558 342276 358208 438517 761691 1055256 1106967
45898 1106967 962406 656001 208451 -112490 24252 519680 924569 1046617 1081312 1104771
45888 1104771 903042 451326 121664 168273 348468 308625 60540 -173807 -326987 -430517
45878 -430517 -426544 -316156 -307599 -537023 -798809 -830019 -719620 -738313 -877695 -890197 -735842
45867 -735842 -643852 -692449 -648527 -362414 -89503 -223875 -807325 -1450305 -1714202 -1491665
45857 -1491665 -1035633 -690856 -610852 -687282 -701288 -533536 -270627 -141425 -309705 -680191
45847 -680191 -951371 -918013 -665093 -399091 -196326 -49202 -40136 -250394 -561827 -786593
45837 -786593 -943087 -1136348 -1224050 -964430 -512690 -353881 -617188 -854072 -678405 -237198
45827 -237198 171080 514788 745545 528270 -274063 -1152527 -1496480 -1372182 -1259779 -1213541
45817 -1213541 -871408 -221393 250413 247924 -6484 -226923 -385905 -474588 -391403 -218993
45807 -218993 -209559 -350948 -339788 -118593 -6336 -116799 -109187 213285 490900 340875
45797 340875 -62421 -318268 -387269 -429190 -334701 81109 569292 631330 193124 -317274
45787 -317274 -578718 -690051 -822968 -912878 -837125 -668782 -607639 -767481 -1083769 -1354755
45777 -1354755 -1411956 -1353881 -1508184 -1990400 -2422968 -2349084 -1844642 -1415204 -1316788 -1318180
45767 -1318180 -1164871 -902762 -615671 -218036 242878 392601 -6985 -587649 -765806
45758 -765806 -542029 -500778 -933089 -1344037 -1085392 -229112 533652 779812 773776 918455
45748 918455 1126755 1020877 589965 292649 465633 908264 1183780 1131514 916085 726135
45738 726135 633325 658540 750792 721849 412510 -55940 -389920 -521428 -680951 -966449
45728 -966449 -1063544 -640002 75203 394326 -69924 -927769 -1413845 -1162161 -468905 126356
45718 126356 353245 317355 277250 412957 722912 1039506 1173662 1117369 1076714 1234883
45708 1234883 1509306 1627700 1437994 1056236 693322 424971 188665 -55257 -261320
45699 -261320 -419485 -656104 -1103350 -1651786 -1960954 -1837421 -1522087 -1419699 -1570513 -1623744
45689 -1623744 -1378608 -1081385 -1040446 -1198364 -1307372 -1309827 -1261005 -1058678 -606698 -144487
45679 -144487 -30528 -220569 -328268 -216062 -143434 -257887 -322336 -103765 277003 542913
45669 542913 549427 263679 -256858 -743401 -879146 -727001 -692739 -931688 -1140844 -1091075
45659 -1091075 -946760 -824460 -493535 126326 600453 580750 420062 645781 1078201 1062786
45649 1062786 454074 -185276 -320396 97605 841239 1579044 1872356 1503833 848890
45640 848890 505961 580043 752107 941216 1313809 1675799 1548873 974144 564515 544218
45630 544218 415754 -98356 -473936 -246126 134969 -46305 -668191 -1004865 -837834 -662348
45620 -662348 -836280 -1107335 -1066486 -646846 -85267 298736 250860 -203775 -670942 -766127
45610 -766127 -580679 -521509 -711805 -841027 -638706 -225207 87044 137691 -626 -119703
45600 -119703 -14993 314722 566894 367206 -360423 -1332646 -2174451 -2638204 -2635834 -2249502
45590 -2249502 -1720149 -1281857 -988068 -780105 -669642 -729532 -950279 -1223205 -1418980 -1402715
45580 -1402715 -1091638 -621556 -304035 -240517 -136826 272815 776371 943838 702289 319525
45570 319525 -73268 -538054 -955102 -1047642 -843222 -677809 -633152 -420031 7540 211501
45560 211501 -50050 -355608 -268375 -72779 -299076 -754882 -697851 48254 790609 927143
45550 927143 648954 433248 348243 255010 294453 654639 1070515 1078069 688165 329424
45540 329424 151103 -107994 -502263 -692910 -595263 -675351 -1217304 -1743553 -1682217 -1285849
45530 -1285849 -1262200 -1658144 -1800308 -1370909 -855803 -704011 -658485 -317828 101064 59285
45520 59285 -503024 -1116147 -1389617 -1289417 -923477 -439448 -103698 -135617 -421157 -631405
45510 -631405 -637922 -604602 -681786 -819005 -885118 -804372 -590893 -390761 -418968 -689301 -913302
45499 -913302 -881867 -826572 -1104537 -1590001 -1734665 -1286443 -639029 -346136 -521287 -851880
45489 -851880 -1027571 -1005985 -951558 -1025373 -1212539 -1337097 -1267034 -1045148 -768082 -460463
45479 -460463 -177614 -69014 -145884 -133252 193706 632867 784473 570859 249289 2627
45469 2627 -154460 -136842 153086 523469 626422 443952 296535 324835 326393 173323 17639
45458 17639 -17445 5513 72612 224397 245232 -198477 -960645 -1438110 -1406134 -1326279 -1523683
45447 -1523683 -1596814 -1112221 -432990 -262172 -644693 -1017704 -1080343 -1026398 -984044 -795291
45437 -795291 -414397 -69775 71476 58823 -67131 -318680 -527767 -398622 101312 640177
45427 640177 873797 707125 225186 -381539 -818363 -882212 -715647 -672209 -912657 -1297583
45417 -1297583 -1613675 -1686724 -1366351 -700380 -72826 155951 121709 232435 501658 524547
45407 524547 182608 -73163 159201 688114 1042252 1049470 862344 650077 539791 699547
45397 699547 1196205 1810926 2175124 2095245 1712881 1425630 1620234 2281307 2856736 2781183
45387 2781183 2190089 1792912 1922172 2098701 1796600 1255442 1104065 1428874 1726269
45378 1726269 1688673 1523760 1450886 1372242 1224434 1237387 1547772 1854194 1808797 1564988
45368 1564988 1549475 1765768 1744669 1268401 754764 682389 915085 931869 570782 156296
45358 156296 -77185 -261665 -475844 -456711 -26052 470975 528521 157026 -156366 -119285
45348 -119285 75257 158035 162657 274275 521296 748195 766899 480241 -10921 -406276
45338 -406276 -472439 -317252 -216458 -184975 21420 445231 769269 742205 497574 290555
45328 290555 158750 31279 -53944 -76435 -187507 -467330 -657469 -432038 103244 451288
45318 451288 307768 -75383 -178156 220007 788122 937592 420772 -339607 -628434 -197715
45308 -197715 491983 860044 838267 765737 860960 1058380 1243218 1347546 1247455 855246
45298 855246 352961 85998 142485 232259 66740 -314161 -680541 -898284 -939854 -755524
45288 -755524 -328177 189166 556030 673656 622125 489771 324149 274098 557118 1114067
45278 1114067 1467269 1221828 668883 538088 1052650 1592186 1527873 1045740 748008 708292
45268 708292 483345 -18467 -309475 -110426 186583 138358 -96054 -81974 230580 550552
45258 550552 721010 788390 765041 661383 631569 791363 1010724 1148883 1329721 1686036
45248 1686036 2013249 2049630 1969606 2186107 2715443 3139818 3203768 3070894 2944076 2782097
45238 2782097 2491380 2126746 1810377 1644199 1706701 1926387 2007261 1747897 1391601 1362324
45228 1362324 1688617 2011826 2131445 2172231 2204591 2092871 1784534 1396107 971663 528694
45218 528694 350117 746178 1427248 1633147 1093259 371381 2248 -210497 -667486 -1201261
45208 -1201261 -1326367 -988363 -604747 -510368 -695555 -928176 -875743 -351083 302298 400069
45198 400069 -178210 -658935 -389445 225700 410658 281835 603010 1408856 1788783 1226209
45188 1226209 357154 23141 201194 350253 343167 489450 879192 1225951 1299771 1136125
45178 1136125 824645 384327 -121843 -558702 -851682 -1022448 -1073168 -932242 -550143 -15167
45168 -15167 452931 661577 619066 483457 302485 -44800 -520247 -744602 -437541 75496
45158 75496 168530 -278809 -753624 -837663 -666789 -539852 -480972 -430174 -517896 -837172 -1192848
45147 -1192848 -1371996 -1447219 -1534541 -1491720 -1194904 -898432 -912476 -1063770 -916378 -472181
45137 -472181 -200133 -325552 -515509 -409043 -100381 112344 187407 298279 483522 569511
45127 569511 411492 80690 -196000 -254646 -169674 -172141 -335719 -438490 -266071 65528
45117 65528 309563 517264 956354 1604355 2061995 2069828 1818178 1621242 1573643 1685223
45107 1685223 2039129 2552348 2830767 2592982 2098749 1845742 1921387 1945917 1622860 1075975
45097 1075975 622087 417787 358771 193260 -232322 -714423 -783726 -247936 468133 776403
45087 776403 624925 437253 423259 353631 78545 -149237 -86869 72312 -34836 -428245
45077 -428245 -793592 -906985 -847577 -838736 -1015241 -1302040 -1449392 -1271047 -891932 -632395
45067 -632395 -617896 -691436 -749265 -885371 -1076792 -1030376 -576454 36957 509659 913667
45057 913667 1441966 1954887 2162189 2105751 2057648 2059789 2017421 2172371 2943573 4231866
45047 4231866 5410969 6193349 7037403 8450519 10336789 12388328 14732208 17671187
45039 17671187 20913369 23496631 24507937 23661041 21276714 18018514 14645783 11722692
45031 11722692 9421131 7661291 6392815 5604129 5125347 4646498 4004059 3347153 2956882
45022 2956882 2920535 3001271 2867133 2491803 2235241 2372453 2639097 2533168 2043049 1680747
45012 1680747 1687599 1657047 1222355 703072 632664 930400 1039333 729095 282298 -15218
45002 -15218 -85460 179411 842619 1566507 1818479 1539479 1177143 967078 670338 196684
44992 196684 -23855 376007 1119085 1629899 1686113 1429932 1022774 639625 568295 919175
44982 919175 1361653 1484925 1325951 1245794 1387631 1570530 1658622 1732265 1900221 2180772
44972 2180772 2549086 2892711 2967502 2624366 2052833 1594736 1350264 1161378 925133 696229
44962 696229 510659 329911 153375 5685 -148295 -299250 -287986 -27075 252273 229693
44952 229693 -88914 -436900 -670533 -775135 -599938 -25149 612020 742257 331805 -30417
44942 -30417 6569 71981 -258311 -731185 -768604 -268870 362358 783754 920693 765743
44932 765743 412090 191534 343491 576036 377445 -230315 -691909 -739243 -736044 -1007896
44922 -1007896 -1280007 -1134129 -698946 -440126 -420384 -230341 329771 907159 1093428 975278
44912 975278 946412 1120439 1209102 997774 710337 743385 1129915 1467879 1432778 1200310
44902 1200310 1205978 1560058 1908306 1915565 1708759 1717103 2189985 3044392 4159103 5633917
44892 5633917 7652874 10157482 12793245 15269129 17737092 20651356 24094442 27289405
44884 27289405 28995600 28500623 26146161 22873267 19456993 16285443 13592686 11513847
44876 11513847 9906321 8418131 6852387 5324107 4034916 3075429 2478178 2239013
44868 2239013 2189846 2051497 1738804 1444459 1308141 1200200 982241 767999 711203 727215
44858 727215 693531 763009 1142984 1653070 1868366 1700508 1490323 1475509 1500528 1348915
44848 1348915 1044625 686340 281662 -75040 -129121 212985 699494 1064706 1327272 1549105
44838 1549105 1539361 1101689 425191 -70742 -196537 -58258 217279 547709 768194 715502
44828 715502 409833 -35478 -572141 -1076610 -1251151 -997000 -712898 -800700 -995192 -684403
44818 -684403 147911 861521 1095114 1153514 1279074 1185131 712967 403154 845416 1802058
44808 1802058 2548385 2852886 3028227 3138900 2818048 1986663 1221430 1134430 1680516 2297852
44798 2297852 2541039 2399598 2126450 1931393 1850455 1859653 2032395 2430621 2829664 2833731
44788 2833731 2454507 2302137 2873357 3842869 4449130 4456342 4316751 4475706 5002695 5890746
44778 5890746 7179214 8677067 10079396 11511752 13418290 15663689 17308595 17687123
44770 17687123 17245609 16838253 16603565 16111095 15277872 14417738 13521784 12244278 10678238
44761 10678238 9461381 8879075 8430495 7607742 6634205 6019386 5727232 5266477 4446056
44752 4446056 3597357 3061133 2796466 2553303 2195855 1797159 1577148 1764843 2353629
44743 2353629 2964508 3120301 2726595 2164561 1851037 1816342 1777873 1515892 1072258 645880
44733 645880 399078 340594 318310 145753 -206347 -586201 -888322 -1209323 -1628515 -1911304
44723 -1911304 -1689017 -982556 -290256 -15638 -32516 1057 140822 246920 350763 531510
44713 531510 569342 216927 -207933 -55733 712658 1382657 1521288 1566759 1972988 2329990
44703 2329990 1980606 1133989 608689 638316 696452 480382 280556 228810 -38200 -603526
44693 -603526 -819386 -168197 855959 1276632 795472 -51197 -698228 -1022105 -1087849 -908406
44683 -908406 -565807 -282656 -239588 -425716 -682737 -825056 -772542 -633768 -573748 -567827
44673 -567827 -442404 -185279 25139 157663 374024 610116 504672 8708 -315950 2585
44663 2585 641820 921823 723124 497208 517640 614590 584575 399547 34285 -482209
44653 -482209 -857081 -794709 -464480 -304952 -382822 -377071 -177610 -10329 61311 237806
44643 237806 492381 500737 222799 58244 214829 383426 272704 35108 -74812 -51103
44633 -51103 69771 317886 473043 156805 -465440 -635053 -57638 551076 507913 229295
44623 229295 583870 1589836 2539436 3178120 3931033 4995001 5969118 6499980 6663604
44614 6663604 6556050 6057963 5198763 4301090 3582153 2989792 2549202 2458938 2687213 2857830
44604 2857830 2721971 2427068 2181990 1993254 1884377 2025328 2416441 2702641 2522054
44595 2522054 1880566 1069657 393874 45290 37204 195908 381193 661118 1033211 1134110
44585 1134110 675474 90580 157213 882727 1371874 1046489 433332 383545 988167 1687766
44575 1687766 2072127 2129133 1992592 1854230 1895286 1978916 1689963 992756 490422 639688
44565 639688 1086423 1260168 1251164 1493567 1889786 1976652 1802097 1872612 2237219 2370242
44555 2370242 2087306 1873895 2055046 2261833 2081391 1742600 1731022 2040059 2191849 1832252
44545 1832252 1053910 278824 -29415 273096 822215 1120613 1140056 1258022 1580966 1774001
44535 1774001 1690687 1663613 1890854 2019532 1743351 1396694 1456275 1775941 1877394 1778013
44525 1778013 1918542 2357230 2646151 2556085 2380767 2395169 2489717 2515252 2561841 2676832
44515 2676832 2680196 2501505 2357572 2320077 2039809 1277993 476387 350927 981055 1692050
44505 1692050 1873051 1592362 1324803 1351770 1585784 1801388 1855509 1747297 1585021 1478702
44495 1478702 1421375 1321613 1178738 1140284 1312245 1567095 1636151 1403438 1056786 917585
44485 917585 1119106 1456449 1571999 1314061 908915 754118 1033703 1531218 1796690 1513391
44475 1513391 793452 159447 126126 686694 1295855 1501266 1489303 1769738 2379655 2754994
44465 2754994 2503188 1970024 1793185 2125309 2580324 2778882 2650738 2336305 2111491
44456 2111491 2292979 2850712 3204583 2843500 2118199 1908475 2431774 2963183 2972354 2931080
44446 2931080 3517205 4493550 5022720 4844413 4476245 4334295 4314282 4308567 4503224 4919676
44436 4919676 5169094 4996579 4707036 4712882 4945387 5075986 5106364 5324823 5747184 5988663
44426 5988663 5765774 5260188 4866478 4745621 4753296 4712025 4605866 4491235 4322558 3980449
44416 3980449 3478279 3025480 2812191 2828001 2989267 3307829 3738748 3977014 3717471 3133748
44406 3133748 2798296 3031240 3582254 4046874 4292213 4301278 3929592 3155211 2382872 2128491
44396 2128491 2434531 2863235 3030319 2898153 2587037 2188663 1807089 1543422 1368389
44387 1368389 1184498 1040479 1089619 1311391 1503972 1614591 1826261 2192281 2436067 2326869
44377 2326869 2057916 1977225 2069823 2035062 1846315 1861289 2251039 2646740 2618324 2298726
44367 2298726 2213413 2587469 3158341 3648322 4027585 4204946 3881900 3027100 2201110 1988020
44357 1988020 2227005 2217863 1663632 1012722 810958 1087115 1503977 1779371 1778867 1489694
44347 1489694 1132427 1070809 1382085 1698214 1673653 1422146 1283977 1363960 1545479 1768602
44337 1768602 2002378 2095917 1972165 1852734 1962716 2106338 1903823 1419713 1169428 1436680
44327 1436680 1921523 2179999 2132419 2003834 1994275 2143586 2335621 2333254 2005116 1622736
44317 1622736 1716277 2472597 3443205 4020691 4072652 3932999 3895286 3960199 4069879 4346001
44307 4346001 4938697 5707737 6214214 6108844 5469271 4660883 3921641 3256080 2718785
44298 2718785 2506669 2611850 2647379 2303301 1815523 1674909 1977690 2381431 2619694 2704704
44288 2704704 2664648 2478086 2303633 2387263 2651629 2730274 2507970 2278784 2267357 2363412
44278 2363412 2441972 2524440 2461301 1940194 1093576 626153 936320 1514765 1682905 1563804
44268 1563804 1741014 2210369 2349062 1884179 1274823 1032487 1158175 1392861 1602640
44259 1602640 1734649 1723586 1632323 1659822 1887311 2200486 2501678 2781564 2973575 2998851
44249 2998851 2973703 3097238 3314251 3379340 3263079 3163747 3106043 2929838 2741358 2914486
44239 2914486 3473594 3933823 4023074 4140637 4746680 5656616 6355808 6730611 7036488 7353314
44229 7353314 7561996 7757675 8217904 8986026 9906132 11064154 12759221 14972441 17277991
44220 17277991 19415500 21585334 24002091 26483253 28687456 30442444 31544062 31501756
44212 31501756 29931942 27191921 24272304 21934496 20131697 18356670 16368526 14404430
44204 14404430 12770838 11462690 10277006 9163335 8281485 7714178 7286392 6761177 6122611
44195 6122611 5562079 5235345 5122885 5087868 4981597 4720999 4348978 4017406 3880606 4037566
44185 4037566 4542496 5292779 5856145 5676548 4684469 3525078 2901431 2824872 2820759 2710234
44175 2710234 2712809 2812965 2626040 2117078 1922313 2529269 3475240 3836668 3340209 2552500
44165 2552500 2076297 1997503 2097709 2169521 2037526 1647825 1285443 1396519 2025242 2682993
44155 2682993 2953308 2986759 3173334 3529350 3711888 3560234 3317108 3254881 3301712 3177392
44145 3177392 2806886 2457279 2446269 2797796 3252920 3580459 3760786 3841811 3770411 3497843
44135 3497843 3141329 2855749 2605416 2275190 1984224 2034125 2483075 3001248 3260271 3278079
44125 3278079 3266351 3333165 3490115 3777255 4188957 4599036 4929821 5266264 5625146 5772557
44115 5772557 5531308 5159206 5108943 5436761 5759126 5826285 5816739 5951356 6128875 6163290
44105 6163290 6138492 6227981 6310471 6126551 5810717 5894685 6615671 7504434 7936707 7922321
44095 7922321 7996516 8375267 8632409 8357662 7762385 7336783 7189462 7135173 7259382 7872227
44085 7872227 8878444 9699561 10010781 10159785 10630840 11448508 12368408 13303003 14212888
44076 14212888 14884701 15260179 15809611 17144186 19338347 22001161 24925324 28277452
44068 28277452 32193706 36557244 41147303 45660242 49641993 52821045 55550378 58576187
44060 58576187 62359658 66958891 72528247 79519921 88411834 99654955 113792274 131036487
44052 131036487 150748217 172045620 194954557 219852097 245092715 266047265 277790636
44045 277790636 279066050 273352772 266159865 261286901 258769537 255270488 246460302 230087830
44037 230087830 207577132 182811185 159390291 138948402 121421410 106109332 92457913
44030 92457913 80448884 70518079 62884270 56988266 51915064 47313787 43520177 40821105
44022 40821105 39053097 37968864 37563549 37923982 39092402 41127682 43937844 46995893
44014 46995893 49574100 51298342 52146415 52011085 50823586 49108263 47706398 46694515
44006 46694515 45194920 42612956 39493809 36704356 34297145 31795212 29225841 27145051
43998 27145051 25722796 24406979 22569279 20101818 17368154 14903888 13147784 12128490
43990 12128490 11394945 10519197 9625239 9136376 9084442 9064367 8889593 8862981 9215988 9601580
43980 9601580 9421068 8522501 7367431 6556184 6325979 6488562 6719721 6815278 6681788
43971 6681788 6228173 5454818 4633009 4152388 4078666 4064969 3839124 3550150 3429234 3367607
43961 3367607 3171592 3038469 3314644 3828061 3959045 3489877 2935653 2805779 2932333
43952 2932333 2877708 2713880 2931478 3662884 4442021 4819683 4874070 4949385 5152765 5337982
43942 5337982 5418569 5439206 5415459 5358779 5437643 5833061 6363066 6513773 6003834 5128938
43932 5128938 4387723 3966110 3798274 3912496 4359830 4885895 5043728 4672261 4000049
43923 4000049 3289435 2677126 2343012 2441282 2776273 2923410 2810959 2813197 3086127 3199743
43913 3199743 2719787 1849552 1180281 1038356 1355222 1926491 2477410 2696204 2551719
43904 2551719 2413525 2558659 2768653 2744901 2671607 2916926 3348795 3462541 3149360 2867293
43894 2867293 3010520 3497009 4011808 4296898 4178261 3676197 3147544 2993894 3186234
43885 3186234 3375328 3448510 3601012 3848270 3904459 3661768 3409320 3417641 3609877 3774861
43875 3774861 3830448 3779038 3670870 3667569 3852465 3966754 3702198 3284244 3318074 3947371
43865 3947371 4629443 4918080 4990779 5134605 5168242 4764291 4033489 3411061 3156759 3232670
43855 3232670 3465192 3608314 3485622 3263926 3312278 3627205 3769085 3583671 3541473 4033942
43845 4033942 4781030 5363978 5921108 6786886 7805455 8616914 9356071 10411652 11678516
43836 11678516 12743140 13715464 15142048 17066720 18932927 20618551 22870340 26326431
43828 26326431 30600602 34730950 38181229 41055977 43659060 46234389 48901524 51404681
43820 51404681 52978657 52808397 50704662 47226151 43217247 39370059 36111720 33611658
43812 33611658 31764787 30286278 28994045 28061575 27926191 28846948 30577087 32609658
43804 32609658 34742580 37204344 40196808 43606375 47271435 51107713 54593849 56465300
43796 56465300 55518294 51741272 46294729 40451662 34943201 30168216 26350770 23286861
43788 23286861 20444143 17608653 15127462 13344282 12142292 11226318 10496316 9908449
43780 9908449 9284931 8512927 7677685 6817198 5853326 4955117 4586936 4889501 5342960
43771 5342960 5392674 5125975 4971218 5014021 5040528 5015637 5014288 4818453 4118123 3112624
43761 3112624 2437068 2402621 2683508 2847794 2862257 2953079 3244534 3666726 4027657 4107210
43751 4107210 3856564 3520442 3368253 3333225 3167143 2909893 2864928 3084749 3265681 3262326
43741 3262326 3305491 3502913 3524951 3144926 2800719 3164120 4260944 5431885 6148067
43732 6148067 6487421 6769691 7121577 7579581 8297554 9363109 10574496 11666658 12670278
43723 12670278 13811084 15123476 16423990 17637716 18845010 19944150 20591908 20667717
43715 20667717 20530185 20531987 20457954 19775890 18364147 16652577 15055534 13617980 12290236
43706 12290236 11190886 10399217 9747258 9048152 8357809 7804148 7304629 6669918 5895625
43697 5895625 5164588 4616737 4242050 3924294 3511014 2981430 2620970 2793368 3376502
43688 3376502 3693611 3287173 2548567 2237407 2527102 2901876 2905959 2596056 2276382 2175799
43678 2175799 2412591 2908957 3288499 3212010 2870683 2783146 3048830 3223606 3044431 2804942
43668 2804942 2799078 2870098 2845946 2987993 3551603 4217683 4463618 4297538 4131831 4069908
43658 4069908 3830833 3320561 2765888 2262672 1683663 1115043 900575 1090855 1294007
43649 1294007 1296359 1417252 1941423 2546592 2687768 2350134 2051089 2194332 2724456 3351752
43639 3351752 3844369 4118654 4245756 4352262 4400264 4188242 3712732 3329533 3312190 3440927
43629 3440927 3351915 3135579 3190865 3583311 4004146 4346765 4816216 5376565 5622462 5442235
43619 5442235 5348782 5826341 6726752 7660492 8618735 9773865 10974426 11965391 12922660
43610 12922660 14222249 15758772 17024832 17865992 18644535 19583045 20419201 20824189 20721848
43601 20721848 20068745 18783184 17094960 15537149 14342658 13225484 11985268 10891620
43593 10891620 10152662 9449677 8460940 7505588 7133328 7283266 7374570 7109408 6688736
43584 6688736 6321564 6046232 6024879 6464106 7116290 7333407 6830771 6048800 5558050 5406884
43574 5406884 5268896 4981688 4694759 4620315 4813161 5120905 5287406 5217755 5146984 5372903
43564 5372903 5830099 6164447 6240443 6282712 6447887 6572841 6490989 6313223 6211315 6167322
43554 6167322 6131736 6208716 6481471 6853149 7258035 7820813 8577808 9242249 9527527 9562885
43544 9562885 9703555 10024409 10286144 10358120 10409697 10680421 11276592 12199946 13375154 14617785
43534 14617785 15750738 16824898 18131898 19948882 22293101 24902253 27439217 29805118
43526 29805118 32310834 35457550 39503686 44356507 49908518 56271519 63564140 71661646
43518 71661646 80297200 89186985 97807103 105177938 110141027 111895506 110297650 105936403
43510 105936403 100115606 94448915 90041576 87086914 85433082 85288484 87016722 90490166
43502 90490166 95198873 100929202 107708218 114869076 120628660 122938645 120662621 113966457
43494 113966457 103992973 92363610 80620986 69718355 59977078 51516809 44511258
43487 44511258 38981617 34649213 31180506 28388237 26082587 23987736 21994747 20282119
43479 20282119 18989327 17954518 16955245 16009505 15223289 14519725 13775048 13108587 12782572
43470 12782572 12841716 13020584 12986663 12592163 11976922 11501028 11441324 11663703 11749590 11524262
43460 11524262 11241117 11134182 11089022 10997506 11169294 12040564 13608794 15450709 17154625
43451 17154625 18413921 18851605 18211627 16766172 15174866 13842421 12668073 11467732
43443 11467732 10343244 9510217 8989408 8622888 8277321 7947201 7741454 7781167 8020078
43434 8020078 8216387 8214431 8164225 8267433 8414537 8364799 8226086 8387361 8920823 9414632
43424 9414632 9553515 9562102 9861774 10514972 11240473 11840060 12415429 13245316 14563358 16342292
43414 16342292 18191477 19591766 20332760 20599486 20576359 20176146 19283707 18042774 16694109
43405 16694109 15301058 13875988 12655116 11969421 11863809 12068324 12354602 12722147 13189397
43396 13189397 13577824 13620952 13232034 12592302 11980719 11542542 11231595 10959764 10734976
43387 10734976 10597422 10486033 10279358 9940105 9516044 9054138 8653549 8520031 8738200
43378 8738200 9025079 8981950 8612101 8319803 8375564 8695521 9177913 9844382 10519370 10827608
43368 10827608 10768522 10872639 11470779 12237361 12865041 13743611 15388384 17545144 19568654
43359 19568654 21492201 23972174 27249269 30955511 34987973 39687248 44840429 49291122
43351 49291122 52029837 53065720 52707962 50600335 46250587 40221571 34014487 28770218
43343 28770218 24634429 21372543 19002053 17625814 17064278 16921939 16841826 16583435 16023041
43334 16023041 15171351 14083449 12743710 11167164 9584564 8354884 7677075 7486170
43326 7486170 7569968 7662880 7543890 7250976 7110601 7319498 7574837 7397753 6780733 6197680
43316 6197680 5956118 5873992 5689299 5462251 5386766 5460375 5574863 5766718 6141571 6636124
43306 6636124 7051698 7281637 7357417 7312631 7142296 6872011 6537155 6099529 5509365 4877007
43296 4877007 4472879 4475609 4759709 5010959 5057014 5011857 5051415 5124553 5003741 4601172
43286 4601172 4092518 3699685 3493685 3454125 3537014 3579298 3341267 2837507 2464572 2561899
43276 2561899 2967103 3274722 3440201 3798471 4494474 5235153 5692373 5866277 5917658 5869533
43266 5869533 5637834 5219784 4731693 4340712 4181648 4220914 4223274 4023823 3793147 3808916
43256 3808916 4017857 4128957 4108595 4181713 4295911 4067437 3458303 3043698 3279219 3878499
43246 3878499 4288070 4441476 4606831 4773267 4710865 4477351 4338160 4248165 3918850 3405065
43236 3405065 3133265 3259766 3444668 3407006 3315293 3442318 3758303 4067834 4283053 4366873
43226 4366873 4241501 3956215 3754043 3777513 3865360 3818727 3723706 3817165 4129580 4443749
43216 4443749 4569166 4524083 4457373 4473891 4546633 4587316 4599109 4688935 4873966 4996508 4960099
43205 4960099 4904307 4931388 4815311 4318109 3704032 3511134 3786826 4000214 3833884 3602797
43195 3602797 3660149 3829184 3774841 3589376 3595806 3811576 4014512 4156893 4310372 4350549
43185 4350549 4121304 3819099 3792180 4012649 4169249 4242557 4504216 4900614 4965327 4549624
43175 4549624 4181757 4380099 4944558 5284275 5203524 4978156 4803300 4580376 4251534 3996850
43165 3996850 3995804 4209014 4474466 4645403 4584832 4235512 3806839 3695910 4038277 4467555
43155 4467555 4537245 4301689 4217824 4475168 4734324 4671059 4502928 4685514 5216794 5570631
43145 5570631 5341019 4702335 4174349 4136765 4632459 5432529 6178796 6622420 6839832 7106188
43135 7106188 7502085 7792457 7747273 7412403 7007954 6747264 6796175 7157412 7520908 7529908
43125 7529908 7309946 7374231 7822216 8064757 7673524 7070894 6888810 7011143 6888612 6559371
43115 6559371 6594659 7066995 7350156 7110606 6797762 6851593 7031267 6926189 6634595 6482012
43105 6482012 6456628 6401937 6475179 6919477 7558197 7967662 8051004 8053983 8097249 8064783 7910750
43094 7910750 7730400 7523015 7169649 6659951 6118048 5623046 5206957 4974581 4997243 5126421
43084 5126421 5130632 4988604 4863694 4854239 4961151 5203504 5527615 5686109 5474454 5041177
43074 5041177 4716314 4592450 4541832 4582043 4899897 5503753 6144582 6610509 6842711 6767719
43064 6767719 6321894 5682205 5175206 4885739 4614646 4266552 3994074 3902328 3913919 4007836
43054 4007836 4279543 4649410 4817637 4657386 4385996 4223718 4169714 4232162 4532518 4996966
43044 4996966 5296077 5335560 5472436 5952322 6450569 6521798 6231009 5958706 5823778 5714570
43034 5714570 5670713 5748146 5649378 5016240 4059572 3408118 3316513 3492771 3733459 4187843
43024 4187843 4842070 5271770 5206468 4944552 4895213 5034980 5131534 5194778 5330864 5398868
43014 5398868 5243342 5113547 5389505 5917855 6054267 5456857 4490660 3709390 3236874
43005 3236874 2866703 2544526 2455519 2680844 3006680 3145186 3020349 2748215 2410049 1989457
42995 1989457 1569897 1445270 1847062 2576815 3117851 3205234 3114420 3238757 3538523 3649302
42985 3649302 3470778 3363725 3685702 4331264 4851840 4910364 4518447 3931731 3436159 3185698
42975 3185698 3133099 3104564 2982063 2809449 2713629 2751680 2837400 2791555 2509801 2159931
42965 2159931 2146141 2701502 3511833 3953221 3781714 3385679 3232133 3287327 3207508 2913767
42955 2913767 2650198 2546513 2476368 2383576 2412434 2587277 2646813 2386724 1963027 1673051
42945 1673051 1617760 1769178 2178159 2856303 3583939 4113496 4484297 4865882 5164216 5105818
42935 5105818 4701422 4285304 4042798 3850079 3694311 3857507 4411506 4851937 4642319
42926 4642319 3983556 3638214 3988247 4608474 4857056 4607841 4243022 4107498 4163867 4135484
42916 4135484 3857928 3456312 3189334 3137182 3123076 3004239 2933571 3175808 3718848 4263031
42906 4263031 4603307 4834402 5138427 5550128 5996108 6394894 6635744 6616085 6383974 6088354
42896 6088354 5726556 5163108 4512832 4225667 4542520 5088881 5329122 5263797 5301351 5541185
42886 5541185 5640450 5421025 5141398 5006982 4836522 4471574 4144208 4094969 4129639 3972709
42876 3972709 3842383 4192042 4979677 5694246 6120023 6579180 7293112 7973403 8291129
42867 8291129 8371152 8512475 8703127 8731581 8554085 8229517 7687258 6914678 6225489 5957969
42857 5957969 5990078 5931620 5737133 5708613 5888316 5913360 5601208 5258289 5204039 5365755
42847 5365755 5602877 6068433 6867885 7610870 7753213 7310689 6857936 6835249 7189744 7706717
42837 7706717 8321610 8956406 9335904 9219937 8718124 8182362 7794473 7371264 6605570
42828 6605570 5457819 4270821 3475159 3202613 3251009 3404632 3636995 3938907 4133567
42819 4133567 4049239 3780583 3581454 3542679 3559365 3579381 3671497 3839723 3989669 4144035
42809 4144035 4492385 5100786 5704053 5935647 5724288 5366102 5210311 5318341 5422841
42800 5422841 5194060 4540565 3656106 2817414 2203715 1875568 1778631 1737885 1622176 1585538
42790 1585538 1939657 2661230 3260110 3345107 3100188 2932888 2872959 2682211 2388553 2265509
42780 2265509 2345595 2389848 2322993 2273703 2204274 1976075 1783809 1969654 2334722 2270673
42770 2270673 1779772 1695255 2505568 3550921 3873416 3368163 2580939 1858987 1321638
42761 1321638 1232552 1650751 1995020 1710617 1168982 1143972 1576373 1735088 1534096 1681724
42751 1681724 2346197 2686761 2163230 1440258 1349487 1627858 1439147 705583 158748 294210
42741 294210 938889 1725942 2398899 2697020 2485166 2037948 1781256 1748945 1666446 1507965
42731 1507965 1509814 1629247 1505850 1107246 946046 1383624 2063271 2353556 2126214 1775298
42721 1775298 1618849 1634671 1760490 2100587 2673755 3165622 3182954 2748920 2361170 2465829
42711 2465829 2981659 3472588 3711441 3861384 4078163 4192685 3996370 3706586 3854354
42702 3854354 4637204 5574169 5967621 5661479 5195975 5173329 5600453 5995050 6054089 5948430
42692 5948430 5887067 5710958 5208112 4613953 4372931 4455423 4365946 3910673 3510140 3552028
42682 3552028 3843893 4006596 4059166 4227375 4437000 4448723 4355833 4494961 4889405 5182056
42672 5182056 5156793 4976604 4828969 4645538 4307646 3914862 3712857 3851755 4243119 4569407
42662 4569407 4512637 4140525 3968998 4407179 5225149 5862044 6195801 6632172 7399126 8160733
42652 8160733 8510144 8532558 8639588 9035300 9546799 9851471 9726061 9198335 8574436 8197183
42642 8197183 8087104 7950552 7592141 7124942 6696920 6262173 5798408 5530701 5684975
42633 5684975 6136472 6541069 6757329 6932017 7201539 7515130 7784156 8046751 8403850
42624 8403850 8863230 9315814 9656638 9883895 10038646 10069805 9870417 9503564 9254037 9308849
42614 9308849 9500832 9573322 9602658 9883266 10439228 10976961 11343522 11668512 11950696 11898362
42604 11898362 11417032 10928427 10882426 11167179 11320844 11162354 10878957 10602460 10266985
42595 10266985 9889132 9668218 9713573 9878244 9954511 9902225 9817998 9768032 9702964 9510292
42585 9510292 9160680 8809143 8670556 8753830 8819934 8663422 8328951 7992620 7766197 7694945
42575 7694945 7791872 7963715 8038546 7956546 7782817 7481919 6930620 6261934 5880968 5922039
42565 5922039 5988390 5709237 5261891 4997193 4847083 4570317 4354174 4596748 5177858 5533329
42555 5533329 5480401 5400978 5506915 5517955 5308276 5308481 5844060 6467276 6437896 5684030 4872369
42544 4872369 4614920 4946359 5529145 6041045 6313747 6339375 6262195 6276293 6477560 6832508
42534 6832508 7250536 7641256 7955700 8220150 8472333 8631573 8518000 8058058 7406931
42525 7406931 6824938 6485402 6406676 6480994 6549611 6533369 6503531 6559865 6677259 6772916 6860713
42514 6860713 6982006 7026989 6808004 6305716 5703806 5235067 5131014 5555345 6299407 6690643
42504 6690643 6223251 5253113 4642820 4712591 5015715 5188119 5421962 5887834 6288399 6362128
42494 6362128 6325407 6381808 6265339 5785646 5379965 5474725 5651049 5223519 4468787 4425439
42484 4425439 5413895 6553823 6995895 6938387 7032135 7336635 7392246 7014716 6515738 6241415
42474 6241415 6248040 6387332 6457509 6296441 5897872 5404939 4897594 4291045 3553031 2893139
42464 2893139 2582116 2660755 2959737 3343718 3806310 4347561 4854046 5119139 4985864 4520644
42454 4520644 4041067 3892697 4181845 4765142 5435857 6017927 6362059 6432595 6376103 6345827
42444 6345827 6303588 6166049 6048044 6092712 6134808 5889193 5473563 5333761 5552991 5663798
42434 5663798 5349323 4921016 4791606 4826049 4611981 4119367 3655690 3325812 2984814 2660167
42424 2660167 2581396 2761930 2940939 3031678 3294650 3926563 4733781 5358704 5634146 5589978
42414 5589978 5292936 4833901 4356677 3955522 3582416 3120530 2521151 1871350 1379457
42405 1379457 1239217 1402979 1560052 1492443 1372747 1500032 1820914 2014209 2027689 2143634
42395 2143634 2409777 2421314 1938514 1385377 1348271 1776615 2094998 2020068 1843688 1884697
42385 1884697 2067286 2185068 2247831 2337071 2347279 2142665 1874643 1915385 2479676 3421328
42375 3421328 4342584 4798957 4514750 3618728 2665659 2221425 2335168 2523059 2337328
42366 2337328 1863005 1576343 1778786 2279420 2648023 2701300 2657509 2806089 3127145 3360671
42356 3360671 3417507 3517314 3819630 4111735 4089634 3847224 3798204 4103776 4468953 4602821
42346 4602821 4596588 4643510 4613074 4207167 3451822 2739007 2359787 2228894 2141054 2115557
42336 2115557 2357463 2941152 3616801 3951530 3707522 3113521 2671054 2599340 2574249 2165323
42326 2165323 1430952 851057 697297 723694 542121 97768 -319625 -385171 6065 644420
42316 644420 1116538 1173943 1038516 1161322 1638358 2100136 2260726 2296685 2514790 2910945
42306 2910945 3295195 3618094 3872915 3865343 3456510 2954196 2874865 3271685 3604483 3363804
42296 3363804 2597892 1756071 1223874 1095769 1226056 1394724 1500499 1602166 1710159
42287 1710159 1668932 1438274 1335442 1657209 2143876 2257533 2018734 2058329 2655080 3233934
42277 3233934 3179500 2721409 2524281 2702543 2820252 2717913 2709381 2906924 2926531 2482075
42267 2482075 1836487 1384338 1105567 731333 232371 -148079 -220991 15897 463134 939842
42257 939842 1221391 1243813 1185298 1193893 1167619 997240 879147 1107173 1618236 2027789
42247 2027789 2110011 1982765 1811945 1623315 1476441 1533769 1800925 2021394 2004973 1880464
42237 1880464 1841634 1816552 1620147 1306336 1094107 997428 821943 567371 546675 945369
42227 945369 1460182 1614806 1379959 1251497 1644463 2369393 2854417 2812486 2499587 2294780
42217 2294780 2251490 2232420 2314603 2748306 3507612 4169557 4345677 4008868 3288301 2226128
42207 2226128 978166 25528 -178344 270319 835361 1155194 1303021 1467467 1672403
42198 1672403 1862598 1997232 1969860 1678810 1292159 1216659 1637304 2238095 2526351 2328909
42188 2328909 1872712 1501402 1410958 1549045 1689969 1711092 1816804 2303884 3053242 3493507
42178 3493507 3202454 2346427 1404882 697534 334694 335291 507670 442400 -34659 -547900
42168 -547900 -635134 -384701 -239469 -268208 -70537 578182 1400669 2022624 2339437 2376032
42158 2376032 2154530 1870745 1851149 2096245 2166350 1802097 1397198 1502171 2024693 2305179
42148 2305179 1933386 1140930 383522 -102651 -228396 99046 767104 1292738 1218312 684310
42138 684310 335901 558544 1023850 1169477 954805 851807 1130984 1491080 1515394 1219696
42128 1219696 934680 842839 895157 1069373 1427381 1935111 2434339 2767961 2780714 2336994
42118 2336994 1613027 1239170 1734490 2778967 3451389 3288722 2724964 2351478 2196174
42109 2196174 2027286 1958034 2261586 2765017 2910781 2450414 1758533 1395716 1555452 1959907
42099 1959907 2149589 1886731 1384208 1078914 1103628 1145907 956934 745883 795257 921351
42089 921351 739256 351604 284960 693951 1085801 1003387 605207 341899 366968 538267
42079 538267 763734 1034617 1249621 1296113 1256671 1315580 1498128 1678711 1782844 1788780
42069 1788780 1599395 1163875 722168 652366 971763 1209632 942264 312021 -163826 -200821
42059 -200821 40512 293997 478730 588326 538828 322174 170742 335994 749680 1121545
42049 1121545 1354773 1614958 1949413 2135763 2077766 2095831 2542823 3275134 3816626 3991719
42039 3991719 4072292 4273068 4448832 4457475 4540640 5049193 5899672 6585899 6743741 6487254
42029 6487254 6130744 5795576 5456444 5220661 5268352 5477771 5382308 4698221 3740942 3077119
42019 3077119 2857450 2787129 2718255 2873494 3342060 3730374 3618190 3118792 2650870 2330897
42009 2330897 1973033 1594905 1491021 1743967 2012933 1937234 1512031 975285 544509 351023
41999 351023 430605 687917 1014880 1446282 2006659 2456154 2495857 2224312 2023545 1939790
41989 1939790 1612181 973415 552254 759964 1250470 1375208 996961 480388 145371
41980 145371 148449 652710 1600219 2461039 2736582 2648069 2815526 3309364 3611261 3558268
41970 3558268 3667945 4297080 5084371 5609400 6103668 7014917 8213738 9153437 9594207
41961 9594207 9655026 9291593 8281853 6766931 5346751 4502816 4216506 4198898 4177065
41952 4177065 3912001 3313068 2681721 2515775 2885828 3281966 3257854 2930328 2616159 2307142
41942 2307142 1874194 1532677 1607380 1916304 1893012 1394649 943903 1005942 1419935 1785871
41932 1785871 2055951 2387567 2658380 2561521 2113469 1689858 1532754 1526640 1511638 1536209
41922 1536209 1697836 1957615 2226115 2459882 2594258 2576187 2559866 2849185 3476150 4010796
41912 4010796 3996869 3468380 2843167 2401365 2095747 1840787 1739651 1931771 2345128 2700003
41902 2700003 2737927 2438216 2040941 1840065 1911437 2058681 2048089 1859520 1694454 1799647
41892 1799647 2283187 2998648 3604710 3893082 4078819 4542617 5213537 5523836 5207292
41883 5207292 4835293 5151864 6046824 6672595 6555551 6091312 5824673 5725950 5460897 5005973
41873 5005973 4619117 4405495 4267867 4187360 4249064 4431158 4612674 4760926 4911533 5020791
41863 5020791 5057604 5194464 5664247 6434224 7254551 8030856 8878776 9737739 10198345 9890437
41853 9890437 8893676 7617385 6390805 5302165 4327003 3451338 2711562 2214807 2053086
41844 2053086 2109794 2071051 1783974 1503624 1579284 1952960 2208404 2113693 1854903 1683757
41834 1683757 1629865 1702982 2065643 2706744 3162938 2968630 2332010 1983899 2315104 3010964
41824 3010964 3616804 4074327 4487868 4705169 4471692 3820199 3010713 2221902 1566716
41815 1566716 1245002 1340434 1564604 1541720 1278113 1018794 748053 274384 -235924 -356724
41805 -356724 -139057 -192295 -769380 -1278916 -1096072 -434987 78746 393082 1002747 2058557
41795 2058557 3068497 3554051 3592079 3599505 3870980 4395162 4887679 4977253 4566416 3972239
41785 3972239 3495530 2984027 2170222 1329462 1110476 1656997 2368011 2684432 2695222 2762566
41775 2762566 2943191 3064632 3074064 3024031 2924802 2816902 2758294 2584714 2007287 1153647
41765 1153647 628891 735113 1012137 936253 688988 733447 976412 984321 793167 782821
41755 782821 852652 503333 -205087 -565961 -316699 -77751 -352498 -771235 -805715 -619975
41745 -619975 -590914 -477149 178900 1100063 1500950 1192006 767692 669794 712477 662200
41735 662200 670582 859231 961358 712596 259285 -124450 -443756 -807625 -1081921 -1043070
41725 -1043070 -744887 -452549 -284521 -135299 105816 428933 738279 893265 805871 592944
41715 592944 490400 509181 372017 -44371 -425526 -425661 -163281 9887 92457 391319
41705 391319 930887 1322737 1328878 1203501 1286882 1515543 1545818 1189746 539226 -195406
41695 -195406 -766532 -914366 -545636 101435 618099 782451 680614 487763 247283 -70059
41685 -70059 -357947 -371747 -38741 292220 125074 -555541 -1113301 -925521 -111863 635316
41675 635316 860970 702560 505276 472094 740781 1377109 2104571 2423938 2261729 2157488
41665 2157488 2504420 2953100 2968747 2657679 2518017 2604871 2566011 2397746 2469096 2736394
41655 2736394 2649615 2088114 1735525 2122777 2848675 3256823 3432847 3907250 4666987 5159708
41645 5159708 5195818 5196499 5475232 5826923 5978134 5961909 5835191 5447109 4772780 4153140
41635 4153140 3882146 3770866 3429782 2848370 2410129 2400738 2745698 3211862 3658825 4059578
41625 4059578 4408342 4656772 4708108 4510132 4190431 4014879 4128037 4389933 4534679 4427269
41615 4427269 4112273 3706420 3335967 3116871 3112840 3329005 3721608 4101613 4089918 3457961
41605 3457961 2604531 2365405 3079509 4068976 4368930 3817573 3074566 2702330 2701778 2951130
41595 2951130 3550169 4471459 5275554 5556340 5478667 5550026 5971901 6495490 6821187 6837676
41585 6837676 6505139 5829387 5028320 4457243 4218757 4014258 3526678 2825578 2239150
41576 2239150 1913323 1683877 1384729 1124672 1185792 1716921 2574984 3417616 3918435 3957355
41566 3957355 3668792 3277234 2844747 2235636 1393282 563995 91438 12256 41007 -8838
41556 -8838 369 218187 472730 474071 238923 56515 57666 66852 -75941 -270920 -336509
41545 -336509 -265355 -182848 -160365 -180051 -214631 -250783 -265022 -216017 -32188 364971 925700
41534 925700 1378703 1425364 1071215 642145 428112 424506 458115 439060 435759 596885 1007435
41523 1007435 1519883 1797825 1732779 1746251 2349178 3385247 4103529 4101366 3778355 3637823
41513 3637823 3582112 3272821 2802928 2501122 2318164 1960823 1499948 1280757 1269063 1056440
41503 1056440 583024 324799 614443 1234132 1834596 2304592 2552859 2420629 2089562
41494 2089562 2107562 2632287 3050433 2792077 2183294 1959736 2165018 2137806 1545628 851580
41484 851580 626131 848367 1094742 1091118 854906 531010 324101 449286 926231 1466713
41474 1466713 1720765 1632034 1461697 1469820 1656098 1850708 2005565 2277785 2746883 3144409
41464 3144409 3065907 2474649 1780093 1322755 1015752 679726 488511 739818 1288431 1593982
41454 1593982 1384236 959617 737793 772472 879198 998583 1198447 1438607 1565207 1517920
41444 1517920 1380099 1214696 972611 605242 206409 -7598 116100 473578 723096
41435 723096 590208 182164 -101612 -45602 85335 -147839 -794764 -1413848 -1567689 -1272826
41425 -1272826 -855189 -490135 -89821 383340 736600 778928 547157 171220 -298568 -746632
41415 -746632 -887037 -619578 -352396 -562831 -1070074 -1196564 -715312 -144106 73382 146267
41405 146267 375601 551159 430434 384632 877583 1557029 1636774 1115560 822857 1144758
41395 1144758 1484364 1271884 785569 515094 333020 -85707 -466602 -268851 396380
41386 396380 849942 798367 618083 646251 723933 600005 358838 225083 239356 328633
41376 328633 481207 684765 865394 1023549 1274333 1636797 1934231 2019849 1964829 1905821
41366 1905821 1826404 1612354 1238042 799138 431776 267619 378553 684363 979316 1096061
41356 1096061 971020 559994 -125534 -828266 -1110509 -805688 -281591 -51148 -202114
41347 -202114 -423566 -533685 -701157 -1083508 -1490817 -1572724 -1220470 -644661 -126683 187516
41337 187516 300015 297820 283469 292205 271943 183075 84068 56468 79616 67474 25374 81303
41325 81303 326790 676687 927630 955215 853508 862677 1101492 1370357 1335941 974382
41315 974382 677050 744410 896043 559585 -359670 -1283208 -1610044 -1298375 -679904 8365
41305 8365 662339 1119380 1282415 1356762 1648466 2131956 2478795 2511721 2353962 2092165
41295 2092165 1590462 781359 -80813 -639507 -786273 -659712 -418102 -168795 -40020
41286 -40020 -134563 -381662 -543755 -442411 -158192 52438 68277 63468 244015 473449
41276 473449 392623 -24446 -325783 -207009 -8945 -228993 -719028 -839048 -373125 196894
41266 196894 419378 404657 436022 475509 359934 180412 141236 239242 351098 470065
41256 470065 635337 804606 981968 1238403 1406633 1073310 199197 -541488 -467922 248189
41246 248189 861626 1032122 1026490 1026897 823311 326200 -108266 -131417 137790 362384 479230
41235 479230 694661 1098983 1479475 1510719 1077364 428032 -36197 -198548 -338931 -661458
41225 -661458 -879244 -574734 117817 579043 488815 174226 72197 200872 334570 374123
41215 374123 301358 31194 -405270 -713720 -661212 -439467 -445771 -769787 -1134217 -1304070
41205 -1304070 -1319109 -1303891 -1255861 -1106059 -864765 -609450 -369083 -83218 313698 776132
41195 776132 1133199 1221195 1039448 765109 630219 789265 1233584 1764572 2108878 2158871
41185 2158871 2067546 2023041 1990805 1798654 1422928 1041393 824705 812565 969154 1207623
41175 1207623 1362136 1272718 911988 360459 -263314 -745305 -801746 -376721 192371 542254
41165 542254 718637 990860 1357610 1573342 1585935 1574873 1601540 1619457 1786397 2286075
41155 2286075 2820168 2814044 2238763 1680698 1425695 1075355 362415 -270172 -358476 -160700
41145 -160700 -171201 -322269 -255304 -20263 142889 428219 1143109 1916379 1970311 1191960
41135 1191960 279696 -226200 -428013 -504316 -335956 57877 291708 160365 -20487 72468
41125 72468 302882 418045 480809 613112 640911 392929 108712 138134 389010 460779
41115 460779 235357 -25746 -126971 -139227 -151361 -135686 -108088 -132797 -84171 306128 991666
41104 991666 1443211 1211523 543526 143238 329402 731696 908983 936655 1110067 1314338
41094 1314338 1122180 467083 -226639 -665584 -997280 -1306174 -1248772 -564982 368591 937587
41084 937587 1041130 1019035 1005632 842235 539048 307963 126009 -253918 -808431 -1223433
41074 -1223433 -1426675 -1636040 -1761437 -1322574 -236081 809153 1128808 815979 390434
41065 390434 58248 -250185 -428119 -305698 -61227 -38859 -209189 -209671 108422 530529
41055 530529 858777 1106228 1300449 1393338 1397687 1365528 1227105 896085 526997 403840
41045 403840 546985 667278 538081 203465 -173417 -428339 -375193 40731 521179 632056
41035 632056 336871 65846 159106 489461 742726 796776 657562 290681 -231226 -610727
41025 -610727 -645417 -561464 -758338 -1268580 -1713713 -1783137 -1537000 -1227139 -1029458 -990834
41015 -990834 -1044429 -1010283 -747117 -370027 -149235 -118349 12168 404562 753501 639182
41005 639182 111832 -349414 -432470 -273959 -116527 30576 267119 573684 879124 1184711
40995 1184711 1457437 1561601 1473237 1398939 1474063 1510915 1311529 1075840 1146722 1423283
40985 1423283 1426351 984080 476800 296488 415296 649283 1007000 1515633 1946212 2007325
40975 2007325 1700183 1283481 999264 978993 1252287 1661009 1906361 1852714 1639524 1358953
40965 1358953 869838 164491 -346091 -284642 116721 304977 196450 241450 668622 1105057
40955 1105057 1132931 895620 887898 1312230 1868388 2113492 1876991 1345458 842017 553787
40945 553787 468519 526712 692650 817994 643144 145365 -267332 -204614 137554 183461
40935 183461 -253116 -746865 -860937 -611594 -200526 358652 1087359 1765218 2102126 2062830
40925 2062830 1806072 1441862 1074643 943062 1218519 1697716 1945901 1758631 1300572
40916 1300572 816938 422856 167089 47566 -102285 -498238 -1038106 -1252586 -828991
40907 -828991 -61451 452791 512497 454259 574403 704987 554868 252390 216591 523927
40897 523927 742398 517845 56500 -189387 -127847 -50074 -151575 -334144 -481312 -627381
40887 -627381 -745551 -609380 -45972 801312 1610879 2185703 2483397 2443654 1985151 1194836
40877 1194836 387103 -103154 -173627 -1266 144696 153085 156808 357068 763583 1150768
40867 1150768 1280979 1126855 866360 713761 763348 927123 1000046 857646 623491 567366
40857 567366 790373 1085144 1176129 1037415 887252 906309 1060011 1199298 1240382 1189540
40847 1189540 1039769 735521 289980 -99185 -153955 192880 657903 863769 744652 591397
40837 591397 648526 790547 742438 562501 676889 1323659 2138598 2532781 2432598 2351707
40827 2351707 2639511 2962934 2789164 2156469 1585865 1318483 1070828 592081 40481
40818 40481 -347632 -580507 -698003 -615057 -449321 -617667 -1219747 -1665631 -1403924 -757840
40808 -757840 -475096 -627716 -605276 -151223 287842 366821 344817 529113 771584 841151
40798 841151 835732 890652 895568 841327 1026973 1523075 1832691 1565350 1095331 991717 1078453
40787 1078453 722909 -77185 -611366 -531717 -355810 -643157 -1174602 -1305762 -822443 -100824
40777 -100824 408154 562907 486078 376106 376309 508584 708557 941758 1249391 1667263
40767 1667263 2134483 2481104 2513301 2209056 1863295 1864119 2196828 2362241 2007945 1459892
40757 1459892 1301410 1538260 1597943 1182771 703645 699815 1156512 1624432 1783016 1657745
40747 1657745 1452901 1395714 1634376 2092287 2490603 2650188 2674411 2705606 2638920 2272802
40737 2272802 1649567 1026303 546581 164463 -89113 8910 595152 1429757 2001203 1915289
40727 1915289 1179595 187154 -537884 -669496 -274600 296601 739947 1004692 1177003
40718 1177003 1269904 1258076 1269487 1535098 2066011 2542261 2656789 2441510 2094049 1630694
40708 1630694 977337 319885 11437 80432 166966 80275 101894 519464 1123382 1435257
40698 1435257 1253687 734335 120322 -343438 -424870 -153726 97589 103198 177819 687943
40688 687943 1335757 1455575 991686 618917 784417 1167426 1298773 1199667 1068352 776036
40678 776036 146269 -523481 -698186 -279855 309903 665942 728795 648763 614403 782765
40668 782765 1115671 1308622 1133190 824163 844800 1242893 1537040 1365619 1008629 1057456
40658 1057456 1673978 2374095 2556157 2134923 1610001 1547245 2031396 2625100 2817425 2466485
40648 2466485 1840518 1331644 1164512 1297977 1528309 1688028 1750873 1737529 1598333 1303756
40638 1303756 1002500 915581 1064105 1284789 1544669 2007531 2673448 3177432 3158942 2711058
40628 2711058 2268684 2125592 2218533 2301713 2160722 1723392 1145333 754754 749583 968093
40618 968093 1093344 1038658 978187 1047982 1207301 1373850 1480164 1370736 885392 175253
40608 175253 -252250 -28149 580515 872434 480809 -198135 -484737 -253275 -65815 -391874
40598 -391874 -926533 -951901 -286007 465536 669793 361643 -5809 -240381 -522387 -933147
40588 -933147 -1202213 -1029160 -500530 -55809 -36035 -313366 -447393 -254100 -85949 -360934
40578 -360934 -930202 -1250079 -1170713 -1116810 -1341301 -1471494 -1124994 -569776 -311163 -322217
40568 -322217 -216332 24106 93831 47767 292833 836797 1163099 1031131 829741 874716
40558 874716 910549 708934 684863 1360274 2469859 3152514 2964797 2272404 1669140 1417967
40548 1417967 1508097 1873786 2365548 2718828 2743656 2492972 2178041 1966806 1882819 1847853
40538 1847853 1810747 1839179 2019139 2234545 2168627 1638395 860814 284590 204362 590692
40528 590692 1174058 1580754 1519289 1033650 536124 424335 668589 889906 809557 493594
40518 493594 183535 30473 14839 30121 16668 40029 208097 508702 830703 1154490
40508 1154490 1531399 1806260 1636841 1007972 476313 558933 1030463 1218295 915754 567723
40498 567723 546660 711703 793915 756635 582385 175758 -207014 113372 1393290 2852718
40488 2852718 3457604 3145313 2711169 2586124 2406572 1900823 1508222 1734360 2380195
40479 2380195 2878054 3066909 3152866 3133914 2810508 2303713 2042956 2158582 2312306 2261486
40469 2261486 2205153 2366927 2567249 2495943 2187679 1920897 1769148 1559089 1266375 1215059
40459 1215059 1797414 3056166 4528170 5482051 5450445 4645137 3731246 3081979 2436429
40450 2436429 1473982 485325 92252 400840 883777 1152944 1382431 1759597 1960394
40441 1960394 1584226 853664 398151 403099 418484 70816 -447158 -775266 -923156 -1107800
40431 -1107800 -1278970 -1182031 -837011 -596175 -645429 -741941 -612861 -385571 -373051 -559287
40421 -559287 -596734 -324572 -15803 14888 -147429 -161647 73889 276275 156769 -193565
40411 -193565 -382576 -141284 392082 821191 893908 715332 557744 536685 559237 542650
40401 542650 535649 587304 621819 524322 281381 -13168 -219481 -197057 84905 419770 482003
40390 482003 182423 -196078 -317170 -138721 157028 441217 692488 888936 1026911 1171113
40380 1171113 1318917 1292630 943032 393613 -84269 -356616 -419709 -245392 111863 360824
40370 360824 245806 -56016 -117236 166307 499853 687205 827605 939265 795901 353215
40360 353215 6081 121130 508184 640862 319348 -87458 -27830 688225 1656532 2180802
40350 2180802 1956911 1440336 1309384 1604412 1759629 1515630 1316326 1598706 2167942
40341 2167942 2614685 2914118 3158768 3085415 2474729 1800358 1814432 2505731 3059549 2926053
40331 2926053 2391361 1949734 1634836 1254025 883206 771436 970983 1342063 1766941
40322 1766941 2129920 2231423 1966894 1517171 1153051 882492 470833 -174134 -780365
40313 -780365 -951661 -582207 39942 555134 885302 1186924 1523847 1779985 1919565 2094544
40303 2094544 2358394 2481641 2245407 1754242 1261727 856966 541555 420449 531285
40294 531285 654620 605594 545493 659323 718310 399630 -126416 -447876 -618658 -990884
40284 -990884 -1390075 -1205189 -445997 45154 -237573 -766757 -885868 -770545 -914573 -1196036
40274 -1196036 -1159797 -875582 -789844 -923620 -906217 -702879 -650484 -795486 -829688 -733639
40264 -733639 -875415 -1332144 -1666592 -1587947 -1358007 -1291440 -1262407 -995553 -527051 -91582
40254 -91582 201103 320657 171380 -228306 -564843 -490216 -24892 449910 567091 274486
40244 274486 -158667 -388439 -328131 -223186 -286825 -352442 -121030 316453 544450 435427
40234 435427 330822 500973 775140 868688 744849 463768 10532 -494876 -752668 -724878
40224 -724878 -788473 -1120695 -1275239 -798752 26307 565930 734778 923685 1157094 995776
40214 995776 343096 -282396 -488837 -507344 -693441 -986400 -1161956 -1228281 -1234639 -1019491
40204 -1019491 -517911 -66363 -37621 -356664 -688147 -900053 -1022445 -980088 -771029 -729439
40194 -729439 -1144955 -1706416 -1789467 -1279260 -658323 -272831 -12038 188249 65770 -462414
40184 -462414 -936177 -865815 -349282 153448 450129 679258 891063 923959 676782 241216
40174 241216 -241192 -672123 -974095 -1131495 -1206660 -1180633 -877219 -232391 439413 668983
40164 668983 326566 -237470 -507088 -163449 727787 1707558 2217311 2119149 1841919 1827050
40154 1827050 1989971 2003196 1923395 2089705 2446455 2478440 1962000 1349183 1169862 1387236
40144 1387236 1604011 1619213 1481158 1213685 829248 497126 397002 456590 467540 402041
40134 402041 392025 451039 452811 366436 283677 192155 -62541 -504807 -870828 -848669 -446435
40123 -446435 -50681 -75079 -526830 -973406 -1038089 -875716 -954244 -1357199 -1601915 -1305987
40113 -1305987 -743362 -444365 -446602 -322397 121169 555267 594689 242003 -227259 -572313
40103 -572313 -672314 -519311 -256510 -76058 6909 135436 322326 384783 256211 136751
40093 136751 165135 130556 -254094 -890062 -1338214 -1314786 -969703 -667458 -630359 -804481
40083 -804481 -948896 -832549 -445406 -35386 154396 188762 361442 778291 1151654 1107803
40073 1107803 615057 984 -387734 -416793 -121155 366960 810769 981173 891935 791208
40063 791208 804697 739075 415139 41371 -37005 91517 -70499 -750867 -1557778 -1971736
40053 -1971736 -1932911 -1719597 -1455716 -1042588 -493192 -41062 113892 -13744 -280806 -531151
40043 -531151 -616131 -441491 -47459 399994 682784 592848 55203 -709678 -1261891 -1316674
40033 -1316674 -982425 -571543 -328064 -406724 -841063 -1319528 -1275431 -548047 241747 363075
40023 363075 -136804 -649739 -951257 -1329974 -1776431 -1741493 -993438 -164698 -14161 -494212
40013 -494212 -955933 -1011266 -777004 -449722 -65228 370115 828277 1313145 1739034 1847307
40003 1847307 1495958 950363 621179 561664 471822 161585 -238403 -515295 -592059 -494058
39993 -494058 -292555 -100477 26656 174640 420976 658863 738093 714224 750992 825221
39983 825221 769404 599202 540605 672111 767399 608125 300097 165240 405803 941005
39973 941005 1499820 1827482 1861028 1739219 1629441 1585670 1605245 1716378 1899568 2008424
39963 2008424 1904937 1624268 1312592 1096749 1102087 1411394 1823371 1861202 1320220 659119
39953 659119 496444 817285 1068081 968879 762389 637081 433785 99817 -59690 122908
39943 122908 333765 262731 86306 96815 160927 -13556 -302856 -338273 -116742 30628
39933 30628 1442 -26867 -78457 -378760 -777830 -708588 17691 798505 967102 626318
39923 626318 380904 460450 547353 404069 228144 274691 456724 529777 487309 543939 786412
39912 786412 1038501 1104902 1012813 928349 907955 845499 663884 458773 400346 545666 794279
39901 794279 987202 1016394 901645 812862 940522 1264037 1523647 1518645 1340591 1171363
39891 1171363 959294 531499 -19656 -365321 -420961 -500220 -819243 -1095049 -888490 -197977
39881 -197977 544403 980802 1082793 953912 658486 303156 73630 66853 168084 158087
39871 158087 -77426 -415151 -544172 -263619 186845 267663 -211593 -764986 -822522 -484001
39861 -484001 -308235 -472968 -650963 -730526 -1055413 -1712129 -2128571 -1789696 -940963 -132430
39851 -132430 566602 1347627 1947178 1832762 1036463 174677 -390751 -806971 -1069445 -790552
39841 -790552 74299 855823 970759 672155 534508 538083 221935 -447802 -957293 -995803
39831 -995803 -823034 -771001 -786618 -663114 -429229 -277078 -282001 -401110 -632155 -967135
39821 -967135 -1236298 -1205899 -891028 -633471 -747617 -1145948 -1459058 -1521680 -1540107 -1676410
39811 -1676410 -1697103 -1310543 -716865 -431720 -547592 -588218 -249333 128996 129064 -55431
39801 -55431 56877 411776 427049 -161674 -896379 -1186286 -1000132 -779169 -844382 -1087002
39791 -1087002 -1192023 -1033834 -803799 -746384 -828006 -805679 -638188 -598922 -834511 -1040419
39781 -1040419 -831885 -273118 251857 549885 658652 513862 45619 -395008 -228985
39772 -228985 532957 1091414 790692 -26651 -424437 25417 832226 1186060 718166 -293510
39762 -293510 -1249120 -1712857 -1700998 -1552332 -1522956 -1553226 -1424514 -1045084 -560095 -272453
39752 -272453 -442838 -1018352 -1546710 -1540710 -991451 -372482 -96325 -144981 -285983 -424981
39742 -424981 -606172 -830776 -1025085 -1091311 -923018 -520012 -149954 -185467 -649271 -1106700
39732 -1106700 -1162722 -901280 -677976 -651580 -719097 -780243 -847218 -955842 -1136272 -1424297
39722 -1424297 -1780242 -2049483 -2074238 -1761179 -1038657 27784 1004191 1281129 732259
39713 732259 -40671 -378823 -300946 -307663 -647886 -1117242 -1453534 -1556100 -1365137 -906325
39703 -906325 -487609 -494346 -871713 -1092122 -794593 -259520 -81072 -473080 -1036874 -1195236
39693 -1195236 -788281 -202694 122777 253863 633486 1378216 2001529 2027936 1599961 1170943
39683 1170943 848685 476040 195246 370203 898747 1121073 622670 -244865 -865444
39674 -865444 -1074528 -1140810 -1288826 -1504807 -1659552 -1597814 -1207097 -567525 43735 396393
39664 396393 453489 238687 -232383 -783989 -1082272 -1005990 -846983 -928842 -1150388 -1122826
39654 -1122826 -678583 -44001 439731 582716 368336 -103777 -659360 -1129894 -1412958
39645 -1412958 -1439432 -1170257 -697395 -244512 46187 242161 417857 434229 115971 -398856
39635 -398856 -718873 -665907 -491699 -509225 -652285 -597226 -280417 -63492 -278974 -777398
39625 -777398 -1120385 -1146784 -1108874 -1236599 -1423189 -1437991 -1204172 -709272 107899 1131592
39615 1131592 1934060 2176787 2017439 1815087 1571444 1042158 313654 -172398 -192792 49745
39605 49745 310388 476314 338279 -289716 -1076168 -1334308 -957460 -707881 -1200475 -2015337
39595 -2015337 -2272049 -1774323 -1112689 -852491 -1079592 -1592140 -2093146 -2273005 -2075017
39586 -2075017 -1807066 -1699445 -1525272 -996727 -309409 142781 372683 587657 566980 -69154
39576 -69154 -1010408 -1419790 -1093337 -744436 -838960 -832217 -66954 1095740 1684026 1379652
39566 1379652 761655 387158 191057 -134601 -617874 -1057118 -1324622 -1419884 -1344346 -1077737
39556 -1077737 -658757 -218112 89548 195014 154746 65300 -34718 -135347 -194883 -217756
39546 -217756 -333007 -635725 -987919 -1165112 -1165878 -1132087 -975533 -422390 452158 1053439
39536 1053439 867550 41944 -833238 -1359738 -1564269 -1666256 -1830529 -2051600 -2124331 -1836460
39526 -1836460 -1301256 -922193 -886324 -908957 -677431 -322490 -188720 -334769 -559639 -752818
39516 -752818 -885090 -798932 -394427 49044 114500 -224503 -674222 -1154475 -1810486 -2468536
39506 -2468536 -2586578 -1945548 -997002 -296033 78986 315930 423386 313261 76533
39497 76533 -162711 -505727 -1079610 -1695927 -1998026 -1874219 -1488638 -1011633 -584890 -439976
39487 -439976 -707828 -1123574 -1246060 -1024552 -865703 -1060799 -1421137 -1613341 -1609185 -1603197
39477 -1603197 -1659921 -1685292 -1670902 -1724488 -1832047 -1784208 -1443882 -971687 -644247 -496891
39467 -496891 -330476 -121968 -209829 -839000 -1628840 -1842585 -1281006 -601653 -529587 -978616
39457 -978616 -1250842 -967012 -452016 -212398 -341459 -508280 -315356 373135 1249448 1686372
39447 1686372 1281373 332267 -439563 -657207 -528050 -328920 -43079 363636 710150
39438 710150 895993 1083999 1290313 1143767 469372 -184238 -143796 410671 650588 268383
39428 268383 -162173 -143628 6559 -274495 -903089 -1278567 -1103718 -661156 -331564 -187774
39418 -187774 -123068 -130860 -304842 -625527 -860889 -771198 -445806 -312410 -644153 -1138694
39408 -1138694 -1236723 -833700 -369891 -187770 -176644 -174270 -284566 -514244 -494480 5807
39398 5807 566961 595498 129631 -318376 -565073 -816053 -979146 -604140 311663 1068437
39388 1068437 1141189 826202 642996 542358 195689 -274993 -448292 -325518 -330047 -612472
39378 -612472 -874985 -932402 -946480 -971923 -752834 -219193 216382 182967 -123641 -277188
39368 -277188 -237091 -245867 -287990 -99175 314148 577717 448601 92010 -219246 -379876
39358 -379876 -335389 -14450 455192 747957 756635 744929 866650 826112 338614 -325375
39348 -325375 -673673 -702281 -798334 -1014345 -973522 -555081 -140160 7372 108583 339880
39338 339880 401860 25195 -458783 -546712 -326635 -296165 -547504 -665500 -429932 -117754
39328 -117754 -14206 -64075 -160175 -381649 -718424 -865237 -558534 49637 538473 602850
39318 602850 189611 -552566 -1323050 -1839011 -2072445 -2168235 -2100368 -1690146 -1047881 -622477
39308 -622477 -586545 -524280 -52710 566453 855852 896393 1123903 1470229 1327307 476162
39298 476162 -484072 -883803 -759224 -590945 -581165 -539855 -310219 36282 381442 680313
39288 680313 891763 951367 822198 491555 -31733 -642066 -1140527 -1393578 -1403450 -1182541
39278 -1182541 -733666 -245915 -72276 -303297 -558318 -460152 -148421 -19331 -125624 -236937
39268 -236937 -375153 -761897 -1208242 -1149799 -521005 -57231 -342337 -994885 -1284110 -1198556
39258 -1198556 -1298961 -1716799 -1980559 -1836798 -1601919 -1548775 -1505338 -1302939 -1137157 -1179467
39248 -1179467 -1242335 -1168410 -1186503 -1494539 -1803119 -1735400 -1442650 -1345310 -1419921 -1249862
39238 -1249862 -734887 -263119 -137653 -264408 -483777 -792334 -1100088 -1163125 -976701 -927110
39228 -927110 -1303233 -1866535 -2118123 -1827394 -1136438 -338050 256152 410800 176279 -87495
39218 -87495 -91256 52955 40229 -185554 -395318 -432004 -410961 -548451 -921520 -1415950 -1815354
39207 -1815354 -1923887 -1675015 -1160156 -556225 -48959 193419 77780 -305124 -666709
39198 -666709 -690008 -264349 390027 814626 645867 -17809 -650055 -844593 -766074 -872412
39188 -872412 -1250745 -1489060 -1226507 -574973 71907 409580 321410 -138920 -717905 -1102526
39178 -1102526 -1213146 -1196324 -1075088 -667030 28566 639242 813049 591124 218112 -173727
39168 -173727 -484738 -518570 -233101 54959 1048 -366149 -809907 -1262613 -1740723 -2051468
39158 -2051468 -1945496 -1499983 -1053377 -812919 -770789 -889030 -1070138 -1061109 -730650 -364663
39148 -364663 -341249 -587740 -736665 -750202 -938825 -1354726 -1655563 -1680354 -1684076 -1792636
39138 -1792636 -1662960 -1004226 -121870 399433 351973 -45613 -560346 -1074294 -1415401 -1410866
39128 -1410866 -1142128 -907441 -863694 -852465 -628396 -146821 421903 871773 1082513 1012480
39118 1012480 680851 208359 -199154 -429570 -609949 -916309 -1218299 -1141189 -612076 -113439
39108 -113439 -145784 -592434 -907252 -838219 -646404 -632307 -767307 -853102 -784469 -567813
39098 -567813 -272104 -23304 100007 170774 273542 328999 254012 198404 354355 610317
39088 610317 703886 648349 647504 637597 339864 -218735 -689494 -967910 -1293143 -1660449 -1660676
39077 -1660676 -1152905 -608218 -442510 -430107 -187066 115661 -919 -579087 -1178857 -1464146
39067 -1464146 -1447725 -1219098 -781967 -183828 419734 852864 992480 867292 751618 935897
39057 935897 1277752 1259245 683932 17349 -228248 -147571 -145374 -262989 -228785 -7792
39047 -7792 143878 110176 19620 -53595 -167419 -318995 -471618 -740760 -1257044 -1851827
39037 -1851827 -2152076 -2013261 -1655481 -1368941 -1240802 -1138889 -852452 -345373 50674
39028 50674 -90840 -686510 -1092808 -887675 -410927 -244064 -472151 -828812 -1240990 -1732946
$$ [...]
##END NTUPLES=NMR SPECTRUM
##END=
