##TITLE=31Pdec_DE-87_oil_TFA
 CDCl3, 24 sc
 31.3.2025
##JCAMPDX= 6.0         $$ Bruker NMR JCAMP-DX V2.0
##DATA TYPE= NMR SPECTRUM
##DATA CLASS= NTUPLES
##ORIGIN= UXNMR, Bruker Analytische Messtechnik GmbH
##OWNER= root
$$ XWIN-NMR		Version 3.5
$$ Mon Mar 31 15:46:14 2025 Russian Standard Time (UT+4h)  she@DPX200
##.OBSERVE FREQUENCY= 81.013821
##.OBSERVE NUCLEUS= ^31P
##.ACQUISITION MODE= SIMULTANEOUS
##.ACQUISITION SCHEME= undefined
##.AVERAGES= 64
##.DIGITISER RES= 17
##SPECTROMETER/DATA SYSTEM= spect
##.PULSE SEQUENCE= zgpg30
##.SOLVENT NAME= CDCl3
##.SHIFT REFERENCE= (INTERNAL, CDCl3, 0, 198.062)
##AUDIT TRAIL= $$ (NUMBER, WHEN, WHO, WHERE, WHAT)
$$ ##TITLE= Audit trail, XWIN-NMR		Version 3.5
$$ ##JCAMPDX= 5.01
$$ ##ORIGIN= Bruker BioSpin GmbH
$$ ##OWNER= she
$$ F:/spectra/data/she/nmr/P31/2/pdata/1/auditp.txt
$$ ##AUDIT TRAIL=  $$ (NUMBER, WHEN, WHO, WHERE, WHAT)
(   1,<2025-03-31 15:44:56.31 +0400>,<she>,<DPX200>,
      <created by zg, POWCHK disabled, PULCHK disabled
       configuration hash MD5:
       00 E9 B6 7A A2 85 ED C7 34 08 36 98 17 FE 4E 26
       data hash MD5: 32K
       16 F7 09 11 CB 5E 3E DD 21 51 FE 09 21 C9 C9 74>)
(   2,<2025-03-31 15:44:58.75 +0400>,<she>,<DPX200>,
      <Start of raw data processing
       efp BC_mod = 2 LB = 1.5 FT_mod = 6 PKNL = 1 PHC0 = 1474.104 PHC1 = -92.30579 SI = 64K 
       data hash MD5: 64K
       F2 16 92 60 27 22 35 47 CE 61 CE BD 0E 46 71 63>)
(   3,<2025-03-31 15:45:32.45 +0400>,<she>,<DPX200>,
      <pk PHC0 = -116.6534 PHC1 = 359.8 
       data hash MD5: 64K
       C3 1E 39 D9 06 2B 44 27 7D F9 8A 44 00 6B 2C 9B>)
$$ ##END=
$$ 
$$ hash MD5
$$ 76 15 36 6A E4 DE 83 1F 74 EC C0 A8 AA 2E 9E B0
##$RELAX= 
##$RELAX= 
##$RELAX= 
##$RELAX= 
##$RELAX= 
##$RELAX= 
##$RELAX= 
##$RELAX= 
$$ Bruker specific parameters
$$ --------------------------
##$DU= <F:/spectra>
##$EXPNO= 2
##$NAME= <P31>
##$PROCNO= 1
##$TYPE= <nmr>
##$USER= <she>
##$AMP= (0..31)
100 100 100 100 100 100 100 100 100 100 100 100 100 100 100 100 100 100 
100 100 100 100 100 100 100 100 100 100 100 100 100 100 
##$AQSEQ= 0
##$AQ_mod= 1
##$AUNM= <au_zg>
##$AUTOPOS= <>
##$BF1= 81.014009
##$BF2= 200.13
##$BF3= 200.13
##$BF4= 200.13
##$BF5= 200.13
##$BF6= 200.13
##$BF7= 200.13
##$BF8= 200.13
##$BYTORDA= 1
##$CFDGTYP= 0
##$CFRGTYP= 5
##$CHEMSTR= <none>
##$CNST= (0..31)
1 1 145 1 1 1 1 1 1 1 1 1 1 1 1 1 1 1 1 1 1 1 1 1 1 1 1 1 1 1 1 1 
##$CPDPRG= <waltz16>
##$CPDPRG1= <>
##$CPDPRG2= <waltz16>
##$CPDPRG3= <>
##$CPDPRG4= <mlev>
##$CPDPRG5= <mlev>
##$CPDPRG6= <mlev>
##$CPDPRG7= <mlev>
##$CPDPRG8= <mlev>
##$CPDPRGB= <>
##$CPDPRGT= <>
##$D= (0..31)
0 1 0 0 0 0 0 0 0 0.06 0 0.03 2e-05 3e-06 0 0 0.0002 0 0 0 0 0 0 0 0 0 
0 0 0 0 0 0 
##$DATE= 1743421495
##$DBL= (0..7)
120 120 120 11 120 120 24 19 
##$DBP= (0..7)
150 150 150 150 150 150 150 150 
##$DBP07= 0
##$DBPNAM0= <>
##$DBPNAM1= <>
##$DBPNAM2= <>
##$DBPNAM3= <>
##$DBPNAM4= <>
##$DBPNAM5= <>
##$DBPNAM6= <>
##$DBPNAM7= <>
##$DBPOAL= (0..7)
0.5 0.5 0.5 0.5 0.5 0.5 0.5 0.5 
##$DBPOFFS= (0..7)
$$ [...]
##$SUBNAM3= <"">
##$SUBNAM4= <"">
##$SUBNAM5= <"">
##$SUBNAM6= <"">
##$SUBNAM7= <"">
##$SUBNAM8= <"">
##$SUBNAM9= <"">
##$SW= 400.765351723535
##$SWIBOX= (0..15)
0 1 3 0 0 0 0 0 0 0 0 0 0 0 0 0 
##$SW_h= 32467.5324675325
##$TD= 32768
##$TD0= 1
##$TE= 0
##$TE2= 300
##$TE3= 300
##$TEG= 300
##$TL= (0..7)
0 120 53 12 22 120 120 120 
##$TP= (0..7)
150 150 150 150 150 150 150 150 
##$TP07= 0
##$TPNAME0= <>
##$TPNAME1= <>
##$TPNAME2= <>
##$TPNAME3= <>
##$TPNAME4= <>
##$TPNAME5= <>
##$TPNAME6= <>
##$TPNAME7= <>
##$TPOAL= (0..7)
0.5 0.5 0.5 0.5 0.5 0.5 0.5 0.5 
##$TPOFFS= (0..7)
0 0 0 0 0 0 0 0 
##$TUNHIN= 0
##$TUNHOUT= 0
##$TUNXOUT= 0
##$USERA1= <user>
##$USERA2= <user>
##$USERA3= <user>
##$USERA4= <user>
##$USERA5= <user>
##$V9= 5
##$VALIST= <valist>
##$VCLIST= <CCCCCCCCCCCCCCC>
##$VD= 0
##$VDLIST= <DDDDDDDDDDDDDDD>
##$VPLIST= <PPPPPPPPPPPPPPP>
##$VTLIST= <TTTTTTTTTTTTTTT>
##$WBST= 1024
##$WBSW= 4
##$XGAIN= (0..3)
0 0 0 0 
##$XL= 0
##$YL= 0
##$YMAX_a= 5866
##$YMIN_a= -28705
##$ZGOPTNS= <>
##$ZL1= 120
##$ZL2= 120
##$ZL3= 120
##$ZL4= 120
##$ABSF1= 0
##$ABSF2= 0
##$ABSG= 0
##$ABSL= 0
##$ALPHA= 0
##$AQORDER= 0
##$ASSFAC= 0
##$ASSFACI= 0
##$ASSFACX= 0
##$ASSWID= 0
##$AUNMP= <proc_1d>
##$AZFE= 0.1
##$AZFW= 0.5
##$BCFW= 0
##$BC_mod= 2
##$BYTORDP= 0
##$COROFFS= 0
##$CY= -3
##$DATMOD= 1
##$DC= 0
##$DFILT= <>
##$DTYPP= 0
##$F1P= 0
##$F2P= 0
##$FCOR= 1
##$FTSIZE= 65536
##$FT_mod= 6
##$GAMMA= 0
##$GB= 0
##$INTBC= 1
##$INTSCL= 9.790993e-09
##$ISEN= 30
##$LB= 1.5
##$LEV0= 0
##$LPBIN= 0
##$MAXI= 10000
##$MC2= 0
##$MEAN= 0
##$ME_mod= 0
##$MI= 50
##$NCOEF= 0
##$NC_proc= -8
##$NLEV= 6
##$NOISF1= 182.463
##$NOISF2= 159.3651
##$NSP= 0
##$NTH_PI= 0
##$NZP= 0
##$OFFSET= 198.0616
##$PC= 4
##$PHC0= 1357.451
##$PHC1= 267.4942
##$PH_mod= 1
##$PKNL= yes
##$PPARMOD= 0
##$PSCAL= 0
##$PSIGN= 0
##$REVERSE= no
##$SF= 81.0140089999434
##$SI= 65536
##$SIGF1= 159.3651
##$SIGF2= -187.1042
##$SINO= 113.3802
##$SIOLD= 16384
##$SREGLST= <1H.CDCl3>
##$SSB= 0
##$STSI= 65536
##$STSR= 0
##$SW_p= 32467.5324675325
##$SYMM= 0
##$S_DEV= 0
##$TDeff= 32768
##$TDoff= 0
##$TI= <>
##$TILT= no
##$TM1= 0
##$TM2= 0
##$TOPLEV= 0
##$USERP1= <user>
##$USERP2= <user>
##$USERP3= <user>
##$USERP4= <user>
##$USERP5= <user>
##$WDW= 1
##$XDIM= 65536
##$YMAX_p= 245359865
##$YMIN_p= -150610662
$$ End of Bruker specific parameters
$$ ---------------------------------
##NTUPLES= NMR SPECTRUM
##VAR_NAME=  FREQUENCY,     SPECTRUM/REAL,   SPECTRUM/IMAG
##SYMBOL=    X,             R,               I
##VAR_TYPE=  INDEPENDENT,   DEPENDENT,       DEPENDENT
##VAR_FORM=  AFFN,          ASDF,            ASDF
##VAR_DIM=   65536,         65536,           65536
##UNITS=     HZ,            ARBITRARY UNITS, ARBITRARY UNITS
##FACTOR=    0.49542278885378, 1,            1
##FIRST=     16045.7642231865, 0,            0
##LAST=      -16421.768244346, 0,            0
##MIN=       -16421.768244346, -150610662,   0
##MAX=       16045.7642231865, 245359865,    0
$$ Real data points
##PAGE= N=1
##DATA TABLE= (X++(R..R)), XYDATA
$$ [...]
##PAGE= N=2
##DATA TABLE= (X++(I..I)), XYDATA
$$ plain form
7499 12046830 12052082 8341504 1788606 -2929274 -2829714 -268268 465556 -1410329 -2972848
7490 -2972848 -1978956 522361 2084192 1855355 884813 174744 -512658 -1713892 -2850136
7481 -2850136 -2619860 -924413 395292 -507809 -3103438 -4895874 -4387341 -2924426 -3067577
7472 -3067577 -5415511 -7645030 -6910506 -2928759 1702427 4252874 4356630 3367600 1983795
7463 1983795 -154878 -2561552 -3359876 -1687242 581776 949164 -608657 -2183738 -3056084
7454 -3056084 -4417225 -6919562 -9340142 -10335084 -10105285 -9520319 -8765797 -7776303 -7038574
7445 -7038574 -6906143 -6742457 -5712501 -4013524 -2513384 -1521568 -650818 388424 1497241
7436 1497241 2444786 2918312 2662932 2061906 2155367 3507453 5434572 6926312 7911832
$$ packed form
7499A2046830N252l710578o552898m717880R9560K561446P33824j875885j562519
7490b972848R93892K501317J561831k28837r70542p10069o87402j201234j136244
7481b850136K30276J695447J319705r03101k595629j792436N08533J462915j43151
7472c067577k347934k229519P34524L981747M631186K550447J03756r89030j383805
7463A983795k138673k406674p98324J672634K269018L67388j557821j575081q72346
7454c056084j361141k502337k420580r94942K29799N84966P54522R89494P37729
7445g038574J32431J63686J029956J698977J500140R91816Q70750J039242J108817
7436A497241R47545M73526k55380o01026R3461J352086J927119J491740R85520
$$ plain form
7427 7911832 8917701 9746809 9222021 6321182 1419172 -3321292 -4948006 -2216149 2425283
7418 2425283 4530887 2291890 -1541325 -3386804 -3132505 -2969560 -3162292 -1768547 1460202
7409 1460202 3716641 2723813 -386373 -3079590 -4640668 -5837571 -6571539 -5634604 -2427061
7400 -2427061 2276558 6959224 9955819 10074809 7678465 4686362 2593606 1066505
7392 1066505 -534042 -1138652 801659 4372099 6430145 5314918 2807902 1530280
7384 1530280 1564311 882932 -1475541 -4019379 -4713999 -3308485 -1246518 183730 837125
7375 837125 882557 -132102 -2614194 -5593282 -7046971 -5983999 -3610234 -1906737 -1476259
7366 -1476259 -1358125 -608087 660450 1659710 1607410 -30881 -3239063 -7007326 -9663041
$$ packed form
7427G911832J005869Q29108n24788k900839m902010m740464j626714K731857M641432
7418B425283K105604k238997l833215j845479K54299J62945j92732J393745L228749
7409A460202K256439r92828l110186k693217j561078j196903p33968R36935L207543
7400b427061M703619M682666K996595J18990k396344k992103k092756j527101
7392A066505j600547o04610J940311L570440K058046j115227k507016j277622
7384A530280L4031o81379k358473k543838o94620J405514K061967J430248O53395
7375H37125M5432j014659k482092k979088j453689J062972K373765J703497M30478
7366a476259J18134P50038J268537R99260n2300j638291l208182l768263k655715
$$ plain form
7357 -9663041 -10204516 -9262008 -8350540 -8090049 -7559386 -5756965 -3322927 -1942009 -1941128 -1627757
7347 -1627757 235621 2426894 3121874 2851223 3554032 5080296 5245704 3777323 3317558
7338 3317558 5103258 6399401 4577425 1494721 737541 2030530 1944749 -490676 -2613353
7329 -2613353 -2772391 -2568237 -3503760 -4635658 -5041083 -5764904 -7421279 -8279289 -6878141
7320 -6878141 -4557473 -3203530 -2326965 -830927 -6406 -1743874 -4691248 -5337542 -2812434
7311 -2812434 162346 1336173 1359535 1560609 1697934 1073447 97203 -519003 -902645
7302 -902645 -1313679 -1324064 -653786 40603 117656 19389 618255 2058386 3844234 5456752
7292 5456752 6293587 5682076 3694176 1439058 -148368 -1354535 -2858239 -4355222 -4878459
$$ packed form
7357i663041n41475R42508R11468K60491N30663J802421K434038J380918Q81L13371
7347a627757J863378K191273O94980k70651P02809J526264J65408j468381m59765
7338C317558J785700J296143j821976l082704p57180J292989q5781k435425k122677
7329b613353j59038K04154r35523j131898m05425p23821j656375q58010J401148
7320f878141K320668J353943Q76565J496038Q24521j737468k947374o46294K525108
7311b812434K974780J173827K3362K01074J37325o24487r76244o16206l83642
7302i02645m11034j0385O70278O94389P7053r8267N98866J440131J785848J612518
7292E456752Q36835o11511j987900k255118j587426j206167j503704j496983n23237
$$ plain form
7283 -4878459 -4219411 -3113252 -2025225 -657178 1018203 1978141 1156481 -890852 -2012768
7274 -2012768 -612000 2373960 4102426 2636465 -1121922 -4475966 -5547584 -4479566
7266 -4479566 -2451358 -366814 1314044 2211341 2176356 1671905 1518764 2107888 2998975
7257 2998975 3365433 2782321 1572911 509079 316780 1366426 3421532 5466649 6251743
7248 6251743 5591587 4819050 5153387 5815309 4904615 2344049 646844 1992730 5531621
7239 5531621 8508841 9258313 8115308 6191818 4524489 3904404 4221202 4247140 3222090
7230 3222090 2242635 2725406 3884404 3506968 1366657 95980 1962161 6010249 9111050
7221 9111050 8984452 5810997 1835422 -239789 518713 2194292 2032023 -274806 -2442123
$$ packed form
7283d878459O59048J106159J088027J368047J675381R59938q21660k047333j121916
7274b012768J400768K985960J728466j465961l758387l354044j071618J068018
7266d479566K028208K084544J680858Q97297l4985n04451j53141N89124Q91087
7257B998975L66458n83112j209410j063832j92299J049646K055106K045117P85094
7248F251743o60156p72537L34337O61922r10694k560566j697205J345886L538891
7239E531621K977220P49472j143005j923490j667329o20085L16798K5938j025050
7230C222090r79455M82771J158998l77436k140311j270677J866181M048088L100801
7221I111050j26598l173455l975575k075211P58502J675579j62269k306829k167317
$$ plain form
7212 -2442123 -2890982 -2558847 -2735787 -2789795 -1390195 1218201 3698510 5588445 7231764
7203 7231764 8182070 7251410 4308444 967582 -803977 -242063 1998888 4628825 6673133
7194 6673133 7907043 8321708 7404570 4752777 1516587 113472 1809928 5329084 8386494
7185 8386494 9719664 9093357 6654960 3485811 1714683 2506886 4442357 5197178 4334819
7176 4334819 3155172 2409652 1795184 1351380 1532570 1804397 901072 -1061704 -2179569
7167 -2179569 -1108773 1270055 3105145 3531583 2835842 1594399 421869 97968 1322054
7158 1322054 4313772 8440957 11857314 12153214 8621809 3725863 858261 456660 -63973
7149 -63973 -1976343 -2692453 962624 8101103 14243340 16115459 14426856 11892860 10058744
$$ packed form
7212b442123m48859L32135j76940n4008J399600K608396K480309J889935J643319
7203G231764R50306r30660k942966l340862j771559N61914K240951K629937K044308
7194F673133J233910M14665r17138k651793l236190j403115J696456L519156L057410
7185H386494J333170o26307k438397l169149j771128P92203J935471P54821q62359
7176D334819j179647p45520o14468m43804J81190K71827r03325j962776j117865
7167b179569J070796K378828J835090M26438o95741j241443j172530l23901J224086
7158A322054K991718M127185L416357K95900l531405m895946k867602m01601n20633
7149f3973j912370p16110L655077P138479O142237J872119j688603k533996j834116
$$ plain form
7140 10058744 8690667 7177858 5464755 3841204 2519902 1528996 785027 263338 90535
7131 90535 171464 -319987 -2350798 -5223506 -5968785 -2063676 4887226 9703960 9040684
7122 9040684 5178347 2904284 3544215 4334984 3381958 2308380 3043024 4685348 5479346
7113 5479346 5843154 7031553 8223343 7591431 5403342 3363230 1400324 -1974377 -6136117
7104 -6136117 -8235059 -7321045 -5804358 -5665203 -5726074 -4195031 -1657364 333848 1765852
7095 1765852 3198403 3876911 3146161 2569663 4061954 6498371 6782803 4276269 1701112
7086 1701112 1144075 1440629 630267 -851687 -1137316 -90058 322984 -1215720 -3661636
7077 -3661636 -5162046 -5358906 -5196506 -4851927 -3215250 -13662 2628257 2113841 -1418896
$$ packed form
7140A0058744j368077j512809j713103j623551j321302r90906p43969n21689j72803
7131I0535Q0929m91451k030811k872708p45279L905109O950902M816734o63276
7122I040684l862337k274063O39931P90769r53026j073578P34644J642324P93998
7113E479346L63808J188399J191790o31912k188089k040112j962906l374701m161740
7104f136117k098942R14014J516687J39155o0871J531043K537667J991212J432004
7095A765852J432551O78508p30750n76498J492291K436417K84432k506534k575157
7086A701112n57037K96554q10362j481954k85629J047258M13042j538704k445916
7077c661636j500410j96860J62400L44579J636677L201588K641919n14416l532737
$$ plain form
7068 -1418896 -5177643 -7070802 -7555155 -7801244 -7704442 -6752398 -5461170 -4501280 -3381758
7059 -3381758 -1522924 181372 577869 403851 1274085 2847910 3242951 2441377 2783515
7050 2783515 4985031 5894104 2244995 -4572588 -9662921 -10152757 -7627735 -5006176 -3035409
7041 -3035409 -926358 1007152 1225125 -591652 -2486737 -2439778 -923168 -235180 -1411574
7032 -1411574 -2875060 -2648206 -1067392 -284811 -1369044 -3105653 -4026983 -4581338 -6310987
7023 -6310987 -9301799 -11600265 -11477264 -9513477 -7822800 -7551272 -7829340 -7201585 -5439477
7014 -5439477 -3573917 -2515545 -2154577 -1784148 -1026650 -181502 252157 309401 618580
7005 618580 1384294 1424312 -948791 -5578549 -9738960 -10726569 -8786744 -6359957 -4708239
$$ packed form
7068a418896l758747j893159m84353k46089R6802R52044J291228R59890J119522
7059c381758J858834J704296L96497j74018Q70234J573825L95041q01574L42138
7050B783515K201516R09073l649109o817583n090333m89836K525022K621559J970767
7041c035409K109051J933510K17973j816777j895085M6959J516610O87988j176394
7032a411574j463486K26854J580814P82581j084233j736609r21330n54355j729649
7023f310987k990812k298466J23001J963787J690677K71528k78068O27755J762108
7014e439477J865560J058372L60968L70429P57498Q45148M33659N7244L09179
7005F18580P65714M0018k373103m629758m160411r87609J939825K426787J651718
$$ plain form
6996 -4708239 -2857621 -191262 1685247 966544 -1531045 -3171397 -2788038 -1741766 -1647585
6987 -1647585 -2374556 -2800986 -2545813 -2128986 -1915394 -1735413 -1486918 -1456199 -1837940 -2374456
6977 -2374456 -2812345 -3424006 -4545864 -5674380 -5779497 -4939004 -5012013 -7772787 -12461180
6968 -12461180 -16029768 -16101479 -13199426 -9894678 -8243174 -8256408 -8407479 -7266448 -4789395
6959 -4789395 -2179706 -563773 -118036 -582411 -1853364 -3403117 -3916491 -2726575 -1135274
6950 -1135274 -893696 -1697104 -1881492 -1453816 -2240693 -4509260 -5711178 -3866399 -384999
6941 -384999 2020398 2754537 3004233 3274464 3215884 3095511 3465359 3700062 2553837 63408
6931 63408 -2427482 -3940312 -4384026 -3733211 -1919601 594509 3027145 4772518 5210967
$$ packed form
6996d708239J850618K666359J876509p18703k497589j640352L83359J046272R4181
6987a647585p26971m26430K55173M16827K13592J79981K48495L0719l81741n36516
6977b374456m37889o11661j121858j128516j05117Q40493p3009k760774m688393
6968a2461180l568588p1711K902053L304748J651504j3234j51071J141031K477053
6959d789395K609689J615933M45737m64375j270953j549753n13374J189916J591301
6950a135274K41578q03408j84388M27676p86877k268567j201918J844779L481400
6941c84999K405397P34139K49696K70231n8580j20373L69848K34703j146225k490429
6931F3408k490890j512830m43714O50815J813610K514110K432636J745373M38449
$$ plain form
6922 5210967 4063400 2678360 3301347 5555989 5483307 510877 -6062023 -8602910 -6347083
6913 -6347083 -3692969 -3600442 -4497407 -4418035 -4335067 -5437830 -6134167 -4362089 -1032491
6904 -1032491 1227661 1629132 1559557 2198451 3404308 4359093 4122773 2206234 -525531
6895 -525531 -2385407 -3011122 -3816676 -5571193 -7030589 -6996569 -6087431 -5112132 -3411320
6886 -3411320 -660366 1212579 254385 -2302070 -3417280 -2329737 -1002304 -732929 -603453
6877 -603453 462035 2083357 3368311 3892160 3306352 1456828 -572541 -880453 1074651
6868 1074651 3676929 5064185 4972159 4271952 3664749 3480050 3932787 4672840 4427046
6859 4427046 1931964 -2578592 -7141915 -9625564 -9649996 -8815362 -8752888 -9194123 -8612221
$$ packed form
6922E210967j147567j385040O22987K254642p2682m972430o572900k540887K255827
6913f347083K654114R2527q96965P9372Q2968j102763o96337J772078L329598
6904a032491K260152M01471o9575O38894J205857R54785k36320j916539k731765
6895e25531j859876o25715q05554j754517j459396L4020R09138R75299J700812
6886c411320K750954J872945r58194k556455j115210J087543J327433K69375J29476
6877f03453J065488J621322J284954N23849n85808j849524k029369l07912J955104
6868A074651K602278J387256r2026p00207o07203j84699M52737P40053k45794
6859D427046k495082m510556m563323k483649k4432Q34634O2474m41235N81902
$$ plain form
6850 -8612221 -6578955 -4339901 -2882125 -1931870 -1569663 -3095489 -6736742 -9935280 -10116947
6841 -10116947 -8345635 -7782453 -8900739 -9076648 -7319387 -6321215 -8148508 -10348820 -8936058
6832 -8936058 -4007301 344995 1518190 1275062 2436294 4765177 5776445 4669640
6824 4669640 3551769 4470212 6563629 7100448 4829394 1357999 -741909 -362163 1809231
6815 1809231 4545478 6981603 8598958 9036616 8161476 6261457 4157168 2866241 2672634
6806 2672634 2602033 1476105 -480423 -1935833 -2568030 -3817962 -6823189 -10375795 -11773845
6797 -11773845 -9322938 -3621638 2868550 7085662 7323021 4856823 2768449 2372708
6789 2372708 1984517 155413 -1629522 -1388658 -185732 -360942 -1009622 1264754 6536907
$$ packed form
6850h612221K033266K239054J457776R50255L62207j525826l641253l198538j81667
6841a0116947J771312N63182j118286j75909J757261R98172j827293k200312J412762
6832h936058M928757M352296J173195k43128J161232K328883J011268j106805
6824D669640j117871R18443K093417N36819k271054l471395k099908L79746K171394
6815A809231K736247K436125J617355M37658q75140j900019k104289j290927j93607
6806B672634p0601j125928j956528j455410o32197j249932l005227l552606j398050
6797a1773845K450907N701300O490188M217112K37359k466198k088374l95741
6789B372708l88191j829104j784935K40864J202926j75210o48680K274376N272153
$$ plain form
6780 6536907 9794913 6770763 -620041 -6564924 -7594947 -4750452 -796026 2448279
6772 2448279 4247761 4419815 3406553 2133947 1303791 932326 586373 50625 -115506
6763 -115506 1016796 3266862 4750737 3937709 2159843 2513043 5802699 9052579 8918338
6754 8918338 5475023 1768998 621066 2647716 6260586 8564733 7342567 3396076
6746 3396076 58262 -742264 -840967 -2875375 -6211648 -7931284 -7132659 -5762572 -5220068
6737 -5220068 -4676928 -3428676 -2597898 -3202656 -4250522 -4219821 -3159417 -1900251 -396372
6728 -396372 1431086 2170502 375993 -2780050 -4457825 -3942920 -3430628 -4433569 -5475956
6719 -5475956 -4549040 -2011445 645515 3314043 6257804 7761677 5817517 2023239
$$ packed form
6780F536907L258006l024150p390804n944883j030023K844495L954426L244305
6772B448279J799482J72054j013262j272606q30156l71465l45953n35748j66131
6763a15506J132302K250066J483875q13028j777866L53200L289656L249880j34241
6754H918338l443315l706025j147932K026650L612870K304147j222166l946491
6746C396076l337814q00526r8703k034408l336273j719636P98625J370087N42504
6737e220068N43140J248252Q30778o04758j047866L0701J060404J259166J503879
6728c96372J827458P39416j794509l156043j677775N14905N12292j002941j042387
6719e475956R26916K537595K656960K668528K943761J503873j944160l794278
$$ plain form
6711 2023239 661041 3057059 5728770 5588805 4219754 4683692 6442110 6585324 4610286
6702 4610286 2443949 451492 -2646165 -5561208 -4233698 2305289 8938341 9884643
6694 9884643 5294456 180301 -1743674 -776673 1158521 2942014 4231655 4950290 5299430
6685 5299430 5399203 5029252 4435684 4712449 6280360 7725961 7552125 6427033 6047762
6676 6047762 6310621 5591063 3608960 1764074 399117 -1778595 -4601646 -5257083 -2130817
6667 -2130817 1980828 3047271 1251772 469970 2402928 4246544 3336297 1406263 1781859
6658 1781859 3935590 4032256 788531 -2343587 -2011212 610699 2324535 3002254 5282864
6649 5282864 9773365 13527930 13999820 12316805 11472079 12645506 14317238 14041541 10461884
$$ packed form
6711B023239j362198K396018K671711j39965j369051M63938J758418J43214j975038
6702D610286k166337j992457l097657k915043J327510O538987O633052R46302
6694I884643m590187n114155j923975R67001J935194J783493J289641P18635L49140
6685E299430R9773l69951n93568K76765J567911J445601j73836j125092l79271
6676F047762K62859p19558j982103j844886j364957k177712k823051o55437L126266
6667b130817M111645J066443j795499p81802J932958J843616r10247j930034L75596
6658A781859K153731R6666l243725l132118L32375K621911J713836O77719K280610
6649E282864M490501L754565M71890j683015q44726J173427J671732k75697l579657
$$ plain form
6640 10461884 4655689 46349 -271332 3148665 6581659 7469519 6859206 6943238 8144995
6631 8144995 9869162 12062657 14048539 13558569 9436860 4105742 700477 -1277334
6623 -1277334 -4435792 -8267056 -9163735 -6259903 -3733275 -5526666 -10285458 -13491184
6615 -13491184 -12765347 -9145452 -4673422 -918310 978019 865355 63764 9315 699981
6606 699981 1344738 1795855 2225796 2189849 1342220 390438 -64851 -888272 -2874191 -4484676
6596 -4484676 -3386617 -271962 1256590 -611349 -3469195 -4328897 -3843570 -4862705 -7832269
6587 -7832269 -10022337 -9373124 -7116271 -5851293 -6357836 -7265069 -7136071 -5986318 -4982486
6578 -4982486 -5150624 -6263825 -6891462 -5880084 -3723372 -1811283 -419811 1394920 3666517
$$ packed form
6640A0461884n806195m609340l17681L419997L432994Q87860o10313Q4032J201757
6631H144995J724167K193495J985882m89970m121709n331118l405265j977811
6623a277334l158458l831264q96679K903832K526628j793391m758792l205726
6615a3491184P25837L619895M472030L755112J896329j12664q01591n4449O90666
6606F99981O44757M51117M29941l5947q47629r51782m55289q23421j985919j610485
6596d484676J098059L114655J528552j867939k857846q59702M85327j019135k969564
6587g832269k190068O49213K256853J264978n06543r07233J28998J149753J003832
6578d982486j68138j113201o27637J011378K156712J912089J391472J814731K271597
$$ plain form
6569 3666517 4882999 4480774 4407771 6402245 8801428 8371952 4886400 1391795 -157944
6560 -157944 -835052 -1572475 -928182 2110729 5199819 4936311 1060629 -3566340 -6267617
6551 -6267617 -6063357 -3024456 1552497 4908190 5130492 3645378 3460747 5157521 6694029
6542 6694029 6888669 6510315 5733534 3402849 -155568 -2200107 -1075900 1333187 2321006
6533 2321006 1762259 962563 -202234 -2507911 -4665702 -4128991 -824605 2065756 1850589
6524 1850589 -504605 -1866038 -849654 692276 160358 -2324610 -3635436 -1275127
6516 -1275127 3245361 5781873 4196904 234729 -3359218 -5664405 -6701016 -5899008
6508 -5899008 -3393256 -1306680 -1317504 -1844938 -235067 2763365 3660042 1563240 -240034
$$ packed form
6569C666517J216482m02225p3003J994474K399183m29476l485552l494605j549739
6560a57944o77108p37423O44293L038911L089090k63508l875682m626969k701277
6551f267617K04260L038901M576953L355693K22302j485114j84631J696774J536508
6542F694029J94640l78354p76781k330685l558417k044539J124207K409087R87819
6533B321006n58747p99696j164797k305677k157791N36711L304386K890361k15167
6524A850589k355194j361433J016384J541930n31918k484968j310826K360309
6516a275127M520488K536512j584969l962175l593947k305187j036611Q02008
6508e899008K505752K086576j0824n27434J609871K998432Q96677k096802j803274
$$ plain form
6499 -240034 847552 3154767 3962590 3860385 5035988 6656643 5334889 248072 -5067758
6490 -5067758 -6946548 -5557476 -3577274 -2647550 -2605415 -2987417 -3536657 -3683720 -3008703
6481 -3008703 -2121982 -1968060 -2399903 -2510887 -2137254 -1689587 -560331 2617588 7600934
6472 7600934 11977433 13874468 13860192 13046206 10818001 6394102 1696272 75132 1852793
6463 1852793 3303359 1116845 -3631850 -7245329 -8050195 -7653210 -7878318 -8155044 -6706965
6454 -6706965 -3372844 52529 2317253 4233356 6686473 8060321 5718687 412490
6446 412490 -2955098 -587504 5503906 9956677 10338921 8836588 8187234 8501077 8515142
6437 8515142 7745863 6477265 5212116 4773036 5381835 5302380 2533561 -1481017 -2448761
$$ packed form
6499b40034J087586K307215Q07823j02205J175603J620655j321754n086817n315830
6490e067758j878790J389072J980202R29724M2135l82002n49240j47063O75017
6481c008703Q86721J53922m31843j10984L73633M47667J129256L177919M983346
6472G600934M376499J897035j4276q13986k228205m423899m697830j621140J777661
6463A852793J450566k186514m748695l613479q04866L96985k25108k76726J448079
6454f706965L334121L425373K264724J916103K453117J373848k341634n306197
6446D12490l367588K367594O091410M452771L82244j502333o49354L13843J4065
6437H515142p69279j268598j265149m39080O08799p9455k768819m014578r67744
$$ plain form
6428 -2448761 967822 4502366 3754166 130996 -1696880 -710560 -171200 -1736749 -2853071
6419 -2853071 -1060238 2205036 3912828 3444478 2377434 1682784 1102763 580133 451321
6410 451321 272635 -1142629 -4176426 -7665769 -9937429 -10119601 -8465419 -6043485 -4316743
6401 -4316743 -4375633 -5938815 -7264309 -6690387 -4486663 -2742741 -3122692 -5165639 -7226665
6392 -7226665 -8485257 -9100806 -8807953 -6811552 -3359286 -96339 1832836 3015628 4393159
6383 4393159 5686530 6160777 6061708 6080136 5959881 4909783 3182669 2121427 2565933
6374 2565933 3962371 5105439 5300651 4850212 4577639 4604603 3792271 1339095 -1206016
6365 -1206016 -1252172 1016725 2228751 492503 -1672237 -1128575 1117729 1878713 1191664
$$ packed form
6428b448761L416583L534544p48200l623170j827876R86320N39360j565549j116322
6419b853071J792833L265274J707792m68350j067044o94650n80021n22630j28812
6410D51321j78686j415264l033797l489343k271660j82172J654182K421934J726742
6401d316743n8890j563182j325494N73922K203724J743922l79951k042947k061026
6392g226665j258592o15549K92853J996401L452266L262947J929175J182792J377531
6383D393159J293371M74247r9069J8428j20255j050098j727114j061242M44506
6374B565933J396438J143068J95212m50439k72573K6964q12332k453176k545111
6365a206016m6156K268897J212026j736248k164740N43662K246304P60984o87049
$$ plain form
6356 1191664 2214933 5969553 9695518 11046046 10778456 10248613 9220245 7804618 7979121
6347 7979121 10902505 14432038 15620011 14680728 14352791 15736339 16605205 14129673 8308056
6338 8308056 2332118 -397531 231658 928627 -905547 -3745940 -4242524 -2216503 -595406
6329 -595406 -314209 1099684 4358091 5507333 1347732 -4811232 -6758582 -3492343 204984
6320 204984 842789 -201896 -773284 -1633184 -4082173 -6743610 -7350975 -6216467 -5445513
6311 -5445513 -5350511 -3903425 -34366 4085110 4929741 1377100 -3960145 -7267382 -7194299
6302 -7194299 -5584232 -4559405 -3934799 -2484938 -814257 -984729 -3275612 -5430759 -5906783
6293 -5906783 -5857779 -6462603 -6197825 -3267551 248687 -188327 -5485258 -10838868 -11123184
$$ packed form
6356A191664J023269L754620L725965J350528k67590n29843j028368j415627J74503
6347G979121K923384L529533J187973r39283l27937J383548Q68866k475532n821617
6338H308056n975938k729649O29189O96969j834174k840393m96584K026021J621097
6329e95406K81197J413893L258407J149242m159601o158964j947350L266239L697327
6320B04984O37805j044685n71388q59900k448989k661437o07365J134508P70954
6311e445513R5002J447086L869059M119476Q44631l552641n337245l307237P3083
6302g194299J610067J024827O24606J449861J670681j70472k290883k155147m76024
6293e906783M9004o04824K64778K930274L516238m37014n296931n353610k84316
$$ plain form
6284 -11123184 -6501571 -1078957 2367224 3984742 4174285 2363591 -964412 -3430258
6276 -3430258 -3359300 -1844478 -1009891 -1383339 -2207607 -3212809 -4497771 -5361062 -4819907
6267 -4819907 -2911317 -248680 3008535 6261459 7491675 5424528 2248052 1553717
6259 1553717 3324805 3623492 56141 -5017184 -7977946 -8185572 -6980352 -4796181 -1787645
6250 -1787645 278502 -361705 -2582779 -3472731 -1888425 1189781 5154136 9912056 13638402
6241 13638402 13402901 9121516 4699246 3857139 6228805 8679715 9176704 8139704 7022113
6232 7022113 6937830 8178698 9919997 10554232 9120985 6366014 3893046 2381071 1078371
6223 1078371 -919282 -3205451 -4243467 -3347310 -2261561 -3746238 -8087481 -12135321
$$ packed form
6284a1123184M621613N422614L446181J617518J89543j810694l328003k465846
6276c430258P0958J514822Q34587l73448q24268j005202j284962q63291N41155
6267d819907J908590K662637L257215L252924J230216k067147l176476o94335
6259A553717J771088K98687l567351n073325k960762k07626J205220K184171L008536
6250a787645K066147o40207k221074q89952J584306L078206L964355M757920L726346
6241A3638402k35501m281385m422270q42107K371666K450910M96989j037000j117591
6232G022113q4283J240868J741299O34235j433247k754971k472968j511975j302700
6223A078371j997653k286169j038016Q96157J085749j484677m341243m047840
$$ plain form
6215 -12135321 -12895353 -10996665 -8967043 -7203132 -4420888 -1810282 -3019822 -8354587
6207 -8354587 -12106418 -8781874 -483726 5132665 3877015 -913267 -3573303 -2572518
6199 -2572518 -629886 -568019 -2828753 -5882518 -7350104 -5298665 -20093 5496250 7987741
6190 7987741 6933438 4461735 2508104 1088864 -614937 -2628958 -4138806 -4352656
6182 -4352656 -3033201 -824671 655716 -118031 -2884466 -5653315 -6933221 -7009490 -6385426
6173 -6385426 -4273427 -141287 4146679 5791343 4549220 2845821 2235879 1790031 604314
6164 604314 -272093 201434 956962 581571 -15044 1129739 3577136 4420883 1911928
6155 1911928 -2417291 -5667618 -6483200 -5730975 -5269204 -6393026 -8674577 -9949812 -8066294
$$ packed form
6215a2135321p60032J898688K029622J763911K782244K610606j209540n334765
6207h354587l751831L324544Q298148N616391j255650m790282k660036J000785
6199b572518J942632O1867k260734l053765j467586K051439N278572N516343K491491
6190G987741j054303k471703j953631j419240j703801k014021j509848k13850
6182d352656J319455K208530J480387p73747k766435k768849j279906p6269O24064
6173f385426K111999M132140M287966J644664j242123j703399o09942m45848j185717
6164F04314q76407M73527P55528l75391n96615J144783K447397Q43747k508955
6155A911928m329219l250327q15582P52225M61771j123822k281551j275235J883518
$$ plain form
6146 -8066294 -3032401 2823569 6826139 7779542 6145008 3156456 -99590 -3136481
6138 -3136481 -5751014 -7354619 -7196492 -5538683 -3898916 -3549279 -4344229 -5468896 -6458487
6129 -6458487 -6849414 -5968869 -4105219 -2746588 -2344042 -1026977 2721606 7165123 9211646
6120 9211646 8454836 6979165 5708671 3728139 1209595 11771 608786 1065373 150620
6111 150620 -907450 -1062554 -1615934 -4060586 -7409797 -9250320 -8243237 -4589960 357436
6102 357436 3938848 3727294 800359 -521717 1881843 4682118 3654116 -230699 -2191221
6093 -2191221 -47939 3894014 6971119 8927927 10033915 9281646 5906846 1105800
6085 1105800 -2996562 -5260007 -5815934 -5296471 -4349381 -3442127 -2867711 -3009248 -4038079
$$ packed form
6146h066294N033893N855970M002570R53403j634534k988552l256046l036891
6138c136481k614533j603605J58127J657809J639767L49637p94950j124667r89591
6129f458487l90927Q80545J863650J358631M02546J317065L748583M443517K046523
6120I211646p56810j475671j270494j980532k518544j197824N97015M56587r14753
6111A50620j058070j55104n53380k444652l349211j840523J007083L653277M947396
6102C57436L581412k11554k926935j322076K403560K800275j028002l884815j960522
6093b191221K143282L941953L077105J956808J105988p52269l374800m801046
6085A105800m102362k263445n55927N19463R47090R07254N74416j41537j028831
$$ plain form
6076 -4038079 -4940658 -3914634 -821141 1756326 1388928 -1094713 -3074650 -3847564 -4648320
6067 -4648320 -5484278 -4685873 -2007938 333056 757220 565323 1950830 5173081 8653692
6058 8653692 10677098 10278454 7750548 5033756 4298161 5298798 5378895 2963385 -179169
6049 -179169 -1109495 969243 4469012 7274991 7775478 5262966 813218 -2868475 -3768821
6040 -3768821 -2445204 -861393 -12777 469375 1057700 1591672 1328405 -711591 -4497840
6031 -4497840 -7670411 -7102241 -2895640 897817 1297716 541581 2772861 7730247 10844189
6022 10844189 9442219 5666304 2521037 83852 -2699907 -4969478 -5243122 -4478933
6014 -4478933 -5266212 -8151404 -10776124 -10961281 -9107299 -6938007 -5011284 -2461259 1151869
$$ packed form
6076d038079r02579J026024L093493K577467l67398k483641j979937p72914q00756
6067d648320q35958P98405K677935K340994M24164j91897J385507L222251L480611
6058H653692K023406l98644k527906k716792p35595J000637Q0097k415510l142554
6049a79169r30326K078738L499769K805979N00487k512512m449748l681693r00346
6040c768821J323617J583811Q48616M82152N88325N33972k63267k039996l786249
6031d497840l172571N68170M206601L793457L99899p56135K231280M957386L113942
6022A0844189j401970l775915l145267k437185k783759k269571k73644P64189
6014d478933p87279k885192k624720j85157J853982K169292J926723K550025L613128
$$ plain form
6005 1151869 4618609 6105004 5231064 3631680 3059879 3266835 2573295 521540 -1235929
5996 -1235929 -1358657 -1006905 -2199011 -4476600 -4999564 -2417558 877977 1550920 -464894
5987 -464894 -1987929 -697601 2160930 3662636 2666926 379612 -1883033 -4009208 -5954158
5978 -5954158 -6682610 -5369310 -3072569 -1943578 -2687918 -3828611 -3807921 -2863875 -2192752
5969 -2192752 -2113819 -2144867 -2432915 -3713905 -5636723 -6404828 -4909498 -2463579 -1424837
5960 -1424837 -2421420 -3913978 -4464506 -4420343 -4946891 -6189671 -7165330 -7178032 -6604257 -6202265
5950 -6202265 -6170110 -6117694 -5646541 -4669583 -3302675 -1711241 -65811 1536988 3177268
5941 3177268 5029249 7064645 8812324 9449182 8271856 5371685 2055807 347918
$$ packed form
6005A151869L466740J486395q73940j599384n71801K06956o93540k051755j757469
5996a235929j22728L51752j192106k277589n22964K582006L295535O72943k015814
5987d64894j523035J290328K858531J501706r95710k287314k262645k126175j944950
5978e954158p28452J313300K296741J128991p44340j140693K0690R44046O71123
5969b192752P8933l1048k88048j280990j922818p68105J495330K445919J038742
5960a424837r96583j492558n50528M4163n26548j242780r75659j2702N73775M01992
5950f202265L2155N2416M71153R76958J366908J591434J645430J602799J640280
5941C177268J851981K035396J747679O36858j177326k900171l315878j707889
$$ plain form
5933 347918 1436078 4300615 6308908 5715948 3400318 1575894 965397 124544 -2209235
5924 -2209235 -5007091 -5889448 -3687064 614044 5125413 8527213 10487536 11337627 11390720
5915 11390720 10295053 7441187 3473313 719553 1104675 3989956 7097251 9107411
5907 9107411 10009660 9447401 6924235 3901742 3248907 5404188 7131362 5747339 2808469
5898 2808469 1470203 1665718 707852 -1969438 -3734106 -2780249 -523229 1047221 2178164
5889 2178164 4036829 6221162 7321693 7063317 6343551 5623236 4591924 3212167 1978527
5880 1978527 1073411 11421 -1706538 -3858353 -5367023 -4970901 -2613772 -215777 -46953
5871 -46953 -1833572 -2578810 -235063 3379383 4707332 2914911 534367 -341471 -658200
$$ packed form
5933C47918J088160K864537K008293n92960k315630j824424o10497q40853k333779
5924b209235k797856q82357K202384M301108M511369L401800J960323Q50091N3093
5915A1390720j095667k853866l967874k753760L85122K885281L107295K010160
5907I107411R02249n62259k523166l022493o52835K155281J727174j384023k938870
5898B808469j338266J95515r57866k677290j764668R53857K257020J570450J130943
5889B178164J858665K184333J100531k58376p19766p20315j031312j379757j233640
5880A978527r05116j061990j717959k151815j508670L96122K357129K397995J68824
5871d6953j786619p45238K343747L614446J327949j792421k380544q75838l16729
$$ plain form
5862 -658200 -2300125 -4741066 -5372447 -2933892 746699 2939899 3115372 3005696 3860235
5853 3860235 4731491 4033127 2037562 708772 1091571 1964697 1589057 -40282 -1550600
5844 -1550600 -2410148 -3787183 -6914523 -11129284 -14044760 -13762670 -10745015 -7235989 -4834268
5835 -4834268 -3178485 -1408048 -88915 -344705 -1276709 -99697 4237794 8931350 10238115
5826 10238115 7840276 4989039 4754913 7439015 11326616 14364229 14883589 12215783
5818 12215783 7470151 3000492 531407 209660 1502518 4084847 7459245 10551898
5810 10551898 12280300 12064696 9616537 5087692 -133772 -3674990 -4021440 -1747450
5802 -1747450 1331686 3443651 3089909 -461853 -5648487 -8667867 -6866519 -1843108
$$ packed form
5862f58200j641925k440941o31381K438555L680591K193200J75473j09676Q54539
5853C860235Q71256o98364j995565j328790L82799Q73126l75640j629339j510318
5844a550600q59548j377035l127340m214761k915476K82090L017655L509026K401721
5835d834268J655783J770437J319133k55790r32004J177012M337491M693556J306765
5826A0238115k397839k851237k34126K684102L887601L037613N19360k667806
5818A2215783m745632m469659k469085l21747J292858K582329L374398L092653
5810A0551898J728402k15604k448159m528845n221464l541218l46450K273990
5802a747450L079136K111965l53742l551762n186634l019380J801348N023411
$$ plain form
5794 -1843108 2212262 3022649 1664718 -74634 -1650904 -2663121 -2009859 387327 2332140
5785 2332140 1469165 -1865005 -5086339 -6210129 -5224041 -3138548 -935652 641522 1299461
5776 1299461 1295077 756646 -735577 -3114171 -4921452 -4709911 -3195061 -2737628 -4571972
5767 -4571972 -7667396 -10408481 -12095503 -12412350 -10735281 -6911184 -2176974 1308206
5759 1308206 1806939 -701232 -3821968 -3994254 11718 5083282 7063498 5957749 5514500
5750 5514500 7331195 8418691 6066534 2142334 18348 -398751 -1354633 -2656249 -2174608
5741 -2174608 -307595 -131591 -2705969 -5499988 -6328511 -5985196 -5878599 -5669079 -4687197
5732 -4687197 -3553755 -2914722 -2362737 -1938978 -2887340 -5405529 -7286917 -6468777 -3651920
$$ packed form
5794a843108M055370Q10387j357931j739352j576270j012217O53262K397186J944813
5785B332140q62975l334170l221334j123790R86088K085493K202896J577174O57939
5776A299461m384n38431j492223k378594j807281K11541J514850M57433j834344
5767d571972l095424k741085j687022l16847J677069L824097M734210L485180
5759A308206M98733k508171l120736j72286M005972N071564J980216j105749m43249
5750E514500J816695J087496k352157l924200k123986m17099r55882j301616M81641
5741b174608J867013J76004k574378k794019q28523L43315J06597K09520R81882
5732d687197J133442O39033N51985M23759r48362k518189j881388Q18140K816857
$$ plain form
5723 -3651920 -920329 923136 2140513 2595321 2353402 2639263 4258374 5907716 5995582
5714 5995582 5440209 6511794 9146463 10541760 8728831 4853086 1378334 -663705
5706 -663705 -1951200 -3241863 -4199766 -3768447 -1593685 1050885 2250461 1440297 -296928
5697 -296928 -1955278 -3428476 -4351194 -3841323 -2351306 -2057799 -3886573 -5577312 -4481911
5688 -4481911 -1093396 2069295 3884270 4761276 4479965 2584591 376957 -260187 74824
5679 74824 -901188 -3165010 -3933613 -1752460 1542815 3777083 4928593 5629518 5492747
5670 5492747 4362624 3358497 3208265 3079157 2366731 2136784 3397813 5220179 5862044
5661 5862044 4658108 1873558 -1818252 -4673887 -4559220 -1874099 -57098 -1226817
$$ packed form
5723c651920K731591J843465J217377M54808k41919K85861J619111J649342Q7866
5714E995582n55373J071585K634669J395297j812929l875745l474752k042039
5706f63705j287495j290663r57903M31319K174762K644570J199576q10164j737225
5697b96928j658350j473198r22718N09871J490017K93507j828774j690739J095401
5688d481911L388515L162691J814975Q77006k81311j895374k207634o37144L35011
5679G4824r76012k263822p68603K181153L295275K234268J151510P00925j36771
5670E492747j130123j004127j50232j29108p12426k29947J261029J822366O41865
5661E862044j203936k784550l691810k855635J14667K685121J817001j169719
$$ plain form
5653 -1226817 -2920563 -1540685 2291332 4709285 4208635 3079784 3074531 2794765 595715
5644 595715 -2388296 -3891892 -3574768 -2572961 -1005730 2052226 6207755 9029882 8401589
5635 8401589 4947467 1617239 1028555 3299168 6162087 6992381 4942524 1455831 -1134610
5626 -1134610 -1523958 -127399 1776174 3185450 3677872 3183654 2006264 814528 34712
5617 34712 -588191 -1266556 -1441619 -808990 -602571 -2055943 -3581001 -1981801 2530454
5608 2530454 5287227 3296478 -22713 559680 4580037 7073275 6388585 6010801 8002678
5599 8002678 9437891 7441488 3820254 1843489 1465401 795575 -146044 -379965 -732833
5590 -732833 -2279840 -3372362 -1558652 2326298 5043797 5354038 4704851 4117257 3399598
$$ packed form
5653a226817j693746J379878L832017K417953n00650j128851n253k79766k199050
5644E95715k984011j503596L17124J001807J567231L057956M155529K822127o28293
5635H401589l454122l330228n88684K270613K862919Q30294k049857l486693k590441
5626a134610l89348J396559J903573J409276M92422m94218j177390j191736p79816
5617C4712o22903o78365j75063O32629K06419j453372j525058J599200M512255
5608B530454K756773j990749l319191N82393M020357K493238o84690l77784J991877
5599H002678J435213j996403l621234j976765l78088o69826r41619k33921l52868
5590g32833j547007j092522J813710L884950K717499L10241o49187n87594p17659
$$ plain form
5581 3399598 3162255 4445683 6058603 5185109 1335972 -2677052 -4361685 -4062080 -3359501
5572 -3359501 -2992055 -2924809 -2705345 -1408841 1056756 2671403 1499350 -923590 -1099593
5563 -1099593 1240600 2500411 661925 -1780819 -1977828 -951043 -1344163 -3099565 -3946267
5554 -3946267 -2834731 -591810 1849187 3838352 4476400 3607685 2737591 3333640 4814866
5545 4814866 5637409 5564884 5348451 5036039 4359313 4096321 5144093 6637522 6846099
5536 6846099 5760326 5028054 5351505 5640630 4885208 3256159 1063564 -1776058 -4584033
5527 -4584033 -5568665 -3671320 -200658 2106494 1501195 -1488396 -4855502 -7005293 -7957692
5518 -7957692 -8624364 -9019110 -7933949 -4804812 -1060508 1267639 1734509 1400597 1159338
$$ packed form
5581C399598k37343J283428J612920q73494l849137m013024j684633K99605P02579
5572c359501L67446O7246K19464J296504K465597J614647j172053k422940j76003
5563a099593K340193J259811j838486k442744j97009J026785l93120j755402q46702
5554c946267J111536K242921K440997J989165O38048q68715q70094N96049J481226
5545D814866Q22543p2525k16433l12412o76726k62992J047772J493429K08577
5536F846099j085773p32272L23451K89125p55422j629049k192595k839622k807975
5527d584033r84632J897345L470662K307152o05299k989591l367106k149791r52399
5518g957692o66672l94746J085161L129137L744304K328147M66870l33912k41259
$$ plain form
5509 1159338 1254000 1930559 3111742 3584545 2125337 -246127 -662646 2153755 6065060
5500 6065060 8228368 8737175 10013742 12751019 14218253 11603163 6000882 1484287
5492 1484287 328766 844796 552701 -239925 423434 2749912 5208620 7377100 10183232
5483 10183232 13119022 13882358 11747927 8970388 7584661 6976363 6071349 5658124 6536383
5474 6536383 7408487 7029964 6747550 8238471 10165718 9978225 7886989 5997042 4491920
5465 4491920 2120830 -179999 -26076 2040451 2867308 2005368 2737219 6483608 9968184
5456 9968184 9988044 7745673 6041142 5023391 3554621 2525732 3654664 6242196 7812018
5447 7812018 7232591 5256140 2956738 1403446 1628157 2974712 2673045 -968220 -6060113
$$ packed form
5509A159338R4662O76559J181183M72803j459208k371464m16519K816401L911305
5500F065060K163308N08807J276567K737277J467234k615090n602281m516595
5492A484287j155521N16030k92095p92626O63359K326478K458708K168480K806132
5483A0183232K935790P63336k134431k777539j385727o08298r05014m13225Q78259
5474F536383Q72104l78523k82414J490921J927247j87493k091236j889947j505122
5465D491920k371090k300829J53923K066527Q26857q61940P31851L746389L484576
5456I968184J9860k242371j704531j017751j468770j028889J128932K587532J569822
5447G812018n79427j976451k299402j553292K24711J346555l01667l641265n091893
$$ plain form
5438 -6060113 -9635952 -11224470 -11834489 -11017462 -7772584 -3327539 -88746 1584398 2871575
5429 2871575 3481884 2219886 237245 461289 3410818 6404355 7428085 7204816 6954215
5420 6954215 6728112 6636308 7205005 7738173 6735310 4736877 4313499 6305254 8491072
5411 8491072 8967889 8298138 7140677 4560193 524953 -2389234 -2052975 223869 1687493
5402 1687493 1444047 37193 -2274312 -4672562 -5085281 -2812247 -347004 -107273 -747715
5393 -747715 676527 4202750 7463719 9508138 10894490 10816811 7854395 3633157 2112139
5384 2112139 4362318 7122288 7655218 7191253 7977564 9371117 8997713 6320886 3103644
5375 3103644 1057895 393209 124820 -1116862 -3908097 -6824353 -7131829 -3683476 1199061
$$ packed form
5438f060113l575839j588518o10019Q17027L244878M445045L238793J673144J287177
5429B871575O10309j261998j982641K24044K949529K993537J023730k23269k50601
5420F954215k26103r1804N68697N33168j002863j998433m23378J991755K185818
5411H491072M76817o69751j157461k580484m035240k914187L36259K276844J463624
5402A687493k43446j406854k311505k398250m12719K273034K465243K39731o40442
5393g47715J424242L526223L260969K044419J386352p7679k962416m221238j521018
5384B112139K250179K759970N32930m63965P86311J393553l73404k676827l217242
5375C103644k045749o64686k68389j241682k791235k916256l07476L448353M882537
$$ plain form
5366 1199061 3550443 1580053 -2542152 -4820758 -3563598 -1177914 -943855 -2153922
5358 -2153922 -677446 4526450 8305362 5798241 -39592 -1838689 1950869 5356719
5350 5356719 4257986 2096414 3465712 6575896 6458191 2866018 239328 909943 2523826
5341 2523826 2156029 -291654 -3065276 -4422018 -3385543 -727520 894478 -343980
5333 -343980 -2964278 -4271005 -4027236 -3656849 -2755459 318082 4547281 6438255 4751262
5324 4751262 1993121 363209 -709410 -1805100 -1508819 789185 2708579 1977179 -149163
5315 -149163 -993851 -526019 -833178 -2494552 -3885132 -3674248 -2067257 101290 1848258
5306 1848258 2082559 844258 35412 1152979 2728356 2044804 -730256 -2346016 -846047
$$ packed form
5366A199061K351382j970390m122205k278606J257160K385684K34059j210067
5358b153922J476476N203896L778912k507121n837833j799097L789558L405850
5350E356719j098733k161572J369298L110184j17705l592173k626690O70615J613883
5341B523826l67797k447683k773622j356742J036475K658023J621998j238458
5333c43980k620298j306727K43769L70387R01390L073541M229199J890974j686993
5324D751262k758141j629912j072619j095690K96281K298004J919394p31400k126342
5315a49163q44688M67832l07159j661374j390580K10884J606991K168547J746968
5306A848258K34301j238301q08846J117567J575377o83552k775060j615760J499969
$$ plain form
5297 -846047 1890662 2930513 1972750 976842 1197411 2001121 2197911 1404625 155384
5288 155384 -545456 245096 2671777 5646416 7526155 7555276 6595928 6239593 7157139
5279 7157139 8525122 9177539 8899908 8072722 6470854 3606730 484089 -349617 2456643
5270 2456643 7032614 10097577 10291162 8683291 6651090 4832340 3983412 4999172 7404678
5261 7404678 9142191 8740655 6910340 5390818 5051267 5724917 6972787 8120140 8263965
5252 8263965 7197636 5786366 4616753 3091425 1102057 796900 4611342 11300993
5244 11300993 15887746 14685070 9224540 4043805 1480711 66712 -2428252 -6083030
5236 -6083030 -9309076 -10906148 -10745460 -9079909 -6192806 -2818661 -374444 -341971 -3104704
$$ packed form
5297h46047K736709J039851r57763r95908K20569Q03710J96790p93286j249241
5288A55384p00840P90552K426681K974639J879739K9121r59348l56335R17546
5279G157139J367983O52417k77631q27186j601868k864124l122641q33706K806260
5270B456643M575971L064963J93585j607871k032201j818750q48928J015760K405506
5261G404678J737513m01536j830315j519522l39551O73650J247870J147353J43825
5252H263965j066329j411270j169613j525328j989368l05157L814442O689651
5244A1300993M586753j202676n460530n180735k563094j413999k494964l654778
5236f083030l226046j597072J60688J665551K887103L374145K444217L2473k762733
$$ plain form
5227 -3104704 -7175249 -9863065 -9379116 -6465389 -3507621 -1980793 -1364937 -616329 310856
5218 310856 938446 1259360 1349296 834248 -86948 81589 2122702 3843886 2096942
5209 2096942 -2548666 -5456810 -3503215 877221 2964471 1579202 -561577 -1274389
5201 -1274389 -966841 -425693 596782 1724910 1282390 -1235725 -3760947 -4383557 -4093574
5192 -4093574 -4877713 -6100349 -5074497 -1038550 3483629 5544895 4362672 894731
5184 894731 -3306660 -6250585 -6412269 -4706215 -4233273 -6765544 -10446621 -12133901 -11011123
5175 -11011123 -8594816 -6274821 -4641040 -4451048 -6053362 -7972562 -8175969 -6977907
5167 -6977907 -6642731 -7639202 -7514147 -4568379 -581320 1819697 2885954 4712092 7449118
$$ packed form
5227c104704m070545k687816M83949K913727K957768J526828O15856P48608R27185
5218C10856O27590L20914Q9936n15048r21196J68537K041113J721184j746944
5209B096942m645608k908144J953595M380436K087250j385269k140779p12812
5201a274389L07548N41148J022475J128128m42520k518115k525222o22610K89983
5192d093574p84139j222636J025852M035947M522179K061266j182223l467941
5184H94731m201391k943925j61684J706054M72942k532271l681077j687280J122778
5175a1011123K416307K319995J633781J89992j602314j919200k03407J198062
5167f977907L35176r96471J25055K945768L987059K401017J066257J826138K737026
$$ plain form
5158 7449118 8873115 7565484 4535411 1466835 -934220 -2401070 -2497860 -1467723 -726848
5149 -726848 -1597927 -3954454 -6577474 -8384149 -8911642 -8085178 -6073098 -3277374 -232303
5140 -232303 2461484 4230307 4873213 4758165 4353931 3654909 2373307 513868 -1561472
5131 -1561472 -3296321 -3774183 -2037153 1534733 4637955 5078464 3330032 1859996 1823619
5122 1823619 1830698 557494 -759931 280843 3813718 6832228 6135061 1873310 -2143189
5113 -2143189 -2035560 2081110 6161567 6888781 5532785 5950950 9227650 12188544 11652406
5104 11652406 8333708 5368918 4320354 4206478 3731803 2716133 1319072 -606655
5096 -606655 -2717581 -3639913 -2190308 908690 3151088 2522335 -364021 -2738017 -2463871
$$ packed form
5158G449118J423997j307631l030073l068576k401055j466850r6790J030137P40875
5149g26848q71079k356527k623020j806675n27493Q26464K012080K795724L045071
5140b32303K693787J768823O42906j15048m04234o99022j281602j859439k075340
5131a561472j734849m77862J737030L571886L103222M40509j748432j470036l6377
5122A823619P079j273204j317425J040774L532875L018510o97167m261751m016499
5113b143189J07629M116670M080457P27214j355996M18165L276700K960894n36138
5104A1652406l318698k964790j048564j13876m74675j015670j397061j925727
5096f06655k110926r22332J449605L098998K242398o28753k886356k373996K74146
$$ plain form
5087 -2463871 -82889 2133498 2646153 1541654 -555928 -3249647 -5749672 -6510429 -4443427
5078 -4443427 -432339 2945822 3672846 2436080 2185338 4878349 8757586 9948697 7081620
5069 7081620 2955921 799335 444248 -233310 -1511273 -1769561 -463614 1361643 3275964
5060 3275964 5672381 7709144 7611346 5488704 3463195 2460011 1330000 -240710 -802247
5051 -802247 -282228 -1144751 -4519481 -7598717 -7089418 -3396117 602116 3041690 3316929
5042 3316929 962513 -3033810 -5462454 -4369425 -2208729 -2737623 -5710068 -7586518
5034 -7586518 -6864084 -5532423 -5238180 -5045219 -3691250 -1611667 283406 2093941 4275992
5025 4275992 6684553 8847429 10358314 10891039 10630765 10429130 10592278 10026762 7767349
$$ packed form
5087b463871K380982K216387N12655j104499k097582k693719k500025p60757K067002
5078d443427M011088L378161P27024j236766k50742K693011L879237J191111k867077
5069G081620m125699k156586l55087o77558j277963k58288J305947J825257J914321
5060C275964K396417K036763r7798k122642k025509j003184j130011j570710n61537
5051h02247N20019q62523l374730l079236N09299L693301L998233K439574K75239
5042C316929k354416l996323k428644J093029K160696n28894k972445j876450
5034g586518P22434J331661K94243J92961J353969K079583J895073J810535K182051
5025D275992K408561K162876J510885N32725k60274k01635J63148n65516k259413
$$ plain form
5016 7767349 4785727 2933353 2649781 3164726 4326674 6463291 8813971 9970789 9899528
5007 9899528 10003311 11123865 12641773 13328354 12028220 8111623 2614566 -1618662 -2343109
4998 -2343109 -95491 2933445 5183507 5851757 4473321 2256708 2183299 5332283 8446999
4989 8446999 7822089 4422942 2262436 2802193 4177640 5019221 5363627 4279101 576008
4980 576008 -3920522 -5584038 -3987646 -2127664 -1163228 1074620 5102501 7290855 4662665
4971 4662665 -637972 -4000729 -3600480 -1312885 -19256 -1227390 -3842964 -4580315 -1328461
4962 -1328461 3528758 5322632 2951693 -45089 -732638 -90862 -44855 -221927 512569
4953 512569 1519527 1229421 -833589 -3877699 -6400680 -6659574 -4325457 -1679293 -1162543
$$ packed form
5016G767349k981622j852374k83572N14945J161948K136617K350680J156818p1261
5007I899528J03783J120554J517908O86581j300134l916597n497057m233228p24447
4998b343109K247618L028936K250062O68250j378436k216613p3409L148984L114716
4989H446999o24910l399147k160506N39757J375447Q41581L44406j084526l703093
4980E76008m496530j663516J596392J859982R64436K237848M027881K188354k628190
4971D662665n300637l362757M00249K287595J293629j208134k615574p37351L251854
4962a328461M857219J793874k370939k996782o87549O41776M6007j77072P34496
4953E12569J006958k90106k063010l044110k522981k58894K334117K646164N16750
$$ plain form
4944 -1162543 -2112170 -2380302 -2354635 -3836731 -5500878 -4008964 -50498 1513810 -1160174
4935 -1160174 -4117832 -3837541 -1929659 -1277104 -1388968 -412770 1220635 1752286 510072
4926 510072 -2247735 -5707557 -7943538 -7604121 -6285908 -5998386 -4873366 -9505 5969578
4917 5969578 7264021 4140090 3016775 6085722 8133911 5885164 3000223 2721098
4909 2721098 2968477 2348228 3553056 6734818 7117028 3685534 2360256 5591794 7244129
4900 7244129 3595048 516412 2722740 4820512 1246475 -3478153 -3411295 -1794609 -3442752
4891 -3442752 -4809276 -1841178 645653 -1695062 -2813096 2601547 7488229 4878885
4883 4878885 1723657 5682957 9602212 6160842 4765071 12742114 14679989 -1833678
$$ packed form
4944a162543r49627k68132K5667j482096j664147J491914L958466J564308k673984
4935a160174k957658K80291J907882O52555j11864R76198J633405N31651j242214
4926E10072k757807l459822k235981L39417J318213K87522J125020M863861N979083
4917E969578J294443l123931j123315L068947K048189k248747k884941k79125
4909B721098K47379o20249J204828L181762L82210l431494j325278L231538J652335
4900G244129l649081l078636K206328K097772l574037m724628O6858J616686j648143
4891c442752j366524K968098K486831k340715j118034N414643M886682k609344
4883D878885l155228L959300L919255l441370j395771P977043J937875j6513667
$$ plain form
4875 -1833678 -16182955 -10152614 -22144359 -110568330 -253554276 -341732688 -302156034
4868 -302156034 -186809527 -100479855 -76526626 -70418828 -49304902 -29190028 -27091988
4861 -27091988 -29812922 -23844425 -18442779 -22455976 -25838891 -19704031 -13002970 -15032373
4853 -15032373 -19107745 -16456871 -11180393 -9738071 -8975561 -5405833 -4231113 -8879410
4845 -8879410 -12629695 -10282140 -7669636 -10186536 -12137088 -7424813 -1364421 -1386581 -4263961
4836 -4263961 -3247564 -729602 -2841414 -7191409 -6947578 -3094504 -2352783 -5563952 -7383417
4827 -7383417 -5829109 -4119405 -4183080 -5031399 -6339952 -8015345 -7935178 -5132644 -2809290
4818 -2809290 -3326068 -3404695 276134 4243705 3358654 -244774 -337281 3361341 5383182
$$ packed form
4875a833678j4349277O030341j1991745q8423971j42985946q8178412L9576654
4868c02156034J15346507Q6329672K3953229O107798K1113926K0114874K098040
4861b7091988k720934N968497N401646m013197l382915O134860O701061k029403
4853a5032373m075372K650874N276478J442322P62510L569728J174720m648297
4845h879410l750285K347555K612504k516900j950552M712275O060392k2160k877380
4836d263961J016397K517962k111812m349995K43831L853074P41721l211169j819465
4827g383417J554308J709704o3675q48319j308553j675393Q0167K802534K323354
4818b809290n16778p8627L680829L967571q85051l603428r2507L698622K021841
$$ plain form
4809 5383182 3601366 1339447 793737 596685 54673 205311 358653 -1317604 -3498905
4800 -3498905 -2842285 289558 2010695 1297459 1425129 3987722 5908698 4131733 -146001
4791 -146001 -3616796 -4612882 -3430170 -1200042 363575 -176595 -2463960 -4763227 -5950627
4782 -5950627 -5999710 -5045431 -3420524 -1995237 -1059921 257774 2091168 2698315 936278
4773 936278 -1583033 -2664617 -2268932 -1238624 575995 2563486 2180326 -1299454 -4138647
4764 -4138647 -2996249 -393738 -939154 -3726597 -3690879 16650 2415937 146327 -4325956
4755 -4325956 -7338675 -8613455 -9312549 -9126855 -7639748 -6015829 -5221263 -4466798 -3071415
4746 -3071415 -2168379 -3031059 -5011927 -6381708 -6288312 -5194458 -4230276 -4282793 -4728735
$$ packed form
4809E383182j781816k261919n45710j97052n42012J50638J53342j676257k181301
4800c498905O56620L131843J721137p13236J27670K562593J920976j776965m277734
4791a46001l470795r96086J182712K230128J563617n40170k287365k299267j187400
4782e950627m9083R54279J624907J425287R35316J317695J833394O07147j762037
4773I36278k519311j081584L95685J030308J814619J987491l83160l479780k839193
4764d138647J142398K602511n45416k787443L5718L707529K399287k269610m472283
4755d325956l012719j274780o99094J85694J487107J623919P94566P54465J395383
4746c071415R03036q62680j980868j369781R3396J093854R64182n2517m45942
$$ plain form
4737 -4728735 -3370916 918807 5888822 8058506 6915335 4976410 3829274 2325315
4729 2325315 -1045233 -5936147 -10640568 -13283554 -12624843 -9241276 -5516517 -2839250
4721 -2839250 253807 5018604 8968022 8710839 5592911 4581934 7312774 10090448
4713 10090448 9576693 6664907 3413988 -98336 -3756953 -5440629 -3744175 -567162
4705 -567162 1309506 1580422 1495119 1293997 535146 -321592 -389742 547153 2494725 5466023
4695 5466023 8259171 8669631 6144094 2689404 48202 -2283062 -5005454 -6938723
4687 -6938723 -6688944 -4864836 -2968772 -1320628 544388 2727786 5442478 9125129
4679 9125129 12827329 14173079 12321506 9305940 7115970 5456663 3890179 3673067
$$ packed form
4737d728735J357819M289723M970015K169684j143171j938925j147136j503959
4729B325315l370548m890914m704421k642986O58711L383567L724759K677267
4721b839250L093057M764797L949418k57183l117928j010977K730840K777674
4713A0090448n13755k911786l250919l512324l658617j683676J696454L177013
4705e67162J876668K70916q5303k01122p58851q56738o8150R36895J947572K971298
4695E466023K793148M10460k525537l454690k641202k331264k722392j933269
4687f938723K49779J824108J896064J648144J865016K183398K714692L682651
4679I125129L702200J345750j851573l015566k189970j659307j566484k17112
$$ plain form
4671 3673067 5151345 5742536 3559601 1125221 1991504 5022322 5827219 3185651 164963
4662 164963 -1087837 -1769528 -2968356 -3449090 -2358277 -1222865 -1481952 -2215261 -2004675
4653 -2004675 -1312633 -1472885 -2687944 -4196752 -5044210 -3804404 607633 6584876 10223509
4644 10223509 9804521 8162284 8569841 9955171 8919300 5345147 2664371 2635901 3167482
4635 3167482 2200989 832436 938447 2032520 2587577 2772232 3464789 3680942 1694846
4626 1694846 -1618005 -3251776 -2271353 -1087724 -1571256 -2087843 -63364 4014749 7095045
4617 7095045 7252943 5034775 1521253 -2956431 -7733767 -10996487 -11177954 -8779460 -6065288
4608 -6065288 -4823884 -4683614 -3943498 -2099116 -848805 -1779156 -3639980 -3563614 -1114406
$$ packed form
4671C673067J478278N91191k182935k434380Q66283L030818Q04897k641568l020688
4662A64963j252800o81691j198828m80734J090813J135412k59087p33309K10586
4653b004675O92042j60252j215059j508808q47458J239806M412037N977243L638633
4644A0223509m18988j642237M07557J385330j035871l574153k680776k8470N31581
4635C167482r66493j368553J06011J094073N55057J84655O92557K16153j986096
4626A694846l312851j633771R80423J183629m83532n16587K024479M078113L080296
4617G095045J57898k218168l513522m477684m777336l262720j81467K398494K714172
4608f065288J241404J40270P40116J844382J250311r30351j860824P6366K449208
$$ plain form
4599 -1114406 817181 -227 -2167187 -3097434 -2718949 -2803906 -3985211 -5696194 -8005014
4590 -8005014 -10923215 -12536546 -10627149 -6097248 -2215840 -435282 442802 956236 6832
4581 6832 -2190560 -3500469 -3518043 -4598774 -7283814 -7832244 -3311651 3128349 5641120
4572 5641120 3276043 808889 2206318 6277496 9300932 9501123 7921129 6492365
4564 6492365 6253740 6568968 5527955 1893044 -2961695 -5815192 -4840811 -1669303 272581
4555 272581 -574456 -2238917 -1547321 1972299 5380008 6126865 5427377 6158214 8176322
4546 8176322 8404574 5838152 3457348 3752654 5060710 4579627 2846235 2420500 3581270
4537 3581270 4309540 3737832 2736406 1495101 -674041 -3226116 -4742415 -5452759 -6756342
$$ packed form
4599a114406J931587q17408k166960r30247L78485q4957j181305j710983k308820
4590h005014k918201j613331J909397M529901L881408J780558Q78084N13434r49404
4581F832k197392j309909j7574j080731k685040n48430M520593O440000K512771
4572E641120k365077k467154J397429M071178L023436K00191j579994j428764
4564F492365k38625L15228j041013l634911m854739k853497R74381L171508J941884
4555B72581q47037j664461O91596L519620L407709P46857o99488P30837K018108
4546H176322K28252k566422k380804K95306J308056m81083j733392m25735J160770
4537C581270P28270n71708j001426j241305k169142k552075j516299p10344j303583
$$ plain form
4528 -6756342 -8087841 -7205445 -4259623 -2570583 -4015688 -6320743 -6729005 -6008544 -6485971
4519 -6485971 -7815747 -7391266 -4250961 -249817 2521211 3676101 3852045 3563512 3007884
4510 3007884 2091922 553982 -1380161 -2796655 -3185190 -3170671 -3369935 -3281605 -2434477
4501 -2434477 -1815211 -2506566 -3434387 -2562551 -393817 17841 -2619358 -5636205 -6015998
4492 -6015998 -4425051 -3494759 -3321685 -1504697 2487914 5942319 6868672 6784559 7680016
4483 7680016 8244884 5946847 2011984 1105736 5345791 11125702 13332935 11039941 7364229
4474 7364229 4871207 3087621 255816 -4116210 -8668936 -11122859 -9813119 -5323363
4466 -5323363 -601733 1584610 1403256 1201556 2069832 2578131 1309186 -982248 -2861410
$$ packed form
4528f756342j331499Q82396K945822J689040j445105k305055m08262P20461m77427
4519f485971j329776M24481L140305M001144K771028J154890J75944k88533n55628
4510C007884r15962j537940j934143j416494l88535J4519j99264Q8330Q47128
4501b434477O19266o91355r27821Q71836K168734M11658k637199l016847l79793
4492f015998J590947R30292J73074J816988L992611L454405R26353q4113Q95457
4483G680016N64868k298037l934863r06248M240055N779911K207233k292994l675712
4474G364229k493022j783586k831805m372026m552726k453923J309740M489756
4466e323363M721630K186343j81354k01700Q68276N08299j268945k291434j879162
$$ plain form
4457 -2861410 -4532922 -6910254 -9029267 -8539086 -5153068 -1773553 -1059003 -2067580 -1718557
4448 -1718557 1058816 4163268 5168758 3818323 1303112 -1581607 -4642326 -7473761
4440 -7473761 -9464062 -10322683 -9958567 -8210177 -5357985 -2550423 -988146 -849932 -1514167
4431 -1514167 -2435304 -3175664 -3088026 -1913618 -465013 142479 -227536 -927900 -1620478
4422 -1620478 -2293000 -2608602 -2306406 -1913674 -1974497 -2025921 -1610081 -1681855 -3235164 -4959717
4412 -4959717 -4474723 -1890132 266549 1027060 2232299 4894367 7029891 6739494 5051996
4403 5051996 3699684 2255244 -29261 -1403903 247130 3439369 4362779 1887383
4395 1887383 -1402035 -3147665 -3612082 -3903407 -4335517 -5175191 -6757780 -8065294 -7354474
$$ packed form
4457b861410j671512k377332k119013M90181L386018L379515P14550j008577L49023
4448a718557K777373L104452J005490j350435k515211k884719l060719k831435
4440g473761j990301q58621L64116J748390K852192K807562J562277J38214o64235
4431a514167r21137p40360Q7638J174408J448605O07492l70015p00364o92578
4422a620478o72522l15602L02196L92732o0823n1424M15840p1774j553309j724553
4412d959717M84994K584591K156681P60511J205239K662068K135524k90397j687498
4403E051996j352312j444440k284505j374642J651033L192239R23410k475396
4395A887383l289418j745630m64417k91325m32110q39674j582589j307514P10820
$$ plain form
4386 -7354474 -5260889 -5156346 -8760155 -12970215 -13024591 -7993018 -1408514 2943710 4027884
4377 4027884 2641163 -252499 -3347796 -4754359 -3603684 -1479821 -833749 -1936286
4369 -1936286 -2711650 -1912303 -962852 -1665049 -3420419 -4380348 -4448970 -5033820 -6121672
4360 -6121672 -5909518 -3665602 -840180 1176359 2235029 1766386 -1429589 -6398918 -9643835
4351 -9643835 -9512795 -8656740 -9699814 -10734105 -8385920 -3736354 -1294372 -2606988 -4726596
4342 -4726596 -5332974 -5737021 -7634736 -9942541 -10661410 -9788461 -8601409 -7485798 -6072375
4333 -6072375 -4599464 -3758231 -3581414 -3344519 -2444727 -1157425 -677358 -2001615 -4276176
4324 -4276176 -5150214 -3903349 -3161843 -5597695 -9655979 -11050467 -8441768 -5003113 -3770161
$$ packed form
4386g354474K093585J04543l603809m210060n4376N031573O584504M352224J084174
4377D027884j386721k893662l095297j406563J150675K123863O46072j102537
4369a936286p75364P99347R49451p02197j755370r59929o8622n84850j087852
4360f121672K12154K243916K825422K016539J058670m68643l195975m969329l244917
4351i643835J31040Q56055j043074j034291K348185M649566K441982j312616k119608
4342d726596o06378m04047j897715k307805p18869Q72949J187052J115611J413423
4333f072375J472911Q41233J76817K36895Q99792J287302M80067j324257k274561
4324d276176q74038J246865P41506k435852m058284j394488K608699L438655J232952
$$ plain form
4315 -3770161 -3981938 -3335312 -1852328 -1660868 -3804399 -6663712 -7418187 -4729091 -334390
4306 -334390 2259238 1480091 -360169 56729 2935982 5764212 7039336 7279098 6737762
4297 6737762 4961572 2878827 2472748 3574902 3568149 1227187 -1623039 -3280570 -4415284
4288 -4415284 -5891220 -6920806 -6944876 -6909899 -6979934 -5459120 -1998240 583524 140928
4279 140928 -1314114 -774128 968571 876186 -1248677 -2626194 -1989954 -1061251 -1364455
4270 -1364455 -2239030 -2566238 -2367171 -2036696 -1607304 -1366760 -1966471 -3421046 -4865117
4261 -4865117 -5533719 -5315393 -4380447 -2929883 -1247574 393053 1566756 1350356 -904115
4252 -904115 -4098521 -5987968 -5964000 -5878133 -7207958 -8939264 -9416731 -8603617 -6969434
$$ packed form
4315c770161k11777O46626J482984J91460k143531k859313p54475K689096M394701
4306c34390K593628p79147j840260M16898K879253K828230J275124K39762n41336
4297F737762j776190k082745m06079J102154o753k340962k850226j657531j134714
4288d415284j475936j029586k4070L4977p0035J520814L460880K581764m42596
4279A40928j455042N39986J742699r2385k124863j377517O36240R28703l03204
4270a364455q74575l27208J99067L30475M29392K40544n99711j454575j444071
4261d865117o68602K18326R34946J450564J682309J640627J173703k16400k254471
4252i04115l194406j889447K3968Q5867j329825j731306m77467Q13114J634183
$$ plain form
4243 -6969434 -3934955 423741 3636039 3424697 1102688 -248164 -317754 -1437633 -4149557
4234 -4149557 -5973930 -5215292 -3326429 -2342803 -2090007 -1368271 -347455 -157429 -865293
4225 -865293 -1210503 -181952 1879741 3639783 3838159 2180406 -478699 -2722156 -3356558
4216 -3356558 -1944450 795881 3087298 3500357 2691794 2851919 4788535 6455866 5283395
4207 5283395 1281368 -3110997 -5725676 -6291840 -5819676 -5359878 -5342844 -5591580 -5913259
4198 -5913259 -6555812 -7641339 -8486914 -8409589 -7803445 -7049414 -4882703 -83817 5168571
4189 5168571 6378969 2159031 -3765272 -7085002 -7130217 -5382616 -2525647 928268 3282199
4180 3282199 3387320 2374087 1791335 1401820 386969 -881735 -1837597 -2849646 -4039064
$$ packed form
4243f969434L034479M358696L212298k11342k322009j350852o9590j119879k711924
4234d149557j824373P58638J888863R83626K52796P21736J020816J90026p07864
4225h65293l45210J028551K061693J760042J98376j657753k659105k243457o34402
4216c356558J412108K740331K291417M13059q08563J60125J936616J667331j172471
4207E283395m002027m392365k614679n66164M72164M59798J7034k48736l21679
4198e913259o42553j085527q45575P7325O06144P54031K166711M798886N252388
4189E168571J210398m219938n924303l319730m5215J747601K856969L453915K353931
4180C282199J05121j013233n82752l89515j014851j268704r55862j012049j189418
$$ plain form
4171 -4039064 -4780686 -5318552 -6444160 -6806805 -4003966 391466 1108938 -3494354 -8961893
4162 -8961893 -12068204 -15173881 -19644060 -21084725 -16746548 -12031330 -12618435 -14973398
4154 -14973398 -12632160 -7611003 -6472531 -8501609 -7941809 -5678819 -7811220 -13749181
4146 -13749181 -17061289 -17759293 -21625734 -27215269 -27648870 -27122150 -38562544 -58123242
4138 -58123242 -59488166 -26863937 19191999 44461567 40882062 27919548 21104526 17890679
4130 17890679 13413580 11545128 15041359 18333954 17065000 15435803 17884922 20855971
4122 20855971 18797177 12762069 7708904 5496667 5038773 5823715 7275008 7445297 5639114
4113 5639114 4003416 4222718 5269644 6260983 8259625 10977242 11038574 6471763 360306
$$ packed form
4171d039064p41622n37866j125608l62645K802839M395432P17472m603292n467539
4162h961893l106311l105677m470179j440665M338177M715218n87105k354963
4154a4973398K341238N021157J138472k029078N59800K262990k132401n937961
4146a3749181l312108o98004l866441n589535m33601N26720j1440394j9560698
4138e8123242j364924L2624229M6055936K5269568l579505j2962514o815022l213847
4130A7890679m477099j868452L496231L292595j268954j629197K449119K971049
4122B0855971k058794o035108n053165k212237m57894P84942J451293J70289j806183
4113E639114j635698K19302J046926R91339J998642K717617O1332m566811o111457
$$ plain form
4104 360306 -2804596 -2373167 -771818 353191 690362 -156620 -1982873 -3167433 -2768293
4095 -2768293 -2200008 -2817467 -3250854 -1531092 1178316 1626404 -966617 -3709461 -3817104
4086 -3817104 -1877152 -542286 -1001342 -1832334 -1262343 353013 1089903 206464 -907925
4077 -907925 -960472 -597562 -986351 -1727228 -1585746 -384915 1284895 3277414 5191166
4068 5191166 5521278 3468300 668238 -917965 -1740086 -2906775 -3040595 -203931 3751882
4059 3751882 4542412 1303006 -2454813 -4121732 -4551610 -4578206 -2941458 538352 3179980
4050 3179980 3235918 2861582 4874682 8523670 10700945 9852937 6884836 3619820 1888991
4041 1888991 2652590 4602029 5104631 3678650 2737403 3736218 4816331 3928544 2061740
$$ packed form
4104C60306l164902M31429J601349J125009L37171q46982j826253j184560L99140
4095b768293N68285o17459m33387J719762K709408M48088k593021k742844j07643
4086c817104J939952J334866m59056q30992N69991J615356P36890q83439j114389
4077i07925n2547L62910l88789p40877J41482J200831J669810J992519J913752
4068E191166L30112k052978k800062j586203q22121j166689j33820K836664L955813
4059C751882P90530l239406l757819j666919m29878k6596J636748L479810K641628
4050C179980N5938l74336K013100L648988K177275q48008k968101l265016j730829
4041A888991P63599J949439N02602j425981r41247R98815J080113q87787j866804
$$ plain form
4032 2061740 1217972 1109228 339163 -607062 -164922 1400332 2246623 1669324 746692
4023 746692 747780 2299328 5317645 8371174 9204105 7559985 6400054 8382136 11976599
4014 11976599 13111990 10150268 5347037 1789541 701831 1520266 2913341 3732826
4006 3732826 4223279 6011173 9700540 13050379 13068690 9602342 5406163 2898513 2219609
3997 2219609 2238634 1995220 1098522 -91312 -559996 257749 1643868 2596467 3181777
3988 3181777 3985366 4769391 4740123 3731542 2227166 815615 476525 2348215 5835375
3979 5835375 7975828 6564833 3285654 1730110 2659151 3391963 1911872 -727288 -2692477
3970 -2692477 -3930526 -5194854 -6025725 -5242006 -2809241 -63659 1658107 1920826 1114518
$$ packed form
4032B061740q43768j08744p70065r46225M42140J565254Q46291n77299r22632
4023G46692J088J551548L018317L053529Q32931j644120j159931J982082L594463
4014A1976599J135391k961722m803231l557496j087710Q18435J393075Q19485
4006C732826M90453J787894L689367L349839J8311l466348m196179k507650o78904
3997B219609J9025k43414q96698j189834m68684Q17745J386119R52599N85310
3988C181777Q03589P84025k9268j008581j504376j411551l39090J871690L487160
3979E835375K140453j410995l279179j555544R29041P32812j480091k639160j965189
3970b692477j238049j264328q30871P83719K432765K745582J721766K62719q06308
$$ plain form
3961 1114518 225716 483581 2458207 5254596 6952269 6213319 3572446 1060145 421425
3952 421425 1675282 3397588 4164548 3546806 2118905 1063370 1500142 3471421 5656208
3943 5656208 6715190 6698977 6395162 5749709 4165282 2104001 907224 1025079 1930594
3934 1930594 3718632 6863581 10190785 11387099 10312870 9566082 10625821 11671321
3926 11671321 10757733 8994493 8550986 9301510 9723823 9733183 10257559 10988401 10814281 9806090
3916 9806090 8833305 7964428 7061979 6980689 8117971 8680795 6622021 2665855 -612697
3907 -612697 -1969472 -1802216 -422265 1554476 2159379 248804 -2024018 -1809911 127683
3898 127683 921173 637601 1818419 4140000 4145967 1369908 218356 3502300 7834265
$$ packed form
3961A114518q88802K57865J974626K796389J697673p38950k640873k512301o38720
3952D21425J253857J722306P66960o17742j427901j055535M36772J971279K184787
3943E656208J058982j6213l03815o45453j584427k061281j196777J17855R05515
3934A930594J788038L144949L327204J196314j074229p46788J059739J045500
3926A1671321r13588j763240m43507P50524M22313R360N24376P30842j74120j008191
3916I806090r72785q68877r02449q1290J137282N62824k058774l956166l278552
3907f12697j356775J67256J379951J976741O04903j910575k272822K14107J937594
3898A27683P93490k83572J180818K321581N967k776059j151552L283944M331965
$$ plain form
3889 7834265 8374669 5329406 2604173 2054263 2280003 1939210 1290557 822637 567767
3880 567767 683071 1300158 2150784 3273989 5231157 7738345 9399636 9887259 10699506
3871 10699506 12185780 11723574 7322328 1671347 -416926 1876427 4743242 5275300
3863 5275300 4608381 4649037 4468907 2046387 -1925099 -4274340 -3180731 -150232 2096392
3854 2096392 2584753 2338157 2306852 1972930 300184 -2361466 -3973462 -2758446 631509
3845 631509 3187292 2102934 -2470910 -7240931 -8656807 -6154302 -2338590 -16311
3837 -16311 375616 329607 1252266 3468284 6273136 8028892 7016883 3354484 -618397
3828 -618397 -3101716 -5175230 -8753163 -12978924 -14901437 -13522241 -10734140 -7992269
$$ packed form
3889G834265N40404l045263k725233n49910K25740l40793o48653m67920k54870
3880E67767J15304O17087Q50626J123205J957168K507188J661291M87623Q12247
3871A0699506J486274m62206m401246n650981k088273K293353K866815N32058
3863E275300o66919M0656j80130k422520l971486k349241J093609L030499K246624
3854B096392M88361k46596l1305l33922j672746k661650j611996J215016L389955
3845F31509K555783j084358m573844m770021j415876K502505L815712K322279
3837a6311L91927m6009R22659K216018K804852J755756j012009l662399l972881
3828f18397k483319k073514l577933m225761j922513J379196K788101K741871
$$ plain form
3820 -7992269 -4662573 -560583 2410819 2778512 1733127 1094960 628203 -718139 -2209931
3811 -2209931 -2208537 -1015769 -705640 -2139054 -3837826 -4092344 -2963997 -1886854 -2121319
3802 -2121319 -3787159 -5771631 -6451527 -4977702 -1986510 1075384 3124068 3831850 3325115
3793 3325115 1915425 17909 -1800639 -2708323 -1979677 83040 2120015 3254564 3953885
3784 3953885 4452367 3430507 -13404 -3943897 -5355929 -3829632 -1040612 2676606
3776 2676606 8009482 13129507 14540964 12349569 10612725 10940864 10103767 6410891 3913058
3767 3913058 6400313 11064537 12895407 12336844 13061136 14202241 11023980 2908264 -5105148
3758 -5105148 -9327196 -10861200 -11181365 -9380455 -5631641 -2970302 -3243287 -4612057 -4993980
$$ packed form
3820g992269L329696M101990K971402L67693j045385o38167m66757j346342j491792
3811b209931J394J192768L10129j433414j698772k54518J128347J077143k34465
3802b121319j665840j984472o79896J473825K991192L061894K048684P07782n06735
3793C325115j409690j897516j818548r07684P28646K062717K036975J134549O99321
3784C953885M98482j021860l443911l930493j412032J526297K789020L717218
3776B676606N332876N120025J411457k191395j736844L28139q37097l692876k497833
3767C913058K487255M664224J830870n58563P24292J141105l178261q115716q013412
3758e105148m222048j534004l20165J800910L748814K661339k72985j368770l81923
$$ plain form
3749 -4993980 -4782814 -4459326 -3045192 -1083112 -1607539 -5362274 -8188201 -6412987 -2310940
3740 -2310940 -806517 -2785674 -5182200 -6111545 -6218758 -5821670 -4356611 -2600650 -2413237
3731 -2413237 -3966541 -5568943 -6390426 -7261418 -8620701 -9582213 -9296452 -7790001 -5516999
3722 -5516999 -3381612 -2758497 -3977153 -5302560 -5005458 -3751472 -3134542 -2746480 -1127979
3713 -1127979 947941 996214 -1308566 -3548123 -4287589 -4662744 -5420374 -5054615 -2330579
3704 -2330579 1470031 4390459 6167186 7281068 7257664 5592520 3171667 1236865 -63203
3695 -63203 -803747 -178795 2199313 4952722 6544355 7363196 8540533 9547977 8961988
3686 8961988 7116547 5855255 5659189 5073316 3398401 2090459 2623324 4342694 5457367
$$ packed form
3749d993980K11166L23488J414134J962080n24427l754735k825927J775214M102047
3740b310940J504423j979157k396526r29345j07213L97088J465059J755961J87413
3731b413237j553304j602402q21483q70992j359283r61512K85761J506451K273002
3722e516999K135387O23115j218656j325407K97102J253986O16930L88062J618501
3713a127979K075920M8273k304780k239557p39466l75155p57630L65759K724036
3704b330579L800610K920428J776727J113882k3404j665144k420853j934802j300068
3695f3203p40544O24952K378108K753409J591633Q18841J177337J007444n85989
3686H961988j845441j261292j96066n85873j674915j307942N32865J719370J114673
$$ plain form
3677 5457367 5264641 4488462 4049740 4356693 5426998 6861565 7621889 6366357 2522766
3668 2522766 -2630460 -6095824 -5246839 -510780 4472651 6150578 4234421 1003249
3660 1003249 -1723354 -3527688 -3909985 -2079921 1152618 3099563 2103556 -251826 -964375
3651 -964375 972959 3821265 5130877 3744929 419008 -2692223 -3633817 -2432809 -798590
3642 -798590 389995 2284091 5874944 9714020 11293602 10080830 7677098 5383165
3634 5383165 3231647 1301976 300318 523259 1597823 3531126 6685125 10347893
3626 10347893 12704240 12858814 11767106 10589921 9302099 7638455 6171537 5317272
3618 5317272 4154218 1542983 -1947760 -4348149 -4479076 -3104906 -1950801 -2127595 -3469635
$$ packed form
3677E457367j92726p76179m38722L06953J070305J434567P60324j255532l843591
3668B522766n153226l465364Q48985M736059M983431J677927j916157l231172
3660A003249k726603j804334l82297J830064L232539J946945r96007k355382p12549
3651i64375J937334K848306J309612j385948l325921l111231r41594J201008J634219
3642g98590J188585J894096L590853L839076J579582j212772k403732k293933
3634E383165k151518j929671j001658K22941J074564J933303L153999L662768
3626A0347893K356347J54574j091708j177185j287822j663644j466918q54265
3618E317272j163054k611235l490743k400389j30927J374170J154105j76794j342040
$$ plain form
3609 -3469635 -4946976 -5604415 -5183722 -3857427 -1744221 734120 2318143 1764474 -631771
3600 -631771 -3303709 -5318379 -6906044 -7949777 -7528002 -5691059 -4139053 -3894705 -3551182
3591 -3551182 -1300567 2301759 5239492 6911211 8224561 9196698 8457432 5417624 1415786
3582 1415786 -1664610 -2786197 -1718074 1005238 3828520 5282090 5816881 7211051
3574 7211051 9533176 10125755 6837561 1390703 -1922838 -822490 2671582 4679895
3566 4679895 3496981 813808 -723250 -504638 -77333 -594927 -1192971 -509925 1009861
3557 1009861 1582436 679057 -147661 574912 2256490 3127156 2544648 1663957 1856499
3548 1856499 2912809 3078114 975420 -2638623 -5482256 -6205808 -5559861 -4778602 -3820051
$$ packed form
3609c469635j477341o57439M20693J326295K113206K478341J584023n53669k396245
3600f31771k671938k014670j587665j043733M21775J836943J552006K44348L43523
3591c551182K250615L602326K937733J671719J313350R72137p39266l039808m001838
3582A415786l080396j121587J068123K723312K823282J453570N34791J394170
3574G211051K322125N92579l288194n446858l313541J100348L494072K008313
3566D679895j182914k683173j537058K18612M27305n17594n98044O83046J519786
3557A009861N72575r03379q26718P22573J681578Q70666n82508q80691J92542
3548A856499J056310J65305k102694l614043k843633p23552O45947P81259R58551
$$ plain form
3539 -3820051 -2193635 -617512 -253750 -704371 -600142 -227025 -1527627 -4751916 -7012075
3530 -7012075 -5666921 -1940697 543697 294104 -660687 9215 1720063 1717227 -1471345
3521 -1471345 -5935482 -7895629 -5339658 -55330 4238541 5736807 6006763 7483543
3513 7483543 10253499 12001227 10819830 7293729 3650122 1354920 -49264 -1837185
3505 -1837185 -4338986 -6724621 -8358241 -9531749 -10413575 -10063756 -7572169 -3983085 -1948147
3496 -1948147 -3062475 -6135160 -8351417 -7703096 -4249609 312591 3964501 5671075
3488 5671075 5824011 5569019 5959831 7665641 10493596 12543244 11014386 5435077 -520426
3479 -520426 -2381276 -95911 1956231 512012 -2969047 -5084301 -4976039 -4472664 -4929959
$$ packed form
3539c820051J626416J576123L63762m50621J04229L73117j300602l224289k260159
3530g012075J345154L726224K484394k49593r54791O69902J710848k836l188572
3521a471345m464137j960147K555971N284328M293871J498266K69956J476780
3513G483543K769956J747728j181397l526101l643607k295202j404184j787921
3505a837185k501801k385635j633620j173508q81826L49819K491587L589084K034938
3496a948147j114328l072685k216257O48321L453487M562200L651910J706574
3488E671075J52936k54992L90812J705810K827955K049648j528858n579309n955503
3479e20426j860850K285365K052142j444219l481059k115254J08262N03375m57295
$$ plain form
3470 -4929959 -5693169 -5396983 -3587570 -1115776 447004 102730 -1363166 -1937467 -590687
3461 -590687 1633627 3068982 3115784 2036837 175340 -1746470 -2483898 -1537331 -15585
3452 -15585 655670 343116 -231250 -774372 -1270342 -1217500 -223079 975224 1173797 274201
3442 274201 -633251 -650462 62667 615448 191482 -1081653 -1815980 -621315 2042444
3433 2042444 4251828 5143125 5557431 5551166 3390346 -1208588 -4645134 -2943732 3021916
3424 3021916 8358092 9903703 8652053 6516951 3642575 -60297 -3178506 -4371206
3416 -4371206 -4271410 -4258119 -4309682 -3536470 -2184044 -1591687 -2210155 -2790743 -1823481 882506
3406 882506 4378580 7905392 11437018 14684641 16038257 13437879 6734398 -1343378
$$ packed form
3470d929959p63210K96186J809413K471794J562780l44274j465896n74301J346780
3461e90687K224314J435355M6802j078947j861497j921810p37428R46567J521746
3452a5585O71255l12554n74366n43122m95970N2842R94421J198303J98573q99596
3442B74201r07452j7211P13129N52781m23966j273135p34327J194665K663759
3433B042444K209384Q91297M14306o265k160820m598934l436546J701402N965648
3424C021916N336176J545611j251650k135102k874376l702872l118209j192700
3416d371206R9796J3291n1563P73212J352426N92357o18468n80588R67262K705987
3406H82506L496074L526812L531626L247623J353616k600378o703481q077776
$$ plain form
3398 -1343378 -7105494 -8574715 -6264503 -2285024 751246 1058290 -762590 -1909289
3390 -1909289 -250741 3174169 5292896 4223497 714804 -2809291 -3725483 -848078
3382 -848078 3893649 6298438 4204899 358014 -787013 1629873 4864308 7012617
3374 7012617 8525361 9412020 8267460 5051999 2020013 486089 -1004219 -3865987
3366 -3865987 -7056374 -9051623 -10135104 -10845185 -10028718 -6627251 -2017742 1522013 3545388
3357 3545388 4719897 4665719 2810646 514314 -47699 1262037 2794862 3759032 4629794
3348 4629794 5385823 5458495 5181282 5220241 4821730 2888044 693336 967133 3836155
3339 3836155 6144564 5673089 3804233 2859733 2820481 2157332 300163 -2272596 -5127218
$$ packed form
3398a343378n762116j469221K310212L979479L036270L07044j820880j146699
3390a909289J658548L424910K118727j069399l508693l524095r16192K877405
3382h48078M741727K404789k093539l846885j145027K416886L234435K148309
3374G012617J512744Q86659j144560l215461l031986j533924j490308k861768
3366c865987l190387j995249j083481p10081Q16467L401467M609509L539755K023375
3357C545388J174509n4178j855073k296332n62013J309736J532825R64170Q70762
3348D629794P56029P2672k77213L8959l98511j933686k194708K73797K869022
3339C836155K308409m71475j868856r44500l9252o63149j857169k572759k854622
$$ plain form
3330 -5127218 -7540231 -8122600 -6295383 -3415961 -1212107 115829 1132340 1612089 1256904
3321 1256904 1023136 1940559 3193810 3156880 1879431 693463 -225923 -1683542 -2938638
3312 -2938638 -1976463 938564 2399676 9315 -4374384 -7080400 -6842527 -4985053 -2835134
3303 -2835134 -994078 -191651 -549856 -358774 2191271 5960598 7574008 5671900 2792449
3294 2792449 2382094 5214125 9257323 11853252 11520876 8756596 5581268 3452958 1625662
3285 1625662 -1233633 -4151460 -4706184 -3032882 -2412263 -4733702 -7755386 -8577914 -7687182
3276 -7687182 -7300767 -7433187 -6310794 -3718248 -1320133 -137529 36326 -767074 -2325421
3267 -2325421 -2854919 -552795 3438145 5958131 5959238 5541494 6628485 8794483 10747235
$$ packed form
3330e127218k413013n82369J827217K879422K203854J327936J016511M79749l55185
3321A256904k33768R17423J253251l6930j277449j185968r19386j457619j255096
3312b938638R62175K915027J461112k390361m383699k706016K37873J857474K149919
3303b835134J841056Q02427l58205J91082K550045L769327J613410j902108k879451
3294B792449m10355K832031M043198K595929l32376k764280l175328k128310j827296
3285A625662k859295k917827n54724J673302O20619k321439l021684q22528Q90732
3276g687182L86415j32420J122393K592546K398115J182604J73855q03400j558347
3267b325421n29498K302124L990940K519986J107m17744J086991K165998J952752
$$ plain form
3258 10747235 11771505 11239053 8945327 6583354 6596846 8685359 9694874 8060619 6091333
3249 6091333 6418574 8346098 9568777 9657653 9598152 9137019 7015846 3473810 592865
3240 592865 -7953 1240128 2535361 2366249 792331 -606096 -556661 231654 310001
3231 310001 124420 1434261 3901615 4827755 3316427 2042808 3084197 4465826 3356320
3222 3356320 694264 -390063 548185 1180107 569056 237871 960952 1318819 150561
3213 150561 -1650238 -2494113 -1709772 503080 3135861 4113105 1701147 -3127464 -6951844
3204 -6951844 -7112522 -3843546 885063 5469658 9190370 11530549 11664021 8743750 3136353
3195 3136353 -2536983 -4824865 -2921206 193004 1109659 -555374 -3156595 -5845623
$$ packed form
3258A0747235J024270n32452k293726k361973J3492K088513J009515j634255j969286
3249F091333L27241J927524J222679Q8876n9501m61133k121173l542036k880945
3240E92865o00818J248081J295233j69112j573918j398427M9435P88315P8347
3231C10001j85581J309841K467354R26140j511328j273619J041389J381629j109506
3222C356320k662056j084327R38248O31922o11051l31185P23081L57867j168258
3213A50561j800799q43875P84341K212852K632781R77244k411958m828611l824380
3204f951844j60678L268976M728609M584595L720712K340179J33472k920271n607397
3195C136353n673336k287882J903659L114210R16655j665033k601221k689028
$$ plain form
3187 -5845623 -8405695 -9595847 -8311109 -5834357 -4437732 -4116310 -3209394 -1876453 -2008135
3178 -2008135 -3579332 -4197059 -2976692 -1915047 -2301128 -2603235 -1555273 -816937 -2379703
3169 -2379703 -5105833 -6115989 -4584599 -2268915 -1014843 -1348675 -2922809 -4804585
3161 -4804585 -5557518 -4234410 -1358492 1528093 2966405 2132677 -690890 -3636965 -4267642
3152 -4267642 -1996759 1050794 2268489 1215003 -365248 -617946 697186 2148629
3144 2148629 2183374 1023936 515242 1409254 1838564 87057 -2061637 -1247343 2435698
3135 2435698 5241632 5181740 4697257 6560772 9700737 11112407 10061067 8293088 7321402
3126 7321402 7313788 7661516 7100836 4297102 -171071 -3368287 -3093448 -741631 204773
$$ packed form
3187e845623k560072j190152J284738K476752J396625L21422R06916J332941j31682
3178b008135j571197o17727J220367J061645l86081l02107J047962P38336j562766
3169b379703k726130j010156J531390K315684J254072l33832j574134j881776
3161d804585p52933J323108K875918K886585J438312q33728k823567k946075o30677
3152d267642K270883L047553J217695j053486j580251k52698J315132J451443
3144B148629L4745j159438n08694Q94012M29310j751507k148694Q14294L683041
3135B435698K805934n9892m84483J863515L139965J411670j051340j767979r71686
3126G321402p614L47728n60680k803734m468173l197216K74839K351817R46404
$$ plain form
3117 204773 -2026773 -6103765 -9197408 -9241648 -6552062 -3811094 -3371164 -4396837 -4423190
3108 -4423190 -3743959 -5262869 -9061712 -10754009 -7596938 -2964283 -1449986 -2248668 -1424513
3099 -1424513 1228317 2178161 111687 -2546442 -3902410 -4245149 -3296157 -44674 3861878
3090 3861878 4624737 1706991 -765339 165551 2171382 1491009 -1767798 -4621747 -5440612
3081 -5440612 -4644327 -2670372 131964 2230674 1758895 -1286635 -4870007 -6753738 -5833397
3072 -5833397 -2332177 2406558 6716312 9716693 11176316 10401429 6713987 1459137
3064 1459137 -2222651 -2784106 -2071621 -2457542 -3456504 -2889638 -548994 1321416 1192060
3055 1192060 218858 475077 2255106 3928951 4058290 2841806 1272153 -409643 -2463428
$$ packed form
3117B04773k231546m076992l093643m4240K689586K740968M39930j025673k6353
3108d423190O79231j518910l798843j692297L157071M632655J514297p98682Q24155
3099a424513K652830R49844k066474k658129j355968l42739R48992L251483L906552
3090C861878P62859k917746k472330R30890K005831o80373l258807k853949q18865
3081e440612P96285J973955K802336K098710m71779l045530l583372j883731R20341
3072e833397L501220M738735M309754L000381J459623p74887l687442n254850
3064A459137l681788n61455P12485l85921r98962N66866K340644J870410j29356
3055A192060r73202K56219J780029J673845J29339j216484j569653j681796k053785
$$ plain form
3046 -2463428 -4083850 -3662394 -1339541 277586 -605028 -2372826 -2678463 -2358876 -3794757
3037 -3794757 -6174438 -6096452 -3173738 -1122622 -1904826 -2522274 -22343 3450402 3685331
3028 3685331 244675 -3846862 -6455275 -7164810 -5306168 -866558 3339198 4010437 1782967
3019 1782967 157692 247061 149130 -324438 1436759 5678088 7950085 4801571 -812891
3010 -812891 -3029341 -555132 2338132 1652557 -2235198 -6350440 -8681158 -9282621 -9334158
3001 -9334158 -9909101 -10987109 -11316336 -9691031 -6320952 -2437008 1139406 4231811 6397503
2992 6397503 6903434 5815267 4254281 3258952 2992588 3210136 3749898 4250678 4127978
2983 4127978 3418577 3204008 4569147 7239391 9615837 10134456 8499071 5805877 3596193
$$ packed form
3046b463428j620422M21456K322853J617127q82614j767798l05637L19587j435881
3037c794757k379681P7986K922714K051116p82204o17448K499931L472745K34929
3028C685331l440656m091537k608413p09535J858642M439610M205756O71239k227470
3019A782967j625275Q9369r7931m73568J761197M241329K271997l148514n614462
3010h12891k216450K474209K893264o85575l887755m115242k330718o01463n1537
3001i334158n74943j078008l29227J625305L370079L883944L576414L092405K165692
2992F397503N05931j088167j560986r95329k66364K17548N39762N00780j22700
2983D127978p09401k14569J365139K670244K376446N18619j635385k693194k209684
$$ plain form
2974 3596193 2559723 2072998 1199822 -74027 -1200833 -2416020 -4488062 -6817675 -7337759
2965 -7337759 -5455137 -3732465 -4763939 -7214834 -7348545 -4349577 -1470476 -1215251 -2061713
2956 -2061713 -1525179 -108339 176119 -461695 -184307 1007187 1361610 775104 1167532
2947 1167532 2931634 3747928 2186529 300185 971053 4124954 7137173 7974047 6589792
2938 6589792 4094737 1874541 953939 1145506 1250974 721979 292375 349715 -60042
2929 -60042 -1551845 -3002965 -3246017 -3013815 -3502056 -3978661 -2823903 -254617 2174298
2920 2174298 4285830 6922528 8905476 7394734 2437542 -1431006 -141924 4896075
2912 4896075 8658923 8303416 5222152 2135143 317642 -305988 -225787 -100633 -271738
$$ packed form
2974C596193j036470m86725q73176j273849j126806j215187k072042k329613n20084
2965g337759J882622J722672j031474k450895j33711K998968K879101K55225q46462
2956b061713N36534J416840K84458o37814K77388J191494L54423n86506L92428
2947A167532J764102Q16294j561399j886344O70868L153901L012219Q36874j384255
2938F589792k495055k220196r20602J91567J05468n28995m29604N7340m09757
2929f0042j491803j451120k43052K32202m88241m76605J154758K569286K428915
2920B174298K111532K636698J982948j510742m957192l868548J289082N037999
2912D896075L762848l55507l081264l087009j817501o23630Q0201J25154j71105
$$ plain form
2903 -271738 -57628 1566678 4281670 6277868 6080031 3730261 91003 -3840740 -6561898
2894 -6561898 -6433782 -3452263 299198 2925723 4444449 5163202 3811137 -480707 -5075332
2885 -5075332 -5571067 -1157512 4174375 6671157 6797615 6961743 7683669 8118733 8449304
2876 8449304 9117453 8986995 7076986 5191906 5754188 7570084 7232171 4817665 4332507
2867 4332507 7360873 10047283 8644830 4959343 3301634 4302466 5173475 4765277 4736003
2858 4736003 5902511 6705103 6039679 5201412 5927201 8061984 10078267 10783611 9744784
2849 9744784 6903660 2661200 -1863410 -5149530 -6176951 -5403984 -4720863 -5518297 -6623030
2840 -6623030 -5434397 -1651167 1768530 2510672 2076344 3281109 6091028 8294756 9228962
$$ packed form
2903b71738K14110J624306K714992J996198j97837k349770l639258l931743k721158
2894f561898J28116K981519L751461K626525J518726P18753j352065m291844m594625
2885e075332m95735M413555N331887K496782J26458J64128P21926M35064L30571
2876H449304O68149j30458j910009j885080N62282J815896l37913k414506m85158
2867D332507L028366K686410j402453l685487j657709J000832Q71009m08198k9274
2858D736003J166508Q02592o65424q38267P25789K134783K016283P05344j038827
2849I744784k841124m242460m524610l286120j027421P72967O83121p97434j104733
2840f623030J188633L783230L419697P42142m34328J204765K809919K203728R34206
$$ plain form
2831 9228962 10070921 10978161 10953197 10620216 12015955 14779299 15396362 11722542 6013148
2822 6013148 1775086 -551472 -2886685 -5919982 -8363375 -9125054 -8311995 -6189419 -2729542
2813 -2729542 1435875 4636233 5398870 3903839 1919705 1130320 1561950 2024266 2084242
2804 2084242 2632144 3966965 4670263 3799421 3052037 4616128 7449978 8129090 5343056
2795 5343056 1105106 -2691149 -6195966 -9404261 -10870304 -10040666 -8513963 -7401591
2787 -7401591 -5580027 -2266845 725877 1241750 -516723 -3349576 -7068071 -10938026
2779 -10938026 -12286346 -9681103 -5981986 -4998873 -6187950 -6045358 -3979464 -2857786
2771 -2857786 -3508658 -2629831 2362615 9333049 14045158 14753409 12663812 9564977 6678703
$$ packed form
2831I228962Q41959R07240k4964l32981J395739K763344O17063l673820n709394
2822F013148m238062k326558k335213l033297k443393p61679Q13059K122576L459877
2813b729542M165417L200358P62637j495031j984134p89385M31630M62316N9976
2804B084242N47902J334821P03298q70842p47384J564091K833850O79112k786034
2795E343056m237950l796255l504817l208295j466043Q29638J526703J112372
2787g401591J821564L313182K992722N15873j758473k832853l718495l869955
2779a0938026j348320K605243L699117R83113j189077J42592K065894J121678
2771b857786o50872Q78827M992446O970434M712109P08251k089597l098835k886274
$$ plain form
2762 6678703 4780674 3973379 3651626 3211783 2351959 895975 -571399 -317188 2453284
2753 2453284 5290100 4709479 1181479 -724025 1653423 5429489 6330548 4261404 2388248
2744 2388248 2387341 3380681 4612966 6256885 7697552 7656644 6451777 5913298 6322729 5371780
2734 5371780 1329684 -4102968 -7365835 -6703978 -3298989 540722 3160929 3876384 2813939
2725 2813939 921037 -509687 -953862 -1238734 -2643939 -5301732 -7714290 -8081959 -6059038
2716 -6059038 -3079936 -1117245 -1325595 -3599113 -6830604 -9488104 -10447409 -9612117 -7662584
2707 -7662584 -5326256 -3196924 -1930229 -1765752 -1803858 -725207 1314980 2317907 671961
2698 671961 -2757376 -5512600 -6263134 -5943132 -6153258 -6929740 -6442943 -3067193 2264050
$$ packed form
2762F678703j898029q07295l21753m39843q59824j455984j467374K54211K770472
2753B453284K836816n80621l528000j905504K377448L776066R01059k069144j873156
2744B388248r07R93340J232285J643919J440667m0908j204867n38479M09431r50949
2734E371780m042096n432652l262867O61857L404989L839711K620207P15455j062445
2725B813939j892902j430724m44175k84872j405205k657793k412558l67669K022921
2716f059038K979102J962691k08350k273518l231491k657500r59305Q35292J949533
2707g662584K336328K129332J266695J64477l8106J078651K040187J002927j645946
2698F71961l429337k755224p50534L20002k10126p76482M86797L375750N331243
$$ plain form
2689 2264050 6254285 6303607 2995486 -1099988 -4377963 -6605544 -7092749 -4983941 -1877635
2680 -1877635 -1468648 -4881097 -8435303 -8255374 -5444852 -4035451 -5019856 -5671666 -4491442
2671 -4491442 -3445011 -4519121 -6847803 -8489378 -8868710 -8205620 -6437209 -4027571 -2220884
2662 -2220884 -1317414 -303626 787132 138062 -2828108 -5760540 -6558713 -6300393 -6862136
2653 -6862136 -7575790 -6925205 -5780532 -5638371 -5020986 -1584348 2788189 3351651 -613881
2644 -613881 -4496792 -5098290 -4599137 -5841937 -7477876 -6723530 -4045910 -1940156 -1198281
2635 -1198281 -1367113 -2893659 -5633760 -7044860 -5388159 -3313201 -4531403 -8043847
2627 -8043847 -9750719 -9079815 -9409373 -11744504 -12774206 -10472660 -7250828 -5618255 -4690750
$$ packed form
2689B264050L990235M9322l308121m095474l277975k227581m87205K108808L106306
2680a877635M08987l412449l554206J79929K810522J409401r84405o51810J180224
2671d491442J046431j074110k328682j641575l79332O63090J768411K409638J806687
2662b220884R03470J013788J090758o49070k966170k932432p98173K58320n61743
2653f862136p13654O50585J144673J42161O17385L436638M372537N63462l965532
2644f13881l882911o01498M99153j242800j635939P54346K677620K105754P41875
2635a198281j68832j526546k740101j411100J656701K074958j218202l512444
2627h043847j706872O70904l29558k335131j029702K301546L221832J632573R27505
$$ plain form
2618 -4690750 -3469302 -3974744 -7976307 -13336344 -16728095 -17728131 -17334233 -14989575 -10683341
2609 -10683341 -7755231 -9168200 -12185504 -11299626 -6116941 -1884526 -1807326 -3180705 -2365574
2600 -2365574 309187 2505929 3520729 3761221 3117471 2060274 2217785 3592894 3106022
2591 3106022 -1504295 -7638636 -10350347 -8262948 -4589556 -2549779 -2166092 -2008681 -2010212
2582 -2010212 -3192341 -5445355 -6949947 -6227249 -4282420 -3807767 -5807606 -7896477 -7123839
2573 -7123839 -3823229 -880985 435137 1393855 2204159 644793 -3855530 -7359052 -5567386
2564 -5567386 458014 5515327 6540790 5061534 3743406 3273661 3124202 3068270 2936637
2555 2936637 2337957 1388492 687097 241865 -490200 -1347787 -1480404 -813525 -281947 -401664
$$ packed form
2618d690750J221448n05442m001563n360037l391751j000036L93898K344658M306234
2609a0683341K928110j412969l017304Q85878N182685M232415P7200j373379Q15131
2600b365574K674761K196742J014800K40492o43750j057197J57511J375109m86872
2591C106022m610317o134341k711711K087399L673392K039777L83687J57411j531
2582b010212j182129k253014j504592P22698J944829M74653j999839k088871P72638
2573g123839L300610K942244J316122R58718Q10304j559366m500323l503522J791666
2564e567386O025400N057313J025463j479256j318128m69745j49459n5932j31633
2555B936637n98680r49465p01395m45232p32065q57587j32617O66879N31578j19717
$$ plain form
2545 -401664 -776918 -1112078 -1440671 -1337854 -413041 324883 -629562 -2642398 -3126078 -1118130
2535 -1118130 1233181 1952454 2276930 4713553 9168601 12809527 13395186 11458417 9424688
2526 9424688 9465013 11896107 14987860 16666043 16725267 16657974 17144554 17108014 15900903 14746889
2516 14746889 14652841 14328183 12017989 8482939 6261109 6491625 8145697 9834198 10573981
2507 10573981 9323838 5987808 2881027 3033359 6536179 10263705 11619706 10928153
2499 10928153 9756818 8712698 7641467 6403023 4598587 1914116 -573095 -999508
2491 -999508 515816 1380460 -23397 -2044605 -2443609 -1837772 -2428865 -4307517 -5321631
2482 -5321631 -4307050 -2338091 -639311 884656 2562858 3900386 4280299 3722723 2469434
$$ packed form
2545d01664l75254l35160l28593J02817R24813P37924r54445k012836m83680K007948
2535a118130K351311P19273L24476K436623M455048L640926N85659j936769k033729
2526I424688M0325K431094L091753J678183N9224o7293M86580l6540j207111j154014
2516A4746889r4048l24658k310194l535050k221830K30516J654072J688501P39783
2507A0573981j250143l336030l106781J52332L502820L727526J356001o91553
2499A0928153j171335j044120j071231j238444j804436k684471k487211m26413
2491i99508J515324Q64644j403857k021208l99004O05837n91093j878652j014114
2482e321631J014581J968959J698780J523967J678202J337528L79913n57576j253289
$$ plain form
2473 2469434 682394 -1073235 -1936521 -1849421 -1873027 -2903232 -4499785 -5317339 -4373476
2464 -4373476 -1799725 1204590 3050838 2850467 1038391 -1193861 -2828361 -3142102 -1574872
2455 -1574872 1662994 5241121 7928129 9881698 11757237 12977487 12272832 9739768
2447 9739768 6814710 4271416 2043320 1100403 3105240 7293036 10068788 9392746 7576274
2438 7576274 7564236 8171837 5940497 853777 -3087210 -3269401 -1535283 -848504 -1311739
2429 -1311739 -1077276 451730 2087282 2658557 2027278 956439 911815 3075297 6426714
2420 6426714 7800473 5420424 1724676 844437 3425453 5791126 4524700 122278
2412 122278 -4503082 -7284113 -7494255 -4685196 576891 5452303 6711015 4461397 2261490
$$ packed form
2473B469434j787040j755629q63286Q7100k3606j030205j596553q17554R43863
2464d373476K573751L004315J846248k00371j812076k232252j634500l13741J567230
2455a574872L237866L578127K687008J953569J875539J220250p04655k533064
2447I739768k925058k543294k228096r42917K004837M187796K775752o76042j816472
2438G576274j2038O07601k231340n086720l940987j82191J734118O86779m63235
2429a311739K34463J529006J635552N71275o31279j070839m4624K163482L351417
2420F426714J373759k380049l695748q80239K581016K365673j266426m402422
2412A22278m625360k781031k10142K809059N262087M875412J258712k249618k199907
$$ plain form
2403 2261490 2664034 4170862 3869106 1816433 923301 2884653 6035411 7459000 5820268
2394 5820268 1808256 -2831329 -6055766 -6493144 -4604883 -2334072 -1107883 -802540 -832446
2385 -832446 -1080246 -1268848 -827521 -291663 -1369121 -4213676 -5962645 -3936442 498807
2376 498807 3310212 2598968 -37510 -2641836 -4942779 -6871115 -7417664 -6173513 -4433490
2367 -4433490 -3594974 -3483878 -2991609 -1333577 1713326 5385505 7284742 5045787 -296899
2358 -296899 -4378347 -4345753 -2102151 -1231395 -2349588 -3542330 -3978362 -4394365 -4602127
2349 -4602127 -3308768 -699603 1079473 698904 -752512 -1530909 -1231155 -565530 -443438
2340 -443438 -1669004 -4254361 -6581550 -6540924 -4098917 -1612130 -1048484 -2020001 -3113410
$$ packed form
2403B261490M02544J506828l01756k052673q93132J961352L150758J423589j638732
2394E820268m012012m639585l224437m37378J888261K270811J226189L05343k9906
2385h32446k47800j88602M41327N35858j077458k844555j748969K026203M435249
2376D98807K811405p11244k636478k604326k300943j928336n46549J244151J740023
2367d433490Q38516J11096M92269J658032L046903L672179J899237k238955n342686
2358b96899m081448L2594K243602Q70756j118193j192742m36032m16003k07762
2349d602127J293359K609165J779076l80569j451416p78397K99754O65625J22092
2340d43438j225566k585357k327189M0626K442007K486787N63646r71517j093409
$$ plain form
2331 -3113410 -3882443 -4599376 -5072549 -4870168 -4212437 -3756982 -3771603 -3995727 -3938797 -3128728
2321 -3128728 -1786807 -1384211 -3306960 -6437946 -7543449 -5301131 -2761435 -4056115
2313 -4056115 -9211243 -14036345 -15103944 -13085206 -10774059 -9511038 -8586009 -6946312
2305 -6946312 -4064361 285340 5525089 9496966 9770729 6600660 3480030 3394369 5085517
2296 5085517 4741881 1407629 -1403664 -529510 2409821 3572031 2665404 3214697 7006818
2287 7006818 11223379 12348076 10649050 8991764 8829509 9379397 9651639 9135086 7073741
2278 7073741 3251932 -556793 -1886976 -628855 829590 805682 42722 -265989 -448203
2269 -448203 -1221165 -1815387 -709193 2109443 4689155 5006681 2880219 72844 -1319736
$$ packed form
2331c113410p69033p16933m73173K02381O57731M55455j4621k24124N6930Q10069
2321c128728J341921M02596j922749l130986j105503K242318K539696j294680
2313d056115n155128m825102j067599K018738K311147J263021R25029J639697
2305f946312K881951M349701N239749L971877K73763l170069l120630q5661J691148
2296E085517l43636l334252k811293Q74154K939331J162210r06627N49293L792121
2287G006818M216561J124697j699026j657286j62255N49888K72242n16553k061345
2278G073741l821809l808725j330183J258121J458445k3908p62960l08711j82214
2269d48203p72962n94222J106194K818636K579712L17526k126462k807375j392580
$$ plain form
2260 -1319736 -764112 428885 962456 1257924 2442762 4006359 3977317 1729949 -911326
2251 -911326 -2074421 -1913074 -1347190 -276720 1468262 2736591 2592917 2357526 3883858
2242 3883858 6254802 6591080 4134156 1038679 -1231330 -3517570 -5977314 -6426518 -3811820
2233 -3811820 -1017761 -1361160 -3739189 -4354064 -2471524 -1091299 -1809456 -2447644 -1002139
$$ packed form
2260a319736N55624J192997N33571K95468J184838J563597k9042k247368k641275
2251i11326j163095J61347N65884J070470J744982J268329j43674k35391J526332
2242C883858K370944L36278k456924l095477k270009k286240k459744m49204K614698
2233c811820K794059l43399k378029o14875J882540J380225p18157o38188J445505
$$ [...]
##END NTUPLES=NMR SPECTRUM
##END=
