##TITLE=31Pdec_DE-87_oil
 CDCl3, 24 sc
 31.3.2025
##JCAMPDX= 6.0         $$ Bruker NMR JCAMP-DX V2.0
##DATA TYPE= NMR SPECTRUM
##DATA CLASS= NTUPLES
##ORIGIN= UXNMR, Bruker Analytische Messtechnik GmbH
##OWNER= root
$$ XWIN-NMR		Version 3.5
$$ Mon Mar 31 14:13:00 2025 Russian Standard Time (UT+4h)  she@DPX200
##.OBSERVE FREQUENCY= 81.013821
##.OBSERVE NUCLEUS= ^31P
##.ACQUISITION MODE= SIMULTANEOUS
##.ACQUISITION SCHEME= undefined
##.AVERAGES= 64
##.DIGITISER RES= 17
##SPECTROMETER/DATA SYSTEM= spect
##.PULSE SEQUENCE= zgpg30
##.SOLVENT NAME= CDCl3
##.SHIFT REFERENCE= (INTERNAL, CDCl3, 0, 198.062)
##AUDIT TRAIL= $$ (NUMBER, WHEN, WHO, WHERE, WHAT)
$$ ##TITLE= Audit trail, XWIN-NMR		Version 3.5
$$ ##JCAMPDX= 5.01
$$ ##ORIGIN= Bruker BioSpin GmbH
$$ ##OWNER= she
$$ F:/spectra/data/she/nmr/P31/2/pdata/1/auditp.txt
$$ ##AUDIT TRAIL=  $$ (NUMBER, WHEN, WHO, WHERE, WHAT)
(   1,<2025-03-31 14:11:56.03 +0400>,<she>,<DPX200>,
      <created by zg, POWCHK disabled, PULCHK disabled
       configuration hash MD5:
       00 E9 B6 7A A2 85 ED C7 34 08 36 98 17 FE 4E 26
       data hash MD5: 32K
       0D F2 2F 6D F3 6A 6E 62 16 8B 8D 10 9D D0 4C AD>)
(   2,<2025-03-31 14:11:58.51 +0400>,<she>,<DPX200>,
      <Start of raw data processing
       efp BC_mod = 2 LB = 1.5 FT_mod = 6 PKNL = 1 PHC0 = 1463.396 PHC1 = -92.30579 SI = 64K 
       data hash MD5: 64K
       1E 05 93 B5 9F B0 A3 0E 3B E6 1D 9F 02 57 A0 C9>)
(   3,<2025-03-31 14:12:15.98 +0400>,<she>,<DPX200>,
      <pk PHC0 = 10.70771 PHC1 = 0 
       data hash MD5: 64K
       13 58 80 7B 64 9D 6B 3C 33 61 A8 C4 F2 12 78 7C>)
(   4,<2025-03-31 14:12:19.60 +0400>,<she>,<DPX200>,
      <abs ABSG = 5 
       data hash MD5: 64K
       6D EA E5 F0 62 0A 9A AF 9E 6A 00 C6 49 B6 40 38>)
(   5,<2025-03-31 14:12:32.85 +0400>,<she>,<DPX200>,
      <abs ABSG = 5 
       data hash MD5: 64K
       5F 1B C8 A3 C5 CC 8B 45 13 BA BB E5 D2 F8 15 DF>)
$$ ##END=
$$ 
$$ hash MD5
$$ 15 04 66 FA 66 5C BA 0D D1 0D 3C A2 2E DE A3 5D
##$RELAX= 
##$RELAX= 
##$RELAX= 
##$RELAX= 
##$RELAX= 
##$RELAX= 
##$RELAX= 
##$RELAX= 
$$ Bruker specific parameters
$$ --------------------------
##$DU= <F:/spectra>
##$EXPNO= 2
##$NAME= <P31>
##$PROCNO= 1
##$TYPE= <nmr>
##$USER= <she>
##$AMP= (0..31)
100 100 100 100 100 100 100 100 100 100 100 100 100 100 100 100 100 100 
100 100 100 100 100 100 100 100 100 100 100 100 100 100 
##$AQSEQ= 0
##$AQ_mod= 1
##$AUNM= <au_zg>
##$AUTOPOS= <>
##$BF1= 81.014009
##$BF2= 200.13
##$BF3= 200.13
##$BF4= 200.13
##$BF5= 200.13
##$BF6= 200.13
##$BF7= 200.13
##$BF8= 200.13
##$BYTORDA= 1
##$CFDGTYP= 0
##$CFRGTYP= 5
##$CHEMSTR= <none>
##$CNST= (0..31)
1 1 145 1 1 1 1 1 1 1 1 1 1 1 1 1 1 1 1 1 1 1 1 1 1 1 1 1 1 1 1 1 
##$CPDPRG= <waltz16>
##$CPDPRG1= <>
##$CPDPRG2= <waltz16>
##$CPDPRG3= <>
##$CPDPRG4= <mlev>
##$CPDPRG5= <mlev>
##$CPDPRG6= <mlev>
##$CPDPRG7= <mlev>
##$CPDPRG8= <mlev>
##$CPDPRGB= <>
##$CPDPRGT= <>
##$D= (0..31)
0 1 0 0 0 0 0 0 0 0.06 0 0.03 2e-05 3e-06 0 0 0.0002 0 0 0 0 0 0 0 0 0 
0 0 0 0 0 0 
$$ [...]
##$SUBNAM3= <"">
##$SUBNAM4= <"">
##$SUBNAM5= <"">
##$SUBNAM6= <"">
##$SUBNAM7= <"">
##$SUBNAM8= <"">
##$SUBNAM9= <"">
##$SW= 400.765351723535
##$SWIBOX= (0..15)
0 1 3 0 0 0 0 0 0 0 0 0 0 0 0 0 
##$SW_h= 32467.5324675325
##$TD= 32768
##$TD0= 1
##$TE= 0
##$TE2= 300
##$TE3= 300
##$TEG= 300
##$TL= (0..7)
0 120 53 12 22 120 120 120 
##$TP= (0..7)
150 150 150 150 150 150 150 150 
##$TP07= 0
##$TPNAME0= <>
##$TPNAME1= <>
##$TPNAME2= <>
##$TPNAME3= <>
##$TPNAME4= <>
##$TPNAME5= <>
##$TPNAME6= <>
##$TPNAME7= <>
##$TPOAL= (0..7)
0.5 0.5 0.5 0.5 0.5 0.5 0.5 0.5 
##$TPOFFS= (0..7)
0 0 0 0 0 0 0 0 
##$TUNHIN= 0
##$TUNHOUT= 0
##$TUNXOUT= 0
##$USERA1= <user>
##$USERA2= <user>
##$USERA3= <user>
##$USERA4= <user>
##$USERA5= <user>
##$V9= 5
##$VALIST= <valist>
##$VCLIST= <CCCCCCCCCCCCCCC>
##$VD= 0
##$VDLIST= <DDDDDDDDDDDDDDD>
##$VPLIST= <PPPPPPPPPPPPPPP>
##$VTLIST= <TTTTTTTTTTTTTTT>
##$WBST= 1024
##$WBSW= 4
##$XGAIN= (0..3)
0 0 0 0 
##$XL= 0
##$YL= 0
##$YMAX_a= 5857
##$YMIN_a= -26447
##$ZGOPTNS= <>
##$ZL1= 120
##$ZL2= 120
##$ZL3= 120
##$ZL4= 120
##$ABSF1= 198.0616
##$ABSF2= -202.7028
##$ABSG= 5
##$ABSL= 3
##$ALPHA= 0
##$AQORDER= 0
##$ASSFAC= 0
##$ASSFACI= 0
##$ASSFACX= 0
##$ASSWID= 0
##$AUNMP= <proc_1d>
##$AZFE= 0.1
##$AZFW= 0.5
##$BCFW= 0
##$BC_mod= 2
##$BYTORDP= 0
##$COROFFS= 0
##$CY= -3
##$DATMOD= 1
##$DC= 0
##$DFILT= <>
##$DTYPP= 0
##$F1P= 0
##$F2P= 0
##$FCOR= 1
##$FTSIZE= 65536
##$FT_mod= 6
##$GAMMA= 0
##$GB= 0
##$INTBC= 1
##$INTSCL= 9.790993e-09
##$ISEN= 30
##$LB= 1.5
##$LEV0= 0
##$LPBIN= 0
##$MAXI= 10000
##$MC2= 0
##$MEAN= 0
##$ME_mod= 0
##$MI= 50
##$NCOEF= 0
##$NC_proc= -8
##$NLEV= 6
##$NOISF1= 182.463
##$NOISF2= 159.3651
##$NSP= 0
##$NTH_PI= 0
##$NZP= 0
##$OFFSET= 198.0616
##$PC= 4
##$PHC0= 1474.104
##$PHC1= -92.30579
##$PH_mod= 1
##$PKNL= yes
##$PPARMOD= 0
##$PSCAL= 0
##$PSIGN= 0
##$REVERSE= no
##$SF= 81.0140089999434
##$SI= 65536
##$SIGF1= 159.3651
##$SIGF2= -187.1042
##$SINO= 113.3802
##$SIOLD= 16384
##$SREGLST= <1H.CDCl3>
##$SSB= 0
##$STSI= 65536
##$STSR= 0
##$SW_p= 32467.5324675325
##$SYMM= 0
##$S_DEV= 0
##$TDeff= 32768
##$TDoff= 0
##$TI= <>
##$TILT= no
##$TM1= 0
##$TM2= 0
##$TOPLEV= 0
##$USERP1= <user>
##$USERP2= <user>
##$USERP3= <user>
##$USERP4= <user>
##$USERP5= <user>
##$WDW= 1
##$XDIM= 65536
##$YMAX_p= 131976037
##$YMIN_p= -281466706
$$ End of Bruker specific parameters
$$ ---------------------------------
##NTUPLES= NMR SPECTRUM
##VAR_NAME=  FREQUENCY,     SPECTRUM/REAL,   SPECTRUM/IMAG
##SYMBOL=    X,             R,               I
##VAR_TYPE=  INDEPENDENT,   DEPENDENT,       DEPENDENT
##VAR_FORM=  AFFN,          ASDF,            ASDF
##VAR_DIM=   65536,         65536,           65536
##UNITS=     HZ,            ARBITRARY UNITS, ARBITRARY UNITS
##FACTOR=    0.49542278885378, 1,            1
##FIRST=     16045.7642231865, 0,            0
##LAST=      -16421.768244346, 0,            0
##MIN=       -16421.768244346, -281466706,   0
##MAX=       16045.7642231865, 131976037,    0
$$ Real data points
##PAGE= N=1
##DATA TABLE= (X++(R..R)), XYDATA
$$ [...]
##PAGE= N=2
##DATA TABLE= (X++(I..I)), XYDATA
9612 1355281 1182344 -1119192 -4465593 -6415691 -5797795 -2976547 1163934 5478976 8703291
9603 8703291 10219787 10230473 8918424 6203582 2479945 -1259759 -4085470 -5189785 -3938702
9594 -3938702 -1326253 -565486 -3748374 -8074876 -8364180 -3960950 -146369 -1380917 -5986026
9585 -5986026 -9317728 -9487337 -7562302 -4542716 -1221491 536401 -435721 -2256083 -1997145
9576 -1997145 501336 2915525 3653734 2651060 118109 -2899701 -3713439 -713295 3636693
9567 3636693 5409090 4369530 3568457 4294617 4944930 4877717 5438996 6300277 4667989
9558 4667989 -79308 -4237982 -4466971 -2002503 56825 1265569 2926020 4437779
9550 4437779 3618252 174107 -3456256 -4786952 -3536955 -1469648 -837329 -2389581 -4242729
9541 -4242729 -3536570 286392 4924483 8129445 9377330 8293375 4205132 -1191467
9533 -1191467 -3530998 -869728 2887030 2706414 -850846 -3015390 -2005143 -860761
9525 -860761 -1753018 -2385342 28475 3915552 5100962 2344486 -1103233 -1529658 998082
9516 998082 2960300 1559753 -1950453 -3561564 -1140968 3019315 4876841 3108254
9508 3108254 -138981 -2440993 -3561333 -4516367 -5493037 -5654339 -4660733 -3492420 -3206251
9499 -3206251 -3081986 -1045176 3296688 7039824 7133007 4691746 3829193 5939710 7869054
9490 7869054 6795992 3985383 1719220 -604365 -4224069 -7131895 -6352524 -2960502
9482 -2960502 -847988 -918521 -499775 1334443 2066531 456033 -945229 21964 1575187
9473 1575187 1022046 -1036194 -2020440 -1187688 234878 1516537 2792141 3623691 3042331
9464 3042331 858268 -2058411 -4378465 -4751504 -2724060 189123 1637442 1258639 892665
9455 892665 1467573 1784497 1378756 2025301 4491989 6173574 4674181 2013014 2140664
9446 2140664 5225686 7523249 6565758 3540805 450155 -2269417 -4675699 -6214022
9438 -6214022 -6564462 -5963416 -4241273 -1209526 1713906 2250440 317543 -1444137 -1046507
9429 -1046507 520686 1213564 640225 -265782 -980421 -1511909 -1626418 -1065258 -30355
9420 -30355 1198254 2465465 3133809 2308258 277450 -1480830 -2602820 -4773719 -8930698
9411 -8930698 -12694344 -12641939 -8779920 -4718736 -3173748 -3202576 -2691905 -1840345 -2508768
9402 -2508768 -4899537 -6795662 -6474573 -5051511 -4987734 -6877862 -8761144 -8564027 -6265583
9393 -6265583 -3337093 -1006459 40109 -1089279 -5005466 -10455127 -14438388 -14863573
9385 -14863573 -12577108 -10000168 -8295733 -6930844 -5631198 -5108975 -5341124 -4651299 -1821397
9376 -1821397 1791706 3892501 4625672 6411905 10087937 13141587 12886604 9843643 6431207
9367 6431207 3545706 501786 -2304435 -3112606 -1430531 1127800 3242339 5248620
9359 5248620 7246682 7726637 5561510 2087950 -361025 -1153561 -1221081 -1085206 -637644
9350 -637644 -376507 -1192041 -2972461 -4736351 -6075731 -7210522 -7700900 -6564349 -4000205
9341 -4000205 -1774688 -1336637 -2350140 -3440060 -3620529 -2734407 -1395727 -935301 -2478322
9332 -2478322 -5325615 -6936605 -5492529 -2193988 -47220 -359488 -1453621 -1259643 -94827
9323 -94827 266955 -423341 -676394 -137175 -469116 -2189068 -2718947 131865 4180514
9314 4180514 5265253 2880599 187950 -1274058 -2907851 -4435259 -2540076 3442689
9306 3442689 8407858 7642373 3310504 918422 1521922 1812407 509484 -181913 667522
9297 667522 1003295 -343587 -1715040 -1605809 -675870 -5984 -8842 -1502636 -4936615
9288 -4936615 -8075910 -7657368 -4133958 -1572798 -1944061 -2937430 -2626433 -2489882 -3740914
9279 -3740914 -4173348 -1446722 3130491 6686487 8276440 7940655 4988968 155971 -2975218
9270 -2975218 -2113164 -28083 -842572 -4090340 -5928906 -5023280 -3479367 -2502660 -833115
9261 -833115 2276984 5591570 7873297 8928905 8421653 5915641 2475008 318473 527832
9252 527832 2394462 4696157 6197447 5676985 3337582 1478920 1843805 3147308 3263248
9243 3263248 2639256 2939063 3527346 2599212 1019669 1352912 3301409 3933809 2675314
9234 2675314 2099549 2974387 2571772 -527344 -3649182 -4180983 -3367785 -3552612 -4261140
9225 -4261140 -3638900 -1742914 140188 1856067 3677411 4542802 3330352 1091268 90760
9216 90760 1109217 2924296 3705691 2044345 -2155185 -6806479 -9066650 -8651285 -8152095
9207 -8152095 -9059409 -9524256 -7578613 -4446226 -2572723 -2140468 -1805539 -1382558 -1415240
9198 -1415240 -1321862 -328673 816366 1280414 2104078 4374393 6699038 7116019 6270383
9189 6270383 5724049 4370695 299268 -4363945 -4732594 185737 5972038 8890958 9701126
9180 9701126 9919354 8337381 4145526 401530 600752 3363004 4103916 1383954 -1619867
9171 -1619867 -2031556 -760647 -280353 -1212126 -2432273 -3109038 -3224932 -2858005 -2216743
9162 -2216743 -2066915 -3005728 -4271467 -4240787 -2490473 -607554 -303164 -1306292 -2112976
9153 -2112976 -2489410 -3743909 -6085070 -7244492 -5098905 -901023 1646018 463448
9145 463448 -2930019 -5533841 -5835964 -4447126 -2758413 -1516333 -389955 1213639 2872382
9136 2872382 3277318 2079745 626888 -219611 -1911088 -5960418 -10532177 -11823570 -9042005
9127 -9042005 -5436226 -3629658 -2655110 -1174695 -923092 -4095644 -8897830 -10979413 -9000677
9118 -9000677 -5963082 -4787525 -5105415 -5089831 -4198489 -3013899 -2148371 -2423534 -4503501
9109 -4503501 -7116175 -7279361 -3952802 -98596 858411 -493084 -989403 -70404 -504117
9100 -504117 -3584560 -6605890 -6632533 -4541333 -3308300 -3801333 -4448903 -4149929 -3319425
9091 -3319425 -2459316 -1675861 -1424496 -1893658 -1824834 102268 2792460 3822658 3118622
9082 3118622 2993802 3914359 3145599 -767347 -4818068 -5328740 -3042533 -1595697 -2147911
9073 -2147911 -2654853 -2009777 -1678075 -2702413 -3799241 -3471525 -1912055 322744 3657083
9064 3657083 7985767 11098608 10330246 5472647 -917723 -5819756 -7771597 -7155198 -5312132
9055 -5312132 -3374043 -1686682 -387944 -156397 -1595227 -3962628 -5499395 -5215430 -3514074
9046 -3514074 -1033132 1907244 4383073 4827992 2915460 607231 269248 2120306 4254015
9037 4254015 4866966 3945164 3019825 3544690 5215237 5959054 4276135 1474772 495780
9028 495780 2427736 5484830 7626387 8432658 7697009 4280169 -1825241 -7713537 -10096911
9019 -10096911 -9102000 -7633900 -7252220 -6575924 -3872815 470044 4438182 6052730 4325765
9010 4325765 -88717 -4782850 -7279687 -7281489 -6435387 -5967970 -5887803 -6450962 -8332271
9001 -8332271 -10537343 -10237375 -6412171 -2218494 -1599796 -4267530 -6212331 -4941246 -1967917
8992 -1967917 137989 809857 566142 -831670 -3395381 -5352400 -4758442 -2299726 -620946
8983 -620946 -902960 -1798879 -1843756 -1122198 -197977 675971 526709 -2104710 -6481538 -9026360
8973 -9026360 -7333236 -3543300 -1590964 -2154434 -2794466 -2253964 -1553607 -976005 617978
8964 617978 2715453 2792995 635246 -170650 2473687 5149992 3590766 -478573 -1233936
8955 -1233936 3043186 7751022 8678831 7257372 7277026 9192691 10333819 9217649 6877297
8946 6877297 4300948 1043440 -2966203 -5955572 -5954789 -3370406 -819014 -232697 -826529
8937 -826529 -435738 1557808 3499735 3726143 2585806 1607165 1408850 1381971 1070159
8928 1070159 892334 1579649 3630390 7088252 10970845 13118112 11759767 7476956 2788889
8919 2788889 -320736 -1618864 -1408147 507165 3818524 6520609 5916071 1111539 -5672795
8910 -5672795 -10471108 -10692064 -7263798 -3366466 -824567 1287698 3760009 4617569 1671497
8901 1671497 -3079928 -4720377 -1702082 1981218 2247658 -77515 -1739246 -2143958 -3017470
8892 -3017470 -4409306 -4362650 -2259017 409709 2689762 4880805 6300819 5183858 1785131
8883 1785131 -941989 -1158613 -496745 -1125012 -2587737 -3500670 -4417542 -6385577 -8009462
8874 -8009462 -7061250 -4584516 -4253498 -7158782 -10007518 -9623463 -6895968 -4667690 -3591037
8865 -3591037 -2197814 1687 1748725 2160174 1760333 1116511 -145223 -2477484 -5543760
8856 -5543760 -8601022 -10879413 -11227837 -8438073 -2830722 3045501 6336998 6529675 5532020
8847 5532020 5166020 5380347 5223838 4656687 4335097 3880167 1776031 -2285290 -5938484
8838 -5938484 -6350959 -3694780 -1110100 -910667 -2009075 -1810598 321317 2605169 3387174
8829 3387174 3009410 3064736 4510981 6647840 7540378 5524806 753337 -4744253 -8754168
8820 -8754168 -10433876 -10106911 -8266726 -5467877 -2691827 -951704 -636590 -1601834 -3303783
8811 -3303783 -4338990 -2898795 1142798 5374499 7369845 7244568 6222867 3877366
8803 3877366 -647187 -5311546 -6429213 -3812086 -1531897 -2299741 -4082085 -4206350 -3955137
8794 -3955137 -6159095 -10180840 -12586821 -11847290 -9372872 -6523256 -3668498 -2052402
8786 -2052402 -3350693 -6630258 -8433854 -7068920 -4750372 -4294983 -5522886 -6394834 -6303739
8777 -6303739 -6515471 -7952996 -9950725 -11171976 -11022508 -10154521 -9830635 -10639180 -11892831
8768 -11892831 -12641649 -12918357 -13169188 -12748814 -10210373 -5312693 205870 4094223 5178192
8759 5178192 3737519 1366332 254011 1272701 2800707 2776521 1688203 1635516 2404611
8750 2404611 1018442 -3765997 -8830011 -10350627 -8439336 -6151129 -5058384 -3986775
8742 -3986775 -1579670 1965760 5710676 8842000 10505221 10083018 8010727 5535844
8734 5535844 3641757 2876836 3820464 6467146 9180124 9662972 7616176 5571738 6268000
8725 6268000 9425942 11714191 10110655 5175181 673481 -333939 1276867 2065841
8717 2065841 452703 -1499887 -1213171 881636 2267259 1966787 1539887 2477745 4110774
8708 4110774 4686691 3609851 1949454 1179843 1912338 3652227 5445405 6734097 7604925
8699 7604925 8213643 8255092 7350785 5860050 4864926 5097034 5958170 5858104 3834956
8690 3834956 900262 -686375 97204 1686138 1774269 249425 -652911 844905 4021477
8681 4021477 6578956 6730452 4192801 76046 -3821812 -6378379 -8087151 -9955126
8673 -9955126 -11560108 -11348270 -8875919 -5329707 -1672169 1983539 4755360 4920660 2634604
8664 2634604 827209 1788553 4244031 5295650 3978094 1532366 -411245 -545834 1464366
8655 1464366 3418460 1754686 -3487650 -7122330 -5275528 -1315703 -1316944 -5064156 -6601646
8646 -6601646 -3667860 -1206006 -3756108 -8914047 -11250750 -9515147 -6761481 -5351846
8638 -5351846 -4776542 -3357127 49744 5163041 9553984 10004710 6110450 1372507 -626821
8629 -626821 155363 1558836 2314109 2108937 438942 -2287906 -3807948 -2536973 -160761
8620 -160761 463953 -827932 -1829200 -1257135 494976 3039716 5904199 7321732 5759163
8611 5759163 2438582 -151879 -1944359 -4632288 -7459499 -7200794 -3285200 447899
8603 447899 970157 214204 1504667 3967680 3612894 -840571 -6083601 -8330262 -7202473
8594 -7202473 -4952753 -3354780 -2325188 -1014580 569846 1329479 485193 -1170651 -2110080
8585 -2110080 -1998412 -1758794 -1687168 -997372 197806 163361 -1891332 -3922647 -3477235
8576 -3477235 -1012337 1126678 2210300 3211216 3746347 1845055 -2453616 -5841768
8568 -5841768 -5632903 -3056254 -963130 168738 1790785 3866925 4409235 2453980 -472415
8559 -472415 -2285343 -2396493 -1693386 -1820088 -4474136 -9673885 -14380936 -14815114 -11085193
8550 -11085193 -7698193 -8087289 -10322368 -10191016 -7143060 -4493505 -4221535 -4559412 -3412958
8541 -3412958 -1544974 -771086 -819648 8815 2026776 3977185 5293207 6685073 8323470
8532 8323470 9090097 8261812 6660813 5246680 3559732 776677 -2215684 -3257698 -1661850
8523 -1661850 619679 1230676 75709 -1079996 -1211934 -1124278 -1771991 -2441193 -1364320
8514 -1364320 1995599 5764487 7049896 4723721 862667 -1019768 428242 3043109
8506 3043109 4039561 3539278 3727764 4772614 3847471 -722313 -6162199 -7917804 -4700305
8497 -4700305 801493 5494951 8275250 9250268 8757763 7644559 6985812 6897260 6569274
8488 6569274 5636769 4474723 3200330 1729730 820197 1435623 2850857 3163220 2183975
8479 2183975 1927314 3378202 4721920 4119940 2484603 1753360 1855369 1452931 615739
8470 615739 379154 154772 -1868796 -5450557 -7677281 -6546694 -3534073 -1436635 -819762
8461 -819762 33365 2155290 4213696 4062986 1311461 -2087035 -3706036 -2885451 -977365
8452 -977365 536454 1753554 3807109 6829280 9188449 9287629 7847917 7492412 9511503
8443 9511503 11752391 11006958 7399057 4616381 4924957 5781169 3342000 -1907172 -5712415
8434 -5712415 -5888330 -4661906 -4622134 -5185861 -4585580 -3138926 -2616876 -3789687 -6189026
8425 -6189026 -8965270 -10543425 -9022890 -4727793 -913565 14458 -499527 -191596 -333725
8416 -333725 -3742098 -9181712 -11541375 -8246193 -2413253 1555942 2983369 4001007
8408 4001007 5667155 6933995 6528179 4391375 1640698 -237386 -733556 -1116969 -2888725
8399 -2888725 -5195606 -5286780 -2363619 458476 -566371 -5360308 -10229363 -12134678 -11400502
8390 -11400502 -10099404 -9073217 -7513654 -5054871 -3050879 -3092224 -4877365 -6629193
8382 -6629193 -7443048 -7929704 -8439472 -8332403 -7615973 -7375871 -7364626 -5244290 -254385
8373 -254385 4273445 4900246 3217388 3609415 6564909 8022579 5666392 2185728 1214498
8364 1214498 3184533 6379463 9058832 9299907 6053523 2073650 2312401 6986426 9693296
8355 9693296 5675296 -1248042 -4196974 -3019705 -3216884 -6424163 -8097553 -5421807
8347 -5421807 -1798061 -945345 -1069626 1490923 5891676 8129768 7183227 5846993 5787771
8338 5787771 5332917 2924627 -48129 -1348377 -1011754 -761150 -1362365 -2084083 -2228768
8329 -2228768 -1776068 -695485 1010242 2371169 1790223 -1054647 -4425395 -6225573 -5879262
8320 -5879262 -4081756 -1572792 985622 2672863 3099739 3258098 4401003 6088847 6419352
8311 6419352 4386714 1157610 -1234252 -1865942 -1532439 -1834405 -3449571 -4922666 -3939642
8302 -3939642 -622906 1610575 192118 -2538853 -1953458 2348525 5529287 3826736
8294 3826736 -793128 -3786946 -3549615 -1743233 139476 2004529 3669944 4464485 4437314
8285 4437314 4454912 4847480 4883195 3705428 1286336 -1403929 -2922354 -2525483 -1023033
8276 -1023033 203095 1057318 2512860 4431272 5118482 3559948 581764 -2771117 -6229070
8267 -6229070 -8860029 -8708781 -5368563 -1305747 861032 976864 82843 -1485221 -3088685
8258 -3088685 -3003220 -924779 508637 -818791 -3086081 -3212294 -1409844 -63948 592300
8249 592300 2199881 4434827 5064919 3713148 2240269 1333038 -46662 -1686242 -1996917
8240 -1996917 -1295943 -1750466 -3226163 -2652161 1158932 5253825 6705861 6126708 5300633
8231 5300633 4224288 2670596 2053918 3086442 3613732 1566951 -1405252 -1984307 175318
8222 175318 2480807 3379445 3602597 3520677 1885864 -1852666 -5676057 -6821913 -5034920
8213 -5034920 -2964007 -2961289 -4082264 -3417322 -560941 1116272 -774470 -3367505 -1986240
8204 -1986240 3012908 6635976 6726995 6770390 9570355 12261998 10757886 6114279 2718626
8195 2718626 2098840 2304310 2176199 2433376 3054360 3135513 3286968 4895908 6835317
8186 6835317 6143738 2612841 -289631 -58597 1920433 3171455 3299884 2894255 1555608
8177 1555608 -1020141 -3567860 -4750230 -5066793 -5719416 -6588210 -6841156 -6600467 -6449236
8168 -6449236 -6195529 -5847762 -6929463 -10558514 -14483413 -14508336 -9529267 -3220732 198071
8159 198071 240419 -785414 -1205960 -774986 635399 2880199 4479511 3757042 1121927
8150 1121927 -1420413 -2947751 -3975212 -4260878 -2789631 -593976 -887799 -4794079 -9131546
8141 -9131546 -10362097 -8832247 -7015285 -5537776 -3718214 -2449010 -3198702 -4940609
8133 -4940609 -5331881 -4523466 -4592830 -5479696 -4927143 -2534612 -344473 923829 2507409
8124 2507409 3880243 2506307 -1368505 -3740403 -2587971 -754909 -853184 -1156674 619396
8115 619396 3211147 4841962 6739319 9624226 10170877 5972491 1279522 1979100 6535736
8106 6535736 8163595 5422674 3967921 6671533 8480946 4232289 -3241097 -6821245
8098 -6821245 -4068195 1219533 4800977 6112147 7055281 8988535 11238937 11812187 9724696
8089 9724696 6657522 5379096 6481703 7912454 7813809 6363174 4606219 3100928 2229790
8080 2229790 2448199 3603304 4942485 5967521 6419504 5791357 4077271 2450310 1738430
8071 1738430 1021658 -480504 -1259890 236742 2249136 1771137 -674701 -1998272 -2039448
8062 -2039448 -3867038 -7994012 -10717794 -9783762 -7664536 -7146493 -7320065 -6258772 -4228742
8053 -4228742 -1777767 1861472 5621716 5471790 122106 -5234882 -5111494 -1244485 459488
8044 459488 -1539869 -3814335 -4606041 -5758815 -7970908 -8960714 -7410126 -4945821 -3097840
8035 -3097840 -1496804 -32047 299026 -238702 158584 1477249 972992 -2872629 -7791584
8026 -7791584 -10678493 -11144773 -10655891 -9905595 -8641377 -6810576 -4611924 -2503169 -1890550
8017 -1890550 -4190551 -8207964 -10226612 -8196104 -4413752 -2489419 -2893715 -3265894 -2190569
8008 -2190569 -700346 -305713 -1169130 -2342420 -2720019 -1721918 134780 1425054 1291540
7999 1291540 538753 551690 1422481 2052777 1982013 2069780 3071037 4358856 4662143 3687143
7989 3687143 2419617 1911521 2296703 3083739 3768509 3653110 1705841 -2176224 -5769798
7980 -5769798 -5897777 -2062614 2419673 4148879 3693645 4422895 7760338 11337890 11982540
7971 11982540 9009507 4189017 -164381 -2478811 -2512347 -1493135 -1007821 -1325037 -1542862
7962 -1542862 -1491776 -2154070 -3599328 -3969023 -1840357 1299803 2495116 984400 -925690
7953 -925690 -797384 1222843 3056174 3246671 2141836 876894 97053 56280 1300135
7944 1300135 4173091 7517076 8990167 7541198 4909750 3711513 4565403 6184723
7936 6184723 7658381 8956073 9364202 7472036 3337714 -1023034 -4152678 -6603411
7928 -6603411 -8883884 -9679591 -7858056 -5051612 -4079059 -5125882 -5444385 -3094464 520936
7919 520936 2348025 934618 -2346653 -4564225 -3537864 354860 4423368 6210046
7911 6210046 5819367 5284412 5962552 7367292 8295148 8020625 6376867 3742420 1160821
7902 1160821 -411911 -1063413 -1244244 -377637 2324636 5544226 6347496 3976480 1430231
7893 1430231 1788641 4319315 6017187 5937383 5808475 6845868 8321364 9482401 10703998
7884 10703998 12015969 12279229 10786154 8281128 5496536 2054092 -2084661 -5324500
7876 -5324500 -5977404 -4354245 -2207774 -780163 -303908 -470173 -275617 1551803 4618684
7867 4618684 6432843 5555836 4099260 4935967 7311700 7953127 6220835 5050419 6267467
7858 6267467 8083928 8523480 8391699 8752739 7927245 3922981 -1512455 -4296662 -3178636
7849 -3178636 -1050605 -990435 -3023677 -5117341 -5558525 -3707909 141774 4694277 8195198
7840 8195198 9815118 10230176 10533759 10797395 9840742 6417786 909768 -4123910 -5798002
7831 -5798002 -3741011 -427445 1749944 2815399 3988115 5397597 6378052 7127429 8373143
7822 8373143 9800459 10439117 10379687 10430126 10100676 7766463 3321522 -938710 -2988303
7813 -2988303 -3543826 -4913145 -7978434 -11152111 -12183841 -10580574 -8180218 -7262111 -8078505
7804 -8078505 -8751800 -7909727 -6641378 -7032310 -9339618 -11588763 -11608486 -8657067 -3615823
7795 -3615823 1355030 3804718 2812019 -263656 -3337534 -5110228 -4542711 -695893 5143004
7786 5143004 8862310 7735428 4263942 2959350 4011448 3520363 -144746 -4035687
7778 -4035687 -5443524 -5338012 -5458733 -5323270 -4281502 -3693785 -4484077 -4759536 -2583547
7769 -2583547 594758 1993113 1648855 1790557 2992816 3758136 3650380 4282254 6719366
7760 6719366 9572046 10256284 7523019 2881100 -198322 570827 3470273 4549934 2868110
7751 2868110 1782732 3570284 5329433 3049546 -2102226 -5128621 -4082811 -2008092
7743 -2008092 -1851930 -2816513 -2874972 -2298409 -2889176 -4864668 -5849088 -3042260 3342233
7734 3342233 8633197 7227440 -1037296 -9630699 -12569350 -11170724 -10500224 -10848746 -7682577
7725 -7682577 -79636 6312530 6960543 4584165 4290861 5990478 5740937 2571171 -384134
7716 -384134 -982300 -553186 -914595 -1770136 -1839489 -601085 1656946 3932084 4337156
7707 4337156 1493295 -3324377 -6760463 -6744686 -4380127 -2148715 -1214331 -897905 28619
7698 28619 1955804 3778981 3563191 591206 -3306586 -5401506 -5000688 -3603084 -2197548
7689 -2197548 -98639 3002956 5740399 7214593 8894619 12334389 15905052 16277376
7681 16277376 13105478 9734148 8551281 8030280 5850450 2821889 1324120 1144575
7673 1144575 -217095 -3290101 -5485268 -4878349 -2758084 -1240098 -398905 591966 1120864
7664 1120864 69577 -1786607 -2431654 -1460003 -508679 -765815 -1551275 -1620277 -574414
7655 -574414 1409644 4127299 7010331 8940893 8962951 6965276 3635182 121593 -2346771
7646 -2346771 -3023245 -1896091 733176 4473147 8345825 10866805 11418667 10936912 10391368
7637 10391368 9288670 6734859 3250066 180851 -2081102 -3760236 -4136967 -2238833
7629 -2238833 1038521 3437389 4150106 4308303 4414219 3282138 249288 -3292355 -5457292
7620 -5457292 -5598564 -3912528 -939232 1790797 2322473 589946 -1195387 -1350109 -413403
7611 -413403 764736 2648068 5373115 7489550 8232786 9248403 11695823 13163433 10409950
7602 10409950 4398537 -442652 -1846120 -1686540 -2110720 -2736218 -2742514 -2983946 -4156314
7593 -4156314 -4775842 -3095574 33484 2087166 2040545 1028054 268914 -150982 -599136
7584 -599136 -1367849 -2810177 -4726151 -5520609 -3366564 1236682 5214864 6111388 4815130
7575 4815130 4201584 5559092 7431244 7916317 7061830 6532841 7443041 8982329 9116219
7566 9116219 6604007 2457991 -835085 -1914925 -1972691 -2797906 -3797149 -2452293 1869285
7557 1869285 6099955 6627893 3339720 -701185 -2896460 -3054270 -2146064 -740567 1040981
7548 1040981 3003241 4571164 4578150 1893200 -2799616 -6504547 -6708181 -4399338 -2683108
7539 -2683108 -2525460 -1849015 798059 3810564 4853265 3935111 2726404 1974309 1130225
7530 1130225 -82520 -1097164 -1310824 -605794 698910 1840300 1970632 1050066 -92006
7521 -92006 -998537 -2210029 -4153613 -6209583 -7580288 -8336930 -8772024 -8393470 -6619153
7512 -6619153 -4146988 -2629940 -2927768 -4278846 -5259586 -5166624 -4323874 -3165494 -1350884
7503 -1350884 1550557 4325459 4302467 533291 -4097158 -5787322 -4399779 -2971921 -2868374
7494 -2868374 -2280637 -279408 701830 -1564280 -5256505 -6703798 -5177362 -3235644 -3042784
7485 -3042784 -4329916 -5599946 -5723187 -4574605 -3226768 -3071577 -3909151 -3727654 -1217873
7476 -1217873 2576271 5915070 8147451 8847313 7224166 4106859 2453395 3556744
7468 3556744 4571741 2559217 -686734 -1177137 1156109 2754977 2369313 2537199 4580949
7459 4580949 6081163 4920224 2683683 1944816 2407620 1945060 113192 -1359362 -1098194
7450 -1098194 217204 773316 -10063 -140428 2969911 8468849 11595099 9153513 4012544
7441 4012544 1345317 1533858 579505 -2744254 -4655532 -2437020 1412887 3280990 3272087
7432 3272087 3312479 3254492 1887599 -201831 -1710476 -3023338 -4866766 -6030589 -5276302
7423 -5276302 -4311664 -5755438 -8743684 -9635167 -7096369 -3716096 -2143784 -2075470 -1896298
7414 -1896298 -1316126 -1211545 -2099269 -3774243 -5734360 -7303852 -7844691 -7247191 -5897518
7405 -5897518 -4190356 -2591271 -2000251 -3172339 -5562215 -7425967 -7440429 -5841769 -3685135
7396 -3685135 -1340446 1712543 5452993 8240993 8076356 5151120 2208801 1611591 2809831
7387 2809831 3677251 3457957 2864924 2001649 383213 -1042844 -284523 2625132 5009671
7378 5009671 4937121 3431901 2372099 2100366 2398751 3892414 6534307 8009439 5850728
7369 5850728 781871 -3604328 -4356104 -1431813 2992251 6412324 7500476 6594123 4789970
7360 4789970 2698877 739000 188187 2282830 6082978 8939730 9467835 8375471 6243095
7351 6243095 2887873 -495705 -1370450 636415 2738142 2877959 2046335 1314423 -301383
7342 -301383 -2898494 -3931119 -2388484 -1698616 -4795754 -8902935 -9449312 -7075127 -6025160
7333 -6025160 -7052269 -7074192 -5311954 -4489858 -5482507 -5672052 -3803159 -2157039 -2383071
7324 -2383071 -2995020 -2675555 -2526618 -3113299 -2464737 760387 4659110 6683721 6693587
7315 6693587 5662296 3549189 409724 -2207024 -2894650 -2125967 -1038521 85969 1086960
7306 1086960 1356291 1098730 1491761 2614562 2976002 1904366 315220 -1694224 -5330586
7297 -5330586 -9764902 -11138411 -7246421 -1159081 2223998 1681203 -377551 -1845707
7289 -1845707 -2402049 -2205185 -1476847 -872658 -624166 27453 1336831 2116822 1535360
7280 1535360 461254 -341804 -1742181 -4309069 -6483681 -6572615 -5102414 -3387732 -1504234
7271 -1504234 190616 -511161 -4772103 -9571571 -10573746 -7450166 -3644911 -1612710
7263 -1612710 -1081611 -1281959 -1769713 -1386253 492274 1823176 184473 -2790355 -2724194
7254 -2724194 1154460 4391194 3244637 -835529 -4242978 -5883651 -6688935 -6715843 -5272779
7245 -5272779 -2761082 -316915 1687321 3274170 3736520 2312735 -467582 -3154667
7237 -3154667 -4676510 -4660523 -3259649 -1343243 13265 913467 2552626 5098128 6916216
7228 6916216 6887270 6163358 6210654 6264734 4607618 1696428 -148277 -235184 -588067 -2679454
7218 -2679454 -4687768 -3579584 634071 4282285 4056972 642960 -2456306 -3099179 -2282313
7209 -2282313 -1777643 -1626287 -1059359 -694536 -1940525 -4511769 -6448680 -6910633 -7125094
7200 -7125094 -7835670 -7670149 -5531940 -3213716 -3535940 -6320430 -8207193 -6782626 -3388919
7191 -3388919 -1257766 -1995397 -4628313 -7208144 -8351805 -7621875 -5496247 -3254683 -2275851
7182 -2275851 -2873705 -3835270 -3473187 -1407799 801901 1137286 -737807 -3223506 -4801986
7173 -4801986 -5629884 -6498542 -6856725 -5177036 -1351114 2633854 4990999 5871496 5903977
7164 5903977 4383859 737387 -2999925 -3605591 -875284 1751696 1560955 -435210 -1986515
7155 -1986515 -2998857 -4534361 -6110385 -6523769 -6438417 -7494221 -9138598 -8877523 -5804200
7146 -5804200 -1650885 1737218 3632183 3106641 -562875 -5396945 -7527342 -5907152
7138 -5907152 -3693309 -3499265 -4007143 -3262367 -2467393 -3493409 -4780365 -3320180 387065
7129 387065 2860672 2728840 2105135 2847073 4355216 5482233 6019648 5623265 3492194
7120 3492194 -45354 -3281170 -4959608 -4895767 -2749074 1873308 7752245 12349461 14236532
7111 14236532 13736475 11247878 7045769 2852248 1030997 1450167 1493482 82363 -809124
7102 -809124 75946 656754 -1163635 -3609375 -3173601 421961 3973979 5106910 4584061
7093 4584061 4236160 4524625 4822285 4908402 5331972 6572196 8190069 8914921 7776483
7084 7776483 5113425 2107646 -468050 -2375990 -3153309 -2470511 -1237875 -902272 -1329267
7075 -1329267 -863378 1021326 2706912 2769679 1697676 325303 -1707571 -4476644 -6227520
7066 -6227520 -5164125 -1956793 1151010 3111295 4521503 5943364 7241828 8197792
7058 8197792 8568447 7995351 6834868 6230167 6157792 4526468 -12186 -5287255 -7860403
7049 -7860403 -7594518 -7567844 -9396634 -11172820 -10815211 -9227469 -8747299 -10027649 -11954294
7040 -11954294 -13589044 -14690010 -14940140 -14095403 -12686824 -11398005 -9786932 -6709606
7032 -6709606 -2244306 1690232 3099870 1779170 -906557 -3472015 -4959170 -4718932
7024 -4718932 -2655143 214545 2354455 3219799 3496181 3668193 3393888 2734324 2612639
7015 2612639 3004277 2119658 -824338 -3169293 -1613972 3008276 6444186 6619696 5666097
7006 5666097 5705104 5781498 4726476 4231876 6290835 9344531 10017390 7944034 6124533
6997 6124533 6622962 8338819 9375263 9526762 9524455 9163827 7366710 3929005 629414
6988 629414 16757 2532483 5312638 5204711 2793776 1386309 1788123 1119685 -1709191
6979 -1709191 -2748581 1496717 7767340 9618316 6340179 3772454 5857438 9631387
6971 9631387 10095454 6547432 1918571 -1480657 -2990819 -2201639 703690 3777734 4613179
6962 4613179 2908899 538161 -844787 -1276970 -1581275 -1862215 -1367665 282748 2130208
6953 2130208 2667567 1641257 281008 -565941 -1384241 -2364587 -2326966 -736072 598600
6944 598600 -101090 -1636544 -1779107 -1274532 -2767433 -5967061 -7389534 -5582810 -3261361
6935 -3261361 -2938390 -3526964 -3120724 -2383074 -2763469 -3447314 -2723912 -1068436 -458396
6926 -458396 -1437120 -2794705 -3436236 -2970554 -1385046 221284 -407907 -4152084 -8710321
6917 -8710321 -11098015 -11200873 -11056368 -11418596 -11228312 -10113645 -9091649 -8498857 -7154716
6908 -7154716 -4238433 -675616 1927566 2845005 2467687 1827396 2028574 3308168 4457592
6899 4457592 3861117 1302093 -1690445 -3284674 -2857525 -1383031 -650344 -1575966 -2837905
6890 -2837905 -1839321 2333872 7519664 10637421 10501649 7878304 3885355 -376327 -3391460
6881 -3391460 -4066206 -2980324 -1748657 -1181415 -834387 -119623 908935 1656989 1385763
6872 1385763 28287 -984473 298228 3781711 6805649 7168661 5565554 3909323
6864 3909323 2594621 1023984 -462840 -1299021 -2392153 -4785776 -7182265 -7188273 -4761567
6855 -4761567 -2069123 -125005 1811694 3406389 2796498 -106157 -2457180 -1996446 290813
6846 290813 2248689 3236006 3292407 1688283 -1640010 -4675270 -5500854 -4898714 -4658212
6837 -4658212 -4082924 -645712 5838529 11904890 14039017 12153693 8820427 6300940
6829 6300940 5216806 5130251 5110160 3968521 1153401 -2165902 -3586072 -1664255 2531875
6820 2531875 6380054 7944207 6986729 4444741 1904360 1158890 2672197 4201941 2653948
6811 2653948 -1864106 -5514515 -5542668 -3926064 -4262179 -6503037 -7563273 -6423765 -5378183
6802 -5378183 -5911357 -6494276 -5674408 -4713095 -5396323 -7167772 -8265278 -8210225 -7379212
6793 -7379212 -5395096 -1932416 1666070 3438721 3083781 1738552 -47846 -2667883
6785 -2667883 -6106681 -9546152 -12054096 -12663662 -10522936 -6457890 -3649972 -4616278 -7544997
6776 -7544997 -7826626 -3821408 901509 2162619 246555 -1290961 -656610 552844 487731
6767 487731 -474851 -1206048 -2023035 -3835311 -6003932 -6918075 -6631405 -7111419 -9255018
6758 -9255018 -11224338 -10901618 -8855756 -7459066 -7828940 -9151869 -10469883 -11413917 -11380812
6749 -11380812 -9762337 -7137920 -4668848 -2209587 1258682 5119270 7033443 5988273
6741 5988273 3600996 1721992 725382 967319 3463893 7487339 9746212 8205724 5013577
6732 5013577 3318141 2854957 1472651 -418912 -440466 1320727 2188412 1500613 1715006
6723 1715006 3781203 4702894 1747085 -3281101 -6205692 -5328506 -2066469 1905863 5797535
6714 5797535 8553099 8809711 6443459 3040995 564750 33791 1219759 3044623 4616354
6705 4616354 6298981 9142073 12831792 15247030 14908188 12807716 10617752 8189586
6697 8189586 4664198 1360938 1090132 4120747 6909541 6064077 2320868 -665380 -693701
6688 -693701 1074553 2149253 1334438 -869759 -3452452 -5684363 -6926074 -6424500 -3960673
6679 -3960673 -663020 1622704 2375538 3250317 5940259 9522161 11230538 9953824 7476900
6670 7476900 5724172 4401768 2580066 1153065 1766217 3993519 5623898 5584735 4655957
6661 4655957 3295549 935269 -2073019 -3997142 -4178995 -3943816 -3873521 -2356998 1262996
6652 1262996 4123887 3170296 -136586 -1424113 701434 3262347 3451678 1714294 -203998
6643 -203998 -1454761 -1273270 1421775 5966942 9471030 10058143 8945566 7790977 5932485
6634 5932485 2490994 -334115 999281 6564588 12170347 13647589 10477212 5258334
6626 5258334 1114222 -328128 133091 -32335 -2510177 -6041535 -7534312 -5141737 303688
6617 303688 6307187 10238214 10559726 7957811 5088681 4134392 4810460 5527654 5695693
6608 5695693 5663410 5341770 4680295 4859773 6936273 9552923 10097119 8151456 5770361
6599 5770361 4257310 2874635 1088705 -272236 -960174 -2282484 -4941260 -7562595
6591 -7562595 -8514850 -7799272 -6258822 -4418068 -2958499 -2684451 -3034895 -2318205 -407673
6582 -407673 756986 560267 1270711 4293539 7092804 6495189 3342029 810289 -612367
6573 -612367 -2897551 -5671632 -5498773 -858456 5187560 8620138 8472636 6117792 2943910
6564 2943910 348983 -55249 1591092 2555975 796170 -1801610 -1687013 1220194 2974141
6555 2974141 605930 -4227374 -7557795 -7698804 -6225400 -5125429 -4486210 -3174281 -785102
6546 -785102 1662212 2613861 1264411 -1696757 -4276806 -4419778 -1591854 2742744 6321002
6537 6321002 7694482 6826937 4826123 3486901 4304251 6955092 9131401 8894500 6914485
6528 6914485 5264195 4398849 3025232 924802 -324602 -252258 -867597 -3410861 -5499597
6519 -5499597 -3928119 535493 3605749 2650202 -663456 -3079647 -3240835 -1989051 -810834
6510 -810834 -758316 -1871022 -3113514 -3603202 -3902359 -5071975 -6647794 -7076128 -6169424
6501 -6169424 -5290537 -4798319 -3517863 -1657428 -1823960 -5139424 -8161705 -6430477 -465466
6492 -465466 4358652 4103204 301617 -2828698 -3332635 -2613412 -2827630 -4430601 -5885762
6483 -5885762 -5111159 -1567297 2717082 4784289 3869826 2227722 2228247 3375148 3246424
6474 3246424 910999 -2015225 -3787359 -4437182 -4475585 -3101352 636006 5466437 8644430
6465 8644430 9373663 9734954 11328725 12615056 11209922 7754412 5333715 5174343 5009167
6456 5009167 2354613 -2238236 -6198376 -7957680 -7769954 -6383150 -4304689 -2196528
6448 -2196528 -901521 -831182 -1710564 -2844810 -3462198 -3258427 -2906524 -3386338 -4363687
6439 -4363687 -4071691 -1608777 1378141 2324121 515445 -2749275 -6004199 -8161046 -7819364
6430 -7819364 -4147863 1218430 4993671 5716012 4992957 4613947 4092163 2305115 76749
6421 76749 -743220 -28551 631567 408230 -6453 -133970 -564980 -1660159 -2682860 -2707700
6411 -2707700 -1342357 1725243 6494808 11260872 12848133 9609458 3590650 -1378080
6403 -1378080 -3342411 -3180823 -2607809 -2420198 -2380851 -1693164 242259 2614685 3244287
6394 3244287 1181489 -1191902 -614635 2347407 3243787 -650344 -6645599 -10144411 -10224780
6385 -10224780 -9550328 -9691700 -9219370 -6674640 -3162166 -960225 -896508 -2008175 -2843616
6376 -2843616 -2362589 -411037 1937305 3158831 2950436 2402546 2065199 921698 -1855498
6367 -1855498 -5180344 -7342922 -8219214 -8659158 -8202214 -5346239 -327886 4107402 5467068
6358 5467068 3824692 774012 -2496733 -5040037 -5474087 -3339664 -633720 -172495 -2296528
6349 -2296528 -4626102 -5243961 -4571037 -3610223 -2061414 509738 2775775 2591391 -489994
6340 -489994 -4876423 -8756801 -10947913 -10315720 -6321671 -745001 2790197 2278335 -483421
6331 -483421 -2191136 -1787667 -743949 -130493 966681 3669475 7051156 8636407 7074420
6322 7074420 3731956 1209595 277689 -1148262 -5336676 -11378349 -15671371 -16016131 -13885778
6313 -13885778 -11758725 -9517391 -5191365 1323010 7241873 9869162 9177586 7065520
6305 7065520 5329086 4874722 5700913 6761295 6561127 4648857 2121062 321181 -343068
6296 -343068 -43558 1057500 2419130 2902134 1678728 -1065147 -4697264 -8680032 -12108152
6287 -12108152 -13684256 -13013909 -11213923 -9387686 -7199207 -3920298 -234616 2161796
6279 2161796 2399547 901221 -1538988 -4073432 -5659370 -5885122 -5751001 -6465242 -7679895
6270 -7679895 -8124955 -7678781 -7292540 -6996167 -5773444 -3685065 -2289970 -2326721 -2698481
6261 -2698481 -2582836 -2733106 -3417280 -2836517 451731 4667989 6466712 4870112 1645735
6252 1645735 -1640164 -4623548 -6341942 -5155779 -1423475 1899120 2726837 2308725 2801497
6243 2801497 3926599 3945208 2787384 1832142 1073313 -874657 -3628030 -4472507 -2166101
6234 -2166101 770743 1326505 12134 -564422 -109335 -933299 -3836961 -6362975 -6156030
6225 -6156030 -4035939 -2339517 -1826696 -1952252 -2926552 -5267160 -7781676 -8254506 -6378698
6216 -6378698 -4113699 -2667366 -990461 1813818 4282342 4282462 1890412 -850689 -2336741
6207 -2336741 -2201578 -375936 2967155 6660260 9258009 10617184 11450746 11343157 8962602
6198 8962602 4748520 1540612 1261445 2300273 1764143 -559983 -2272702 -1973057 -870497
6189 -870497 -552856 -916277 -1114519 -1137387 -1197796 -476568 1957327 5147127 6605673 5166519
6179 5166519 2583309 1587856 2786460 4172106 3628333 1312411 -690747 -761859 576849
6170 576849 1394002 507883 -1334340 -2509572 -2562688 -2791983 -4500757 -6902535 -7434629
6161 -7434629 -4525248 316923 3689316 3491980 621448 -2219182 -2758840 -441862 3419224
6152 3419224 6327569 6260299 3355145 -401697 -3437729 -5825181 -7898170 -8855629 -7921474
6143 -7921474 -6079978 -5166011 -5590285 -6362476 -7000967 -7727582 -7909613 -6351322 -3588675
6134 -3588675 -1920465 -2233011 -2514607 -724085 2320310 4250385 4128130 2787978 1361256
6125 1361256 903623 2418365 5622945 8491636 9516180 9578245 10138023 10752491 10310936
6116 10310936 9552780 9846409 10231765 8523589 5105699 2658750 1866847 366773 -3261818
6107 -3261818 -7182513 -9016478 -8438425 -6069852 -2334541 1364318 2959192 2725060 3285720
6098 3285720 4842311 3502652 -2775548 -9352976 -10003957 -5332812 -1954470 -3722581
6090 -3722581 -7671569 -8987592 -6403440 -1649663 3298972 6732742 7239358 5170727
6082 5170727 2941733 2589677 3839475 5221050 5943927 5882637 4799379 2638735 177449
6073 177449 -1177221 -119037 3688938 8714216 11951047 11467572 8486121 5869121 4877587
6064 4877587 4666383 4304309 3364174 994445 -3069740 -6497774 -6176025 -2793730 -903299
6055 -903299 -3134247 -6868659 -8258281 -7018113 -5097445 -3034974 -668851 241864 -2213275
6046 -2213275 -6133439 -7106023 -4134767 -1512868 -3534857 -9244324 -13814417 -13949108 -10639866
6037 -10639866 -7229026 -5918847 -6270864 -6608307 -6417119 -6842594 -8742439 -11194615 -12708646
6028 -12708646 -13089544 -12929160 -11959232 -9598059 -6942599 -6314976 -8285524 -10657663 -11188883
6019 -11188883 -10083435 -8914145 -8248458 -7564953 -6671746 -5735092 -4286188 -1752517 907412
6010 907412 1585947 -317327 -2810865 -3860250 -4073347 -5442845 -7968629 -9409139 -8640820
6001 -8640820 -7335636 -7247089 -7482344 -6167997 -3600237 -1474906 430114 4085410 9257987
5992 9257987 12260911 10126664 4496462 -85203 -757423 1839608 5185392 7000924
5984 7000924 6585762 5307805 5226197 6397849 6458175 3820949 139339 -1738470 -1183529
5975 -1183529 400879 2122701 3941542 5089710 4383689 2179054 240257 -480241 -473897
5966 -473897 -230273 187656 233476 -616085 -1392960 -660333 718380 -27459 -3681999 -7502682
5956 -7502682 -8546355 -6758055 -3696504 -111564 3561209 5841070 5436440 3124153
5948 3124153 637283 -1782900 -4951636 -8106286 -8638803 -5122522 492734 4497968
5940 4497968 4952722 3313997 2637829 4161730 5824804 4689931 734809 -2850565 -3547592
5931 -3547592 -2391909 -1987006 -2929998 -3967305 -4897922 -6894094 -9617913 -10328695 -7228912
5922 -7228912 -2228780 1280149 2555771 3612761 5534736 6718987 5395878 2225367
5914 2225367 -803769 -2881824 -4267393 -4471169 -2575671 522565 2076012 507398
5906 507398 -2804880 -5507420 -6794034 -7092761 -6602015 -5474995 -4421883 -3675761 -2214701
5897 -2214701 529036 3141880 4161387 4561064 6049211 7601558 6479260 2641017
5889 2641017 -763788 -1758516 -1488530 -1031805 494875 2967179 3475627 176524 -4264815
5880 -4264815 -5891093 -4455246 -2399671 -403539 2672831 6299668 8403009 8953816
5872 8953816 9962224 11363575 10292397 5671669 473283 -2376990 -3715841 -5515792
5864 -5515792 -6803399 -5262211 -1773496 -62659 -1587385 -3443230 -2381816 969468
5856 969468 3318311 2990651 1334328 106697 -912481 -2937039 -5706360 -7259282 -6242940
5847 -6242940 -3449645 -571151 1731945 3661817 4873390 4654743 3566499 3508305 5428173
5838 5428173 7816926 8301311 6245225 3036938 188040 -1954187 -3610584 -4545731 -4191258
5829 -4191258 -2594438 -775965 137384 102109 220147 1480822 3694291 5898612 7473618
5820 7473618 8366626 8482383 7577936 5816876 3835849 2190992 1266093 1592223 3335971
5811 3335971 5345110 5817563 4449715 2888413 2296711 1565281 -818583 -3999712 -5590207
5802 -5590207 -5004013 -4121622 -4366412 -4903269 -4468980 -3319497 -2184608 -784086 968193
5793 968193 1490050 -571011 -3589835 -4535235 -3221684 -2373194 -2952093 -2417978 733775
5784 733775 3503374 2313343 -1444345 -3274148 -2164825 -1493653 -3064386 -4164024 -2293296
5775 -2293296 340078 -243804 -4267643 -8297352 -9752751 -8836683 -6744174 -4538393 -3611715
5766 -3611715 -4777617 -6486931 -5948865 -2595063 1244523 3576134 4817368 5873827
5758 5873827 6088668 4651096 2675972 1907714 1894221 393726 -3215064 -6591475 -7313085
5749 -7313085 -5987034 -5326103 -6648458 -8634678 -9603696 -9492017 -8671951 -6211925 -1364762
5740 -1364762 3594268 4606434 981000 -2755485 -2082977 1748105 3508582 965042
5732 965042 -2529509 -2796643 143782 2963167 3261375 1429150 -709628 -1568607 -495627
5723 -495627 1835103 3546229 2936120 151791 -2767707 -3702970 -2316441 -220899 610561
5714 610561 -356714 -1972427 -2804857 -2401343 -1091007 772191 2833486 4543741 5611973
5705 5611973 6233593 6331638 5343930 3633746 3139683 5137571 8021188 9038056 7770866
5696 7770866 5993801 4559828 2950588 1855951 3057560 5774845 6211329 2662342
5688 2662342 -1424724 -1819497 1108214 3954489 5429313 6778284 8129070 7837611 5398667
5679 5398667 2078748 -1542639 -5949528 -10275936 -12300626 -11690774 -10807279 -11306502 -12229508
5670 -12229508 -12450264 -12438204 -12015026 -8925928 -2112519 5331945 9103192 8516092 6073089
5661 6073089 3367374 232569 -2718539 -3965777 -3771255 -4068651 -4972107 -4240219 -1407847
5652 -1407847 387016 -1250432 -4068375 -4186229 -1445393 1055598 1750949 1856525 2153817
5643 2153817 1765885 760070 1043627 3318051 5458456 5527104 4465507 3980445 3434436
5634 3434436 1045990 -2903113 -6282693 -7900760 -8044185 -6783813 -3936137 -550682
5626 -550682 1679009 2576858 3125978 2984388 689237 -3229931 -5808614 -5441807 -4078473
5617 -4078473 -4262621 -5729954 -6483693 -5760239 -4221285 -2387395 -669614 -115041 -1424967
5608 -1424967 -3823424 -6279279 -8972599 -11936551 -13259177 -10920993 -6085380 -2312244
5600 -2312244 -1423224 -2224617 -3448118 -5461462 -8158148 -9517662 -8069558 -5295075 -3632014
5591 -3632014 -3003811 -1380666 1551592 3470759 2747361 957309 802361 2494500 3730004
5582 3730004 2997256 1330883 341877 -25235 -586693 -829929 395843 2258083 2046257
5573 2046257 -1263245 -5058386 -5980993 -3825334 -1247541 -251675 -434221 -512475 -130894
5564 -130894 270014 495819 975542 2354003 4814568 7668309 9781286 10519281 9931430
5555 9931430 8081039 5083894 1990250 364915 333963 342717 -262834 -18428 1776004
5546 1776004 2613937 -250207 -5226297 -7672404 -5876267 -3116616 -3038747 -5250472 -6676569
5537 -6676569 -5535580 -2604446 338431 2079208 2498480 2225320 1572780 175921 -1465973
5528 -1465973 -1030283 2877801 7313404 7195467 1716440 -4094712 -5553920 -3615948 -2233566
5519 -2233566 -2794378 -3699069 -3784433 -3285194 -2183622 -224256 1704167 2404783 2449450
5510 2449450 3487583 5619836 7307217 7807113 7883282 8079494 8057929 7776048 7600184
5501 7600184 6992060 4718408 820082 -2933162 -4875434 -4655513 -2758215 -304258 746819
5492 746819 -979634 -4278513 -6405596 -6476557 -6226099 -7090496 -8436555 -9283361 -9785707
5483 -9785707 -10030594 -9208821 -7162504 -5059510 -3302418 -539770 3767696 7588622 8943390
5474 8943390 8592404 7986782 6260634 2128176 -2438053 -3914547 -2419498 -1767328 -3746648
5465 -3746648 -5563190 -4285603 -1006531 1338332 2055801 2284288 2061176 401077 -2245417
5456 -2245417 -3827818 -3127294 -962670 1030809 1742699 875883 -1011673 -2712610 -3272260
5447 -3272260 -2507563 -401330 2950302 6041611 6181283 2809305 -569245 -149516 3058074
5438 3058074 4544832 2635379 454164 837950 2434454 2670007 1930209 2150186 3075194
5429 3075194 2979079 2173613 2639867 4227576 4287905 1962166 253414 2143962 6267644
5420 6267644 8384139 6589412 3494141 3136497 6663791 11328724 13332912 11470862
5412 11470862 8042573 6210484 6701303 7521826 6765022 4870635 3688394 3918201 4320861
5403 4320861 3492754 1713229 496129 600381 1299141 1835530 2620761 4051032 4947934
5394 4947934 3905455 2074914 2477488 5750755 8598256 7957089 4992556 2981547 2670247
5385 2670247 2268234 1146835 590857 960216 941084 57401 -640955 -927404 -1722469 -2261639
5375 -2261639 -16287 4903478 8252581 7163833 4792870 6175995 10939747 13795211
5367 13795211 11858711 7861466 5496010 4819560 3813933 2071649 763799 178555
5359 178555 -660600 -2202499 -3646240 -4142677 -3838386 -3506065 -3605731 -3853787 -3473344 -1836413
5349 -1836413 922889 3833282 5728263 6108538 5395483 4235434 2630863 210388 -2421935
5340 -2421935 -3355060 -1383746 1910522 3317239 1448124 -2024768 -4762087 -6036364
5332 -6036364 -6113469 -4936091 -2645554 -302356 1306989 2872648 5361899 8335436 10664657
5323 10664657 12085815 12612912 11333126 7750697 3783218 2141927 2685929 2606825 641083
5314 641083 -1160111 -796277 657519 980392 272567 580365 2689016 4931868 5128271
5305 5128271 2693102 -984613 -3420611 -2646824 1042579 5072816 7145600 7606206 8341207
5296 8341207 9610898 9436374 6542073 2534732 80811 -265390 -111625 -470509 -483435
5287 -483435 716016 2161354 2078108 141080 -2239886 -3639318 -3877251 -3749715 -4137839
5278 -4137839 -5184828 -5844170 -4703860 -1934255 270842 276720 -631630 72032 2652693
5269 2652693 5102041 6243298 6558240 5929235 3365089 -220711 -1795918 -303363 1544409
5260 1544409 1377399 539277 1013707 1523277 -68689 -2421793 -2621961 -1234418 -1304378
5251 -1304378 -2733545 -2088748 1313545 3383562 1089755 -3098894 -4886832 -3738401
5243 -3738401 -2452030 -3049829 -5379927 -8420107 -10737592 -10495333 -7038229 -2292382 669218
5234 669218 288384 -2768580 -6696285 -9577959 -10241913 -9048014 -7329009 -5726523 -4015316
5225 -4015316 -2703864 -3131912 -5232243 -6888412 -6684207 -5803404 -5852193 -6166953 -4901901
5216 -4901901 -1801483 1636795 3939847 4246911 2128639 -1496580 -3958035 -3104163 222148
5207 222148 3213882 4164946 3350296 1631028 -143447 -757804 539979 2761134 4207232
5198 4207232 4877601 6370791 9045273 10715117 9085389 4787144 1140876 943162 3805463
5189 3805463 6764451 7482371 6493821 5805398 5722861 4447687 1155174 -2087366 -2670408
5180 -2670408 -754808 1050316 742877 -1475149 -4121581 -5746810 -5630996 -4269134 -3054321
5171 -3054321 -2769472 -2767149 -2259072 -1640451 -1577590 -1606480 -900962 264718 1229589 2427309
5161 2427309 4392506 5738498 4278380 376699 -2876245 -3573538 -3296884 -4412457 -6579099
5152 -6579099 -7585160 -6820660 -5994660 -6225190 -5981573 -2942272 2690208 7747111 9044528
5143 9044528 6204240 1583472 -1735990 -1675284 1812634 6255690 8012230 5664063 1816542
5134 1816542 167671 1195805 2405300 2239681 1162065 -1099802 -5945445 -12209607
5126 -12209607 -15342065 -12774734 -7717689 -4827781 -4112496 -2386024 748438 2208836
5118 2208836 252178 -3618282 -7648683 -11318002 -13360580 -11815790 -7399859 -3936123
5110 -3936123 -3732396 -4829015 -4459117 -2969594 -2279855 -2443722 -2323245 -2445877 -4449332
5101 -4449332 -8041744 -10925008 -11889731 -11913206 -11760754 -10539043 -7748036 -5213040 -5291383
5092 -5291383 -7808722 -10369742 -11538579 -12108433 -12915029 -13043851 -11221909 -7762125 -3882636
5083 -3882636 -176929 2732556 3192024 463473 -2972140 -3810460 -2587572 -2963150 -5908774
5074 -5908774 -8046418 -7109729 -5494431 -5994020 -7275173 -6904142 -6168997 -7769702 -10486504
5065 -10486504 -10675008 -8305590 -6988286 -7892339 -7976632 -5135688 -1229617 1308037 2395825
5056 2395825 2277842 -105033 -4550297 -8086997 -8478463 -7291663 -7192661 -7801783 -6648333
5047 -6648333 -3249624 27326 860298 -877596 -3651200 -5742558 -6294272 -5621205 -4403562
5038 -4403562 -2504892 691019 4698062 7820441 9005701 8730633 7698879 5867048
5030 5867048 3212613 239631 -2763108 -5713078 -7572086 -6785115 -3740591 -1329642
5022 -1329642 -1802349 -4001372 -4850015 -2952847 213682 2258694 2325753 1803676 2793395
5013 2793395 5545406 7679940 6699571 2923967 -1106853 -3675117 -4839358 -4689660 -2648941
5004 -2648941 1076132 4944476 7511873 8288426 7188307 4607844 2029216 834023
4996 834023 408084 -823278 -2451309 -2297671 25190 1870289 641254 -3533691 -8717348
4987 -8717348 -13069097 -15430675 -15782851 -15607317 -16266727 -16951894 -15942987 -13551060 -11465245
4978 -11465245 -9549637 -6356177 -2888897 -2260863 -4704073 -6423652 -4889568 -2060289
4970 -2060289 -607091 -24660 1309412 2843823 3028735 1806512 -112918 -2720922 -5811845
4961 -5811845 -8425948 -10514429 -13022513 -15059350 -13662439 -8240083 -2741642 -1210799
4953 -1210799 -3229406 -5722546 -7101134 -7454593 -6682840 -4902964 -3396906 -3252142 -4168061
4944 -4168061 -5713236 -8060025 -10423855 -10849489 -8829582 -6268101 -4923007 -4867694 -5859099
4935 -5859099 -7568156 -8118680 -5638041 -1774138 -167319 -1059141 -1476361 -990836 -2233372
4926 -2233372 -5055096 -6115554 -5599057 -7685643 -12101935 -12429456 -6356292 -438111 -49681
4917 -49681 -1453489 715016 4564516 5678266 4802594 4327368 2544860 -1903949 -4975199
4908 -4975199 -3358921 -783782 -1674742 -3752664 -3589974 -3663557 -6516623 -8096302 -5120869
4899 -5120869 -2819915 -6375973 -10996995 -10193816 -7339115 -8301322 -9485508 -5470156 -1993077
4890 -1993077 -7619537 -18091255 -23136198 -23274410 -24982892 -25506000 -19394346 -13773866
4882 -13773866 -18058542 -24827798 -22314940 -18727259 -28338295 -40752102 -36664127 -28220642
4874 -28220642 -39410985 -42723515 28769575 178884021 307048819 314802937 222340497
4867 222340497 131813428 98245987 91079288 72178787 50212577 44979508 47458928
4860 47458928 41051429 31080715 29120509 29705647 23091140 14355738 12052826 11719269
4852 11719269 6431140 1709000 5237600 12017145 13325141 11543758 13388789 16278475
4844 16278475 13716767 7833354 5234903 5641172 4728531 3361388 4561340 5787972
4836 5787972 3198384 -331567 248444 3174798 3187204 604962 -155588 1715763 3739510
4827 3739510 5413618 7288697 7679324 5735869 4708194 7046327 9638469 8856202 6545048
4818 6545048 5924137 5596650 3075000 247164 -294146 -367418 -1858965 -1419213 4123225
4809 4123225 10852302 12992850 11658593 11487575 11751154 8381347 2615870 -33845 1666121
4800 1666121 3954374 4922688 5728982 6076116 4882193 4539749 8107969 12972606 13701475
4791 13701475 10658314 9181396 10413587 9914013 6069910 3019183 3424613 4364373 2771582
4782 2771582 24082 -1196667 -551467 1283880 3854081 5378884 3701575 248539
4774 248539 -455047 3345055 8344115 10718780 9764440 6363192 1542112 -2364371 -2788923
4765 -2788923 -625822 327593 -1238603 -2620163 -1984027 -959536 -717712 628234 4186386
4756 4186386 7174873 6714954 4309513 3414414 4206091 3793693 764040 -3121069 -5519343
4747 -5519343 -5817663 -4825444 -3578254 -2661125 -1974937 -1078526 27302 749228 657545
4738 657545 13888 -421670 291303 2772180 6374647 9075182 9210475 7122103 4344453
4729 4344453 1675270 -937215 -3071830 -3650490 -2036675 1418840 5623116 8996997
4721 8996997 10222405 9478873 8213904 7175689 5836961 4308548 4030086 5384834 6424004
4712 6424004 5514029 3585503 2094932 530742 -2076319 -4837285 -6346079 -6786918 -6611026
4703 -6611026 -4887625 -1380043 1532167 1752383 681235 717206 1200239 -73502 -2898321
4694 -2898321 -5568047 -8191392 -11401644 -13110224 -10666473 -5481228 -1507014 286479
4686 286479 1985024 3994223 4605770 4013156 4266950 5077349 4096138 1812024 1736958
4677 1736958 4914863 8433539 10252225 11293404 11786136 10070391 6676762 5285742
4669 5285742 7379625 9547583 8386537 4966084 2293951 1185980 720804 350517 -221114
4660 -221114 -1181572 -1565690 -332126 1114308 463581 -1196983 -451598 2511550 3555308
4651 3555308 1373065 -376354 249016 -80192 -3590510 -6374357 -4111091 988197 3647043
4642 3647043 3026880 2114024 1977692 1473270 1128011 2595921 4896079 5307757 3745402
4633 3745402 2646217 2592147 1371381 -2240926 -6469847 -8906251 -9036599 -8008294 -7036460
4624 -7036460 -6131056 -4048629 -325545 2657446 1783492 -2015578 -3959357 -1927704 287467
4615 287467 -1397112 -5388690 -7175981 -5645274 -3150985 -1215473 50048 -381388 -3330136
4606 -3330136 -6494473 -6375602 -3216090 -918510 -1731269 -3584365 -3091647 795751 6317395
4597 6317395 10551411 11728311 11057555 11402072 13028701 12401986 7044410 -337553 -5120424
4588 -5120424 -6424218 -6566990 -6476705 -5266493 -3514391 -3189014 -4313830 -4911083 -4368984
4579 -4368984 -3911428 -3626097 -2081827 557539 1800060 156903 -2748564 -4074067 -2335674
4570 -2335674 1907716 6369267 8260817 6876595 4667237 4298757 5516857 6683825
4562 6683825 8033270 10696779 13484019 13803350 11518311 8990477 7398388 5746363
4554 5746363 3402595 929796 -1385891 -3060327 -1916187 3583279 10512169 13505165
4546 13505165 11071067 6629952 2977071 -397492 -3551800 -3993038 -760161 2671354
4538 2671354 2494936 -479853 -2488708 -1765649 525978 3026718 5428884 7449035 8388736
4529 8388736 7828336 6000195 3704037 2069735 1679742 1798762 1403837 886346 1388931
4520 1388931 2518131 2465069 674252 -1398299 -2630542 -3465400 -4094012 -3286277 -213966
4511 -213966 3903798 7086453 8526482 8422463 6963381 4507519 2075189 643840 32279
4502 32279 -1007861 -3310077 -5698551 -5305871 -697452 5270087 7615341 5026195 1277696
4493 1277696 -411845 -1558212 -4392363 -6552088 -3976000 2361344 6979065 6725897
4485 6725897 3269017 -755334 -4003518 -5041049 -3044421 -331415 -214009 -1916036
4477 -1916036 -1626293 1157868 2922651 2315678 1884076 2379172 861165 -3107204 -4686432
4468 -4686432 -685061 5105838 7291451 5892731 4162858 2798515 620713 -1527316
4460 -1527316 -1818501 -728486 162541 1026029 2492245 3456671 3091748 2879464 3650971
4451 3650971 3088333 -350816 -3492526 -2500733 1106477 2755377 1545600 259272 -176063
4442 -176063 -1531319 -3865046 -4595407 -2432086 1044975 3876726 5021419 3694120 496454
4433 496454 -1439234 210737 3078117 3140134 1057890 1346863 5207209 8538293 7978491
4424 7978491 4963417 2431052 1055983 501170 1352345 3675213 5726022 5849410 4202380
4415 4202380 1670656 -1191154 -3443072 -4066162 -3926044 -5371739 -8661968 -10605741 -8256882
4406 -8256882 -2835356 1221840 512276 -4440623 -9707955 -11206282 -8312181 -4129019
4398 -4129019 -1406523 799079 4779870 9709304 12281507 11468324 9674521 8788219 7870794
4389 7870794 5617653 2683138 470011 -451254 167290 2474417 5364360 6806361 6132417
4380 6132417 4529775 2896540 1027926 -704962 -1058714 -124642 119066 -1609755 -4392656
4371 -4392656 -6753151 -7909182 -6846727 -2492165 3974574 8940267 9932082 8066372
4363 8066372 6104705 5626519 6810726 9044049 10625617 9647545 6385817 3298612 1758092
4354 1758092 641694 -788258 -791015 2321088 7199643 10799572 11496570 9429025 5118964
4345 5118964 -516302 -5740707 -9135745 -10554917 -10138519 -7645307 -3804639 -838446
4337 -838446 -172915 -807759 -1261978 -1767537 -2967925 -3790002 -2605429 255804 2899104
4328 2899104 4167981 4044020 2492436 -337363 -3123642 -4196201 -3341084 -1739332 -398765
4319 -398765 382709 459588 -113737 -703517 -687437 -293442 -289950 -1132069 -2686851 -4201010
4309 -4201010 -4455677 -3040152 -1634974 -2484777 -5122497 -6441219 -4874653 -2511106 -1788373
4300 -1788373 -2191446 -2044972 -1575704 -1762797 -1688891 186407 3045459 4714658 5036830
4291 5036830 5566232 6275959 5371238 2502798 -424595 -2057748 -2921173 -3568402 -3744807
4282 -3744807 -3937449 -5341266 -7358286 -7443508 -4744838 -1824186 -1127984 -1494839 -89891
4273 -89891 3464695 6879903 8245906 7341344 4531155 481773 -3107791 -4513136 -4173337
4264 -4173337 -4297895 -5795698 -7093646 -6648341 -5043383 -3512392 -1891110 282805 1741539
4255 1741539 763615 -1853404 -3317591 -2572118 -1397498 -1254119 -1287001 -623914 -436606
4246 -436606 -1794357 -3167650 -2361773 223753 2553914 4081158 5241052 4708339 542014
4237 542014 -5815678 -10029504 -10256198 -9083176 -8909144 -8433727 -5791368 -2620108 -2164285
4228 -2164285 -4679085 -7383161 -8372032 -8282812 -8233003 -8113864 -7332727 -5954888 -4589690
4219 -4589690 -3726813 -3425225 -3485415 -3990923 -5501486 -8152265 -10816909 -12207598 -12714619
4210 -12714619 -13776115 -15252378 -15051009 -12017120 -7793282 -4974582 -4468002 -5251085 -5658678
4201 -5658678 -4488260 -2021354 -262276 -884324 -2864010 -3746412 -3133618 -2683464 -2570241
4192 -2570241 -876030 2602651 4890976 3761048 637711 -2084615 -4252097 -6598789
4184 -6598789 -8363273 -8362562 -6841345 -4673615 -2469551 -1675264 -4109147 -8678227 -10996156
4175 -10996156 -8355142 -3097183 580671 920281 -1601427 -5746891 -9064231 -9225764
4167 -9225764 -7759446 -8929183 -12998247 -14994435 -12685826 -10641429 -12764707 -16189301
4159 -16189301 -17182173 -17521817 -19331980 -19303931 -15145431 -12380182 -16346978 -22245924 -22568929
4150 -22568929 -19997215 -22145662 -27425248 -28633819 -27626616 -32081469 -39462019 -40847664
4142 -40847664 -40349605 -49514076 -57218370 -29742595 42733413 118303561 144410404 117154591
4134 117154591 78479681 60895986 58747701 53922833 44832154 39606904 38004028 34105340
4126 34105340 28249498 24891825 23528114 20567016 16932965 16546322 19234623 20877595
4118 20877595 19371826 16238412 13524338 12451797 13861670 17087279 19355584 18420230
4110 18420230 14835512 10493100 6681009 4602348 5358822 7898400 9319390 8740521
4102 8740521 8474476 9918196 11165896 10727613 10644396 13015588 15753285 15124821 11174011
4093 11174011 7555768 6758167 8142335 10148365 11881698 12607791 11857181 10341158 9335901
4084 9335901 9100661 9046851 9259814 10569706 13047273 15439513 16357250 15564935 14083842
4075 14083842 13226946 13343267 13477965 12536018 10434126 7557872 3939005 335840 -804412
4066 -804412 2087825 6351005 7256310 4268485 2162032 4363832 8066827 8413469 5219214
4057 5219214 2413272 2252889 3527992 5022060 7325137 10574674 13110983 13607054 12772120
4048 12772120 11848189 10781002 8970129 6802119 5258135 4461327 3520469 1712805 -661006
4039 -661006 -2536746 -3009126 -2144801 -927560 -182012 375093 1658519 3889380 6275837
4030 6275837 8049391 9179547 9782510 9475364 8011529 6306285 6040643 7992411 11110005
4021 11110005 13317961 12906259 9385078 4050190 11514 184536 3905426 6602173
4013 6602173 4787364 800577 108634 3856149 7125713 5734880 1704966 -353924
4005 -353924 215250 470003 -721298 -1316648 80775 2311738 4020366 5261334 6154757
3996 6154757 6249269 5870376 6083809 6834508 7111071 7250372 8733609 11119509 11666392
3987 11666392 9059717 5368875 3193324 2815575 3208605 3898757 4734254 5607877 7233423
3978 7233423 10197790 12685403 11867965 8525963 7089433 9412859 11858763 10976840 8737049
3969 8737049 8803974 10563957 11023985 10501095 11716379 14299078 14883850 12539273 9852990
3960 9852990 8362875 6939737 5281126 4985859 5986538 5655779 3151777 1397031 2768737
3951 2768737 5632576 7277031 7821645 8877857 10313053 10713683 9597533 7141966 3198710
3942 3198710 -1381648 -3956225 -2971518 -481239 571617 530236 1849286 4560850 6086492
3933 6086492 5665171 5780574 8060311 10373759 9820602 6805784 4030706 2443275 452688
3924 452688 -2880900 -5860080 -6183367 -3833973 -918273 876553 1644856 2102230 2067585
3915 2067585 772981 -1731499 -4303770 -5961093 -6822571 -7512012 -8083266 -8021580 -7096292
3906 -7096292 -5710453 -4412705 -3437280 -2691624 -1729793 301967 3988694 8421619 11246362
3897 11246362 10921521 8836400 8043586 9470248 10511105 8341524 3724671 55504
3889 55504 -929840 -648274 -713478 -569640 765620 2248391 1982539 98550 -1410436
3880 -1410436 -1518698 -1050970 -604583 481381 2171552 2352967 -887331 -6182567 -9772543
3871 -9772543 -9677620 -7654405 -6391096 -5986917 -4571486 -1810220 137959 -292369 -1682023
3862 -1682023 -1650183 -155806 966227 1130289 1508338 2309801 1770406 -1190668 -4930730
3853 -4930730 -6794973 -5646081 -1885622 3458247 8430193 10524744 9183970 6956334
3845 6956334 6561396 7763028 8732473 9184697 9855737 9879822 7629210 4017357 2044493
3836 2044493 2518168 2849782 1032409 -1587974 -2828104 -2857792 -3157756 -3809588 -3668582
3827 -3668582 -2371629 -637545 830195 1479281 525729 -2287867 -5786901 -8143139 -8417548
3818 -8417548 -6916531 -4665722 -3095047 -3326940 -4767893 -5105559 -2907238 152980 835583
3809 835583 -1983801 -6138960 -8623192 -8265443 -5935702 -3249446 -1738750 -2516088 -5490860
3800 -5490860 -8639484 -9012771 -5500064 -384452 2954736 3981920 5216847 7927826
3792 7927826 9559615 7355722 3098227 1335244 3212688 5193067 4521261 2836307
3784 2836307 2733748 3467817 2622539 327105 -976546 -182623 1502034 2837059 3593219
3775 3593219 3465243 2065081 235800 -428673 258220 916768 854851 856669 1260060 930062
3765 930062 -889379 -2963072 -3404479 -1762060 1207811 4942647 8826384 10944179 8857714
3756 8857714 2453210 -4829217 -8672115 -7789091 -4596648 -2126527 -1204115 -996377 -1128331
3747 -1128331 -1909321 -2983025 -3422193 -3326832 -3752417 -4541417 -3844034 -801054 2707432
3738 2707432 4332797 4132967 3664169 3246871 2087950 522010 -111538 65555 -817346
3729 -817346 -3578255 -6508638 -7472427 -6192400 -3714977 -871152 1731165 3211167 3158385
3720 3158385 2373912 1830843 1204875 -598711 -3562363 -6103226 -6715081 -5476375 -3650154
3711 -3650154 -2221942 -1299565 -843282 -1375302 -3431421 -6432422 -8778970 -9414581 -8818563
3702 -8818563 -7961620 -6709766 -4067243 42761 4048259 6179055 6301264 5942775 6544225
3693 6544225 7905955 8530296 7458688 5360509 3465977 1949388 273874 -1196236
3685 -1196236 -1403168 -673681 -908689 -2755823 -4112911 -2878696 64065 2376973 3730480
3676 3730480 5534223 7775647 8636082 7421754 5578012 4251613 2955672 1388506
3668 1388506 444472 282809 -574553 -2598544 -3438885 -882754 3418090 5431674 3625117
3659 3625117 359464 -1663632 -2499152 -3862137 -6251545 -8137332 -7558894 -4016711 963775
3650 963775 4920735 6383444 5934801 5319816 5588269 6186314 5555896 2412578 -3051563
3641 -3051563 -8623889 -11052901 -8472177 -2198446 4119629 7278319 6620522 4069962
3633 4069962 2647569 4389519 8595497 11966988 11385106 7066670 2468856 664231
3625 664231 1337836 1928841 1165735 328590 929290 2388771 2949731 2246783 1727074 2505244
3615 2505244 3909862 4536467 3830444 2123625 25162 -1470241 -1196805 664370 1890638
3606 1890638 484320 -2557070 -4184775 -3065003 -856622 645704 1927818 4235173
3598 4235173 7017225 8562406 8587038 8499789 9074655 9377756 8477969 6922749 5606563
3589 5606563 4173621 1935932 -71322 256639 2886110 4692443 2987615 -1062376
3581 -1062376 -4113742 -4908214 -4786829 -4414699 -2841364 -457412 80811 -2331875 -4906125
3572 -4906125 -4738835 -2923307 -2143579 -1983598 -212865 2301685 2142733 -1021084 -3300570
3563 -3300570 -2102127 703515 2485927 3386648 4268131 4236099 2759994 1873168 3483724
3554 3483724 6140989 6965970 5376106 2587976 -1039631 -5474373 -8940174 -9164488 -6232625
3545 -6232625 -2077080 2059605 5438926 6204377 2902620 -2661932 -6774310 -7987024
3537 -7987024 -7618676 -6448297 -3856258 -517484 1097968 69561 -1404861 -1016551 809808
3528 809808 2065235 1521792 -1002401 -5143832 -9539743 -12008426 -11359111 -8531605 -5553927
3519 -5553927 -4104073 -5061756 -8066473 -11042046 -11381153 -8248463 -3028510 2440620 6935955
3510 6935955 9359750 8925284 6281351 3127734 402780 -1965376 -3628213 -3787115 -2592057
3501 -2592057 -788486 1915233 5904842 9143267 8577365 4846098 2534735 4214406
3493 4214406 7029395 7191211 5189669 3861936 3442676 1836096 -1252981 -3583866 -3566396
3484 -3566396 -1806598 433735 2387423 3535725 3875892 4244508 5052131 5266932 4012070
3475 4012070 2265948 1315272 566742 -1008158 -2207102 -959604 2115712 4212069 4335520
3466 4335520 4129378 4463807 3993735 1971015 5460 -295341 417565 593393 -71797
3457 -71797 -856134 -1002550 322889 3525742 7108265 8248696 5964336 2368670 -136279
3448 -136279 -1326907 -1752279 -815570 1873152 4704869 5821274 5764724 6341506 7620913
3439 7620913 8272981 8340192 9164962 10555655 10575497 8780216 7354525 7905317 9052146
3430 9052146 8656222 6940788 5751256 5786382 6271010 6685445 7132216 7357492 6994369
3421 6994369 6594962 6921950 7376754 6805618 5899638 6865542 10175078 13507617 14836978
3412 14836978 14778006 14573725 13504716 10269261 5799622 2571296 1712074 2694763 5200417
3403 5200417 9008424 12440941 13526773 12884731 12931039 13857357 13171187 10073869 7304051
3394 7304051 6988590 7445547 6430160 5146085 6073538 8580906 10035210 10226311 11209184
3385 11209184 13140587 13808531 12615924 11609040 11540609 10101066 5868215 1484654 571835
3376 571835 3030497 5594074 6038523 4780974 2929205 861535 -1152026 -2562779 -3279933
3367 -3279933 -3799641 -4227380 -3983582 -2920492 -2068966 -2572424 -4072674 -4851208 -3824153
3358 -3824153 -1876984 -637324 -242474 723150 2948370 5105396 5394908 3554281 794271
3349 794271 -1306720 -1319181 1097923 3604772 2334532 -3126025 -7303546 -4567534 3022904
3340 3022904 7016503 2467875 -6535756 -12559993 -13058104 -10761120 -8428080 -6545173
3332 -6545173 -5256308 -5257871 -6208478 -6370854 -4735080 -2315274 -606044 508393 2515502
3323 2515502 5981800 9023132 8835129 5197047 1592727 1435667 3556342 3472925 -481097
3314 -481097 -4607681 -4743399 -1712679 202873 -985813 -3086247 -3154621 -699164 2688570
3305 2688570 5230595 6014039 5194839 3585199 1670292 -675567 -3050703 -4016025 -2918410
3296 -2918410 -1536543 -2228871 -4471012 -4835542 -1007287 5157033 9224948 8462401 4251623
3287 4251623 493991 -254923 1044183 1856724 1743249 2809489 6248684 10087773 11531829
3278 11531829 10295523 8148406 6176287 4299557 2948864 3275918 5545402 8634935
3270 8634935 11215840 12442365 11730792 9080076 5606235 2836389 1572568 1991834 4066066
3261 4066066 6894643 8586088 8232764 7234785 7206897 7498241 6550192 4721560 3515212
3252 3515212 2760401 1197756 -508729 -217793 2125258 4238071 5263701 6887599 9845966
3243 9845966 12180790 12325826 11373879 10660996 9428518 6808142 4149176 3194960 3338816
3234 3338816 2704634 918144 -895268 -1870434 -1628730 159033 2823734 4297091 3273879
3225 3273879 971404 -623210 -1226981 -1550446 -1381471 -288044 728765 366821 -777095
3216 -777095 -1076622 -404331 228382 1095832 3470353 6839763 8783218 8370728 7713285
3207 7713285 8889019 10694559 10040892 6160358 2002650 904518 2519651 3084940 49978
3198 49978 -4574758 -6648505 -4928179 -1726766 1213017 4695944 8885119 10992153 8598583
3189 8598583 3492396 -511623 -2470958 -4342677 -6876823 -8387111 -7543229 -4781238
3181 -4781238 -752505 4178343 8534010 10302594 9749610 9602065 11512530 14089859 15254170
3172 15254170 14747717 13277878 10866724 7481551 4226549 2610463 3135112 5161666
3164 5161666 7361279 7977632 5936220 2399227 44841 8338 611182 -121007 -1878282
3155 -1878282 -3009312 -2981862 -2663303 -2796073 -3302972 -3715819 -3470683 -2213377 -546495
3146 -546495 7377 -1422416 -3833161 -5341012 -5126944 -3897564 -2717795 -1877823 -789337
3137 -789337 1166735 3489707 4483578 3077246 637094 -135386 1578491 3686584 3912239
3128 3912239 2480169 1245067 1047213 1131210 828027 580990 935071 1172724 -293369
3119 -293369 -3908077 -7781729 -9349164 -8331951 -6974443 -6824192 -6706884 -5129548 -3175459
3110 -3175459 -2840304 -3524028 -2968222 -1349888 -1354077 -3751546 -5972036 -6125403 -5554660
3101 -5554660 -5851581 -5990423 -4446110 -1971801 -95915 1311126 2780022 3207319 1385744
3092 1385744 -1735662 -4416854 -6412258 -7883249 -7725693 -5548470 -3827229 -5106018
3084 -5106018 -8054993 -9252861 -8006882 -6316047 -4881225 -2751897 -659088 -865841
3076 -865841 -3227637 -4956112 -5070643 -5566592 -7053198 -6945361 -4016118 -1497595 -2892743
3067 -2892743 -6969014 -9660729 -9285852 -7250877 -4924793 -2630158 -1101224 -1299947 -2677980
3058 -2677980 -3556179 -3436986 -3413336 -4022740 -3975423 -1581635 3094758 7795516 9752959
3049 9752959 8124149 4805270 2323386 1102144 -182472 -1816365 -2485451 -1869922 -1572651
3040 -1572651 -2274241 -2142836 -24171 1643147 -213938 -4471920 -6844422 -5513788 -2962160
3031 -2962160 -1819148 -1492937 -9443 2843364 5678545 7494696 8110311 7517777 6093177
3022 6093177 4840322 4215696 3123662 346022 -3142928 -4669735 -3176586 -948634
3014 -948634 -1019710 -3452039 -5517152 -5508299 -4741536 -4982757 -5480764 -4377630 -2148620 -1129144
3004 -1129144 -1502139 -434322 3559793 7657583 8170317 5447211 3011946 2706993 3248817
2995 3248817 3328815 3366719 3494488 2321930 -605551 -2717907 -925016 4161615 8252137
2986 8252137 7975848 4311136 787375 -917580 -2352138 -5150205 -7867818 -7414138 -3394066
2977 -3394066 740961 1716827 240958 -647528 -98257 -298995 -2770447 -5732070 -6127608
2968 -6127608 -3237725 703892 3018361 2966361 1812350 992370 331955 -1744073 -5964128
2959 -5964128 -10576002 -12795194 -11828806 -9493892 -7641393 -6079348 -3710313 -749660
2951 -749660 1411675 2303232 3174160 5305398 8144905 9681638 8571808 5531404 2520759
2942 2520759 773645 -123661 -1275606 -2957102 -4230391 -3916216 -1818834 912391 2667546
2933 2667546 2861450 2470877 2735096 3524132 3744600 3282903 3326132 4283233 4707842 3369265
2923 3369265 1319338 390305 360593 -519537 -2372012 -3125454 -1682970 125209 -69660
2914 -69660 -2027828 -3547905 -3613011 -3331435 -3623125 -3316248 -504802 4602372 9193420
2905 9193420 10632101 9257052 7828634 8354164 10049598 10388956 7587060 2216124 -2807510
2896 -2807510 -4097675 -1019032 2893696 3364837 508529 -1541955 -780091 -266035 -3019623
2887 -3019623 -6795790 -7276585 -4615757 -2801174 -3305044 -3598257 -2176264 -953856 -1583347
2878 -1583347 -2956306 -3772523 -4406288 -4770713 -3569128 -1453295 -1659949 -5185059 -8335548
2869 -8335548 -7776421 -5243673 -4198645 -4388035 -3328071 -1122429 154440 451413 1145174
2860 1145174 1494241 -179157 -2303889 -1329139 2633095 5423692 4717950 2660876 1921167
2851 1921167 2741710 4839166 8443832 11978427 12417985 9994177 9064273 11775023 14128932
2842 14128932 11595277 5971089 2856449 4057299 6422908 7225256 6663145 5177839
2834 5177839 2294707 -881661 -1371941 1684945 4986905 4851571 1567084 -1627295 -2692949
2825 -2692949 -2243770 -1678580 -1678322 -2354272 -3275979 -3178762 -1120083 1555768 1866642 -1045717
2815 -1045717 -3912676 -2841997 1598375 4782504 3723993 281078 -2096110 -2450393
2807 -2450393 -1392576 1582093 6636588 10576291 9195592 3187667 -1595746 -1062882
2799 -1062882 2688874 5347628 5989052 6344727 6722054 5831283 3765699 2261069 2099570
2790 2099570 2524934 3233962 4830896 7046742 8460393 8571932 8510924 8892115 8336577
2781 8336577 5272959 519234 -3018883 -3234931 -885823 1394346 1957436 1647609 2170805
2772 2170805 3457344 3702173 2075963 71359 -504825 225867 811880 351558 -1041003
2763 -1041003 -2613617 -2974052 -1005657 2055079 2853645 -205867 -4570262 -6697904 -6162229
2754 -6162229 -4499711 -1679148 3004688 7420532 7866417 4199593 314557 -1152431
2746 -1152431 -1299883 -1370566 -503639 1195538 1129295 -1429271 -2629166 723809 5609011
2737 5609011 6541726 3381493 1055441 2110624 4067717 4608243 4895391 6064511 6331103
2728 6331103 4338397 2559751 4141274 8064646 10657897 10938834 11160697 12217191 11869957
2719 11869957 8566676 4331155 2110615 2045945 2281746 2219204 2790813 4071317 4847522
2710 4847522 4735156 4788975 5426752 5451048 4051779 2277871 1272320 362445 -1391167
2701 -1391167 -2657031 -1002715 3434506 7397316 8183044 6429211 4647038 4336183 5398498
2692 5398498 7235545 9211835 10594637 11036307 10847014 10196492 8590512 5919199 3525459
2683 3525459 3166843 4879599 6579285 5924330 2278575 -2935622 -7304550 -8998812 -7972349
2674 -7972349 -5910061 -4870664 -5875393 -8552735 -11551022 -13121359 -12097352 -9125546
2666 -9125546 -6684408 -7094667 -10274831 -13661511 -14311941 -11114553 -5532493 -685330 750156
2657 750156 -1405853 -4689759 -6256061 -5349090 -3407890 -2066702 -1578165 -1122590 -107299
2648 -107299 1110178 1650977 1125646 93655 -650018 -1060011 -1602229 -2105573 -1759899
2639 -1759899 -684502 -543729 -2552287 -5326442 -5968286 -3426038 227870 2278118 2314735
2630 2314735 1989041 2299724 2202102 334238 -2579523 -4113377 -3112988 -1278967 -897152
2621 -897152 -1638435 -1029138 1914775 5123424 6226012 5474666 4706984 4418214 3508605
2612 3508605 1547523 -427990 -1592391 -2330528 -2938726 -2519599 -176158 3341888 6214799
2603 6214799 7540207 7831837 7569574 6286264 3608307 411254 -2006034 -3547703 -4978623
2594 -4978623 -5932320 -4696437 -765085 3631225 5892668 6145422 6389224 7099982 6672323
2585 6672323 4293299 1295850 -993828 -2911800 -4997906 -6533828 -6790122 -6386202 -6053964
2576 -6053964 -5180673 -3027593 -507883 700556 210876 -1067050 -2281580 -2938071 -2714985
2567 -2714985 -2126328 -2413846 -3597472 -3825799 -2118255 -377322 -700817 -1931985 -1339231
2558 -1339231 1114820 2910800 3013350 3005932 4118389 5753070 7267326 8632437 8819942
2549 8819942 6207598 1569788 -1728082 -1752399 -239223 254799 -603374 -1919707 -3462969
2540 -3462969 -4845160 -4546776 -1759804 1794201 3516807 2701010 509785 -1893600 -4026387
2531 -4026387 -5704428 -7017113 -8017163 -7840587 -5226783 -627615 3413315 4800583
2523 4800583 3685183 1250180 -1608010 -3618876 -3249727 -988759 209013 -1529756
2515 -1529756 -4412597 -5537064 -4522820 -2822318 -950325 1421258 3743621 5136620
2507 5136620 5810379 6099941 5213629 2961421 1389339 2141436 3305497 1839800 -1565246
2498 -1565246 -3284860 -2255636 -1325689 -2578034 -4421575 -4458404 -2626052 -148349 2357174
2489 2357174 4164423 3784753 929513 -2078952 -2584176 -600953 1785957 3426221 5096241
2480 5096241 7488395 9272607 7887243 2448032 -4417037 -8528120 -8438007 -6779043 -6373640
2471 -6373640 -6250137 -3543247 1292948 3926117 1522054 -3491308 -6366924 -5306332
2463 -5306332 -2345167 62125 1595487 3106641 4408779 4135813 1880355 -520771
2455 -520771 -969504 304 -6015 -1416853 -1899169 -438107 313726 -2038528 -5459179
2446 -5459179 -6166408 -4003215 -1868519 -853978 422441 2155216 2854713 2538828 2645376
2437 2645376 2517544 27470 -3648045 -4322316 -1364530 441714 -2047389 -5472975 -5173755
2428 -5173755 -1696643 1415778 3368406 5653689 7971615 8690012 8182233 8123044 8335800
2419 8335800 7591105 6754896 7883437 10515713 11703380 9581190 4723642 -1298494 -6297284
2410 -6297284 -7369350 -3384806 2766762 6980293 8518855 9329780 9673019 7710635 3341729
2401 3341729 -737371 -2340778 -1772697 -295830 1170365 1894195 2049927 3176100 5629557
2392 5629557 6589034 3719386 -206208 -466556 2274477 2695359 -573157 -2437675 570839
2383 570839 4763079 5063669 2085350 -487373 -2101159 -4289210 -5852330 -4212659 -662607
2374 -662607 540118 -1447473 -2712862 -614948 2295682 2062279 -1410782 -4824899 -5833026
2365 -5833026 -5086768 -4390403 -4287090 -4021378 -3406316 -3719469 -5896098 -8345217 -8222921
2356 -8222921 -5219455 -2275018 -1624267 -2035314 -1444321 -293916 144595 1105999 4646313
2347 4646313 9208137 10500406 7440978 3988801 3668478 5108756 5111311 3778528 3602128
2338 3602128 4736607 4652776 2717577 1970826 4791511 8942600 10149879 7549325 4184194
2329 4184194 2344133 1022573 -1147760 -2873109 -2216310 -227086 50350 -2106302 -4249285
2320 -4249285 -4612593 -4497524 -5765565 -7860658 -8837741 -8024245 -6062955 -3270209 313014
2311 313014 3632769 4918950 3398566 -9433 -3394369 -4713644 -2926443 542104
2303 542104 2308494 634368 -1877972 -933308 4111405 9264105 10653664 8691263 6679800
2294 6679800 6545968 7186674 6515656 4024305 1225377 144384 1552433 4442549 7047059
2285 7047059 8299429 8373104 8070248 7875639 7471915 6086318 3487521 564133 -1544310
2276 -1544310 -2856704 -4342658 -6119917 -6799959 -5224891 -2114053 684677 1969055
2268 1969055 1690752 547224 -253210 190933 985071 -147766 -3759005 -7113155 -7370636
2259 -7370636 -5360102 -4159041 -4644683 -4918121 -3945664 -3050757 -3271610 -3803703 -4075113
2250 -4075113 -4996949 -6715280 -7263257 -5347102 -2761369 -1874055 -2050555 -1034273 1002093
2241 1002093 1610228 222352 -663143 608603 2001301 482085 -3737355 -7373751 -7989186
2232 -7989186 -6304630 -4665916 -4416875 -5169472 -5829864 -5623550 -4336459 -2199723 175444
2223 175444 1967422 2590929 2089543 1011241 -86561 -884592 -1148383 -660245 573010
2214 573010 2258537 3996685 5212563 4978422 2676830 -708474 -2702841 -1687761 1156148
2205 1156148 3196143 3439619 3133106 3312328 3350381 2621097 2039164 2546884 3206754 2601429
2195 2601429 1411429 1463579 2483361 2300274 701404 355947 2565436 4641320 3732979
2186 3732979 1251160 652390 2240001 3501565 3874844 5307001 7709356 7831052 4326158
2177 4326158 611535 215999 1823173 1836142 58123 -461688 1540712 3805377 3999555
2168 3999555 2489821 1197394 1471229 3494336 6319964 8111755 7497749 4919024 1835117
2159 1835117 -1046862 -3636951 -5166375 -4718337 -2885542 -1272808 -395559 389062 1067460
2150 1067460 950190 448063 783850 1599034 970785 -1509726 -3722069 -4028319 -3355195
2141 -3355195 -3028696 -2340636 59920 3649628 6617148 8107814 8395370 7595753 5778204
2132 5778204 3886561 3043639 3029811 2603599 1324549 162836 257442 1665577 3315228
2123 3315228 3901206 3131447 2300373 3078466 5483415 7748611 8427664 7655537 5983183
2114 5983183 3307794 -138904 -2926581 -3816093 -3295387 -2682258 -2453019 -2522875 -3310943
2105 -3310943 -5137894 -7149515 -8218954 -8485738 -8690172 -8474795 -6885728 -4287393 -2136113
2096 -2136113 -822252 679115 2775028 4435762 4932733 4961480 5178129 4757148 2553046
2087 2553046 -872196 -3426172 -3572441 -1589393 1137161 3456224 4986520 5819483 6155824
2078 6155824 6276687 6538871 7030986 7294163 6812258 5853513 5290608 5272891 4586195 1944327
2068 1944327 -2203307 -5626161 -6199586 -3795855 -414039 1593330 1667749 1366024 2261432
2059 2261432 3849891 4248303 2738700 552611 -968771 -1835603 -2652098 -3512210 -4265873
2050 -4265873 -4996959 -5650903 -5930607 -5898869 -5781996 -5041717 -3015293 -801789 -787008 -3552971
2040 -3552971 -6959006 -9057317 -9859692 -9239195 -5898569 -582378 2367637 -56525 -4818585
2031 -4818585 -6576020 -4790571 -3190323 -3049372 -1747632 1497472 3139318 424228
2023 424228 -4554714 -8075274 -9205120 -8920425 -7481999 -5111061 -3112287 -1884058 308084
2014 308084 4140257 6717096 5189112 1462370 14103 1722820 3232871 2457539 1362038
2005 1362038 2298527 4342996 4951242 3457974 1212354 -621286 -1726401 -1709190 -140301
1996 -140301 2374814 4308624 4825986 4678507 5135321 6487527 7995378 8814429 8275130
1987 8275130 5694450 1274266 -2578026 -2536970 1694893 5976659 6267873 3933488 4025548
1978 4025548 8105686 11562215 9480979 2996530 -2359498 -3341706 -1624346 -181747
1970 -181747 548964 2106954 5042215 7758520 8276093 6677848 5363239 6430706 8984130
1961 8984130 9934684 7704548 4099357 1944423 1950825 2876960 3821729 4925388 6177857
1952 6177857 6948877 6901401 6468901 6195193 6195800 6435896 7099315 8453076 10429522 12405000
1942 12405000 13609532 14007698 14373481 14862798 14066702 10771606 6408645 3975027 4163583
1933 4163583 4391960 2493638 -363397 -1584163 -383629 2226790 5181567 7490976
1925 7490976 7981123 6733129 5710264 6158399 6490137 4735671 1915463 460819 143732
1916 143732 -1381162 -4075956 -4734861 -1607975 2761857 4775962 4135657 3561623 5278434
1907 5278434 8949853 12465389 14012540 13707196 13297469 13840969 14250762 13226670 11833635
1898 11833635 12145094 13519088 12620563 7801754 1457821 -2844418 -3834347 -2321530 527827
1889 527827 3359087 4690865 4419924 4216657 5114207 5775319 4484842 1740059 -772121
1880 -772121 -2862781 -5522059 -8240504 -8737037 -5990754 -2184266 -605032 -2017556 -3817587
1871 -3817587 -2848813 1285821 5977871 8446179 8094151 5851623 2407815 -1602840 -4475557
1862 -4475557 -4525450 -2435440 -723004 -466216 -293890 873382 2119071 2622544 3466313
1853 3466313 5670124 7918845 8202074 6787519 5731567 6069751 7133856 8028442 8097130
1844 8097130 6526676 3423934 970704 1405772 3693631 4210479 1342833 -2367685 -3610727
1835 -3610727 -2373455 -1331849 -2140796 -3850358 -4774744 -4526582 -3726889 -2659793 -1225459
1826 -1225459 -12941 -247103 -2037070 -3489643 -2667484 -58849 2167156 3191088 4191591
1817 4191591 5711135 6368401 5313734 4187597 4799963 6042979 5290141 2361974 -117807
1808 -117807 -470466 -116486 -1342936 -4356830 -7339365 -8430953 -6974396 -3603333 136691
1799 136691 2674407 3497039 3257127 2762594 2267297 1795180 1547711 1608989 1530330 566519
1789 566519 -1569070 -4119634 -5545709 -4765839 -2293579 231995 1754595 2526236 3090088
1780 3090088 3458072 3684429 4232111 5023771 4999655 3469043 1132683 -997149 -2681433
1771 -2681433 -3537428 -2409712 700428 3160303 2278995 -1130875 -3812986 -4374666 -4323077
1762 -4323077 -4847306 -5095124 -4357132 -3650615 -3793214 -3637073 -1839436 664284 1491059
1753 1491059 -341895 -3468762 -5755530 -6055180 -4670513 -2698520 -854607 1171239
1745 1171239 3886922 6696091 8190043 7763209 6065217 3760734 918138 -1995128
1737 -1995128 -3592619 -2856854 -450386 1831320 2697687 2313662 1944241 2603978 3704967
1728 3704967 3411519 935028 -2123667 -3744776 -4226661 -5511829 -8049415 -9944918 -9359257
1719 -9359257 -6361467 -2287149 1403118 3589518 4210987 4537157 5431374 5727123 4022506
1710 4022506 1520727 767954 1930466 3100267 4110655 6535418 9370286 8737474 3671005
1701 3671005 -1325003 -1824846 1403961 5133127 8275017 10723218 10659157 7025007 2743505
1692 2743505 1540830 2841789 3356709 2414439 2015371 2762628 3683829 5179480 7974390
1683 7974390 9797775 7716144 3746548 3306421 7229160 9968814 7317930 1680612
1675 1680612 -2357561 -3784227 -3915440 -2845603 -361633 1932283 2523985 2652521 4624301
1666 4624301 8481965 12051715 13180934 10823079 5681495 997695 485400 3811673
1658 3811673 6313716 4999633 2377656 2057963 3220111 2766456 973772 981681 3364462
1649 3364462 4938850 3192044 -981367 -5235904 -7987017 -8369210 -6243225 -2798561
1641 -2798561 399785 3008739 5156316 5753623 3709406 479530 -1021343 -158330 1012556
1632 1012556 1166189 1095410 1309302 906493 -124465 112594 2529829 4890981 4306229
1623 4306229 878753 -2559526 -3619659 -2130673 549234 2806864 3680996 3460285 3442685
1614 3442685 4731912 7262627 9881919 11043700 9758691 6610906 3616400 2245547
1606 2245547 1877809 1168368 386540 819123 2085851 2030668 -257325 -3056251 -4383635
1597 -4383635 -4272574 -3841727 -3437939 -2728372 -1646135 -299381 1355430 3123373 4538601
1588 4538601 5501245 6009217 5196811 2154638 -1865680 -3763434 -1988529 1744978 4805908
1579 4805908 6040779 5129744 1868645 -2318365 -4352460 -3334727 -2737435 -6054665 -11483259
1570 -11483259 -14015061 -12220533 -9632368 -9225230 -9879455 -9409030 -8094744 -7253172 -6476701
1561 -6476701 -4714014 -2922058 -3249657 -5817656 -8188214 -8257000 -6331793 -4065097 -2540412
1552 -2540412 -2014284 -2590557 -4085429 -5444320 -5269659 -3295599 -806694 821527 1530614
1543 1530614 1958470 1965487 959098 -359209 -52995 2498511 5225124 5591492 3435288
1534 3435288 531447 -1894612 -3784173 -4840820 -4281366 -2315608 -523048 -130055 -749517
1525 -749517 -1302432 -1497450 -1959965 -3390127 -5837782 -8322445 -9088605 -6947389 -2714652
1516 -2714652 1119528 2394763 750255 -2647897 -6187380 -8723676 -10192189 -11374124
1508 -11374124 -12429819 -11877477 -8091280 -1920675 3342978 5139719 3985838 2245989
1500 2245989 1434064 1362798 1303779 1168050 1562606 2840984 3987685 2934613 -1038500
1491 -1038500 -5407968 -6347739 -3014805 1387467 3477804 3301576 3064760 3577939 3637926
1482 3637926 2353875 337056 -1532036 -3201500 -4974584 -6866014 -8740964 -10353172
1474 -10353172 -10976619 -9746839 -6873004 -4039601 -2981773 -3684938 -4398614 -3636409 -1968558
1465 -1968558 -1403839 -2828982 -4573454 -4164745 -1266556 1985006 3551962 3352311 2269599
1456 2269599 558702 -1781119 -3828459 -4202656 -2651463 -395546 1094323 1154027 -19503
1447 -19503 -1705242 -3033891 -3503691 -3280032 -2968753 -3267384 -4658630 -6753257 -7898306
1438 -7898306 -6450815 -2868950 491357 2298983 3834111 6667859 9870848 11001462
1430 11001462 9168929 5562530 1444086 -2628605 -5723332 -6560359 -5130043 -2961181
1422 -2961181 -1283516 7150 1196424 1723313 961758 -687328 -1996034 -1877106 -269885
1413 -269885 1348112 786526 -2423967 -5794468 -6474394 -4795343 -3509860 -3721213 -3879829
1404 -3879829 -3128897 -2889849 -3875408 -4169039 -2371242 -475467 -877040 -2067697 -561136
1395 -561136 3513527 6120710 4988733 2522798 1920083 2897303 3012710 1485153 -259538
1386 -259538 -905222 -381253 814298 1909751 1637967 -965239 -5263888 -9182409 -10720094
1377 -10720094 -8999866 -4415258 1312309 5574199 6700089 5701410 5289170 6735875
1369 6735875 8478429 8299988 6074431 3520655 1789364 368550 -1679430 -4342730
1361 -4342730 -6765414 -8090217 -8029415 -7190984 -6879939 -7721094 -8313900 -6469138 -2449643
1352 -2449643 374804 -450095 -2762005 -2174034 2034426 5713545 5219378 1934438 5647
1343 5647 1121332 3462187 5015832 5775075 6524531 7184438 7081266 5976082 4361683
1334 4361683 3303225 4020846 6785169 10052382 11541775 10452427 7905290 5148514
1326 5148514 2465485 244136 -271544 1508270 4067930 5222811 4740347 4309289 4961114
1317 4961114 5777373 5465537 4118463 2815168 2294970 2687331 3847073 5124080 5306963
1308 5306963 3770732 1495151 62599 -281099 -696409 -1875212 -3043021 -3072597 -1767709
1299 -1767709 241465 2095381 2975653 2725672 2469030 3399308 4504470 3140101 -992392
1290 -992392 -4118879 -2646450 1895627 4465156 2586636 -1448966 -4190416 -4295092 -2064912
1281 -2064912 1468623 4104145 3670690 1002754 -439132 780872 2072856 980659
1273 980659 -1238263 -2430472 -3382336 -5561773 -6840872 -3483167 4027967 10750140 13124527
1264 13124527 12058315 9981533 8014168 6768832 6868240 7287174 5635205 1518871 -2407602
1255 -2407602 -3967757 -4027980 -4337367 -4915620 -5050541 -4891242 -4408026 -2683451 -89098
1246 -89098 686964 -1932839 -5348755 -5533741 -1972786 2260507 4522272 4538317 3069907
1237 3069907 1046256 -155350 289660 1236167 838301 -747885 -1468228 -120944 2451560
1228 2451560 4792363 6026149 5818358 4566014 3398226 2644234 848581 -3033234 -7119698
1219 -7119698 -8438275 -6907500 -5111198 -4261960 -3135331 -1337097 -568527 -1390824 -1403717
1210 -1403717 1481943 5884375 8907073 9672255 9054010 7311279 4190909 637230 -1706496
1201 -1706496 -2615431 -3394611 -4848063 -6218507 -6165834 -4107246 -790598 1937264 2357386
1192 2357386 421852 -2295984 -4375642 -5492880 -5484255 -3873230 -1035146 1462036 2593126
1183 2593126 2803965 2457991 921649 -1646096 -3301221 -2853286 -2006754 -3007708 -5322379
1174 -5322379 -6759585 -6808074 -6430914 -5422263 -2843899 176216 1057050 -387350 -1274350
1165 -1274350 490838 3863178 6680115 7711179 6054911 1193262 -4869457 -7766983
1157 -7766983 -5068192 849681 5635679 7377664 6970698 5724563 4372728 3286978
1149 3286978 1925321 -1037547 -5450016 -8482435 -7397136 -2845525 2120376 5544689
1141 5544689 7509346 8581573 9420763 11307933 14709016 17365005 16013641 10336299
1133 10336299 3418667 -1813962 -4734077 -5665520 -4943655 -3882518 -3983976 -3982621 -428946
1124 -428946 6760367 11916932 9922170 3282029 -777400 321244 2090055 527525
1116 527525 -2147666 -1714912 1387806 3334748 3197535 3932650 7247125 11233122 14078844
1107 14078844 16824448 20462045 22798459 20843431 15003751 8519945 3585435 249409
1099 249409 -1546765 -1373653 286319 2198384 4013032 5852507 6547807 4740114 1748762
1090 1748762 486509 1018279 350057 -2232371 -3037085 641206 6025851 8679897 8380418
1081 8380418 7826196 7556169 6248029 4889956 6115152 9328697 10713511 8886596 6699867
1072 6699867 6145116 5203859 1812286 -2308041 -4518451 -5501017 -7548577 -10179558 -10578772
1063 -10578772 -7821256 -4067632 -1708461 -1377331 -2639438 -4626633 -5795685 -4835784
1055 -4835784 -2374249 -552785 -420092 -709964 313337 2582864 4456976 4919136 4928887
1046 4928887 6192996 8633047 9799036 7631710 3443431 897212 1917595 4888125
1038 4888125 7120484 7547319 6424548 4227526 2125753 1990327 4195507 6410861 6217222
1029 6217222 4100779 2271460 1419557 585137 -360830 -300248 1074718 2695777 3842563
1020 3842563 4795738 5504643 5191264 3772610 2353588 1761517 1650359 1477238 1350309
1011 1350309 1456098 1523778 1320336 1042811 933274 992767 1103105 988729 397868 -14436
1001 -14436 1411051 5390995 10010483 12241485 10991162 7586487 3770158 729657 -386208
992 -386208 911708 3118992 3894122 2916168 1881057 1421331 138608 -2586100 -4925169
983 -4925169 -4977378 -3141287 -871893 1368925 3500239 4606000 4112319 3273701 3746180
974 3746180 5133516 5425364 3653056 913670 -1120438 -1722640 -1177251 -119542 979292
965 979292 1884072 2232864 1537396 149839 -359380 892633 2189306 1068844 -1892706
956 -1892706 -3406327 -2079284 -154785 454891 1110645 3423658 5802598 5847202 4363151
947 4363151 3755327 3587439 1294030 -2978040 -5719308 -4792940 -1918175 348437 1430217
938 1430217 1457288 -251680 -3672891 -6805633 -7710947 -6710126 -5141882 -3058473 231107
929 231107 4113314 6905793 7937949 7952377 7394239 5673044 2627207 -351006 -1609037
920 -1609037 -1196550 -515241 -54088 1302308 4080943 6560206 6794334 5581330 5329548
911 5329548 6047728 5067313 1664052 -782427 660217 3927066 4750174 2488344 -90316
902 -90316 -1874268 -4257497 -6681948 -5593230 132516 5866708 6153448 1192046 -4180579
893 -4180579 -6724860 -7252297 -7373651 -6774098 -4615959 -1592793 1006207 3380947 6734512
884 6734512 10653020 12438056 10146019 5635190 3021846 3874303 5519017 5013020 3228654
875 3228654 3215614 5504052 7385876 6848393 5067302 4359445 5282429 6572941 6834926
866 6834926 5640108 3786915 2803891 3460139 4842393 5768725 6481894 7353033 6668218
857 6668218 2424638 -3474333 -5838671 -2317130 3494131 6637448 6387636 5498922 5835563
848 5835563 6995705 7927554 7679644 5466917 2017701 53790 1417265 4296566 5175378
839 5175378 3023194 -222489 -2691330 -3989628 -3912189 -2027179 1101594 4002079 5984391
830 5984391 7410999 8240221 7871692 6655468 5913931 5910488 5230824 2946402 237949
821 237949 -1013884 -419429 1017134 2587256 4460997 6648271 8234195 8198195 6788822
812 6788822 5414696 4832694 4079277 2021874 -559552 -1831796 -1742035 -2266750 -4402069
803 -4402069 -6692489 -7592482 -7474889 -7056458 -5658305 -2817612 -112801 741467 564778
794 564778 1397599 3380695 4960162 5336002 4632672 2644361 -149357 -1310766 823447
785 823447 3748534 3520479 804347 501875 4643647 9356902 10451802 8677400 7235299
776 7235299 6915607 6446440 5590998 4911375 3693785 967886 -1944919 -2413000 -57127
767 -57127 2534145 2823552 777904 -1624651 -2216933 -141240 3433336 6202974 7058161
758 7058161 7126686 7855840 8897979 9022294 8383620 8353959 9297771 9919548 9002086 6756119
748 6756119 4191718 1917562 -130384 -2171730 -3976612 -4768606 -4049714 -2598142 -2022295
739 -2022295 -3037694 -4825609 -6287718 -6949897 -6293570 -3650907 199431 2628281 1871200
730 1871200 -671111 -2344154 -2670255 -3076037 -3764877 -3143424 -629781 2057785 3283705
721 3283705 3553485 4089801 4618713 3952014 2041852 46142 -1418460 -2832323 -4469234
712 -4469234 -5645741 -5767869 -5333228 -5185431 -5287921 -5101688 -4870566 -5343528 -6030333 -5056649
702 -5056649 -1618986 2442590 4741600 5249339 5615852 6195721 5759627 4137638 2864012
693 2864012 2458073 1254860 -1608901 -3843928 -2683858 1083883 3804516 3289496 737209
684 737209 -1461234 -2137658 -1420705 131172 1940987 3732868 5577769 7015805 6549305
675 6549305 3224896 -1365543 -4035058 -3344584 -976056 623066 1006890 1591156 3510298
666 3510298 6308037 8414666 8473830 6460226 3840273 2474834 3096865 4827443 6142611
657 6142611 6292739 6007801 6925813 9918615 13654479 15250713 12909170 7728867 2577964
648 2577964 -440161 -1025553 68322 1794296 3033199 3097052 2313731 1641492 1639324 2183601
638 2183601 3027680 4021711 4701690 4186319 1884771 -1557187 -4048821 -3369521 452490
629 452490 4284486 4762860 2439563 1651042 5301804 11018555 13848618 11865524 7545506
620 7545506 4219640 2948148 2830292 2736517 2182472 1368656 750048 296929 -489998 -1433054
610 -1433054 -1333057 413818 2647698 3850960 3843313 3051492 1374056 -600890 -542210 3086206
600 3086206 8067062 10413801 9050746 6299260 4136493 2637655 1994224 2978385 4751451
591 4751451 5023417 3378831 1990778 2167336 2803238 3270325 4937667 8205200 10723897
582 10723897 10552219 8756762 6966442 4839972 2191924 969186 2140892 2931627 670072
573 670072 -2386469 -1961956 1688888 4280532 4020035 3331077 3845408 4073577 3333368
564 3333368 3990831 7536889 11459036 12602630 11527291 11007146 11711431 11810984 9973861
555 9973861 6636322 2868557 -187390 -1160721 477861 3122125 4109144 2313114 -1047576
546 -1047576 -4023691 -5620487 -6079728 -6193931 -6288009 -5626620 -3352283 -289615 1240685
537 1240685 320614 -798258 762944 4663507 7552648 7118400 4545864 2632547 2662840
528 2662840 3769419 4551302 4573187 4585106 5680125 8054701 10532270 11657094 11205875
519 11205875 10111136 9045885 7923527 6783622 6015323 5305423 3579912 809831 -1229856
510 -1229856 -1201062 -330026 -780255 -2447460 -3168565 -2053226 -709316 -688988 -1489514 -1985119
500 -1985119 -2310234 -3117110 -4175879 -5018665 -5963260 -7133667 -7405312 -5862852 -3502066
491 -3502066 -1819498 -503160 1463520 3049238 2107877 -883573 -2687598 -1630688 379876
482 379876 1262278 1766907 3330987 4998320 4888158 3489625 2911760 3277861 2295204
473 2295204 -1226889 -5276545 -6823126 -5041987 -1746810 739167 1647757 1966643 2857210
464 2857210 4089997 4485711 3792540 3115098 3107911 2903843 1651875 36812 -856672 -1265451
454 -1265451 -1991515 -2693427 -2548175 -2235376 -3529017 -6661233 -9363244 -9050538 -5442627
445 -5442627 -946274 1286633 132635 -2277000 -2852190 -1479427 -1327202 -4300875 -7909193
436 -7909193 -8499150 -6180509 -4033984 -3284538 -2133795 727771 4266945 7242412 9721535
427 9721535 11687776 12221472 10934377 8589632 5873943 3338550 2633378 5242765 9360865
418 9360865 10810939 8359325 5517895 5446233 6669974 6094203 3951913 2870537 3558721
409 3558721 4468309 4946402 5798707 6867737 6613115 4449864 1595372 -753724 -2592902
400 -2592902 -4245599 -5573453 -6175154 -5499077 -3127878 51686 1675148 319186 -2488595
391 -2488595 -4185516 -4421918 -4583851 -4763184 -3659634 -1504425 -537247 -1822432 -3665619
382 -3665619 -4171144 -3606648 -3099868 -2527765 -1114478 875099 2386217 2977361 2968720 2612562
372 2612562 1959951 1306028 1143756 1740588 2926229 4018684 3995808 2311808 -369312
363 -369312 -2719597 -3880014 -3510585 -1292951 2372875 5490499 5964403 4249285 2983483
354 2983483 3573735 4715616 4860038 4334941 3944626 3204421 1624744 471932 1276573
345 1276573 3223535 3914856 2574709 886553 577764 1566912 2720529 3200249 2635729
336 2635729 950435 -1379887 -3401802 -4412995 -4383669 -3644806 -2554645 -1473235 -637610
327 -637610 41439 858071 2043829 3680688 5508475 6647248 6104775 3998506 1724208
318 1724208 409912 -203747 -819703 -1365135 -1575067 -1906487 -2579959 -2419271 -378536
309 -378536 1990503 1548320 -2396605 -6570254 -7115846 -3517807 1528634 5188081 6532344
300 6532344 6241015 5420216 4843926 4860002 5646695 7100644 8231364 7456339 4524580
291 4524580 1618550 1086316 2286705 2441049 730154 -583520 120253 1138907 -19331
282 -19331 -3136746 -6064725 -7541041 -7280137 -4655234 147864 4475306 5538761 4292216
273 4292216 4279131 6425071 7896784 6974758 6017959 7640971 10306515 10387369 7344057
264 7344057 4149637 2947561 2747231 1791244 228256 -502398 234816 1779499 3249870
255 3249870 4318335 4949235 4853466 3673264 1968952 1579872 3959813 7886443 9954747
246 9954747 8195744 4372339 1681919 970867 572165 -686349 -2083355 -2644199 -2438786
237 -2438786 -1652289 189198 3073807 5545141 5991522 4481576 2550667 1526141 1701269
228 1701269 2703145 3805844 4063784 3029025 1502543 943169 1890338 3427790 4409316
219 4409316 4699949 4804417 4753352 4154823 3294577 3257751 4450347 5667097 5448450 4029714
209 4029714 3019227 3250747 3990531 4407883 4678223 5109590 5214234 4432043 2976667
200 2976667 1217204 -880230 -2749259 -2680218 217528 4083045 5978963 5329536 4134467
191 4134467 3822380 3670280 2742023 1624563 1263244 1406693 1429765 1813168 3468700 5939339
181 5939339 7457211 6941455 5206521 3881163 3489756 3015904 1454791 -587065 -1480487
172 -1480487 -743530 354179 790179 1168588 2036625 2068200 -182007 -3378684 -4513281
163 -4513281 -2912431 -970345 -549931 -845050 -541595 12880 -85393 -792032 -1825632
154 -1825632 -3214065 -4110705 -3015022 -527651 184668 -2452282 -5681068 -6080134 -4282037
145 -4282037 -3325234 -3634058 -2919373 -644514 712175 -626929 -3364778 -5186749 -5058973
136 -5058973 -2861031 1123182 5394224 7733929 7622907 6818366 6713028 6571334 5335925
127 5335925 3716564 3095912 3302071 2903312 1359731 -217315 -426583 918723 2627203
118 2627203 3184841 2067122 61627 -1808944 -3339380 -4686183 -5375069 -4684349 -2822544
109 -2822544 -806115 748903 1902610 2702797 3155112 3578988 3938167 3251406 1085412
100 1085412 -701128 444138 4191692 7076331 6389238 2943862 -518532 -2274273 -2381254
$$ [...]
##END NTUPLES=NMR SPECTRUM
##END=
