##TITLE=31Pdec_DE-87_ch_7
 CDCl3, 64 sc
 23.4.2025
##JCAMPDX= 6.0         $$ Bruker NMR JCAMP-DX V2.0
##DATA TYPE= NMR SPECTRUM
##DATA CLASS= NTUPLES
##ORIGIN= UXNMR, Bruker Analytische Messtechnik GmbH
##OWNER= root
$$ XWIN-NMR		Version 3.5
$$ Wed Apr 23 16:44:08 2025 Russian Standard Time (UT+4h)  she@DPX200
##.OBSERVE FREQUENCY= 81.013821
##.OBSERVE NUCLEUS= ^31P
##.ACQUISITION MODE= SIMULTANEOUS
##.ACQUISITION SCHEME= undefined
##.AVERAGES= 64
##.DIGITISER RES= 17
##SPECTROMETER/DATA SYSTEM= spect
##.PULSE SEQUENCE= zgpg30
##.SOLVENT NAME= CDCl3
##.SHIFT REFERENCE= (INTERNAL, CDCl3, 0, 198.062)
##AUDIT TRAIL= $$ (NUMBER, WHEN, WHO, WHERE, WHAT)
$$ ##TITLE= Audit trail, XWIN-NMR		Version 3.5
$$ ##JCAMPDX= 5.01
$$ ##ORIGIN= Bruker BioSpin GmbH
$$ ##OWNER= she
$$ F:/spectra/data/she/nmr/P31/2/pdata/1/auditp.txt
$$ ##AUDIT TRAIL=  $$ (NUMBER, WHEN, WHO, WHERE, WHAT)
(   1,<2025-04-23 16:43:14.34 +0400>,<she>,<DPX200>,
      <created by zg, POWCHK disabled, PULCHK disabled
       configuration hash MD5:
       00 E9 B6 7A A2 85 ED C7 34 08 36 98 17 FE 4E 26
       data hash MD5: 32K
       8E F9 AB 45 A6 AE EC 5A E5 A5 AB 8E 12 E6 B1 98>)
(   2,<2025-04-23 16:43:16.90 +0400>,<she>,<DPX200>,
      <Start of raw data processing
       efp BC_mod = 2 LB = 1.5 FT_mod = 6 PKNL = 1 PHC0 = 1556.643 PHC1 = -342.7069 SI = 64K 
       data hash MD5: 64K
       B6 7C 6D C7 60 50 46 CC 08 12 78 D6 F8 9D 7F BA>)
(   3,<2025-04-23 16:43:35.37 +0400>,<she>,<DPX200>,
      <pk PHC0 = 3.544355 PHC1 = 0 
       data hash MD5: 64K
       9E 3F A0 B2 AB E2 A2 D8 0E 69 B4 BB 02 87 7E 67>)
(   4,<2025-04-23 16:43:42.37 +0400>,<she>,<DPX200>,
      <abs ABSG = 5 
       data hash MD5: 64K
       E5 67 DF C4 A0 8C 38 A7 17 1E E6 79 26 25 22 95>)
$$ ##END=
$$ 
$$ hash MD5
$$ 53 B3 E4 41 E3 69 59 43 63 9B 52 86 3A 25 E1 CD
##$RELAX= 
##$RELAX= 
##$RELAX= 
##$RELAX= 
##$RELAX= 
##$RELAX= 
##$RELAX= 
##$RELAX= 
$$ Bruker specific parameters
$$ --------------------------
##$DU= <F:/spectra>
##$EXPNO= 2
##$NAME= <P31>
##$PROCNO= 1
##$TYPE= <nmr>
##$USER= <she>
##$AMP= (0..31)
100 100 100 100 100 100 100 100 100 100 100 100 100 100 100 100 100 100 
100 100 100 100 100 100 100 100 100 100 100 100 100 100 
##$AQSEQ= 0
##$AQ_mod= 1
##$AUNM= <au_zg>
##$AUTOPOS= <>
##$BF1= 81.014009
##$BF2= 200.13
##$BF3= 200.13
##$BF4= 200.13
##$BF5= 200.13
##$BF6= 200.13
##$BF7= 200.13
##$BF8= 200.13
##$BYTORDA= 1
##$CFDGTYP= 0
##$CFRGTYP= 5
##$CHEMSTR= <none>
##$CNST= (0..31)
1 1 145 1 1 1 1 1 1 1 1 1 1 1 1 1 1 1 1 1 1 1 1 1 1 1 1 1 1 1 1 1 
##$CPDPRG= <waltz16>
##$CPDPRG1= <>
##$CPDPRG2= <waltz16>
##$CPDPRG3= <>
##$CPDPRG4= <mlev>
##$CPDPRG5= <mlev>
##$CPDPRG6= <mlev>
##$CPDPRG7= <mlev>
##$CPDPRG8= <mlev>
##$CPDPRGB= <>
##$CPDPRGT= <>
##$D= (0..31)
0 1 0 0 0 0 0 0 0 0.06 0 0.03 2e-05 3e-06 0 0 0.0002 0 0 0 0 0 0 0 0 0 
0 0 0 0 0 0 
##$DATE= 1745412193
##$DBL= (0..7)
120 120 120 11 120 120 24 19 
##$DBP= (0..7)
150 150 150 150 150 150 150 150 
##$DBP07= 0
##$DBPNAM0= <>
##$DBPNAM1= <>
$$ [...]
##$SUBNAM3= <"">
##$SUBNAM4= <"">
##$SUBNAM5= <"">
##$SUBNAM6= <"">
##$SUBNAM7= <"">
##$SUBNAM8= <"">
##$SUBNAM9= <"">
##$SW= 400.765351723535
##$SWIBOX= (0..15)
0 1 3 0 0 0 0 0 0 0 0 0 0 0 0 0 
##$SW_h= 32467.5324675325
##$TD= 32768
##$TD0= 1
##$TE= 0
##$TE2= 300
##$TE3= 300
##$TEG= 300
##$TL= (0..7)
0 120 53 12 22 120 120 120 
##$TP= (0..7)
150 150 150 150 150 150 150 150 
##$TP07= 0
##$TPNAME0= <>
##$TPNAME1= <>
##$TPNAME2= <>
##$TPNAME3= <>
##$TPNAME4= <>
##$TPNAME5= <>
##$TPNAME6= <>
##$TPNAME7= <>
##$TPOAL= (0..7)
0.5 0.5 0.5 0.5 0.5 0.5 0.5 0.5 
##$TPOFFS= (0..7)
0 0 0 0 0 0 0 0 
##$TUNHIN= 0
##$TUNHOUT= 0
##$TUNXOUT= 0
##$USERA1= <user>
##$USERA2= <user>
##$USERA3= <user>
##$USERA4= <user>
##$USERA5= <user>
##$V9= 5
##$VALIST= <valist>
##$VCLIST= <CCCCCCCCCCCCCCC>
##$VD= 0
##$VDLIST= <DDDDDDDDDDDDDDD>
##$VPLIST= <PPPPPPPPPPPPPPP>
##$VTLIST= <TTTTTTTTTTTTTTT>
##$WBST= 1024
##$WBSW= 4
##$XGAIN= (0..3)
0 0 0 0 
##$XL= 0
##$YL= 0
##$YMAX_a= 14399
##$YMIN_a= -8557
##$ZGOPTNS= <>
##$ZL1= 120
##$ZL2= 120
##$ZL3= 120
##$ZL4= 120
##$ABSF1= 198.0616
##$ABSF2= -202.7028
##$ABSG= 5
##$ABSL= 3
##$ALPHA= 0
##$AQORDER= 0
##$ASSFAC= 0
##$ASSFACI= 0
##$ASSFACX= 0
##$ASSWID= 0
##$AUNMP= <proc_1d>
##$AZFE= 0.1
##$AZFW= 0.5
##$BCFW= 0
##$BC_mod= 2
##$BYTORDP= 0
##$COROFFS= 0
##$CY= -3
##$DATMOD= 1
##$DC= 0
##$DFILT= <>
##$DTYPP= 0
##$F1P= 0
##$F2P= 0
##$FCOR= 1
##$FTSIZE= 65536
##$FT_mod= 6
##$GAMMA= 0
##$GB= 0
##$INTBC= 1
##$INTSCL= 9.790993e-09
##$ISEN= 30
##$LB= 1.5
##$LEV0= 0
##$LPBIN= 0
##$MAXI= 10000
##$MC2= 0
##$MEAN= 0
##$ME_mod= 0
##$MI= 50
##$NCOEF= 0
##$NC_proc= -8
##$NLEV= 6
##$NOISF1= 182.463
##$NOISF2= 159.3651
##$NSP= 0
##$NTH_PI= 0
##$NZP= 0
##$OFFSET= 198.0616
##$PC= 4
##$PHC0= 1560.187
##$PHC1= -342.7069
##$PH_mod= 1
##$PKNL= yes
##$PPARMOD= 0
##$PSCAL= 0
##$PSIGN= 0
##$REVERSE= no
##$SF= 81.0140089999434
##$SI= 65536
##$SIGF1= 159.3651
##$SIGF2= -187.1042
##$SINO= 113.3802
##$SIOLD= 16384
##$SREGLST= <1H.CDCl3>
##$SSB= 0
##$STSI= 65536
##$STSR= 0
##$SW_p= 32467.5324675325
##$SYMM= 0
##$S_DEV= 0
##$TDeff= 32768
##$TDoff= 0
##$TI= <>
##$TILT= no
##$TM1= 0
##$TM2= 0
##$TOPLEV= 0
##$USERP1= <user>
##$USERP2= <user>
##$USERP3= <user>
##$USERP4= <user>
##$USERP5= <user>
##$WDW= 1
##$XDIM= 65536
##$YMAX_p= 171449336
##$YMIN_p= -189556165
$$ End of Bruker specific parameters
$$ ---------------------------------
##NTUPLES= NMR SPECTRUM
##VAR_NAME=  FREQUENCY,     SPECTRUM/REAL,   SPECTRUM/IMAG
##SYMBOL=    X,             R,               I
##VAR_TYPE=  INDEPENDENT,   DEPENDENT,       DEPENDENT
##VAR_FORM=  AFFN,          ASDF,            ASDF
##VAR_DIM=   65536,         65536,           65536
##UNITS=     HZ,            ARBITRARY UNITS, ARBITRARY UNITS
##FACTOR=    0.49542278885378, 1,            1
##FIRST=     16045.7642231865, 0,            0
##LAST=      -16421.768244346, 0,            0
##MIN=       -16421.768244346, -189556165,   0
##MAX=       16045.7642231865, 171449336,    0
$$ Real data points
##PAGE= N=1
##DATA TABLE= (X++(R..R)), XYDATA
$$ [...]
7491a460632K18664l66820j248623k332586k022983L60405K852407K794812K42574
$$ -1460632 -1241968 -1608788 -2857411 -5189997 -7212980 -6852575 -4000168 -1205356 -962782
7482i62782j793985r07905J799539L187262J950771q5096o47410J24457K68352
$$ -962782 -2756767 -3664672 -1865133 1322129 3272900 3187804 2540394 2664851 2933203
7473B933203j179084l021672l558235k443052n15854J408397K804697L007095
$$ 2933203 1754119 -1267553 -4825788 -7268840 -7784694 -6376297 -3571600 -564505
7465e64505J618136n87810k135358k512332k458328k242786r23447J683979L545790
$$ -564505 1053631 465821 -1669537 -4181869 -6640197 -8882983 -9806430 -8122451 -4576661
7456d576661K746572O60027N18971K688505L817310J701461j330983j797444n1140
$$ -4576661 -1830089 -1170062 -651091 2037414 5854724 7556185 6225202 4427758 4376618
7447D376618O93137n97503j671377j089080n39166j757412l275656k283945J228290
$$ 4376618 5069755 4472252 2800875 1711795 1172629 -584783 -3860439 -6144384 -4916094
7438d916094M147440L964269J362214j209873k400586k670726k767588k511898
$$ -4916094 -768654 3195615 4557829 3347956 947370 -1723356 -4490944 -7002842
7430g002842j394064K17157J205033J070077M91790K21780R4981k32461j72781
$$ -7002842 -8396906 -8179749 -6974716 -5904639 -5412849 -5191069 -5096088 -5328549 -5501330
7421e501330J118672L117948M052036K905276O05983r85581p50886R43431K464416
$$ -5501330 -4382658 -1264710 2787326 5692602 6298585 5313004 4562118 5505549 7969965
7412G969965K044819l26654k278029j598117N93397R37011j470146l566300k777991
$$ 7969965 10014784 9688130 7410101 5811984 6405381 7342392 5872246 2305946 -472045
7403d72045q90004j184067l209322l494994j040406J281203J484353J364041K817612
$$ -472045 -1362049 -2546116 -5755438 -9250432 -10290838 -9009635 -7525282 -6161241 -3343629
7394c343629M037826K255331j377050k951343j318174P91193J329861J307015
$$ -3343629 694197 2949528 1572478 -1378865 -2697039 -1905846 -575985 731030
7386G31030J539797L95758k807106m755112j982095L461110N853744L219904o14823
$$ 731030 2270827 2666585 -140521 -4895633 -6877728 -3416618 2437126 5657030 5042207
7377E042207j996321j839849k323345k579552q06187J576908J669628L602j74795
$$ 5042207 3045886 1206037 -1117308 -3696860 -4503047 -2926139 -1256511 -1252909 -1427704
7368a427704J451108J299356k198526n298353m004861J24953K297829J150814
$$ -1427704 23404 1322760 -875766 -6174119 -10178980 -10054027 -7756198 -6605384
7360f605384j41564R47891L070453L594548K052131j38379j746259k289768j599355
$$ -6605384 -6746948 -5799057 -2728604 865944 2918075 2779696 1033437 -1256331 -2855686
7351b855686J0438J657684K664533K916413K215616L12603j909612k538081q93393
$$ -2855686 -2845248 -1187564 1476969 4393382 6608998 6921601 5011989 2473908 1580515
7342A580515J352157K370002K337501K073695R26607j717195l770737k394878
$$ 1580515 2932672 5302674 7640175 9713870 10640477 8923282 5152545 2757667
7334B757667J236050K375387q31123m286621l507585K10495K145392R88702k39493
$$ 2757667 3993717 6369104 5537981 1251360 -2256225 -2045730 99662 1088364 848871
7325H48871M04907J128904j35256k579082m124288l986034k405217K15737K609512
$$ 848871 1253778 2382682 2247426 -331656 -4455944 -8441978 -10847195 -10631458 -8021946
7316h021946K912251J133085k16402N41065J823387J358850l40270j107562n35294
$$ -8021946 -5109695 -3976610 -4193012 -3651947 -1828560 -469710 -809980 -1917542 -2452836
7307b452836l1620k32428n07993n56127n29308o8234R20665J220542J19789n96836
$$ -2452836 -2484456 -2716884 -3224877 -3781004 -4310312 -4378546 -3457881 -2237339 -2117550 -2714386
7297b714386R14294K880767J969497j183599k306690k5887J919142O47509j513972
$$ -2714386 -1800092 1080675 3050172 1866573 -440117 -466004 1453138 2100647 586675
7288E86675j328544J6701n27386k321070k160023K23204J867925J586631J408506
$$ 586675 -741869 -725168 -1252554 -3573624 -5733647 -5510443 -3642518 -2055887 -647381
7279f47381K388689K475649J65699k313566j673585J828546M351930K807516j807234
$$ -647381 1741308 4216957 4382656 2069090 395505 2224051 6575981 9383497 7576263
7270G576263n449888n050718j451113J799439K470992J549693Q02705J64178r63819
$$ 7576263 2126375 -2924343 -4375456 -2576017 -105025 1444668 2247373 2411551 1447732
7261A447732j442467j0462J716007R46933j660795k382313j22724J614982P5495
$$ 1447732 5265 -5197 1710810 2657743 996948 -1385365 -1508089 106893 182388
7252A82388k465306k223839N67224K538091K095430M98554j112178k748576l750072
$$ 182388 -2282918 -4506757 -3939533 -1401442 693988 1192542 80364 -2668212 -6418284
7243f418284k697184K41423K897661L694128L102495K102677P85149q80175k244953
$$ -6418284 -9115468 -8874045 -5976384 -2282256 820239 2922916 3708065 2827890 582937
7234E82937k695541k214547q53388J241829K922228K528087P4596k184541k329043
$$ 582937 -2112604 -4327151 -5180539 -3938710 -1016482 1511605 1586201 -598340 -2927383
7225b927383j039313l17347o90560r05550r9294R83805J267844R80045J213368
$$ -2927383 -3966696 -4284043 -4974603 -5880153 -5979447 -4995642 -3727798 -2747753 -1534385
7216a534385J975721J610808r46287l725612l195294J041188M633230L403609
$$ -1534385 441336 2052144 1105857 -2619755 -5815049 -4773861 -140631 3262978
7208C262978j109916l474773j479118J383345J230378j209290k594308j707018
$$ 3262978 2153062 -1321711 -2800829 -1417484 -187106 -1396396 -3990704 -5697722
7200e697722J19967J781830L018361L035617J079504j675455k928527k120542
$$ -5697722 -5577755 -3795925 -777564 2258053 3337557 1662102 -1266425 -3386967
7192c386967p79720J1786O44657J292815J186733K45916k65040L68739J095499
$$ -3386967 -4166687 -4154901 -3510244 -2217429 -1030696 -784780 -1049820 -681081 414418
7183D14418P06240m32529j177073j254923j215803j342238j334150p37361N69287
$$ 414418 1120658 688129 -488944 -1743867 -2959670 -4301908 -5636058 -6373419 -5804132
7174e804132J867971J781340j01872k055715k061493n76871M31424J032113L071003
$$ -5804132 -3936161 -2154821 -2256693 -4312408 -6373901 -6950772 -6519348 -5487235 -2416232
7165b416232N747443N003045m48726n649247n415723j550952K00411j016323n25641
$$ -2416232 3331211 8334256 7885530 2236283 -3179440 -4730392 -4529981 -5546304 -6071945
7156f071945L494000O375757L947364j163084l587248k609003j659602k233571
$$ -6071945 -2577945 3797812 7745176 6582092 2994844 385841 -1273761 -3507332
7148c507332k398493r28500P60250J360015J494033J921995K221792K187825K474919
$$ -3507332 -5905825 -6834325 -6074075 -4714060 -3220027 -1298032 923760 3111585 5586504
7139E586504K785701J454336j643235l564794j808897J749439K795059J32567
$$ 5586504 8372205 9826541 8183306 4618512 2809615 4559054 7354113 7486680
7131G486680k981766l416239j919799j154338j610846j403281L39627J811569
$$ 7486680 4504914 1088675 -831124 -1985462 -3596308 -4999589 -4659962 -2848393
7123b848393R93722j305737k159180k84548J988608J428062j811124l937985k100616
$$ -2848393 -1854671 -3160408 -5319588 -5604136 -3615528 -2187466 -3998590 -7936575 -10037191
7114a0037191J978000M183090L014055O01707r52438j790018k129519n81849L154113
$$ -10037191 -8059191 -3876101 -862046 -260339 -1212777 -3002795 -5132314 -5714163 -2560050
7105b560050N794899L850161j045220l430307j133873J982092J728989p96399
$$ -2560050 3234849 7085010 6039790 2609483 1475610 3457702 5186691 4390292
7097D390292j682788k27813P00319l99202j602207j011069L59111N49784k26155
$$ 4390292 2707504 2479691 3180010 2780808 1178601 167532 526643 1076427 850272
7088H50272k23261Q87866J476462M11845j303737k005045j657518j712735k833093
$$ 850272 627011 1514877 2991339 3403184 2099447 94402 -1563116 -3275851 -6108944
7079f108944l770318k981806o52213J652077K849947K939184K174651R84112N31208
$$ -6108944 -9879262 -12861068 -13513281 -11861204 -9011257 -6072073 -3897422 -2913310 -2382102
7070b382102J660672K973901J859374j689125m234667l345434j010484m52487
$$ -2382102 -721430 2252471 4111845 2422720 -1811947 -5157381 -6167865 -6620352
7062f620352j152703j45514K462526L007208O1627k726542j662862J608086K559169
$$ -6620352 -7773055 -7918569 -5456043 -2448835 -2387208 -5113750 -6776612 -5168526 -2609357
7053b609357L09221j443978n1368K433077K578648N20034p21917j29893k18920
$$ -2609357 -2300136 -3744114 -3795482 -1362405 1216243 1736277 1014360 884467 665547
7044F65547k834965n664862n083659j358461J637284J768685Q83670J013623J270912
$$ 665547 -2169418 -7834280 -12917939 -14276400 -12639116 -10870431 -9986761 -8973138 -7702226
7035g702226L23538n70735L63427K060300K208613J018567M59146O52357J86057
$$ -7702226 -7378688 -7949423 -7585996 -5525696 -3317083 -2298516 -1839370 -1187013 -1000956
7026a000956n95715o4619J128549O16098j331049j875811p34304j015758l434058
$$ -1000956 -1596671 -1661290 -532741 83357 -1247692 -3123503 -3857807 -4873565 -8307623
7017h307623m004735j69927M547780N393018K837358N13545o61421k021061k739151
$$ -8307623 -12312358 -12482285 -7934505 -2541487 295871 809416 147995 -1873066 -4612217
7008d612217p40282K607876L314816O08033k028436k325868j965452k626631k813586
$$ -4612217 -5352499 -2744623 570193 1178226 -850210 -3176078 -5141530 -7768161 -10581747
6999a0581747o73919K578126M290545L765270K133321J87990j796922k997998
$$ -10581747 -11255666 -8677540 -4386995 -621725 1511596 1699586 -97336 -3095334
6991c095334k597289j121947M7210L76840M91538R29397J378451J233346M38172
$$ -3095334 -5692623 -6814570 -6767360 -6390520 -5898982 -4969585 -3591134 -2357788 -1919616
6982a919616m13562p28953n31661j91741M25747J881151L820307M493804K585665
$$ -1919616 -2333178 -3062131 -3593792 -3785533 -3359786 -1478635 2341672 6835476 9421141
6973I421141q37645l195813l115341j510571j42856O0906o21986j164745n55915
$$ 9421141 8583496 5387683 2272342 761771 618915 679821 57835 -1106910 -1662825
6964a662825J276861L246538M087869L346766J354689j009151k310747j524201
$$ -1662825 -385964 2860574 6948443 10295209 11649898 10640747 8330000 6805799
6956F805799L23339P24371j142308l070364k744023o52141J149776J625493N84046
$$ 6805799 7129138 7853509 6711201 3640837 896814 244673 1394449 3019942 3603988
6947C603988k215973n584794o252194k513663K664920M980344M031590K267864
$$ 3603988 1388015 -4196779 -10448973 -12962636 -10297716 -5317372 -1285782 982082
6939I82082L00842k638271m581706k196302L357007O707358N469343K684394R04805
$$ 982082 1282924 -1355347 -5937053 -8133355 -4776348 1931010 7400353 10084747 10989552
6930A0989552j166238m018549m502163j216056J587733j46843l787294l953013
$$ 10989552 9823314 5804765 1302602 86546 1674279 1527436 -2259858 -6212871
6922f212871m73370K293129K327742J406761P67753l6350l60042J096403K964702
$$ -6212871 -6686241 -4393112 -2065370 -658609 109144 72794 -287248 809155 3773857
6913C773857K279498p54565k662508j790604m4264Q97409J492954J730497L69086
$$ 3773857 6053355 5298790 2636282 845678 801414 1698823 3191777 4922274 5291360
6904E291360j868421j921917Q69428K820404R98891k436663l601085k324980j308583
$$ 5291360 3422939 1501022 2370450 5190854 6189745 3753082 151997 -2172983 -3481566
6895c481566j478202j363984l85453K06985k29951o54575j29898R52575J806311
$$ -3481566 -4959768 -6323752 -6709205 -6502220 -6732171 -7386746 -7516644 -6564069 -4757758
6886d757758K116399J719704N99572m80443l63156J030615K317830K122358M89972
$$ -4757758 -2641359 -921655 -322083 -802526 -1165682 -135067 2182763 4305121 4795093
6877D795093j301936j896871q13584J131606K213938J282659p63337j558523M2674
$$ 4795093 3493157 1596286 782702 1914308 4128246 5410905 4647568 3089045 3131719
6868C131719K254069K269078j04692j928141r94711R32517M41113k420306l723532
$$ 3131719 5385788 7654866 7550174 5622033 4627322 5559839 6000952 3580646 -142886
6859a42886j149402K389619K592219l07769k138096p78974J308745J070672j110191
$$ -142886 -1292288 1097331 3689550 3381781 1243685 464711 1773456 2844128 1733937
6850A733937k623657k119495l80009J128706J380522L77563m90191K86924J950966
$$ 1733937 -889720 -3009215 -3389224 -2260518 -879996 -502433 -992624 -705700 1245266
6841A245266J844503o72744k439189o32706K714777L064363l59781l584630l381373
$$ 1245266 3089769 2417025 -22164 -654870 2059907 5124270 4764489 1179859 -2201514
6832b201514q66607J294597K534058L452804L412869J508382j134556k313744
$$ -2201514 -3068121 -1773524 760534 4213338 7626207 9134589 8000033 5686289
6824E686289j587608l55348M30403P56260J68518j804062l661019k756435Q94071
$$ 5686289 4098681 3743333 4173736 4929996 5098514 3294452 -366567 -3123002 -2228931
6815b228931L589114K220618j715780l957062k537359M78260J971329J153211
$$ -2228931 1360183 3580801 1865021 -2092041 -4629400 -4151140 -2179811 -1026600
6807a026600j69650K9024J610764K333971O83352j725616j852670O12893K612531
$$ -1026600 -1196250 -1167226 443538 2777509 3460861 1735245 -117425 495468 3107999
6798C107999J884496k50706j487705j729095j716162o12731K135701M092306K536828
$$ 3107999 4992495 4741789 3254084 1524989 -191173 -803904 1331797 5424103 7960931
6789G960931q28804j633467P23149K229702N19003j905112k127584q76387o261
$$ 7960931 7132127 5498660 6221809 8451511 8970514 7065402 4937818 4061431 4055170
6780D055170Q45471K399151L157271J731884j65635r1745J177387R61051j148350
$$ 4055170 4900641 7299792 10457063 12188947 12023312 11931567 13108954 14070005 12921655
6771A2921655l208771m130757m198879l143105n84816J944090K237670O72844
$$ 12921655 9712884 5582127 1383248 -1759857 -2344673 -400583 1837087 2509931
6763B509931k89343J08756J46403j122360k307604j997396o07850O86265J204873
$$ 2509931 2220588 2329344 2475747 1353387 -954217 -2951613 -3559463 -2873198 -1668325
6754a668325O43792o49710j228045j80133R27640k4916j940785j471854J780521
$$ -1668325 -1024533 -1674243 -2902288 -3082421 -2154781 -2179697 -4120482 -5592336 -3811815
6745c811815M126393L069906P14279m6885M9052j173793k797835k000133J022629
$$ -3811815 314578 3384484 4098763 4051878 4100930 2927137 129302 -1870831 -848202
6736h48202K809923J680039L9143M86635J980443J772110k80258j609970q22801
$$ -848202 1961721 3641760 3680903 4167538 6147981 7920091 7639833 6029863 5207062
6727E207062M41814J05922j547045k774675k850488k169023p88089J238356K551890
$$ 5207062 5648876 5754798 4207753 1433078 -1417410 -3586433 -4374522 -3136166 -584276
6718e84276J779898J75935M46178K378483K488902o35896l613925l169215j049983
$$ -584276 1195622 1371557 1817735 4196218 6685120 6049224 2435299 -733916 -1783899
6709a783899q81501k250681j843941P50243K601817K475560K141218K290760J243107
$$ -1783899 -2665400 -4916081 -6760022 -6009779 -3407962 -932402 1208816 3499576 4742683
6700D742683j159841k145190k95884J865419J612415k12149j213242j068611j021232
$$ 4742683 3582842 1437652 1141768 3007187 4619602 4407453 3194211 2125600 1104368
6691A104368j412607j664553j506941p95800O67185K103500K049513N69953n94381
$$ 1104368 -308239 -1972792 -3479733 -4275533 -3608348 -1504848 544665 1114618 520237
6682E20237q68753j540822k604089j787022J394328L461440J581866j900819k686523
$$ 520237 -348516 -1889338 -4493427 -6280449 -4886121 -1424681 157185 -1743634 -4430157
6673d430157o50652N75201p71415k672346k865152j441558L80729J861926K698150
$$ -4430157 -5080809 -4505608 -5277023 -7949369 -10814521 -12256079 -11875350 -10013424 -7315274
6664g315274K950823L172712L424388K527355l38301l724609n089674l663403
$$ -7315274 -4364451 -1191739 2232649 4760004 4421703 697094 -4392580 -8055983
6656h055983r87270R96261J382439N04059k67830L27034J671853J809547M67222
$$ -8055983 -9043253 -8046992 -6664553 -6160494 -6428324 -6101290 -4429437 -2619890 -2152668
6647b152668l23229K78157L42750r82719r83487K115804M825969K927073j498047
$$ -2152668 -2475897 -2197740 -1854990 -2837709 -3821196 -1705392 3120577 6047650 4549603
6638D549603k685749l7419J325075p21782k009910M12680L047899J903531p34796
$$ 4549603 1863854 1826435 3151510 2429728 419818 832498 3880397 5783928 5049132
6629E049132k71462K349035K111874j847634m672523l006771N15037J685479L86032
$$ 5049132 4777670 7126705 9238579 7390945 2718422 -288349 226688 1912167 2298199
6620B298199o15257m97080j071029l031633m106865k017815K036392M349948L046100
$$ 2298199 1682942 1185862 114833 -2916800 -7023665 -9041480 -7005088 -2655140 390960
6611C90960K50125o07634J135618K956431K510833K67134j576142j837532j114131
$$ 390960 641085 33451 1169069 4125500 6636333 6903467 5327325 3489793 2375662
6602B375662k25505R06136K409595L402704K834564J190001J85541M43711O34704
$$ 2375662 2150157 3056293 5465888 8868592 11703156 12893157 13078698 13522409 14157113
6593A4157113l26700j445725j325468o22351r09971j742866j265091K68617K58334
$$ 14157113 13830413 12384688 11059220 10436869 9526898 7784032 6518941 6787558 7045892
6584G045892k149749m204850l228334k50311J615006J011095q32208j881468p99543
$$ 7045892 4896143 691293 -2537041 -2787352 -1172346 -161251 -993459 -2874927 -3674470
6575c674470K043504M184736L233919J21815j805566j559813j579601k947695
$$ -3674470 -1630966 2553770 5787689 5909504 4103938 2544125 964524 -1983171
6567a983171l112874n85073J753938J258782Q7169J186668K772262J613905o76552
$$ -1983171 -5096045 -5681118 -3927180 -2668398 -2581229 -1394561 1377701 2991606 2315054
6558B315054k18017J963169J395821j943405l505954k106012j569798l348829
$$ 2315054 2097037 4060206 5456027 3512622 6668 -2099344 -3669142 -7017971
6550g017971l878034j469876K50850j012183j680152J461316N082925M250637
$$ -7017971 -10896005 -12365881 -12115031 -13127214 -14807366 -13346050 -8263125 -4012488
6542d012488K22235j741322k67920J245116O36609m47745j7523J473498K310189
$$ -4012488 -3790253 -5531575 -5799495 -4554379 -3917770 -4365515 -4383038 -2909540 -599351
6533e99351J582070q4178q94543L46827K217961J918035p34030k674417k062705
$$ -599351 982719 898541 3998 350825 2568786 4486821 3752791 1078374 -984331
6524i84331p48742n87275k07197J925426L803548K591124o76680k481126j825124
$$ -984331 -1733073 -2320348 -2527545 -602119 3201429 5792553 5115873 2634747 809623
6515H09623p02648l00001K26610J366175K207369J942444P16430q45390j753895
$$ 809623 106975 -193026 33584 1399759 3607128 5549572 6266002 5420612 3666717
6506C666717j069861O40066J424970O49717o1420K30523J96521o92008l17173
$$ 3666717 2596856 3236922 4661892 5311609 5250189 5480712 5677233 4985225 4668052
6497D668052K231931L721558J217683k745428l424844o60929J709259J903075
$$ 4668052 6899983 10621541 11839224 9093796 5668952 5008023 6717282 8620357
6489H620357J241468N6621k643405n453536n143047j635231J534369K354915K160077
$$ 8620357 9861825 9918446 7275041 1821505 -3321542 -4956773 -3422404 -1067489 1092588
6480A092588J868697N82153j148457r22166J117968J479367j214265l704871l208847
$$ 1092588 2961285 3543438 2394981 1472815 2590783 4070150 2855885 -848986 -4057833
6471d057833j421594q31199m88086J255678K631136R88338k242912k992055l56222
$$ -4057833 -5479427 -6310626 -6798712 -5543034 -2911898 -1923560 -4166472 -7158527 -7514749
6462g514749K300989K114343m3694j581205j504508q35853o32764m38712R72985
$$ -7514749 -5213760 -3099417 -3143111 -4724316 -6228824 -7064677 -7697441 -8136153 -7163168
6453g163168L276233M020414J742770j147863r87958J780710K885092N50422j801706
$$ -7163168 -3886935 133479 1876249 728386 -259572 1521138 4406230 4956652 3154946
6444C154946r26429J401056J680088K02193k40959N19723N6229k094126l501469
$$ 3154946 2228517 3629573 5309661 5511854 5270895 5790618 5846847 3752721 251252
6435B51252k715113j037842R0282P85016J058303L5243j948487k625355p69186
$$ 251252 -2463861 -3501703 -3411421 -2626405 -1568102 -1532859 -3481346 -6106701 -6875887
6426f875887J677249K135321R36449N42434J841825L120708K806562J509652N46331
$$ -6875887 -5198638 -3063317 -2126868 -1584434 257391 3378099 6184661 7694313 8240644
6417H240644k89934k074020m315538m788402k340407J225955L023771K228524
$$ 8240644 7950710 5876690 1561152 -3227250 -5567657 -4341702 -1317931 910593
6409I10593M04701q42870j355872j653573j868277j771802j105279K81629J985402
$$ 910593 1315294 472424 -883448 -2537021 -4405298 -6177100 -7282379 -7000750 -5015348
6400e015348K858481K122883N56850l84167m10265j91208L23370J632631K785297
$$ -5015348 -2156867 -33984 522866 138699 -271566 -462774 -139404 1493227 4278524
6391D278524J942245n66266j967379r62550K23917o17980k070875j378283J016412
$$ 4278524 6220769 5654503 3687124 2724574 2948491 2330511 259636 -1118647 -102235
6382a02235K038424O38464r03377p02140J57356j56468j264146j383183j15265
$$ -102235 1936189 2574653 1671276 969136 1126492 970024 -294122 -1677305 -1792570
6373a792570J127833J259942Q00441P00440Q22679L98894l94823m55071L45453
$$ -1792570 -664737 595205 1395646 2096086 2918765 3317659 2922836 2467765 2813218
6364B813218M43167j162608k811573k025168Q38961K765869K224730R97260R40836
$$ 2813218 3256385 2093777 -717796 -2742964 -1904003 861866 3086596 4083856 5024692
6355E024692J120948n0510j626855j574372l73082l64456j716789j890639K35913
$$ 5024692 6145640 6095130 4468275 2893903 2520821 2156365 439576 -1451063 -1215150
6346a215150K294877J861834q7212j050513q75105j364899k594017k285411M37221
$$ -1215150 1079727 2941561 2854349 1803836 928731 -436168 -3030185 -5315596 -4878375
6337d878375K888861K120546q36965k117617j62640K382710K515884P16393m70107
$$ -4878375 -1989514 131032 -705933 -2823550 -2986190 -603480 1912404 2628797 2158690
6328B158690k73293n2501m13149l49896L54771R9807j869302l334529j532608
$$ 2158690 1885397 1832896 1419747 1069851 1424622 1524429 -344873 -3679402 -5212010
6319e212010K818838N702154M339612L60057k257584j717499N5206L14177j164311
$$ -5212010 -2393172 3308982 7648594 8008651 5751067 4033568 4088774 4402951 3238640
6310C238640k421153k279038j474519p79480K42572J751994K600158K277068K372926
$$ 3238640 817487 -1461551 -2936070 -3715550 -3472978 -1720984 879174 3156242 5529168
6301E529168L993989M980279K529413j992309m138877k579120q79057j969255
$$ 5529168 9523157 14503436 17032849 15040540 10901663 8322543 7443486 5474231
6293E474231l970319l529674q46819J112359Q76543l53094q56199P3398J970829
$$ 5474231 1503912 -2025762 -2872581 -1760222 -883679 -1236773 -2092972 -2019574 -48745
6284d8745L252444K401941J44633r63241j33465M37106o66160j576867o28032
$$ -48745 3203699 5605640 5750273 4787032 4653567 5090673 4424513 2847646 2219614
6275B219614K59887j104791k672258j108767K050107J968687j846956m260149
$$ 2219614 2479501 1374710 -1297548 -2406315 -356208 1612479 -234477 -4494626
6267d494626j980158J946508L085642J446715k08857j046248k071125l075979
$$ -4494626 -6474784 -4528276 -1442634 4081 -204776 -1251024 -3322149 -6398128
6259f398128k643263n65869J873297L607284M208388L263311R41179j244378j712910
$$ -6398128 -9041391 -9607260 -7733963 -4126679 81709 3345020 4286199 3041821 1328911
6250A328911o94213K15142P8194o65477j056912l56097J488741L186008K612855
$$ 1328911 634698 849840 928034 262557 -794355 -1150452 338289 3524297 6137152
6241F137152p49042m276618m482128r38700L074556M047206J616372j657610l150559
$$ 6137152 5388110 1111492 -3370636 -4309336 -1234780 2812426 4428798 2771188 -379371
6232c79371k399935q37081J66396N91618R90461J010057k61821k386766l234336
$$ -379371 -2779306 -3616387 -3449991 -2858373 -1867912 -857855 -1119676 -3506442 -6740778
6223f740778j366539J991350M267267M313506K973206J374597j51124j482418
$$ -6740778 -8107317 -6115967 -1848700 2464806 5438012 6812609 6661485 5179067
6215E179067k130936j647654p4896K109850L977272M188658K004534j406861l513405
$$ 5179067 3048131 1400477 1325581 3435431 7412703 11601361 13605895 12199034 8685629
6206H685629k944573r66014K14056R2770j11899K39808K82912o04190j472388
$$ 8685629 5741056 4775042 4989098 5081868 4969969 5209777 5492689 4888499 3416111
6197C416111j276748p18140j123109j999026j570370J22296P13053r50932k598811
$$ 3416111 2139363 1421223 298114 -1700912 -3271282 -3148986 -2435933 -3386865 -5985676
6188e985676j556349J286587K640039J348601m76138q34241o1775Q97073K177692
$$ -5985676 -7542025 -6255438 -3615399 -2266798 -2742936 -3577177 -3638952 -2741879 -564187
6179e64187L594622L415774O25550k566366k762169J91462K852423K625860N91099
$$ -564187 3030435 6446209 7071759 4505393 1743224 1934686 4787109 7412969 8004068
6170H004068j018903k182991l957038n208543l348081J359557M842409M058082
$$ 8004068 6985165 4802174 845136 -4363407 -7711488 -6351931 -1509522 2548560
6162B548560Q93230p83958n41183j081037l031314l373134j69078L851804M546150
$$ 2548560 3441790 2657832 2116649 1035612 -1995702 -5368836 -5537914 -1686110 2860040
6153B860040J642915j368448j782434r7276J694507K304610J524014p0755j395750
$$ 2860040 4502955 3134507 1352073 1254797 2949304 5253914 6777928 6707173 5311423
6144E311423j768565j641902j714091j648658p42628M55916O05974k89874o15333
$$ 5311423 3542858 1900956 186865 -1461793 -2204421 -1748505 -1142531 -1432405 -2047738
6135b047738N29979J877075J621427j29548j296557j61033K561867M208788K965509
$$ -2047738 -1517759 359316 1980743 1851195 554638 393605 2955472 7164260 10129769
6126A0129769l0419k097378k390172k525608l496735l834170k113990M21336J665247
$$ 10129769 10099350 8001972 5611800 3086192 -410543 -4244713 -6358703 -5937367 -4272120
6117d272120J704407J822786J657079J47489j466391r24994Q60868M76888k407320
$$ -4272120 -2567713 -744927 912152 1059641 -406750 -1331744 -470876 6012 -2401308
6108b401308l721259r43045K813778L104923J43425k255789k014891k61733J432087
$$ -2401308 -6122567 -7065612 -4251834 -1146911 -1003486 -3259275 -5274166 -5535899 -4103812
6099d103812K466401K327836Q41141o63283n03932R01166J521183P34991P4410
$$ -4103812 -1637411 690425 1531566 868283 364351 1265517 2786700 3521691 3596101
6090C596101O73972J720521K001740J445827L61493j434939l619900m550776k900439
$$ 3596101 4270073 5990594 7992334 9438161 9799654 8364715 4744815 194039 -2706400
6081b706400K17867J999023R88135j436329k841430k283319o67561P50018J365586
$$ -2706400 -2488533 -489510 498625 -937704 -3779134 -6062453 -6730014 -5979996 -4614410
6072d614410R85814l23556j755874j949804l70179J873575L107627K637948Q92364
$$ -4614410 -3628596 -3952152 -5708026 -7657830 -8028009 -6154434 -3046807 -408859 483505
6063D83505j244642k613604k169144k38220J293177J218989P13157J340265K167356
$$ 483505 -761137 -3374741 -5543885 -5782105 -4488928 -3269939 -2556782 -1216517 950839
6054I50839R88433j862176l428851k316855n22527p9671j63041Q62985K384100
$$ 950839 1939272 77096 -3351755 -5668610 -6191137 -6270808 -6433849 -5570864 -3186764
6045c186764K594583J446438M63505K27849n1634p21425j138056r81922p08839
$$ -3186764 -592181 854257 1317762 1545611 1493977 772552 -365504 -1347426 -2056265
6036b056265n35212j85258J28627l52789j502857j763405J09409L117484M683329
$$ -2056265 -2591477 -2776735 -2648108 -3000897 -4503754 -6267159 -6157750 -3040266 1643063
6027A643063L435083P87758p55565n78834l60332j352770k392872j599319O54410
$$ 1643063 5078146 5865904 5110339 4531505 4171173 2818403 425531 -1173788 -519378
6018e19378J842421L70650k482947l963348k638242J78326J534601j18491k745110
$$ -519378 1323043 1693693 -789254 -4752602 -7390844 -7212518 -5677917 -5796408 -8541518
6009h541518k722807M04542K959525K245584M43208R42792K819776K563964L8223
$$ -8541518 -11264325 -10859783 -7900258 -5654674 -5211466 -4268674 -1448898 1115066 1153289
6000A153289j561521j275967j308874k044498j024184J828719K817575M16405
$$ 1153289 -408232 -1684199 -2993073 -5037571 -6061755 -4233036 -1415461 -999056
5992i99056j967698j779539j292461k498515k622582P73775M144866K821017j332004
$$ -999056 -2966754 -4746293 -6038754 -8537269 -11159851 -10386076 -6241210 -3420193 -4752197
5983d752197k804187r62686K42863j92102N77855K707935K493620r69930l417653
$$ -4752197 -7556384 -8519070 -8276207 -8468309 -7890454 -5182519 -2688899 -3658829 -7076482
5974g076482j802693J370180K404153J448995Q21899J233234J873995J948296
$$ -7076482 -8879175 -7508995 -5104842 -3655847 -2833948 -1600714 273281 2221577
5966B221577N21642k804000n796816m948249n02471K699363J425040j515589j465577
$$ 2221577 2743219 -60781 -5857597 -10805846 -11308317 -8608954 -7183914 -8699503 -10165080
5957a0165080J676608M084052L578959J689318O23567N80006L51396p24459j781232
$$ -10165080 -8488472 -4404420 -825461 863857 1487424 2067430 2418826 1694367 -86865
5948h6865j171856J396683L619268K711347j045904m316923m600779k567282k03237
$$ -86865 -1258721 137962 3757230 6468577 5422673 1105750 -3495029 -6062311 -6265548
5939f265548J448721K010639J205378l18479j150054r91293q27455o74809O83613
$$ -6265548 -4816827 -2806188 -1600810 -1919289 -3069343 -4060636 -4888091 -5562900 -4879287
5930d879287K776654K786183m27433l802905l787139r40794J428979J911635J817206
$$ -4879287 -2102633 683550 256117 -3546788 -7333927 -8274721 -6845742 -4934107 -3116901
5921c116901K184639K447290J975244J005578j22680j310495k238325k550512
$$ -3116901 -932262 1515028 3490272 4495850 4373170 3062675 824350 -1726162
5913a726162k319973j568100J41164K709057M685850M528598K396900n0610j294865
$$ -1726162 -4046135 -5614235 -5473071 -2764014 1921836 6450434 8847334 8796724 7501859
5904G501859r28295L19772J002908J85953j280939j654221q07744m91727j505616
$$ 7501859 6573564 6893336 7896244 8082197 6801258 5147037 4339293 3847566 2341950
5895B341950k270729j278400O12377J669523J665411J247239K18527j788309l800783
$$ 2341950 71221 -1207179 -594802 1074721 2740132 3987371 4205898 2417589 -1383194
5886a383194m321777l112522j009398J211149K736697K643036J156275j87198
$$ -1383194 -5704971 -8817493 -9826891 -8615742 -5879045 -3236009 -2079734 -2266932
5878b266932p84401j780423l288209k964633L47989L585285L182244L99606o33607
$$ -2266932 -3051333 -4831756 -8119965 -11084598 -10736609 -7151324 -3969080 -3569474 -4203081
5869d203081O42185P62714j654533l454564j942982J006556J838393k3950k334998
$$ -4203081 -3560896 -2798182 -4452715 -7907279 -9850261 -8843705 -7005312 -7029262 -9364260
5860i364260l140244k005288N43831L239206M599203M292527L177576J599133
$$ -9364260 -12504504 -14509792 -13965961 -10726755 -6127552 -1835025 1342551 2941684
5852B941684q11871l083548k830427L08635L090519K534021p8656j259146k02524
$$ 2941684 2129813 -953735 -3784162 -3475527 -385008 2149013 2070357 811211 608687
5843F08687R05138P43686J75057k72447j306024k490986j723959J354912L662732
$$ 608687 1513825 2257511 2432568 2160121 854097 -1636889 -3360848 -2005936 1656796
5834A656796K506935m78013j618647l19439Q46207O42021O19764J602246J857907
$$ 1656796 4163731 3685718 2067071 1747632 2593839 3235860 3855624 5457870 7315777
5825G315777K91083j220533r11945m38538k244414m990582m911667j397515J977077
$$ 7315777 7606860 6386327 5474382 5035844 2791430 -2199152 -7110819 -8508334 -6531257
5816f531257K437091J150544M61982O15733P56032J084277K073140K805724J921341
$$ -6531257 -4094166 -2943622 -2481640 -1865907 -1109875 -25598 2047542 4853266 6774607
5807F774607l57693k351380k622444r37146J639548L100087K091600k22003j156634
$$ 6774607 6416914 4065534 1443090 505944 2145492 5245579 7337179 7115176 5958542
5798E958542J6648J131403M39482j021293j674950k082863l368408m414995l034085
$$ 5958542 5975190 7106593 7546075 6524782 4849832 2766969 -601439 -5016434 -8050519
5789h050519O55235M016622M841679L115294L73253j368012p62531J321981K113834
$$ -8050519 -7395284 -3378662 1463017 4578311 4951564 3583552 2821021 4143002 6256836
5780F256836K28808k205150k348604o47264K7219j342203k725400k099875K54219
$$ 6256836 6485644 4280494 1931890 1284626 1311845 -30358 -2755758 -4855633 -4601414
5771d601414K743590M142165L956215K343330L3087k214039l771107l460158r3889
$$ -4601414 -1857824 2284341 6240556 8583886 8616973 6402934 2631827 -828331 -922220
5762i22220N056601P806581N174525p51454m953914m912172k214238L43111J189805
$$ -922220 4134381 11940962 17115487 16364033 11410119 6497947 4283709 4626820 5816625
5753E816625K19783j243072j171008O52910J713276L00749j441467p18013J115103
$$ 5816625 6036408 4793336 3622328 4275238 5988514 6289263 4847796 4129783 5244886
5744E244886N57358k113153l105110j228259N67779M03132j1598P09448J196430
$$ 5244886 5802244 3689091 583981 -644278 -76499 326633 315035 1024483 2220913
5735B220913M84300o1930K10020j48499j149175l39169K258430K346457j978243
$$ 2220913 2705213 2643283 2853303 2704804 1555629 1216460 3474890 5821347 3843104
5726C843104n583244k986593L137075N465008K427874n46245N5303J310756k64267
$$ 3843104 -1740140 -4726733 -1589658 3875350 6303224 5756979 5812282 7123038 6858771
5717F858771l000973l064920l19709J790973J067050j023852j633674j2062J644356
$$ 6858771 3857798 792878 473169 2264142 3331192 2307340 673666 661604 2305960
5708B305960P93930k042144l349258r47647K741456L412471L11939l030839l452842
$$ 2305960 3099890 1057746 -2291512 -3239159 -497703 2914768 3226707 195868 -3256974
5699c256974j441067O85324J816468K141357J724197N41458o70042q52220J12524
$$ -3256974 -4698041 -4012717 -2196249 -54892 1669305 2210763 1540721 688501 801025
5690H01025J182454J176571j69101j894485k440067r86739J563180L165294K396896
$$ 801025 1983479 3160050 2990949 1096464 -1343603 -2330342 -767162 2398132 4795028
5681D795028k87943k812771k968111l67110K556102K305210j787969n860081n165914
$$ 4795028 4507085 1694314 -1273797 -1640907 915195 3220405 1432436 -4427645 -9593559
5672i593559L86621N660378N783660J174485l552202m641001k137537J416353
$$ -9593559 -9206938 -3546560 2237100 3411585 -140617 -4781618 -6919155 -5502802
5664e502802L706654M000063L002766J988883J577391J078178m97087k684161
$$ -5502802 -1796148 2203915 5206681 7195564 8772955 9851133 9354046 6669885
5656F669885l630254k332724J2030J594388K082952K100793J508312p6049j478323
$$ 6669885 3039631 706907 718937 2313325 4396277 6497070 8005382 7929333 6451010
5647F451010q77558J180871J869053K2109k089959k174120j040818o46140r89911
$$ 6451010 5573452 6754323 8623376 8645485 6555526 4381406 3340588 2694448 1704537
5638A704537j107901j320942j881303j065683K132569M717740L025835j199320
$$ 1704537 596636 -724306 -2605609 -3671292 -1538723 3179017 6204852 5005532
5630E005532k374927R25324L953407K984004J52947j112933j438289k912203m232057
$$ 5005532 2630605 3555929 7509336 10493340 10646287 9533354 8095065 5182862 950805
5621I50805k539900J383714L519814J847104j580916l624271l026854o73314J385270
$$ 950805 -1589095 -205381 3314433 5161537 3580621 -43650 -3070504 -3743818 -2358548
5612b358548J469734O7684o36730N5652K42325j124837j839264P1744K421231
$$ -2358548 -888814 -821130 -1457860 -1402208 -1159883 -2284720 -4123984 -4052240 -1631009
5603a631009J775776q78981j178152K090403N183771M790801J935607p10284k506109
$$ -1631009 144767 -734214 -1912366 178037 5361808 10152609 12088216 11377932 8871823
5594H871823l981548m488022l032583m55745J206185J304637J124316J735343
$$ 8871823 4890275 402253 -2630330 -3086075 -1879890 -575253 549063 2284406
5586B284406K334156J337346j203871l107549k490823j30760J614830J858642
$$ 2284406 4618562 5955908 4752037 1644488 -846335 -977095 637735 2496377
5578B496377J580118J076450o62035l270212m242253k489004l47819Q5305L19170
$$ 2496377 4076495 5152945 4490910 1220698 -3021555 -5510559 -5858378 -5773073 -5453903
5569e453903K333107M246707K962297j86595q38516J565325K807456N53737k165891
$$ -5453903 -3120796 1125911 4088208 3901613 3063097 4628422 7435878 7989615 5823724
5560E823724j860766M77909J614479P21969n36156q55234j98424R53612J746301
$$ 5823724 3962958 4440867 6055346 6777315 6241159 5385925 5187501 6141113 7887414
5551G887414J319148k2098j092264j705768k633010l398802k476295l57910L62234
$$ 7887414 9206562 9184464 8092200 6386432 3753422 354620 -2121675 -2479585 -2117351
5542b117351p62642p43291J878087L854848K015905j395907j984640j8217M07393
$$ -2117351 -2879993 -3623284 -1745197 2109651 4125556 2729649 745009 726792 1134185
5533A134185j662656k553342j56136K587563K322666K28617k09587J619744L096879
$$ 1134185 -528471 -3081813 -3237949 -650386 1672280 1900897 1691310 3311054 6407933
5524F407933K212965m27629l047069m352817l846547j967983j57323K74375m16957
$$ 6407933 8620898 8193269 5146200 793383 -3053164 -5021147 -5178470 -4904095 -5321052
5515e321052q33159l20782M36407Q26205J240122K025251K438459J695534N93433
$$ -5321052 -6154211 -6474993 -6038586 -5212381 -3972259 -1947008 491451 2186985 2780418
5506B780418P96163K362359L193244J654281j051239k100699l49965K446034L646644
$$ 2780418 3576581 5938940 9132184 10786465 9735226 7634527 7284562 9730596 13377240
5497A3377240K219889p72475l357464m031196k684389p63946j88052j496310l111586
$$ 13377240 15597129 14824654 11467190 7435994 4751605 3987659 3799607 2303297 -808289
5488h08289k926836p36365J397817J583336M64393L06294J759609K783080J546950
$$ -808289 -3735125 -4471490 -3073673 -1490337 -1025944 -719650 1039959 3823039 5369989
5479E369989p37417j401245j09264Q69425K02472p79915n93541R8105p5251r68222
$$ 5369989 4632572 3231327 3122063 3991488 4193960 3414045 2820504 2918609 2843358 1875136
5469A875136j539080j470645q11562P60782K768994L256166J194326j360251j622968
$$ 1875136 336056 -1134589 -1946151 -1185369 1583625 4839791 6034117 4673866 3050898
5460C050898L2547P68403m27417j499915o81869J003426J420191R3935j539923
$$ 3050898 3083445 3851848 3424431 1924516 1242647 2246073 3666264 3760199 2220276
5451B220276j904392p87934O18112J204075J413165K324456L220859K041613q63152
$$ 2220276 315884 -472050 146062 1350137 2763302 5087758 8308617 10350230 9487078
5442I487078k029055L4361J754413k64323l332464k541655R87472J305010k896872
$$ 9487078 7458023 7492384 9246797 8982474 5650010 3108355 4095827 5400837 2503965
5433B503965n827008l214285J877164M457043M201612L281892J619355j465508
$$ 2503965 -3323043 -6537328 -4660164 -203121 3998491 7280383 8899738 7434230
5425G434230l692394k377748R98142K655547J835600P50972K28375r21251k574986
$$ 7434230 3741836 1364088 2362230 5017777 6853377 7604349 7832724 6911473 4336487
5416D336487k879594j482627k99932n21718j167343j107981n41516L7313P25817
$$ 4336487 1456893 -25734 -325666 -847384 -2014727 -3122708 -3664224 -3626911 -2901094
5407b901094J682741K863257M195460M978717L809733O08544k158375k291871
$$ -2901094 -1218353 1644904 5840364 10819081 14628814 15237358 13078983 10787112
5399A0787112j157749j749473l939113m566056k426836p2956L69055K45276J394059
$$ 10787112 9629363 7879890 3940777 -625279 -3052115 -3125071 -2756016 -2510740 -1116681
5390a116681K490498J020311k301521l876875k015027Q50799J503696l0882j005595
$$ -1116681 1373817 2394128 92607 -3784268 -5799295 -4948496 -3444800 -3475682 -4481277
5381d481277K55384K434262L141148J677028o34129k095323j861332r8738K060595
$$ -4481277 -4225893 -1791631 1349517 3026545 2392416 297093 -1564239 -1662977 397618
5372C97618L016416K229553J104069J201804J773486O21622k451398m890720m743805
$$ 397618 3414034 5643587 6747656 7949460 9722946 10344568 7893170 3002450 -1741355
5363a741355k999578j544348n04124Q30918J829425J278119l03156r52060J84529
$$ -1741355 -4740933 -6285281 -6789405 -5958487 -4129062 -2850943 -3154099 -4106159 -3921630
5354c921630J908296K591699J770810J62430j140159j512808j268038j085913
$$ -3921630 -2013334 578365 2349175 2511605 1371446 -141362 -1409400 -2495313
5346b495313r17538j66039R33373J249782M92699k05573j8753N38484R27081J438908
$$ -2495313 -3412851 -3578890 -2645517 -1395735 -903036 -1108609 -1127362 -588878 338203 1777111
5336A777111J885778J090119j065152k601982j945549j48737Q83238J106194J609840
$$ 1777111 3662889 4753008 3687856 1085874 -859675 -1008412 -125174 981020 2590860
5327B590860K335566K380328J813256J475011J424172Q82458o79374l106960n380870
$$ 2590860 4926426 7306754 9120010 10595021 12019193 12901651 12222277 9115317 3734447
5318C734447n611124k939972J49557K7422k569635k477067K427567P168261O282951
$$ 3734447 -1876677 -4816649 -4667092 -4639670 -7209305 -9686372 -7258805 -90544 6192407
5309F192407J421765j701670j432445n22021j85423Q21112J877259O77788j890339
$$ 6192407 7614172 5912502 4480057 3958036 3772613 4593725 6470984 7148772 5258433
5300E258433k017523R07729K970087J853375P5539L43654J472122J085001p01947
$$ 5258433 3240910 4148639 7118726 8972101 9047640 9391294 10863416 11948417 11246470
5291A1246470k393978l354755l166338j164946J756113L123755K095045N59010
$$ 11246470 8852492 5497737 2331399 1166453 2922566 6046321 8141366 8700376
5283H700376j8485l87891j110950j170705l79186l73195j559876j769198K20094
$$ 8700376 8681891 8294000 7183050 6012345 5633159 5259964 3700088 1930890 2150984
5274B150984K363236K465811J207821J80987o53517j576225j618778n76218j89409
$$ 2150984 4514220 6980031 8187852 8368839 7715322 6139097 4520319 3944101 3754692
5265C754692j242542j881096r22072j57349r27145j282944M09879J839518L75482
$$ 3754692 2512150 631054 -291018 -448367 -1375512 -2658456 -2248577 -409059 -33577
5256c3577k079318j984712J7174O81618J69765J520807M571808N442046K733713
$$ -33577 -2112895 -4097607 -4080433 -3398815 -3229050 -1708243 2863565 8305611 11039324
5247A1039324k52148p52555l9579o2944j88664N50705Q94337m39918k080983j974458
$$ 11039324 10787176 10034621 9995042 9932098 9743434 10294139 11188476 10748558 8667575 6693117
5237F693117n49716L12964L55072P54729J517283J273942k11901j160017j46482
$$ 6693117 6143401 6456365 6811437 7566166 9083449 10357391 10145490 8985473 8838991
5228H838991J689888J823737m68818k941666k882042l77559J767169J424614n85074
$$ 8838991 10528879 12352616 11883798 8942132 6060090 5682531 7449700 8874314 8289240
5219H289240k105497k378786k088931j567956n09679P88233J344450Q02104k20990
$$ 8289240 6183743 3804957 1716026 148070 -361609 426624 1771074 2573178 2352188
5210B352188j119660j662692j442548j24346J593323K336344J689839O31721J23615
$$ 2352188 1232528 -430164 -1872712 -1997058 -403735 1932609 3622448 4254169 4377784
5201D377784J34700L01694O20879J014580R72029K25006o84739j041200q83684
$$ 4377784 4512484 4814178 5435057 6449637 7421666 7646672 6961933 5920733 5037049
5192E037049q71376j327273j732263j279457P9548J277334J136907j92093j240981
$$ 5037049 4165673 2838400 1106137 -173320 -93772 1183562 2320469 2128376 887395
5183H87395r32355J71981P50711M15575n1988J42498J009086J910984J935908
$$ 887395 -44960 127021 877732 1293307 1241319 1383817 2392903 4303887 6239795
5174F239795M29875k071682l633187k660977p6531J275322N4639j613092q17831
$$ 6239795 6669670 4597988 964801 -1696176 -1772707 -497385 -442746 -2055838 -2873669
5165b873669J913090K841555M2794l589243m044254j633376j22044q14298q52274
$$ -2873669 -960579 1880976 1923770 -1665473 -5709727 -7343103 -7465147 -8279445 -9131719
5156i131719J547461L606011K315914m53649q29018P98340O79428j673598k412110
$$ -9131719 -7584258 -3978247 -1662333 -2115982 -2945000 -2146660 -1467232 -3140830 -5552940
5147e552940L17889L311200L418633J995120J685555J876288N54795j478280j745243
$$ -5552940 -5235051 -1923851 1494782 3489902 5175457 7051745 7606540 6128260 4383017
5138D383017l19532K81065r59093k410489k569826j708271o12615L46379N88135
$$ 4383017 4063485 4344550 3385457 974968 -1594858 -3303129 -3915744 -3569365 -2981230
5129b981230m85537k087155k171809K13907L387898M523513K598563m16208j541803
$$ -2981230 -3466767 -5553922 -7725731 -7511824 -4123926 399587 2998150 2581942 1040139
5120A040139q9003J510531Q09004j329376j853143K68343K708020K956833J162071
$$ 1040139 951136 2461667 3270671 1941295 88152 356495 3064515 6021348 7183419
5111G183419p80244j461295o90775N98766P29780r58593k521315j465877J395386
$$ 7183419 6403175 4941880 4251105 4849871 5579651 4621058 2099743 633866 2029252
5102B029252K560761Q42897j028193q40543O0022j46075n41303L02976J300657
$$ 2029252 4590013 5432910 4404717 3564174 3624196 3478121 2936818 3239794 4540451
5093D540451O95077q69010j575844j238461p31126j78276L29109m4594j031724
$$ 4540451 5235528 4366518 2790674 1552213 821087 642811 971920 927326 -104398
5084a04398o90655J266684J992388j53282k351407j519126P07591Q96050l62144
$$ -104398 -795053 471631 2464019 2310737 -40670 -1559796 -852205 43845 -318299
5075c18299J91776K626244L672809J944118n54701j921717k017704r89950O61749
$$ -318299 -126523 2499721 6172530 8116648 7561947 5640230 3622526 2632576 3294325
5066C294325J016017j094604l371402k664003L72612K448112K553980K138421
$$ 3294325 4310342 3215738 -155664 -2819667 -2447055 1057 2555037 4693458
5058D693458J333271q42032l035705k709931o98193l15661j749707j751685N60899
$$ 4693458 6026729 5184697 2148992 -560939 -1259132 -1574793 -3324500 -5076185 -4515286
5049d515286K082239R36458q72483j322033r87450m46708J116657L141479L134620
$$ -4515286 -2433047 -1496589 -2369072 -3691105 -4678555 -5125263 -4008606 -867127 2267493
5040B267493O94375j118944j87948J793906K412063J676804O62426k57248n63636
$$ 2267493 2961868 1842924 1654976 3448882 5860945 7537749 8200175 7942927 7379291
5031G379291K96997J009217m18761k785795k554319M07872J952110J43227j542919
$$ 7379291 7676288 8685505 8266744 5480949 2926630 3334502 5286612 5429839 3886920
5022C886920O1100K774436K843299N72174j156284j505198j531788j284341j40773
$$ 3886920 3948020 6722456 9565755 10137929 8981645 7476447 5944659 4660318 4519545
5013D519545J189567J480068Q11044j36456j267270k131122j544487L27702J347288
$$ 4519545 5709112 7189180 8000224 7863768 6596498 4465376 2920889 3248591 4595879
5004D595879L93412r00080q84503l42603n63432r83690n48652L09469O93925O60850
$$ 4595879 4989291 4089211 3204708 2862105 2298673 1314983 766331 1075800 1769725 2430575
4994B430575L31476o42073j618326j057683P40693J279909l60336j718724n78811
$$ 2430575 2762051 2119978 501652 -556031 184662 1464571 1104235 -614489 -1193300
4985a193300J724193K397581Q46787j324142k486101j999047m39403N27737o4068
$$ -1193300 530893 2928474 3775261 2451119 -34982 -2034029 -2473432 -1945695 -2009763
4976b009763q57349j96832R20263O97711L65480K196652M356654K746217j787572
$$ -2009763 -2867112 -3063944 -2143681 -1445970 -1080490 1116162 5472816 8219033 6431461
4967F431461l594891p28801K229972J644239l86061j029674j110885j648999j128544
$$ 6431461 2836570 2107769 4337741 5981980 5595919 4566245 3455360 1806361 677817
4958F77817P04432J183601j61208J28023K979491M036752R61218k034778j093552
$$ 677817 1382249 2565850 2404642 2532665 5512156 9548908 10510126 8475348 7381796
4949G381796J232363J260194J35711j98011j444767m138197m018428Q30290M684477
$$ 7381796 8614159 9874353 10010064 9812053 8367286 4229089 210661 1040951 5725428
4940E725428K607791j065307N4858L645836L326995r06l72962K422870L118505
$$ 5725428 8333219 7267912 7322770 10968606 14295601 14294695 13921733 16344603 19463108
4931A9463108N65933j155599n08923o6517q09728j258332j478838k188825j420280
$$ 19463108 20029041 18873442 18364519 18298002 17488274 16229942 14751104 12562279 11141999
4922A1141999K124035M540900J756038l269844m803285l132294k228320j656002
$$ 11141999 13266034 17806934 19562972 16293128 11489843 8357549 6129229 4473227
4914D473227J329990M266164K587310j627736k460266o6268O19379o21074J04259
$$ 4473227 5803217 10069381 12656691 11028955 8568689 8502421 9121800 8500726 8604985
4905H604985K142091J341494j249380p64776K193966K528640O8853p31713N56689
$$ 8604985 10747076 12088570 10839190 10074414 12268380 14797020 14865873 14134160 14690849
4896A4690849P41362N07893K548521M266168J682253k053304j756620P185j171180
$$ 14690849 15432211 15940104 18488625 22754793 24437046 22383742 20627122 20634307 19463127
4887A9463127j185856M493863Q804212M248650j071025L409531R560304M650649
$$ 19463127 18277271 22771134 31575346 35823996 34752971 38162502 47722806 52373455
4879E2373455j946647N875414J6845197R696627l26746J9705656M9178518K0047862
$$ 52373455 50426808 56302222 73147419 82844046 82517300 102222956 151401474 171449336
4871A71449336p7648846j51572843j17476181j4307631M9025858L5823442N710664
$$ 171449336 93800490 -57772353 -175248534 -189556165 -140530307 -104706865 -98996201
4864i8996201P989359K1755833J4775425k59412J352772J0981145Q293760j011066
$$ -98996201 -91006842 -69251009 -54475584 -54734996 -53382224 -42401079 -34107319 -35118385
4856c5118385l17999O024247M016141k494502j005050M952313L401908l014258
$$ -35118385 -35436384 -29412137 -25395996 -27890498 -28895548 -23943235 -20541327 -23555585
4848b3555585k680433L282930M249433k05471j440775J270781J034119k079207
$$ -23555585 -26236018 -22953088 -18703655 -18909126 -20349901 -19079120 -18045001 -20124208
4840b0124208j441509K783303L853597R76760o5561J971206K550461N52702o64869
$$ -20124208 -21565717 -18782414 -14928817 -13952057 -14017618 -12046412 -9495951 -8943249 -9608118
4831i608118o06212j571128k457571n95737J792998P16988j857796j136505J681166
$$ -9608118 -10214330 -11785458 -14243029 -14838766 -13045768 -12328780 -14186576 -15323081 -13641915
4822a3641915J698931m36825J22249L188105L867107J351548m63421n91841j586095
$$ -13641915 -11942984 -12379809 -12257560 -9069455 -5202348 -3850800 -4314221 -4906062 -6492157
4813f492157k998651j796704Q02514L83200k566528k967286j47670Q13262j970496
$$ -6492157 -9490808 -11287512 -10484998 -10101798 -12668326 -15635612 -15783282 -14970020 -16940516
4804a6940516l872175j416207K786674N026596N254484M723703L349426J374739
$$ -16940516 -20812691 -22228898 -19442224 -14415628 -9161144 -4437441 -1088015 286724
4796B86724J4422p85333j924907k298804k60256K154107J029602l086443n275632
$$ 286724 301146 -484187 -2409094 -4707898 -4968154 -2814047 -1784445 -4870888 -10146520
4787a0146520l242742K45093K379694L161662K724623O81868j041124L61645L290326
$$ -10146520 -13389262 -13144169 -10764475 -7602813 -4878190 -4196322 -5237446 -4875801 -1585475
4778a585475K916341j078402l248451p75664K264886J835275J12425R44314L144174
$$ -1585475 1330866 252464 -2995987 -3771651 -1506765 328510 440935 1385249 4529423
4769D529423K728433o08649l308038l039168r52178N33001K17723j116176j552259
$$ 4529423 7257856 6649207 3341169 302001 -650177 -117176 100547 -1015629 -2567888
4760b567888m11167M01296q54625k333345r43789K265739L048391O21306j200804
$$ -2567888 -2979055 -2577759 -3432384 -5765729 -6709518 -4443779 -1395388 -774082 -1974886
4751a974886o81977q71250l257190l883444K61836N246906N508516K117350M12920
$$ -1974886 -2656863 -3528113 -6785303 -10668747 -10406911 -5160005 348511 2465861 2878781
4742B878781J347291Q87667k435673m902359l610911o80240N13203P9705K78437
$$ 2878781 4226072 5113739 2678066 -2224293 -5835204 -6515444 -6002241 -5922536 -5644099
4733e644099J502841K001298Q15047q18517j017809O92122K986279M029694L121392
$$ -5644099 -4141258 -2139960 -1324913 -2143430 -3161239 -2469117 517162 4546856 7668248
4724G668248J146852n34868j386466j731200j895418j774152j170974k47391M67368
$$ 7668248 8815100 8280232 6893766 5162566 3267148 1492996 322022 74631 541999
4715E41999N38555J22090j85754r5213J17014K14501K59606M6818p52725j403230
$$ 541999 1080554 1202644 1016890 921677 1038691 1253192 1512798 1559616 806891 -596339
4705e96339m42504J753058K342150k20458l214749k971370k08264R93971p18022
$$ -596339 -1038843 714215 3056365 2835907 -378842 -3350212 -3558476 -2564505 -3282527
4696c282527k236928r63619J614670K642110J658135Q2862j051389j321777m97552
$$ -3282527 -5519455 -6483074 -4868404 -2226294 -568159 -485297 -1536686 -2858463 -3356015
4687c356015P26666R26364j02334r29269o82110J4505Q15250K207573L495594
$$ -3356015 -2629349 -1702985 -1805319 -2734588 -3416698 -3402193 -2586943 -379370 3116224
4678C116224K701087k47085k611475k600087j643585j396857j171730l29004l25840
$$ 3116224 5817311 5570226 2958751 358664 -1284921 -2681778 -3853508 -4182512 -4508352
4669d508352j740257k091929N7260J494543r86065m448862l397238J539605M026183
$$ -4508352 -6248609 -8340538 -8283278 -6788735 -7774800 -12223662 -15620900 -14081295 -10055112
4660a0055112J462289j477784m84430K167835K137820l0811m87941J508664K835133
$$ -10055112 -8592823 -10070607 -10555037 -8387202 -6249382 -6280193 -6768134 -5259470 -2424337
4651b424337J628161k48678m38160O33018Q73120l92246j707095j553624k45679
$$ -2424337 -796176 -1044854 -1483014 -849996 23124 -369122 -2076217 -3629841 -3875520
4642c875520O11153J79658q17466j480807j913777k275204j646711P13793L478038
$$ -3875520 -3264367 -3084709 -3902175 -5382982 -7296759 -9571963 -11218674 -10504881 -7026843
4633g026843M263075K556102J90734j142687j422695j282561j038702r28181q18677
$$ -7026843 -2763768 -207666 -16932 -1159619 -2582314 -3864875 -4903577 -5831758 -6650435
4624f650435L24008K887228M672310L064132n08532j456587J328530L115082J11549
$$ -6650435 -6326427 -3439199 1233111 4297243 3788711 2332124 3660654 6775736 6887285
4615F887285m467375m821962r51553J837199R50057o91024l49496N29456j63900
$$ 6887285 2419910 -2402052 -3353605 -1516406 -566349 -1257373 -1606869 -1077413 -1241313
4606a241313j324253q78554N59361R52055J09995p26702j293538j913502j690574
$$ -1241313 -2565566 -3444120 -2884759 -1932704 -1822709 -2549411 -3842949 -5756451 -7447025
4597g447025L99508L003961L314469O82781k441881l461826k183404k66632P39925
$$ -7447025 -7047517 -4043556 -729087 -46306 -2488187 -5950013 -8133417 -8400049 -7660124
4588g660124O54062O65089J860615L296112K585849o32359l354965l098092j558295
$$ -7660124 -7006062 -6340973 -4480358 -1184246 1401603 769244 -2585721 -5683813 -7242108
4579g242108j802458l151503k398572N04745K214177J828330K345387M682004
$$ -7242108 -9044566 -12196069 -14594641 -14089896 -11875719 -10047389 -7702002 -3019998
4571c019998M917095O39179l918268l402324P28102K617746P66291p41638N79063
$$ -3019998 1897097 2536276 -1381992 -4784316 -4056214 -1438468 -672177 -1413815 -834752
4562h34752K205006J402305p05024j624346j036915j44083K72462j25669j139860
$$ -834752 1370254 2772559 2067535 443189 -593726 -737809 -465347 -591016 -1730876
4553a730876j229427Q71291L219348K360271j167219k640151j52410K142341O31211
$$ -1730876 -2960303 -2089012 1130336 3490607 2323388 -316763 -469173 1673168 2304379
4544B304379j778011n31662K780699K990542O5767q99523J483373K313318j346289
$$ 2304379 526368 -5294 2775405 5765947 5831714 4932191 6415564 8728882 7382593
4535G382593n125012l850140O99774K959363J789335O68198R83940K19729k731932
$$ 7382593 2257581 -1592559 -892785 2066578 3855913 4524111 5508051 5727780 2995848
4526B995848m914419l769297j030650J21647m42619o16590J22708L37020n28613
$$ 2995848 -1918571 -5687868 -6718518 -6596871 -7039490 -7656080 -7533372 -7196352 -7724965
4517g724965j357647j490429j563197j740158r17295J384109L670880M150398
$$ -7724965 -9082612 -10573041 -12136238 -13876396 -14793691 -13409582 -9738702 -5588304
4509e588304K899993J361321L92834r2608j51533J96424K10047r53122k621770
$$ -5588304 -2688311 -1326990 -934156 -1026764 -1178297 -981873 -771826 -1724948 -4346718
4500d346718k837262p81734J925091L062283K252473P95372l29284j181905j766735
$$ -4346718 -7183980 -7965714 -6040623 -2978340 -725867 69505 -259779 -1441684 -3208419
4491c208419j476447j42675J201446J396957N99971j13424l49129o79377j246916
$$ -3208419 -4684866 -4827541 -3626095 -2229138 -1629167 -1742591 -2091720 -2771097 -4018013
4482d018013j161547M6884J214573R01397m01046p30859N18085J545621O39465
$$ -4018013 -5179560 -5132676 -3918103 -3016706 -3417752 -4148611 -3630526 -2084905 -1445440
4473a445440j317921k001660p82076O34783P67554K64860N36335J359068J084589
$$ -1445440 -2763361 -4765021 -5547097 -4912314 -4144760 -3879900 -3343565 -1984497 -899908
4464h99908q18983k656480k665389j467885j080452j703641j221745J358804L609955
$$ -899908 -1718891 -4375371 -7040760 -8508645 -9589097 -11292738 -12514483 -11155679 -7545724
4455g545724K569980r15145k867660j189042J988831L425663K426324N57997o72119
$$ -7545724 -4975744 -5890889 -8758549 -9947591 -7958760 -4533097 -2106773 -1548776 -2220895
4446b220895p46794L1777O20778J86194l59824P37323K848410K746672p60965
$$ -2220895 -2967689 -2935912 -2315134 -2128940 -2488764 -1751441 1096969 3843641 3082676
4437C082676m110248l378410K41515K414562J974552J618777K562529K503109
$$ 3082676 -1027572 -4405982 -4164467 -1749905 224647 1843424 4405953 6909062
4429F909062n6739l004164m011591l880534m185470l919368j359654K174868L498929
$$ 6909062 6852323 3848159 -163432 -4043966 -8229436 -12148804 -13508458 -11333590 -7834661
4420g834661K038700M24372M99449J160360P74595l70122j133214j395419j453617
$$ -7834661 -5795961 -5371589 -4872140 -3711780 -2937185 -3307307 -4440521 -5835940 -7289557
4411g289557p20905J268607L159907K922814P21445j094330j254069r76635j200922
$$ -7289557 -8010462 -6741855 -3581948 -659134 62311 -1032019 -2286088 -3262723 -4463645
4402d463645m97301K207312M464436L001854q94722k236105O88627L596525K255543
$$ -4463645 -4960946 -2753634 1710802 4712656 3817934 1581829 2270456 5866981 8122524
4393H122524j746257l899999l108869j862787j514597r28157M91615J595154J701592
$$ 8122524 6376267 2476268 -632601 -2495388 -4009985 -4938142 -4446527 -2851373 -1149781
4384a149781J542237J457106O19188j397650l726533n118938m653696j960054
$$ -1149781 392456 1849562 2468750 1071100 -2655433 -7774371 -12428067 -14388121
4376a4388121J875577M268503L667099J514266J37079k22103m10644j9145J275903
$$ -14388121 -12512544 -8244041 -4576942 -3062676 -2925597 -3147700 -3558344 -3577489 -2301586
4367b301586J619054l11501j838356K81042L836632L496878q60796l441467j171572
$$ -2301586 -682532 -994033 -2832389 -2551347 1285285 4782163 3921367 479900 -691672
4358f91672K148123K219366l1604j605944k005898j834538o18160J112792J034632
$$ -691672 1456451 3675817 3644213 2038269 32371 -1802167 -2420327 -1307535 -272903
4349b72903r96588j716192J96501J480670k5660j415533j55470R91420p39739
$$ -272903 -1269491 -2985683 -2789182 -1308512 -1334172 -2749705 -2905175 -1913755 -2653494
4340b653494k097522R89057N475834N137410M20295k419501j061174O52776J21539
$$ -2653494 -4751016 -3761959 1713875 6851285 7271580 4852079 3790905 4443681 4565220
4331D565220q61206j142800k333113m297348l891029l09520K795474K669098R84870
$$ 4565220 3704014 2561214 228101 -4069247 -7960276 -8269796 -5474322 -2805224 -1820354
4322a820354M9629p07460k187836k976505j808813p2968M63278L16521P51092
$$ -1820354 -1770725 -2478185 -4666021 -7642526 -9451339 -9524307 -9061029 -8744508 -7993416
4313g993416J469340J534038J022863M89799J81220M57483J365788J585975m0844
$$ -7993416 -6524076 -4990038 -3967175 -3477376 -3296156 -2838673 -1472885 113090 72246
4304G2246j832199q47017K473482M315220K918778Q07546M21110P51815K9607
$$ 72246 -1759953 -2606970 -133488 4181732 7100510 7908056 8329166 9080981 9110588
4295I110588j200317j767969k208569l288650m153364l786500k613737j230144
$$ 9110588 7910271 6142302 3933733 645083 -3508281 -7294781 -9908518 -11138662
4287a1138662N99088K421800K746516J585853J098106K187098K793741J263910
$$ -11138662 -10539574 -8117774 -5371258 -3785405 -2687299 -500201 2293540 3557450
4279C557450r47451j870437k016318k582241k786320j478439K97745Q47835N81634
$$ 3557450 2609999 739562 -1276756 -3858997 -6645317 -8123756 -7826011 -6978176 -6396542
4270f396542Q88407J429409Q39105p30098j793567j625277o04719P34924J727233
$$ -6396542 -5508135 -4078726 -3239621 -3969719 -5763286 -7388563 -7993282 -7258358 -5531125
4261e531125J693189J183248J712983L092162K843697r3758k983094k742771k27193
$$ -5531125 -3837936 -2654688 -941705 2150457 4994154 4900396 1917302 -825469 -1052662
4252a052662J264079N32116q24991j321426q14964N89179K595341L818293K699236
$$ -1052662 211417 743533 -81458 -1402884 -2217848 -1628669 966672 4784965 7484201
4243G484201m88106l630747m679998l062246j7488J911354J043824r80428n36556
$$ 7484201 6996095 3365348 -1314650 -4376896 -4394384 -2483030 -1439206 -2419634 -2956190
4234b956190L064083N832005L961675j166607m808834m448445j634259P37689
$$ -2956190 107893 5939898 9901573 8734966 3926132 -522313 -2156572 -1418883
4226a418883J065350k98594j416507m69220J759142K251108j82854k805244k622815
$$ -1418883 -353533 -652127 -2068634 -2537854 -778712 1472396 1289542 -1515702 -4138517
4217d138517n78729J48639j119402k023404r30568R93906J682653O74868o04861
$$ -4138517 -4717246 -4568607 -5688009 -7711413 -8641981 -7648075 -5965422 -5290554 -5895415
4208e895415n06423Q54064J405088k21928k286242k020029J10890Q88387n47361
$$ -5895415 -6401838 -5547774 -4142686 -4364614 -6650856 -8670885 -8559995 -7671608 -8218969
4199h218969j227488Q35324L539575M195495L222152K254696J271477q6465q00423
$$ -8218969 -9446457 -8611133 -5071558 -876063 2346089 4600785 5872262 5785797 4985374
4190D985374m08249l59983j302942j475790L0782J095834L2577j463977j325754
$$ 4985374 4577125 4217142 2914200 1438410 1469192 2565026 2597603 1133626 -192128
4181a92128l90145k12338l86586m26717j248040k426683j523444J350798K354769
$$ -192128 -582273 -794611 -1181197 -1607914 -2855954 -5282637 -6806081 -5455283 -3100514
4172c100514J17557j475752J5322J256291m70456k073673p11568O47677p03222
$$ -3100514 -2982957 -4458709 -4443387 -3187096 -3657552 -5731225 -6442793 -5795116 -6498338
4163f498338j484182R23841K334038n59856k965815o74472J215961k120112m801518
$$ -6498338 -7982520 -7058679 -4724641 -5284497 -8250312 -8924784 -7708823 -9828935 -14630453
4154a4630453j101306J711281l952812r225527l704348O85850j3887960l3848153
$$ -14630453 -15731759 -14020478 -17973290 -27198817 -30903165 -30217315 -44105275 -77953428
4146g7953428k4175719J7732389M8978848L7505347M867435q687486N45323O614584
$$ -77953428 -102129147 -84396758 -35417910 2087437 6954872 -1732614 -1187291 5427293
4138E427293K14408l489931K312107N400173p43348n906922k897789J045435n36590
$$ 5427293 5641701 2151770 4463877 9864050 9120702 3213780 315991 1361426 824836
4129H24836k666110n01509J866524R11362L53617K277215K263373r37595j288719
$$ 824836 -1841274 -2342783 -476259 435103 788720 3065935 5329308 4391713 3102994
4120C102994L133301M806151o27891n978056m005891J290714K646475J104166
$$ 3102994 6236295 11042446 10414555 4436499 430608 1721322 4367797 5471963
4112E471963J342237J948379r10790m950360n213304k509699j060287q58388P49512
$$ 5471963 6814200 8762579 7851789 2901429 -2311875 -4821574 -5881861 -6740249 -5990737
4103e990737K736675K351083J032064K072402M409042M602444K944676J863510
$$ -5990737 -3254062 -902979 129085 2201487 6610529 11212973 14157649 16021159
4095A6021159M57172l240371o482882m949056n30765P21051j913657l020994j70818
$$ 16021159 16478331 13237960 6755078 1806022 1275257 1996308 82651 -2938343 -3109161
4086c109161K674049K308590Q70218R37095J170350j51876j289045k7091K273972
$$ -3109161 -435112 1873478 2743696 3680791 4851141 4699265 3410220 3383129 5657101
4077E657101K605721M34523k370408m146327m164223k343532J7428O44358r36613
$$ 5657101 8262822 8697345 6326937 2180610 -1983613 -4327145 -4309717 -3665359 -4601972
4068d601972k279820j183660J306454K697461K637991K689098L251736K985230
$$ -4601972 -6881792 -8065452 -6758998 -4061537 -1423546 1265552 4517288 7502518
4060G502518J329807m14587j110818j193748j140882j33504K132938L442754J236716
$$ 7502518 8832325 8417738 7306920 6113172 4972290 4838786 6971724 10414478 11651194
4051A1651194l308921n868643m406233j665625q23451j095630j10322J454969
$$ 11651194 8342273 2473630 -1932603 -3598228 -4421679 -5517309 -5627631 -4172662
4043d172662J184649k27930L64386K928449L542145O08783k161255j223954J649764
$$ -4172662 -2988013 -3215943 -2851557 76892 3619037 4227820 2066565 842611 2492375
4034B492375K549409J142426r870K3803J13697O7581P77647J811094J750640Q00127
$$ 2492375 5041784 6184210 6174340 6198143 6311840 6379421 7157068 8968162 10718802 11518929
4024A1518929M57219O27577l82869k752573m446951m207195l109903k429469j889323
$$ 11518929 11976148 12603725 12220856 9468283 5021332 814137 -2295766 -4725235 -6614558
4015f614558r53721j28252J58120N61248J523995K174429J810657J394985J942112
$$ -6614558 -7568279 -7696531 -7538411 -6977163 -5453168 -3278739 -1468082 -73097 1869015
4006A869015K224544K21733l205150m492432k209307M90730K26752j543999q12803
$$ 1869015 4093559 4315292 1110142 -3382290 -5591597 -5100867 -4874115 -6418114 -7230917
3997g230917K493808M199729K573108J073658K304538L307378O11492l281581
$$ -7230917 -4737109 -537380 2035728 3109386 5413924 8721302 9332794 6051213
3989F051213l411786l37545R76221o37867j452050j89681j31105k246767k492138
$$ 6051213 2639427 2301882 3278103 2640236 1188186 998505 867400 -1379367 -3871505
3980c871505R68707L512110J233059k433592k260544N09407J056786p62782j152139
$$ -3871505 -2902798 609312 1842371 -591221 -2851765 -2342358 -1285572 -2048354 -3200493
3971c200493K78417N0045k557136l963848k064503J042154K996488L884983M053457
$$ -3200493 -2922076 -2872031 -5429167 -9393015 -11457518 -10415364 -7418876 -3533893 519564
3962E19564K851443P62304k61206K95572Q29248N32378L66308N43920j88872j947620
$$ 519564 3371007 4133311 3872105 4167677 4996925 5529303 5895611 6439531 6250659 4303039
3952D303039k979644k432955j513148j105397n40227M96190J024403N45005j66061
$$ 4303039 1323395 -1109560 -2622708 -3728105 -4268332 -3772142 -2747739 -2202734 -2368795
3943b368795n33620o15375k5637J396506K063462N05342j407354m11903K760682
$$ -2368795 -2902415 -3517790 -3543427 -2146921 -83459 421883 -985471 -1397374 1363308
3934A363308L684216P63940k389451k566218j147077o50214o76851N5592P04097
$$ 1363308 5047524 5811464 3422013 855795 -291282 -941496 -1618347 -1562755 -858658
3925h58658K50271q7562P05780R49208p35525k147195o83921J955493J997502
$$ -858658 -608387 -695949 9831 959039 223514 -1923681 -2607602 -652109 1345393
3916A345393n66612k136807j050392O57314J161633J091524J116965L23405j639340
$$ 1345393 778781 -1358026 -2408418 -1751104 -589471 502053 1619018 1942423 303083
3907C03083l069967k476956p70221L38783R80215K458108M456606M798139K547204
$$ 303083 -2766884 -5243840 -6014061 -5675278 -4695063 -2236955 2219651 7017790 9564994
3898I564994q9199l95962R95942R33193j364541k793763j256576N58784p31000
$$ 9564994 9475795 9079833 10075775 11008968 9644427 6850664 5594088 6152872 5421872
3889E421872l349987k856304L75541J214594k100098n085540m142223j558318
$$ 5421872 2071885 -784419 -408878 805716 -1294382 -6379922 -10522145 -12080463
3881a2080463m14517P95467M208194P121237N671165J436335r02504p49809j112099
$$ -12080463 -12494980 -11699513 -7491319 -370082 5301083 6737418 5834914 5085105 3973006
3872C973006k156877j063923J790889K302694o01325k835774j620153M48932J16275
$$ 3973006 1816129 752206 2543095 4845789 4244464 1408690 -211463 237469 353744
3863C53744j589526j819602k58498J659104L409285M698453M199016J468516j449148
$$ 353744 -1235782 -3055384 -3313882 -1654778 1754507 6452960 10651976 12120492 10671344
3854A0671344k485470k187144k098796k166147j699059j258043j365206p88964
$$ 10671344 8185874 5998730 3899934 1733787 34728 -1223315 -2588521 -3377485
3846c377485J457644L539394K823755j19711k037689j345957K87303Q41444L48000
$$ -3377485 -1919841 1619553 4443308 4323597 2285908 939951 1227254 2068698 2416698
3837B416698j76543n49774j211598k019754k069062o45280J750659L409333K960072
$$ 2416698 2240155 1690381 478783 -1540971 -3610033 -4255313 -2504654 904679 3864751
3828C864751J088192p8019L31198Q62525N4894j340655j606506o05188K95097
$$ 3864751 4952943 4874924 5206122 6068647 6123541 4782886 3176380 2571192 2866289
3819B866289K58414l63377r50150r47158K07565K091589K677134L74018l350047
$$ 2866289 3124703 2761326 1811176 864018 1071583 3163172 5840306 6214324 2864277
3810B864277n039215l271327k32485J136693K55402j420505k543308k644086j590685
$$ 2864277 -2174938 -5446265 -5678750 -4542057 -4286655 -5707160 -8250468 -10894554 -12485239
3801a2485239M02172K268670K626115J315191n4578K24615J733899K168645L60894
$$ -12485239 -12083067 -9814397 -7188282 -5873091 -5927669 -5703054 -3969155 -1800510 -1439616
3792a439616j765555j600258K24290L87083k136072l966023j834757K668399N234523
$$ -1439616 -3205171 -4805429 -4581139 -4194056 -6330128 -10296151 -12130908 -9462509 -4227986
3783d227986M495545K785053J861892R89049m91604j734747k473457l718809n017012
$$ -4227986 267559 3052612 4914504 5903553 5411949 3677202 1203745 -2515064 -7532076
3774g532076l766862O39459M380041L676533P3290j768537n11393R04836M27707
$$ -7532076 -11298938 -10659479 -6279438 -2602905 -2529615 -4298152 -4809545 -3904709 -3477002
3765c477002m60426l540R53287Q69296N6561l65493l78381k56306O95384K710693
$$ -3477002 -3937428 -3940968 -2987681 -2118385 -2061824 -2427317 -2805698 -3062004 -2366620 344073
3755C44073L952778K409914j089729l640170l815921k720252j612172m82952N91062
$$ 344073 4296851 6706765 5617036 1976866 -1839055 -4559307 -6171479 -6654431 -6063369
3746f063369O60982l75510p09808J146174L761551M026644J006557k699945l837985
$$ -6063369 -5402387 -5777897 -6487705 -5341531 -1579980 2446664 3453221 753276 -3084709
3737c084709j858324J067274K598046J975301k35635k855324m312692l399725
$$ -3084709 -4943033 -3875759 -1277713 697588 461953 -2393371 -6706063 -10105788
3729a0105788p30550J319862J261825N11251J350476L289288L492671J101815
$$ -10105788 -10836338 -9516476 -8254651 -7743400 -6392924 -3103636 389035 1490850
3721A490850j210795j149652j7834q4989o93443K03804J893376J735653j32665
$$ 1490850 280055 -869597 -887431 -972420 -1665863 -1462059 431317 2166970 2034305
3712B034305n87739J253504K168282j7947k492541j391244K413805M528071K961096
$$ 2034305 1446566 2700070 4868352 4850405 2357864 966620 3380425 7908496 10869592
3703A0869592o5629j825673j919392j255172n63341n69592j847547l666334m208036
$$ 10869592 10803963 8978290 7058898 5803726 5240385 4670793 2823246 -843088 -5051124
3694e051124k632657r7030J661137J980561J322551N10772K14836N62257J091360
$$ -5051124 -7683781 -7780811 -6119674 -4139113 -2816562 -2305790 -2090954 -1528697 -437337
3685d37337J462518J910924K427344K139151N65349j103296j408152r30013j498386
$$ -437337 1025181 2936105 5363449 7502600 8067949 6964653 5556501 4626488 3128102
3676C128102l157460l788531k159090L88557J954634K177702J472860k08421k523539
$$ 3128102 -29358 -3817889 -5976979 -5588422 -3633788 -1456086 16774 -191647 -2715186
3667b715186l829428k739635j42430J594506J284733r2484r28248p31227k15758
$$ -2715186 -6544614 -9284249 -9426679 -7832173 -6547440 -6639924 -7568172 -8299399 -8515157
3658h515157j5821L95046K036025M365186M823357J842861k173132k995221m2514
$$ -8515157 -8530978 -8135932 -6099907 -1734721 3088636 4931497 2758365 -236856 -279370
3649b79370K548341J426622j581014k446407n18697J412672J599803J009983O36906
$$ -279370 2268971 3695593 2114579 -331828 -850525 562147 2161950 3171933 3808839
3640C808839q3731j431452k228001j723410j014881j234533j535047l63326J981051
$$ 3808839 3725108 2293656 65655 -1657755 -2672636 -3907169 -5442216 -5805542 -3824491
3631c824491L515298L060480J372436j86979j081020j495917j619169j449737
$$ -3824491 -309193 2751287 4123723 3936744 2855724 1359807 -259362 -1709099
3623a709099r69618k67042L46571M58751J96597N35981K149785L832670L162260
$$ -1709099 -2678717 -2945759 -2599188 -2140437 -1943840 -1407859 741926 4574596 7736856
3614G736856m75984m323906m945091k211583O99213J325994M49979M8331L05885
$$ 7736856 7260872 2936966 -2008125 -4219708 -3520495 -2194501 -1744522 -1696191 -1390306
3605a390306J13548l97675K32869K225238L497704K046532j337038l594447k624158
$$ -1390306 -1276758 -1674433 -1441564 783674 4281378 6327910 4990872 1396425 -1227733
3596a227733M42808K459973J765392j229j90664J182358J496823m79680k485843
$$ -1227733 -784925 1675048 3440440 3439211 3248547 4430905 5927728 5448048 2962205
3587B962205j922962L89674J503320M31407j134390j651890j101858K10343J952476
$$ 2962205 1039243 1428917 2932237 3363644 2229254 577364 -524494 -314151 1638325
3578A638325K786747J384674j169329k145786q83680L88883Q0863o61189l17835
$$ 1638325 4425072 5809746 4640417 2494631 1610951 1999834 2080697 1419508 1101673
3569A101673P07327J328398J348853O73407j015581k658216k183331J35418J193184
$$ 1101673 1809000 3137398 4486251 5159658 4144077 1485861 -697470 -562052 631132
3560F31132k90826j331493O63600L438779L348708J120186K90159J295191J329803
$$ 631132 340306 -991187 -327587 3111192 6459900 7580086 7870245 9165436 10495239
3551A0495239m25494j653528j296474j196250k325132k738930p99553K107025
$$ 10495239 10069745 8416217 7119743 5923493 3598361 859431 59878 2166903
3543B166903L524860K691925L88358k104571l165161j927245Q8057M03438q68919
$$ 2166903 5691763 8383688 8772046 6667475 3502314 1575069 1663126 2066564 1197645
3534A197645j211553P4992P04647m51549j156014L21491J932003J098140r62828
$$ 1197645 -13908 61084 765731 314182 -841832 -520341 1411662 2509802 1546974
3525A546974j250152J56871N65181o25777j016880N84166J902875M83944k562709
$$ 1546974 296822 453693 1018874 393097 -623783 -39617 1863258 2347202 -215507
3516b15507l791283j779584J194032K187979J398261J687673M164710N879846
$$ -215507 -4006790 -5786374 -4592342 -2404363 -1006102 681571 4846281 10726127
3508A0726127L572590j311992l932645k391388O3677P7324j407954j612973l43844
$$ 10726127 14298717 12986725 9054080 6662692 6726369 6803693 5395739 3782766 3438922
3499C438922O23522R09518J444759J949091J252378k38090q75981n09080o55938
$$ 3438922 4062444 4971962 6416721 8365812 9618190 9380100 8504119 7995039 7339101
3490G339101j895405l124388l546114l453530k863846j329419N51534J291831
$$ 7339101 5443696 2319308 -1226806 -4680336 -7544182 -8873601 -8322067 -7030236
3482g030236O47110n2277j5931K80880P05127J726584K580786J502083j185227
$$ -7030236 -6383126 -6435403 -6451334 -6170454 -5465327 -3738743 -1157957 344126 -841101
3473h41101k496512q45829J361053J135605p96117j409978J19202J835093K269137
$$ -841101 -3337613 -4183442 -2822389 -1686784 -2482901 -3892879 -3773677 -1938584 330553
3464C30553J892567J554166J624521K477139L665019K987196q93369m934803m259977
$$ 330553 2223120 3777286 5401807 7878946 11543965 14531161 13637792 8702989 4443012
3455D443012P83010L745763N27235m614566m993602r24603J400962o39637l011731
$$ 4443012 5226022 8971785 9499020 4884454 -109148 -1033751 367211 -272426 -3284157
3446c284157k085269J88648N09931l51255K41614J890741K265309J550460J998319
$$ -3284157 -5369426 -5180778 -4670847 -5022102 -4780488 -2889747 -624438 926022 2924341
3437B924341L594451L695211J251269j535381k425795j720182j011085j287739
$$ 2924341 6518792 10214003 11465272 9929891 7504096 5783914 4772829 3485090
3429C485090k681638m265479l982349r06063K337884K043419j203265k630041
$$ 3485090 803452 -3462027 -7444376 -8350439 -6012555 -3969136 -5172401 -7802442
3421g802442Q5066L445655L473162J457704J218080K691406K247275j083091l540024
$$ -7802442 -7717376 -4271721 -798559 659145 1877225 4568631 6815906 5732815 2192791
3412B192791j869600K059348L629165J157215k393841l112205n16118K120880
$$ 2192791 323191 2382539 6011704 7168919 4775078 1662873 1146755 3267635
3404C267635J599497j555097l807848k769316L10297K391308J920021k71285k329057
$$ 3267635 4867132 3312035 -495813 -3265129 -2954832 -563524 1356497 1085212 -1243845
3395a243845k874678j885203p40300p47530j303062n47907J798267L681557L469317
$$ -1243845 -4118523 -6003726 -6744026 -7491556 -8794618 -9342525 -7544258 -3862701 -393384
3386c93384J941641O32114j74051o21121k55604N87511J20713k158360l651764
$$ -393384 1548257 2180371 2006320 1385199 1129595 1717106 1837819 -320541 -3972305
3377c972305j999510J068431J973898M62293n15510L05681R62942l8721j478579
$$ -3972305 -5971815 -4903384 -2929486 -2467193 -2982703 -2677022 -1714080 -1752801 -3231380
3368c231380j801769j278799o52545K99086J611203K264491J748904J126241J336455
$$ -3231380 -5033149 -6311948 -6964493 -6665407 -5054204 -2789713 -1040809 85432 1421887
3359A421887J603839P44176p95813j391034l48558J230259J564974p4576k484317
$$ 1421887 3025726 3769902 2974089 1583055 1234497 2464756 4029730 3955154 1470837
3350A470837l450129k046047K13358J139932L92478o05087p71074k95723J27511
$$ 1470837 -1979292 -4025339 -3811981 -2672049 -2279571 -2884658 -3655732 -3951455 -3823944
3341c823944j41913j438125k902829k569942J13565K613429K143060l93575j587797
$$ -3823944 -3965857 -5403982 -8306811 -10876753 -10763188 -8149759 -6006699 -6400274 -7988071
3332g988071l16447J259706J515315J311569J502106J296324L22345r9392P53054
$$ -7988071 -8304518 -7044812 -5529497 -4217928 -2715822 -1419498 -1097153 -1196545 -443491
3323d43491J425185N46726r79323j536148j121784p03925m71618o6446M11250
$$ -443491 981694 1528420 549097 -987051 -2108835 -2812760 -3284378 -3350824 -2939574
3314b939574P05952Q93607R12066N78515L75290Q57419J135756j38268j964716
$$ -2939574 -2233622 -1340015 -427949 150566 525856 1383275 2519031 2380763 416047
3305D16047j594846J220152L148222J839022q28068j764788p11894O94831J814009
$$ 416047 -1178799 41353 3189575 5028597 4200529 2435741 1723847 2418678 4232687
3296D232687K681761K489785P27322j355182k356482k554238k516097j620134
$$ 4232687 6914448 9404233 10131555 8776373 6419891 3865653 1349556 -270578
3288b70578J53808R33925k05341j065286K89735J860500P12917j875224k051287
$$ -270578 -116770 817155 611814 -453472 -163737 1696763 2409680 534456 -1516831
3279a516831N99299K482882J355619j190527k790846k703832q88392K211456M485377
$$ -1516831 -917532 1565350 2920969 1730442 -1060404 -3764236 -4652628 -2441172 2044205
3270B044205L694591P90651j001548q08278q64785k182418k858687j831464r18447
$$ 2044205 5738796 6529447 5527899 4719621 3854836 1672418 -1186269 -3017733 -3936180
3261c936180j325929j235926P78500K600414J696046n36945o52288J667731L274882
$$ -3936180 -5262109 -6498035 -5719535 -3119121 -1423075 -1960020 -2612308 -944577 2330305
3252B330305K108147m47175k009922k033559j577391j546739j840727j689702
$$ 2330305 4438452 3991277 1981355 -52204 -1629595 -3176334 -5017061 -6706763
3244f706763n55920J071125J960847J506558M19361k72685l58684j01625N72577
$$ -6706763 -7262683 -6191558 -4230711 -2724153 -2304792 -2577477 -2936161 -3037786 -2465209
3235b465209J715594K545194J928117j59283k175009k355901n23529J555231J823386
$$ -2465209 -749615 1795579 3723696 3564413 1389404 -966497 -1490026 65205 1888591
3226A888591M0436k042690k684321j719470J06141K264372L951616L572117N21369
$$ 1888591 1929027 -113663 -2797984 -4517454 -4411313 -2146941 1804675 5376792 5898161
3217E898161k881198l233607k00723K786276K576809k80865k809099l050057j388042
$$ 5898161 3016963 -216644 -417367 2368909 4945718 4664853 1855754 -1194303 -2582345
3208b582345O38391J852862K106160J970854J700475P24476j228240k936487k797431
$$ -2582345 -1943954 -91092 2015068 3985922 5686397 6410873 5182633 2246146 -551285
3199e51285j027460N10387P03510J07164n18255r77368p48422Q12581K722157
$$ -551285 -1578745 -1068358 -364848 -257684 -775939 -1753307 -2501729 -1689148 1033009
3190A033009K647771M388k763493l193486j729347l49257L57632J055351J612516
$$ 1033009 3680780 3685168 921675 -2271811 -4001158 -4350415 -3992783 -2937432 -1324916
3181a324916J167015q7830r21937r28266r33472j342557j382165n22916L72235
$$ -1324916 -157901 -245731 -1167668 -2095934 -3029406 -4371963 -5754128 -6277044 -5904809
3172e904809J68391p91105j006344N8465J041165N16269p47194n12567J772259
$$ -5904809 -5736418 -6527523 -7533867 -7475402 -6434237 -5917968 -6665162 -7177729 -5405470
3163e405470L770249K998700j27678k994657l801043k784307j140474k5482j09417
$$ -5405470 -1635221 1363479 1235801 -1758856 -5559899 -8344206 -9484680 -9510162 -9619579
3154i619579q12820m84646J401088L000589K564707J119246O45485P13960k39378
$$ -9619579 -10432399 -10917045 -9515957 -6515368 -3950661 -2831415 -2185930 -1471970 -1711348
3145a711348j140076M85585L457604L331033r08412m528462l627365n15754L86356
$$ -1711348 -2851424 -2365839 1091765 4422798 3514386 -1014076 -4641441 -5157195 -4770839
3136d770839q93692j024266Q50269K309517J937850J083601J237814K061108K282050
$$ -4770839 -5664531 -6688797 -5838528 -3529011 -1591161 -507560 730254 2791362 5073412
3127E073412J036453j492140l645794l349509q38942R40828K06568r91911o0644
$$ 5073412 6109865 4617725 971931 -2377578 -3216520 -2275692 -2069124 -3061035 -3121679
3118c121679J856562J728963m45849j877910j569974j210501j400762m76526J982708
$$ -3121679 -1265117 463846 17997 -1859913 -3429887 -4640388 -6041150 -6517676 -4534968
3109d534968L522992K253322l30975j601455j230031p90551j077565j334646o84899
$$ -4534968 -1011976 1241346 910371 -691084 -1921115 -2711666 -3789231 -5123877 -5808776
3100e808776O64893J566677J068445l39685r62869n6509Q83262J77953j320638
$$ -5808776 -5143883 -3577206 -2508761 -2848446 -3811315 -3867824 -2984562 -2806609 -4127247
3091d127247j304471N34596K183804K538986K694587L310102K881913J00928l553942
$$ -4127247 -5431718 -4897122 -2713318 -174332 2520255 5830357 8712270 8813198 5259256
3082E259256n247496m103365j765193p5659O13681Q55710Q06463O8009j275543
$$ 5259256 11760 -4091605 -5856798 -5932457 -5318776 -4463066 -3656603 -3588594 -4864137
3073d864137j980106p55097J758657L092499J845446l53826r81089m7879K20075
$$ -4864137 -6844243 -7599340 -5840683 -2748184 -902738 -1256564 -2237653 -2285532 -2065457
3064b065457j065279k015657n99459K572162M852370M349834J710839n78443o95142
$$ -2065457 -3130736 -5146393 -5745852 -3173690 1678680 6028514 7739353 7160910 6465768
3055F465768N20445O33393r90647k082379q02565J202254R71225j436607l030020
$$ 6465768 6986213 7619606 6628959 4546580 3744015 4946269 5917494 4480887 1450867
3046A450867j971450O17096K837063L791626L063692P10190j687606k021572m52769
$$ 1450867 -520583 96513 2933576 6725202 9788894 10499084 8811478 6789906 6337137
3037F337137M78885q23667l112150m173354l095591l73635K587139L830499K495210
$$ 6337137 6816022 5992355 2880205 -1293149 -4388740 -4762375 -2175236 1655263 4150473
3028D150473L17305l35115J66423l60635j752604j454727Q15908J934396L53633
$$ 4150473 4467778 4132663 4299086 3938451 2185847 731120 1547028 3481424 3835057
3019C835057j204577j78661J824722K058792Q99474J15246o42063k242969l060602
$$ 3835057 2630480 2451819 4276541 6335333 7234807 7350053 6707990 4465021 1404419
3010A404419j300571J157205J135793o75453r41642O38707J208268J98855K67799
$$ 1404419 103848 1261053 2396846 1721393 779751 1418458 2626726 2825581 3093380
3001C093380J979681K204254l14691k094716m72064J620057J53651l384470m198714
$$ 3093380 5073061 7277315 6962624 4867908 4395844 6015901 6169552 2785082 -1413632
2992a413632j493507R47311J064118P70882J141380l0390l517798n391496k191076
$$ -1413632 -2907139 -1959828 -895710 -124828 1016552 986162 -2531636 -7923132 -10114208
2983a0114208L084654M479347J410447j107975n25452J4256j897643l229075p44606
$$ -10114208 -7029554 -2550207 -1139760 -2247735 -2773187 -2758931 -4656574 -7885649 -8630255
2974h630255K905469L106838Q16596P01877K924884K869878m76404k117435O87565
$$ -8630255 -5724786 -2617948 -1801352 -1099475 1825409 4695287 4218883 2101448 2789013
2965B789013L389857J220864l218719m278393j884014l68218p31761p6218J747151
$$ 2789013 6178870 7399734 4181015 -97378 -1981392 -2349610 -3081371 -3157589 -1410438
2956a410438J030714k958432n364962k604578K175420L686542J657977l0486N39465
$$ -1410438 -379724 -3338156 -8703118 -11307696 -9132276 -5445734 -3787757 -3818243 -3278778
2947c278778J654956J600072O73512m56571j660431k128073o64414J867119K515723
$$ -3278778 -1623822 -23750 649762 193191 -1467240 -3595313 -4259727 -2392608 123115
2938A23115J42816k259590j104692K840685N225039L643768J86897j977516k275952
$$ 123115 265931 -1993659 -3098351 -257666 4967373 8611141 8798038 6820522 4544570
2929D544570j730853m45835J620091K747714J220846j401864j747579K96407R64324
$$ 4544570 2813717 2367882 3987973 6735687 7956533 6554669 4807090 5103497 6067821
2920F067821j807740n027394m849892j844901M93854R03054J072183J922047K142183
$$ 6067821 4260081 -767313 -5617205 -7462106 -6968252 -6065198 -4993015 -3070968 -928785
2911i28785P75418j053967j792764j321752m95144O3881J79837l983N134N52817
$$ -928785 -153367 -1207334 -3000098 -4321850 -4816994 -4753113 -4573276 -4577259 -4572125 -4019308
2901d019308J166616J022063J09655p07065p90023k80200M00632J032130J561346
$$ -4019308 -2852692 -1830629 -1720974 -2428039 -3218062 -3498262 -3097630 -2065500 -504154
2892e04154J913834J776103O44856j303712k514730j479741Q30249J526949l92016
$$ -504154 1409680 3185783 3830639 2526927 12197 -1467544 -637295 889654 497638
2883D97638k442225k072230l0723J309927J368895R74223J1471j840148k896495
$$ 497638 -1944587 -4016817 -4047540 -2737613 -1368718 -394495 -383024 -2223172 -5119667
2874e119667j001046K805594M867105L490173O25800j315234j994355k004783
$$ -5119667 -6120713 -3315119 1551986 5042159 5667959 4352725 2358370 353587
2866C53587j485193p11805k45005J79830J215430K008533Q17756j915062l394502
$$ 353587 -1131606 -1843411 -2088416 -1908586 -693156 1315377 2133133 218071 -3176431
2857c176431k342548q09704p97061j227249j64761J638238J748233j49377j580331
$$ -3176431 -5518979 -6328683 -7125744 -8352993 -8517754 -6879516 -5131283 -5280660 -6860991
2848f860991m95323K211468L781636K663204K54786o30725P16018J684757k32001
$$ -6860991 -7356314 -5144846 -1363210 1299994 1554780 924055 1640073 3324830 3092829
2839C092829l587392m587601k318737J73292M88990k06555j21232K1532j068051
$$ 3092829 -494563 -5082164 -7400901 -7227609 -6738619 -6945174 -7066406 -7044874 -8112925
2830h112925k254675j627744P5402L79519j096089k080597q68492J815193M178175
$$ -8112925 -10367600 -11995344 -11919942 -11540423 -12636512 -14717109 -15585601 -13770408 -9592233
2821i592233M944944L630212R14777j099548o22240J420662K088793R3987k422476
$$ -9592233 -4647289 -1017077 -102300 -1201848 -1824088 -403426 1685367 1779354 -643122
2812f43122k553239k10843J891395J531780n48787j649431k21953K370786L291043
$$ -643122 -3196361 -3407204 -1515809 15971 -532816 -2182247 -2404200 -33414 3257629
2803C257629J189514k508355n058271m739700j991695J106408K493642J901325
$$ 3257629 4447143 1938788 -3119483 -7859183 -9850878 -8744470 -6250828 -4349503
2795d349503R81907J145555J662388R49914o47390j064238L09874J562385J191322
$$ -4349503 -3367596 -2222041 -559653 390261 -257129 -1321367 -1011493 550892 1742214
2786A742214L24104O43794J564941J261046m21538j964349k605461k873893k778481
$$ 1742214 2066318 2710112 4275053 5536099 5114561 3150212 544751 -2329142 -5107623
2777e107623j394368J159510K865167J988877o80786k717558k702381j122605
$$ -5107623 -6501991 -5342481 -2477314 -488437 -1169223 -3886781 -6589162 -7711767
2769g711767R71831K971790M159485L501452J091924r98362q22889P86927J341254
$$ -7711767 -6739936 -3768146 391339 3892791 4984715 3986353 3163464 3950391 5291645
2760E291645L80010j28685N18494M01003j350822k439440j320122m14471k008600
$$ 5291645 5671655 5542970 6061464 6462467 5111645 2672205 1352083 937612 -1070988
2751a070988l466884j115477K855856K962184o92967k297681K15267K179930Q17732
$$ -1070988 -4537872 -5653349 -2797493 164691 -528276 -2825957 -2610690 -430760 386972
2742C86972J30526L167694N464558J958866m044440n400854j714635J287509J223960
$$ 386972 517498 3685192 9149750 11108616 7064176 1663322 -51313 1236196 2460156
2733B460156J093624K337650K493483O03419q12037n95765p23656j706821j084878
$$ 2460156 3553780 5891430 8384913 8988332 8176295 7580530 6856874 5150053 4065175
2724D065175J537524K593838K35618k259498j739076j52694q36939k845777k823347
$$ 4065175 5602699 8196537 8432155 6172657 4433581 4280887 3443948 598171 -2225176
2715b225176m97968J397795J427120L90007j082910k768022l271480j217558K006777
$$ -2225176 -2723144 -1325349 101771 491778 -591132 -3359154 -6630634 -7848192 -5841415
2706e841415L230801J508304q21086j309147K6592J496564J682674M25117j034993
$$ -5841415 -2610614 -1102310 -1923396 -3232543 -3205951 -1709387 -26713 398404 -636589
2697f36589j027152M48776J185886l10088k151541j354647J616800L116889J440236
$$ -636589 -1663741 -1214965 -29079 -339167 -2490708 -3845355 -2228555 888334 2328570
2688B328570r64600j501693j108123j891022l059919k114169P25547K360399J396939
$$ 2328570 1363970 -137723 -1245846 -3136868 -6196787 -8310956 -7585409 -5225010 -3828071
2679c828071J00186O36803J753434J104624p75639j200602O82616K812751K958059
$$ -3828071 -3727885 -3091082 -1337648 -233024 -1008663 -2209265 -1526649 1286102 4244161
2670D244161P82803k580617n180915m739471p69120L593864M225719J083897j634433
$$ 4244161 5026964 2446347 -2734568 -7474039 -8243159 -4649295 -423576 660321 -974112
2661i74112j135455P04236R06339m63575j648306k321519k939562k855541j612595
$$ -974112 -2109567 -1405331 -498992 -962567 -2610873 -4932392 -7871954 -10727495 -12340090
2652a2340090n14086l77532N57315L526192N742987L738723q32794k883282j178010
$$ -12340090 -12854176 -13231708 -12674393 -9148201 -3405214 333509 -499285 -3382567 -4560577
2643d560577L36501q87958k345745j081278J701354L102778K942013K975161L401880
$$ -4560577 -4224076 -5112034 -7457779 -8539057 -6837703 -3734925 -792912 2182249 5584129
2634E584129K841709J080819l75078n33452k84214j124388l033578m080895k593454
$$ 5584129 8425838 9506657 9131579 8598127 8313913 7189525 4155947 75052 -2518402
2625b518402L37735J705075N51904n88974L22612J384137j04864k659999k367503
$$ -2518402 -2180667 -475592 76312 -512662 -190050 1194087 1089223 -1570776 -3938279
2616c938279J040281L686302L219271J313751P6464m07730k65128P89278J456077
$$ -3938279 -2897998 788304 4007575 5321326 5397790 4990060 4724932 5514210 6970287
2607F970287k653j799378j43624L962005M406045j097312o652405o296292k084109
$$ 6970287 6967634 5168256 5024632 8986637 13392682 12295370 5642965 -653327 -2737436
2598b737436K30216k67287n52186j43824r51014k229972j263638J405590K318089
$$ -2737436 -2507220 -2774507 -3326693 -3470517 -4421531 -6651503 -7915141 -6509551 -4191462
2589d191462O69732p65577m01047N03623J167647K325600L424233K555478M4876
$$ -4191462 -3521730 -4287307 -4688354 -4184731 -3017084 -691484 2732749 5288227 5333103
2580E333103j300761m88901K90675l87643j008574k66766M62825l95858j844406
$$ 5333103 4032342 3543441 3834116 3446473 2437899 2171133 2633958 2238100 393694
2571C93694j841555j87261J503103J695665O4365k221157l030642j409015P05705
$$ 393694 -1447861 -1635122 -132019 1563646 1628011 -593146 -3623788 -5032803 -4327098
2562d327098M80617j982785l604445k360705M65711K432342K548212J324377q1361
$$ -4327098 -3846481 -5829266 -9433711 -11794416 -11328705 -8896363 -6348151 -5023774 -5105135
2553e105135l58991P59302J631521O76922q99088m72189J862909L034773J419406
$$ -5105135 -5464126 -4704824 -3073303 -2396381 -3295469 -3767658 -1904749 1130024 2549430
2544B549430r86879j775767j168443n46698K1648J161880K460199K802800J705705
$$ 2549430 1562551 -213216 -1381659 -1928357 -1906709 -744829 1715370 4518170 6223875
2535F223875l81228k268566k424579n20569J416988J125104o02987q40695J096417
$$ 6223875 5842647 3574081 1149502 628933 2045921 3171025 2568038 1727343 2823760
2526B823760K673820K057519L50249r99059k276125l618991l676046j933365j45441
$$ 2823760 5497580 7555099 7905348 6906289 4630164 1011173 -2664873 -4598238 -4743679
2517d743679L61982O82506J777730K184442N42028j559454j757803l54690Q23921
$$ -4743679 -4381697 -3699191 -1921461 262981 805009 -754445 -2512248 -2866938 -2043017
2508b043017J401337J714984P44836k096145m260118k640001J525898L666371
$$ -2043017 -641680 1073304 1818140 -278005 -4538123 -7178124 -5652226 -1985855
2500a985855J962528o88055j331781n57789k59651m19791M3036R06605J015204
$$ -1985855 -23327 -711382 -2043163 -2600952 -2860603 -3280394 -3237358 -2330753 -1315549
2491a315549K09986n62753p11599n62022o03805p99991o43791K66124J619472
$$ -1315549 -1105563 -1668316 -2379915 -2941937 -3545742 -4345733 -4989524 -4723400 -3103928
2482c103928K536042K598179K324058K062411J072775j169654l227824k915249
$$ -3103928 -567886 2030293 4354351 6416762 7489537 6319883 3092059 176810
2474A76810m14571J513701J143799J8954L42788J541265J434057J53850L01022
$$ 176810 -237761 1275940 2419739 2438693 2781481 4322746 5756803 5910653 6211675
2465F211675K595541L845140J129614l600948n700383l974627j753561j530651
$$ 6211675 8807216 12652356 13781970 10181022 4480639 506012 -1247549 -2778200
2457b778200j694453j45826J686520J198844q35403j251119P52595K808739L019926
$$ -2778200 -4472653 -4618479 -2931959 -1733115 -2568518 -3819637 -3067042 -258303 2761623
2448B761623J638126o74261l334150m530232k548142J056643K614281J383133
$$ 2761623 4399749 3725488 391338 -4138894 -6687036 -5630393 -3016112 -1632979
2440a632979L64969J236916J964686R74761Q9095R30934J639970J47584j901982
$$ -1632979 -1268010 -31094 1933592 2908353 2997448 3928382 5568352 5715936 3813954
2431C813954j719168K14524J439965J400904R30767k97148k426132l224066r75714
$$ 3813954 2094786 2309310 3749275 5150179 6080946 5783798 3357666 133600 -842114
2422h42114J808705J575203m77467k03735K439187L000920l08376l718138l547779
$$ -842114 966591 2541794 2064327 1860592 4299779 7300699 6992323 3274185 -273594
2413b73594q10674J520722K384342J926133J06494j901863j691103Q18361K223002
$$ -273594 -1084268 436454 2820796 4746929 4853423 2951560 1260457 2078818 4301820
2404D301820K68743k593491k692947k52304J609863J539267Q54168N67450J05090
$$ 4301820 4570563 1977072 -715875 -968179 641684 2180951 3035119 3602569 3707659
2395C707659r75708j860036j453280L39887K240780K263010l45286l459747l820649
$$ 3707659 2731951 871915 -581365 -241478 1999302 4262312 3917026 457279 -3363370
2386c363370j182491R53901p653k089368j544020J971263N125422N105731K198103
$$ -3363370 -4545861 -3591960 -3599613 -5688981 -7233001 -5261738 -136316 4969415 7167518
2377G167518j316041l116493k136329M03993J544552k67179k895081k969828k62555
$$ 7167518 5851477 2734984 598655 1002648 2547200 2280021 -615060 -3584888 -3847443
2368c847443K264743K650568J976562J684031J049916j122427l663597l943182
$$ -3847443 -1582700 1067868 3044430 4728461 5778377 4655950 992353 -2950829
2360b950829j502372R28163Q11328q82252j105539Q66510K336554J281349l22131
$$ -2950829 -4453201 -3525038 -2713710 -3595962 -4701501 -3834991 -1498437 -217088 -539219
2351e39219O05682L105444K971235j079779n114614n176075k087988Q50430K547341
$$ -539219 66463 3171907 6143142 5063363 -51251 -5227326 -7315314 -6464884 -3917543
2342c917543L828277M319698K941804P60332K09819J529040K591338K248861J295304
$$ -3917543 -89266 4230432 7172236 7932568 8142387 9671427 12262765 14511626 15806930
2333A5806930J27225j762167l636871l712329k184855j354004j931277k081849
$$ 15806930 15934155 14171988 10535117 6822788 4637933 3283929 1352652 -729197
2325g29197j115670q59398j749769j114857K038578L927906J405083k276830j723269
$$ -729197 -1844867 -2704265 -4454034 -5568891 -3530313 397593 1802676 -474154 -2197423
2316b197423K340329M263320K221577J27174K14756l56164l172353m303985m46758
$$ -2197423 142906 4406226 6627803 6754977 6969733 6613569 3441216 -862769 -1309527
2307a309527M684173N043478R05959k204703j910163j171961k233086l319699
$$ -1309527 3374646 8418124 9324083 7119380 5209217 4037256 1804170 -1515529
2299a515529k536122r49434j1595Q68096K284357L052312K363854J438780J253947
$$ -1515529 -4051651 -5001085 -5012680 -4144584 -1860227 1192085 3555939 4994719 6248666
2290F248666Q45827l58961r02253p8210P1656j847700l494317k289462l0659j69577
$$ 6248666 7094493 6735532 5833279 5755069 5826725 3979025 484708 -1804754 -1835413 -2004990
2280b004990j890259j379089J461929K443741M3407j793866Q2601K966331K593674
$$ -2004990 -3895249 -5274338 -3812409 -1368668 -1325261 -3119127 -3036526 -70195 2523479
2271B523479m00274j955547q66498P8017j161665l112169l269915j169977J730537
$$ 2523479 2123205 167658 -698840 -620823 -1782488 -4894657 -8164572 -9334549 -7604012
2262g604012L729788L764839J761574j025699k508867j378706J510208L497414
$$ -7604012 -3874224 -109385 1652189 626490 -1882377 -3261083 -1750875 1746539
2254A746539K353276j328716m273653l815012p88764J827014K724341L030045
$$ 1746539 4099815 2771099 -1502554 -5317566 -6106330 -4279316 -1554975 1475070
2246A475070L341020K402096j97812k163672j233390J504141K903250J577067
$$ 1475070 4816090 7218186 7020374 4856702 3623312 5127453 8030703 9607770
2238I607770j176553l478416m246781l125446p69824J101438J350683P24717L25388
$$ 9607770 8431217 4952801 706020 -2419426 -3189250 -2087812 -737129 -12412 312976
$$ [...]
##END NTUPLES=NMR SPECTRUM
##END=
