##TITLE=31Pdec_DE-87_ch_6
 CDCl3, 64 sc
 23.4.2025
##JCAMPDX= 6.0         $$ Bruker NMR JCAMP-DX V2.0
##DATA TYPE= NMR SPECTRUM
##DATA CLASS= NTUPLES
##ORIGIN= UXNMR, Bruker Analytische Messtechnik GmbH
##OWNER= root
$$ XWIN-NMR		Version 3.5
$$ Wed Apr 23 14:31:02 2025 Russian Standard Time (UT+4h)  she@DPX200
##.OBSERVE FREQUENCY= 81.013821
##.OBSERVE NUCLEUS= ^31P
##.ACQUISITION MODE= SIMULTANEOUS
##.ACQUISITION SCHEME= undefined
##.AVERAGES= 64
##.DIGITISER RES= 17
##SPECTROMETER/DATA SYSTEM= spect
##.PULSE SEQUENCE= zgpg30
##.SOLVENT NAME= CDCl3
##.SHIFT REFERENCE= (INTERNAL, CDCl3, 0, 198.062)
##AUDIT TRAIL= $$ (NUMBER, WHEN, WHO, WHERE, WHAT)
$$ ##TITLE= Audit trail, XWIN-NMR		Version 3.5
$$ ##JCAMPDX= 5.01
$$ ##ORIGIN= Bruker BioSpin GmbH
$$ ##OWNER= she
$$ F:/spectra/data/she/nmr/P31/2/pdata/1/auditp.txt
$$ ##AUDIT TRAIL=  $$ (NUMBER, WHEN, WHO, WHERE, WHAT)
(   1,<2025-04-23 14:29:39.90 +0400>,<she>,<DPX200>,
      <created by zg, POWCHK disabled, PULCHK disabled
       configuration hash MD5:
       00 E9 B6 7A A2 85 ED C7 34 08 36 98 17 FE 4E 26
       data hash MD5: 32K
       2A F6 4A A7 7B A8 00 F2 5A 26 C1 58 1C 63 BB 23>)
(   2,<2025-04-23 14:29:42.26 +0400>,<she>,<DPX200>,
      <Start of raw data processing
       efp BC_mod = 2 LB = 1.5 FT_mod = 6 PKNL = 1 PHC0 = 1566.447 PHC1 = -342.7069 SI = 64K 
       data hash MD5: 64K
       8C FB 0A 6E 38 E1 94 C7 03 49 E3 2D 71 11 91 29>)
(   3,<2025-04-23 14:30:01.18 +0400>,<she>,<DPX200>,
      <pk PHC0 = -0.0794334 PHC1 = 0 
       data hash MD5: 64K
       80 07 9B 2C 98 C4 1F E5 86 38 E2 66 77 B6 44 9E>)
(   4,<2025-04-23 14:30:05.04 +0400>,<she>,<DPX200>,
      <abs ABSG = 5 
       data hash MD5: 64K
       0C C4 C3 47 1F AB 2A 3E B3 FD A7 8F AC 08 50 9C>)
(   5,<2025-04-23 14:30:27.95 +0400>,<she>,<DPX200>,
      <pk PHC0 = -9.725368 PHC1 = 0 
       data hash MD5: 64K
       0B A3 8C 7C F7 AC 02 E6 B3 DA 53 63 F6 79 CE 01>)
(   6,<2025-04-23 14:30:32.93 +0400>,<she>,<DPX200>,
      <abs ABSG = 5 
       data hash MD5: 64K
       D2 73 BD 27 D3 EF F7 D0 48 B7 7D 7B 40 D9 EE BD>)
$$ ##END=
$$ 
$$ hash MD5
$$ A7 21 64 EA 2A 40 24 62 F5 50 A3 D4 69 18 D4 18
##$RELAX= 
##$RELAX= 
##$RELAX= 
##$RELAX= 
##$RELAX= 
##$RELAX= 
##$RELAX= 
##$RELAX= 
$$ Bruker specific parameters
$$ --------------------------
##$DU= <F:/spectra>
##$EXPNO= 2
##$NAME= <P31>
##$PROCNO= 1
##$TYPE= <nmr>
##$USER= <she>
##$AMP= (0..31)
100 100 100 100 100 100 100 100 100 100 100 100 100 100 100 100 100 100 
100 100 100 100 100 100 100 100 100 100 100 100 100 100 
##$AQSEQ= 0
##$AQ_mod= 1
##$AUNM= <au_zg>
##$AUTOPOS= <>
##$BF1= 81.014009
##$BF2= 200.13
##$BF3= 200.13
##$BF4= 200.13
##$BF5= 200.13
##$BF6= 200.13
##$BF7= 200.13
##$BF8= 200.13
##$BYTORDA= 1
##$CFDGTYP= 0
##$CFRGTYP= 5
##$CHEMSTR= <none>
##$CNST= (0..31)
1 1 145 1 1 1 1 1 1 1 1 1 1 1 1 1 1 1 1 1 1 1 1 1 1 1 1 1 1 1 1 1 
##$CPDPRG= <waltz16>
##$CPDPRG1= <>
##$CPDPRG2= <waltz16>
##$CPDPRG3= <>
##$CPDPRG4= <mlev>
##$CPDPRG5= <mlev>
##$CPDPRG6= <mlev>
$$ [...]
##$SUBNAM3= <"">
##$SUBNAM4= <"">
##$SUBNAM5= <"">
##$SUBNAM6= <"">
##$SUBNAM7= <"">
##$SUBNAM8= <"">
##$SUBNAM9= <"">
##$SW= 400.765351723535
##$SWIBOX= (0..15)
0 1 3 0 0 0 0 0 0 0 0 0 0 0 0 0 
##$SW_h= 32467.5324675325
##$TD= 32768
##$TD0= 1
##$TE= 0
##$TE2= 300
##$TE3= 300
##$TEG= 300
##$TL= (0..7)
0 120 53 12 22 120 120 120 
##$TP= (0..7)
150 150 150 150 150 150 150 150 
##$TP07= 0
##$TPNAME0= <>
##$TPNAME1= <>
##$TPNAME2= <>
##$TPNAME3= <>
##$TPNAME4= <>
##$TPNAME5= <>
##$TPNAME6= <>
##$TPNAME7= <>
##$TPOAL= (0..7)
0.5 0.5 0.5 0.5 0.5 0.5 0.5 0.5 
##$TPOFFS= (0..7)
0 0 0 0 0 0 0 0 
##$TUNHIN= 0
##$TUNHOUT= 0
##$TUNXOUT= 0
##$USERA1= <user>
##$USERA2= <user>
##$USERA3= <user>
##$USERA4= <user>
##$USERA5= <user>
##$V9= 5
##$VALIST= <valist>
##$VCLIST= <CCCCCCCCCCCCCCC>
##$VD= 0
##$VDLIST= <DDDDDDDDDDDDDDD>
##$VPLIST= <PPPPPPPPPPPPPPP>
##$VTLIST= <TTTTTTTTTTTTTTT>
##$WBST= 1024
##$WBSW= 4
##$XGAIN= (0..3)
0 0 0 0 
##$XL= 0
##$YL= 0
##$YMAX_a= 4685
##$YMIN_a= -27285
##$ZGOPTNS= <>
##$ZL1= 120
##$ZL2= 120
##$ZL3= 120
##$ZL4= 120
##$ABSF1= 198.0616
##$ABSF2= -202.7028
##$ABSG= 5
##$ABSL= 3
##$ALPHA= 0
##$AQORDER= 0
##$ASSFAC= 0
##$ASSFACI= 0
##$ASSFACX= 0
##$ASSWID= 0
##$AUNMP= <proc_1d>
##$AZFE= 0.1
##$AZFW= 0.5
##$BCFW= 0
##$BC_mod= 2
##$BYTORDP= 0
##$COROFFS= 0
##$CY= -3
##$DATMOD= 1
##$DC= 0
##$DFILT= <>
##$DTYPP= 0
##$F1P= 0
##$F2P= 0
##$FCOR= 1
##$FTSIZE= 65536
##$FT_mod= 6
##$GAMMA= 0
##$GB= 0
##$INTBC= 1
##$INTSCL= 9.790993e-09
##$ISEN= 30
##$LB= 1.5
##$LEV0= 0
##$LPBIN= 0
##$MAXI= 10000
##$MC2= 0
##$MEAN= 0
##$ME_mod= 0
##$MI= 50
##$NCOEF= 0
##$NC_proc= -8
##$NLEV= 6
##$NOISF1= 182.463
##$NOISF2= 159.3651
##$NSP= 0
##$NTH_PI= 0
##$NZP= 0
##$OFFSET= 198.0616
##$PC= 4
##$PHC0= 1556.643
##$PHC1= -342.7069
##$PH_mod= 1
##$PKNL= yes
##$PPARMOD= 0
##$PSCAL= 0
##$PSIGN= 0
##$REVERSE= no
##$SF= 81.0140089999434
##$SI= 65536
##$SIGF1= 159.3651
##$SIGF2= -187.1042
##$SINO= 113.3802
##$SIOLD= 16384
##$SREGLST= <1H.CDCl3>
##$SSB= 0
##$STSI= 65536
##$STSR= 0
##$SW_p= 32467.5324675325
##$SYMM= 0
##$S_DEV= 0
##$TDeff= 32768
##$TDoff= 0
##$TI= <>
##$TILT= no
##$TM1= 0
##$TM2= 0
##$TOPLEV= 0
##$USERP1= <user>
##$USERP2= <user>
##$USERP3= <user>
##$USERP4= <user>
##$USERP5= <user>
##$WDW= 1
##$XDIM= 65536
##$YMAX_p= 69096780
##$YMIN_p= -270887602
$$ End of Bruker specific parameters
$$ ---------------------------------
##NTUPLES= NMR SPECTRUM
##VAR_NAME=  FREQUENCY,     SPECTRUM/REAL,   SPECTRUM/IMAG
##SYMBOL=    X,             R,               I
##VAR_TYPE=  INDEPENDENT,   DEPENDENT,       DEPENDENT
##VAR_FORM=  AFFN,          ASDF,            ASDF
##VAR_DIM=   65536,         65536,           65536
##UNITS=     HZ,            ARBITRARY UNITS, ARBITRARY UNITS
##FACTOR=    0.49542278885378, 1,            1
##FIRST=     16045.7642231865, 0,            0
##LAST=      -16421.768244346, 0,            0
##MIN=       -16421.768244346, -270887602,   0
##MAX=       16045.7642231865, 69096780,     0
$$ Real data points
##PAGE= N=1
##DATA TABLE= (X++(R..R)), XYDATA
$$ [...]
##PAGE= N=2
##DATA TABLE= (X++(I..I)), XYDATA
7506d242358J858620J222817O85769Q64672M27717j264313k010171J03527L037439
7497F83719L335304J215619r7143N70875J326114J027198P00370P86974K17332
7488I766362r53208r24317P17485J881175J274217L83807O62748J045317J48001
7479A4001587j054159j031019p00566k048623m454786m980369k473726P41581
7471b000080J931256J054153j57464r15926j689744k363607j864799j11439J110165
7462e007485M49400p06451O4509K457825L377249J176043j907507k707243r93717
7453c797377J070998K074031K216626J931211J440915J204184J280274Q07453
7445H228315n07036j292212o03681O862j191317k682211j557417J545399K678234
$$ plain form
7506 -4242358 -2383738 -1160921 -475152 389520 817237 -447076 -2457247 -2353720 683719
7497 683719 4019023 5234642 5137499 5708374 7034488 8061686 8762056 9549030 9766362
7488 9766362 8813154 7888837 8606322 10487497 11761714 12145521 12808269 13853586 14001587
7479 14001587 12947428 11916409 11215843 9167220 4712434 -267935 -2741661 -2000080
7471 -2000080 -68824 985329 827865 -88061 -1777805 -4141412 -6006211 -6117650 -5007485
7462 -5007485 -4558085 -5264536 -5200027 -2742202 635047 1811090 -96417 -2803660 -3797377
7453 -3797377 -2726379 -652348 1564278 3495489 4936404 6140588 7420862 8228315
7445 8228315 7721279 6429067 5825386 5832248 4640931 1958720 401303 1946702 4624936
7436D624936K66909k631176k936645j547304r81743j372747j011917N49774J994901
7427c045012K167637J156153p5010m48527J73908N61855j54806o05989J000915
7418G31124L366501L294274Q81488l10K104146L325336M82973l398705l459565
7409G327262l69893J219631O3004q44141m16737j210629l866369m633574j069001
7400c800447L305934L397932m04669k906846j117089K358248L315643J166147
7392E314853j124173j340685o37573j283078k865516k546223O01112L497570K882970
7383B499257j75632j822351p00375Q49522P81317j30798l99306o9447K82735Q75324
7373A990246J719440J817569P05203m26631m14500J26662l7211p71318j004554
$$ plain form
7436 4624936 4891845 2260669 -675976 -2223280 -3205023 -4577770 -5589687 -5039913 -3045012
7427 -3045012 -877375 278778 203768 -244759 -70851 491004 336198 -269791 731124
7418 731124 4097625 7391899 8273387 8273077 10377223 13702559 14185532 10786827 7327262
7409 7327262 6957369 8177000 8240004 7395863 6979126 5768497 1902128 -2731446 -3800447
7400 -3800447 -494513 2903419 2498750 -408096 -1525185 833063 4148706 5314853
7392 5314853 4190680 2849995 2212422 929344 -1936172 -4482395 -3881283 -383713 2499257
7383 2499257 2323625 501274 -199101 650421 1431738 1300940 901634 832187 1114922 1990246
7373 1990246 3709686 5527255 6232458 5805827 5391327 5517989 5480778 4709460 3704906
7364C704906n08236j21618n54593j646264k403402j539840J138364L679785L642475
7355E391577J241057p18336o72267j50774p20144j282139l57154Q57038L39717
7346C928575j102540r84527O27349J061282o20875k054485j171311Q94188J616441
7337B194097J69364k256946l905738l467771r21693J929481K922130K072475J421875
7328A57274J958522K322527J295404j96919p61091o13413m79552J48832J757407
7319E588991K848877J459160j732820l916107l844237l046774k878367k293992
7311g815269J72093L446100M623215K507994q19412k446197j889884j084622j300908
7302d606890j287523O42636L496937M298694K085395n73324j040655l8949j974
$$ plain form
7364 3704906 3196670 3075052 2520459 874195 -1529207 -3069047 -1930683 1749102 5391577
7355 5391577 6632634 5914298 5242031 5091257 4371113 3088974 2731820 3588858 3928575
7346 3928575 2826035 1841508 2468857 3530139 2909264 854779 -316532 577656 2194097
7337 2194097 2363461 106515 -3799223 -7266994 -8188687 -6259206 -3337076 -1264601 157274
7328 157274 2115796 4438323 5733727 5536808 4775717 4162304 3682752 3831584 5588991
7319 5588991 8437868 9897028 8164208 4248101 403864 -2642910 -5521277 -7815269
7311 -7815269 -7643176 -4197076 426139 2934133 2114721 -331476 -2221360 -3305982 -4606890
7302 -4606890 -5894413 -5251777 -1754840 2543854 4629249 4055925 3015270 2976321 2974347
7293B974347j205023j779524j118938p45448j376013j490592P3312K064072K844998
7284B41191K827443L021650K556356J00613k974459l680071j782903k78344o87003
7275f55527p89337J165247K766754J082426j836991j206097L010981N189183J872722
7266A0599361l388523n414359m206575k940331j891445Q94210M117117L776476
7258A545931j92336k787231j233072J106102Q43698K95437K819197N712825L476293
7249A1586844l014015o501338l348421J610047K360793m01650j911015p74343
7241c93098K89079j94207l99970J142517K941728K852808J062398o86926j697457
7232D916872k567778l286528k752506p14935J123948J220346O64080J681233L670450
$$ plain form
7293 2974347 1769324 -10200 -1129138 -1874586 -3250599 -4741191 -4667879 -2603807 241191
7284 241191 3068634 6090284 8646640 8747253 5772794 2092723 309820 31476 -655527
7275 -655527 -1444864 -279617 2487137 3569563 1732572 526475 3537456 8726639 10599361
7266 10599361 7210838 1796479 -2410096 -5350427 -7241872 -6347662 -2230545 1545931
7258 1545931 1353595 -1433636 -2666708 -1560606 -716908 -421471 2397726 8110551 11586844
7249 11586844 8572829 2071491 -1276930 333117 2693910 2292260 381245 -393098
7241 -393098 -104019 -298226 -698196 444321 3386049 6238857 7301255 6614329 4916872
7232 4916872 2349094 -937434 -3689940 -4404875 -3280927 -2060581 -1396501 284732 3955182
7223C955182L144054j138986n282541m937677j293507Q08233l5695m15995J798262
7214c398670M037641L446977J218975j11024q48631k361364l312495j570529J297766
7205a601354J557658q55471k065050m59408Q35416n99896k214134o30846K544322
7196c488763K888228L4277j643221L32642K858291K039908j071646k389375r46280
7187a385939K24545p58223j968055j312143J08952L73388J44786R74607J932037
7178a666045J180851k09879K79254J887250J440251q64458j144373J502148K824006
7169E229005K85106k532660j885194k8716r04993l158163k857013o49497k36652
7160f738777j268886j13179K849006L281065P48377j24545K082476K771962m18135
$$ plain form
7223 3955182 7099236 5960250 677709 -4259968 -5553475 -4745242 -4780937 -5196932 -3398670
7214 -3398670 638971 4085948 5304923 5193899 4345268 1983904 -1328591 -2899120 -1601354
7205 -1601354 -43696 -899167 -2964217 -3423625 -2588209 -3188105 -5402239 -6033085 -3488763
7196 -3488763 -600535 -566258 -2209479 -1876837 981454 3021362 1949716 -439659 -1385939
7187 -1385939 -1161394 -1919617 -3887672 -5199815 -5090863 -4717475 -4572689 -3598082 -1666045
7178 -1666045 -485194 -695073 -415819 1471431 2911682 2047224 902851 2404999 5229005
7169 5229005 5514111 2981451 1096257 1067541 162548 -2995615 -5852628 -6502125 -6738777
7160 -6738777 -8007663 -8120842 -5271836 -1990771 -1242394 -1366939 715537 3487499 3069364
7151C069364k815876l26491L501740L160997k20376j651837o73827r22526k905049
7142B16119l217317q46821J007150K47371j216545j062359K92425J329114J530942
7133a719921Q22650q16284k348108k299484r91915k30781l83288J05696J726504
7124f134931K625829J291146j241607k855937k639822r46968J428499L290380
7116e183411L440485J943755K54213m26500k17093K16779O08968R69829J232538
7107B839563J222429N75608r82637k754099l236100k066738q33157p35240o55963
7098f626334P25362K205713J851017N04620N93384J995654K345679J353362J259152
7089F207609K462040K421113K23502j324161k16437J248696P1305k780301m058205
$$ plain form
7151 3069364 253488 -73003 3428737 6589734 6369358 4717521 4043694 3121168 216119
7142 216119 -3001198 -3848019 -2840869 -2593498 -3810043 -4872402 -4579977 -3250863 -1719921
7133 -1719921 -897271 -1713555 -4061663 -6361147 -7353062 -7583843 -7967131 -7861435 -6134931
7124 -6134931 -3509102 -2217956 -3459563 -6315500 -8955322 -9902290 -8473791 -5183411
7116 -5183411 -1742926 200829 455042 28542 -188551 28228 637196 1607025 2839563
7107 2839563 4061992 4637600 3654963 900864 -2335236 -4401974 -5235131 -5970371 -6626334
7098 -6626334 -5900972 -3695259 -1844242 -1339622 -746238 1249416 3595095 4948457 6207609
7089 6207609 8669649 11090762 11314264 9990103 9773666 11022362 11093667 8313366 4255161
7080D255161k798682o04080J153531J953858J300109l11754q57034L73802P84723
7071E249634j852714n007553m203303K13095K896128P54114l005282l566042n64784
7062i086707K523456L210708J997189M85711m04497l79593N15881J598931J761816
7053B222895O10935q36383j119524r5283P98091M80893j49432M44907J854644
7044D211743K073517O42615m34993K17976J245125R77950J71280K75538M96669
7035I877420p60287k452588j962285N49730J893005M70184j638873k137238j438984
7026B400084q13623m8113J180449J591137J93517j463479j217801L72978Q24738
7017C019887n79580j962822j667949p9511J522323K320053J905092L81022j002490
$$ plain form
7080 4255161 1456479 852399 2005930 3959788 5259897 4948143 4091109 4464911 5249634
7071 5249634 3396920 -1610633 -5813936 -5600841 -2704713 -1950599 -4955881 -8521923 -9086707
7062 -9086707 -6563251 -3352543 -1355354 -869643 -1274140 -1653733 -1137852 461079 2222895
7053 2222895 2833830 1997447 877923 782640 1580731 2061624 1912192 2357099 4211743
7044 4211743 6285260 6927875 6492882 6710858 7955983 8933933 9105213 9380751 9877420
7035 9877420 9117133 6664545 4702260 5251990 7144995 7615179 5976306 3839068 2400084
7026 2400084 1586461 1538348 2718797 4309934 4503451 3039972 1822171 2195149 3019887
7017 3019887 2440307 477485 -1190464 -1269975 252348 2572401 4477493 4858515 3856025
7008C856025o54573J259462K602433J854997K1383q25890j86600N30965j35336
6999H322866k278052m741272n926190m645702r75927L454272O335699O140758
6991E686452L003414j383879m618959m985807k714514K30876K024806K486346
6983b71265K412144J924681L97921k016929l790125l460030j233109J234660K395189
6974b406863K018101J208148J298345K334882K757556J257262j149541j978942
6966E338948m56434J388555J386305k90170k168323l567447m225601l184763j58750
6957e937680K750355L057075J370379N07048J143617J024893r49489k680849k214503
6948a929154n80759M53361J124587J958608J509699j214346l597838k172162K025363
$$ plain form
7008 3856025 3201452 4460914 7063347 8918344 8939727 8113837 7927237 8458202 8322866
6999 8322866 6044814 1303542 -4622648 -9268350 -10244277 -6790005 -454306 5686452
6991 5686452 8689866 7305987 2687028 -2298779 -5013293 -4782417 -2757611 -271265
6983 -271265 2140879 4065560 4463481 2446552 -1343573 -4803603 -6036712 -4802052 -2406863
6974 -2406863 -388762 819386 2117731 4452613 7210169 8467431 7317890 5338948
6966 5338948 4882514 6271069 7657374 7367204 5198881 1631434 -2594167 -5778930 -5937680
6957 -5937680 -3187325 -130250 1240129 1747177 2890794 3915687 2966198 285349 -1929154
6948 -1929154 -2509913 -2056552 -931965 1026643 2536342 1321996 -2275842 -4448004 -2422641
6939b422641M300808K724071M26134O17583K355082K873119J656852Q1203j283683
6930A1328528k704890l583802k914915j186779q1733k43280p01227o17514l70707
6921a076319n76887j032730j185432j041096j010521j091832p24973M35618J905500
6912e398672K846649L087539L185065L299602K699363J022872o23738r63248n71597
6903H583835j120637k571236k898861j257251M00248J78546q37397m41100R91254
6894A027401J115197l11866o41578J566695L899727L147429m11864l583958m321192
6885A485991l360936k089567p30474Q07104J815173J617542P60384L90698P79223
6876A475138J211777J136851P39222M09173J50398m41262j820965l852571n235894
$$ plain form
6939 -2422641 1878167 4602238 5028372 5645955 8001037 10874156 12531008 12612211 11328528
6930 11328528 8623638 5039836 2124921 938142 856409 613129 -88098 -705612 -1076319
6921 -1076319 -1653206 -2685936 -3871368 -4912464 -5922985 -7014817 -7739790 -7304172 -5398672
6912 -5398672 -2552023 535516 3720581 7020183 9719546 10742418 10118680 9155432 8583835
6903 8583835 7463198 4891962 1993101 735850 1136098 1314644 477247 36147 1027401
6894 1027401 2142598 1830732 1189154 2755849 6655576 9803005 9391141 5807183 1485991
6885 1485991 -1874945 -3964512 -4694986 -3887882 -2072709 -455167 305217 695915 1475138
6876 1475138 2686915 3823766 4562988 4972161 5122559 4681297 2860332 -992239 -6228133
6867f228133m146703k80748L960327N296207K831680j051023l116225k075413
6859d810031Q27309L113730K922662N79642j427413r76830R96270J532441k92758
6850B465022j931286r61708J420740K185166P09003p70983n63485O41101J511956
6841D705526J829157J841625J289939J3990j282490j718284j346452j119470j882023
6832B331518l392972m141596k593419P72586L284618K983084J148273N22971J513533
6823B428596K105141J421822Q97300J244227Q51047j223443k887737j940821K12672
6814C108804M40988j401653k484912j514679l05748k65844q7072J610424L521196
6805B621504L538932J990997Q56940N58936k56781j913919k835416j980362m33328
$$ plain form
6867 -6228133 -10374836 -10655584 -6695257 -1399050 1432630 381607 -2734618 -4810031
6859 -4810031 -3982722 -868992 2053670 2633312 1205899 229069 1225339 2757780 2465022
6850 2465022 533736 -427972 992768 3177934 3886937 3115954 2552469 3193570 4705526
6841 4705526 6534683 8376308 9666247 9680237 8397747 6679463 5333011 4213541 2331518
6832 2331518 -1061454 -5203050 -7796469 -7023883 -3739265 -756181 392092 915063 2428596
6823 2428596 4533737 5955559 6852859 8097086 8948133 7724690 4836953 2896132 3108804
6814 3108804 3549792 2148139 -336773 -1851452 -2157200 -2423044 -2510116 -899692 2621504
6805 2621504 6160436 8151433 9008373 9567309 9310528 7396609 4561193 2580831 2147503
6796B147503K46360p6344p28628j481783k045077j406955P93495K880831K754271
6787C083673O44523j268448j862946j985717k185564j510885M88774K158596J581159
6778h56835p96261k601157k162987J08085K454502L220361K134946O55209L58709
6769B514572Q05611K47993j254904j439872L73784J358032q33506l897384l497876
6760e623550P97302M930387N414206K565585j132796l503394l419566j281630
6752a253456R16028J533172J041881M66007n93898k045885j238709L331883P485554
6743I642577N573195q18137l989164j143943J630577r56788n498793n909848k547213
6734d017537n002O44592J573284K529380J457937m33578k1520J766731R46585
$$ plain form
6796 2147503 2393863 2317519 1588891 107108 -1937969 -3344924 -2551429 329402 3083673
6787 3083673 3728196 2459748 596802 -1388915 -3574479 -5085364 -4596590 -2437994 -856835
6778 -856835 -1653096 -4254253 -6417240 -6309155 -3854653 -634292 1500654 2155863 2514572
6769 2514572 3320183 3568176 2313272 873400 1247184 2605216 1771710 -2125674 -5623550
6760 -5623550 -4826248 104139 5518345 8083930 6951134 3447740 28174 -1253456
6752 -1253456 -337428 1195744 2237625 2703632 2109734 63849 -1174860 2157023 9642577
6743 9642577 15215772 14397635 10408471 9264528 10895105 9938317 4439524 -1470324 -4017537
6734 -4017537 -4022539 -3377947 -1804663 724717 2182654 1749076 1727556 3494287 4440872
6725D440872k355499l310539q8793L068589K461212M3348o74856k5480l73941
6716C184913j664979j919792n43488J342121K682140K825511J374620p96415j777024
6707D707607j241680j242511k927346m243236k823774L35159K298507K288191
6699b849083K077925K720302L015342J512780j411217l944797m577221l254332
6691f710301j218540K68324J116102K047277L188532L759364L225569J935134
6683G611461M49440r72021k124844k850594l195932k874452j155933J535837K775478
6674h01560Q17368k448498l540551k023330m22564K43075J441193L246784L393036
6665i5047J603731J019739L055290M427808K274755j009825j675235o02606j128431
$$ plain form
6725 4440872 2085373 -1225166 -1313959 1754630 4215842 4259190 3584334 3558854 3184913
6716 3184913 1519934 -399858 -943346 398775 3080915 5906426 7281046 6484631 4707607
6707 4707607 3465927 2223416 -703930 -4947166 -7770940 -7435781 -5137274 -2849083
6699 -2849083 -771158 1949144 4964486 6477266 5066049 1121252 -3455969 -6710301
6691 -6710301 -7928841 -7660517 -6544415 -4497138 -1308606 2450758 5676327 7611461
6683 7611461 8060901 7088880 4964036 2113442 -1082490 -3956942 -5112875 -3577038 -801560
6674 -801560 15808 -2432690 -5973241 -7996571 -8419135 -8176060 -6734867 -3488083 -95047
6665 -95047 1508684 2528423 5583713 10011521 12286276 11276451 9601216 8998610 7870179
6656G870179k888989k638478l00327O75838p70336j493052O26550L303383L349949
6647G734717Q52800j711995k508377j274453J006210K375623J399640q76835j917689
6638E079641r80259K69934N88132M68767K74260m85852j157367K30701L665214
6629G953171N882200M295097N43774j811672j844561j495397k144661l048560
6621H329391l019810k042268j004504p37027j309346j722193o62724J803822L744103
6612C379444L290774P60890j774963k746869k339630j733158j664413j820221
6604d648146j476932n75223K41608Q01720J770417L119189L258786J186535j252278
6595B425676j292346P87846J894006N51590j250969j368003l09527M18235O34256
$$ plain form
6656 7870179 4981190 2342712 2042385 2718223 1947887 454835 1081385 4384768 7734717
6647 7734717 8587517 6875522 4367145 3092692 4098902 6474525 7874165 6997330 5079641
6638 5079641 4099382 4369316 4957448 5426215 5700475 5214623 4057256 4287957 7953171
6629 7953171 13835371 18130468 18674242 16862570 15018009 13522612 11377951 8329391
6621 8329391 5309581 3267313 2262809 1525782 216436 -1505757 -2168481 -364659 3379444
6612 3379444 6670218 7431108 5656145 2909276 569646 -1163512 -2827925 -4648146
6604 -4648146 -6125078 -6700301 -6458693 -5656973 -3886556 -767367 2491419 3677954 2425676
6595 2425676 1133330 1921176 3815182 4366772 3115803 1747800 1438273 1856508 2490764
6586B490764O37151o6516j442178j911304m73288J439085J889055R22711m76198
6577C009282k321415m451506m942010k311589J584263L435978K678093J388842
6569a930062O10661m92237j979474k407575j158623O81081J998953K294908R63412
6560a418956j629802k726555N3974M418023N344552J960156j281394j452728r28637
6551B338633k018405k249782R50738M312414K778753k205709m074823o69763K953248
6542B115304K390512l03925j061969m2326J4468r38408m99034J675386L040123
6533F390131J942966l18153j662243j495179k73854J503866L025522L118501J476223
6524A3707780p43589k258428k976083l283247k763319q76912J219405J029554
$$ plain form
6586 2490764 3127915 3061399 1619221 -292083 -765371 673714 2562769 3485480 3009282
6577 3009282 687867 -3763639 -8705649 -11017238 -9432975 -5996997 -3318904 -1930062
6569 -1930062 -1319401 -1811638 -3791112 -6198687 -7357310 -6676229 -4677276 -2382368 -1418956
6560 -1418956 -3048758 -5775313 -5721339 -1303316 4041236 6001392 4719998 3267270 2338633
6551 2338633 320228 -1929554 -978816 3333598 6112351 3906642 -168181 -837944 2115304
6542 2115304 4505816 4201891 3139922 3097596 3112064 2173656 1674622 3350008 6390131
6533 6390131 8333097 8014944 6352701 4857522 4583668 6087534 9113056 12231557 13707780
6524 13707780 12964191 10705763 7729680 4446433 1683114 806202 2025607 3055161
6516C055161k204722n615254n287887q10675L961961N235478L274441J079590
6508B688093J11981p55205k204133k758576j253770P85467J165298M06009Q20070
6499i94766K501173K850408Q77261n58086J172776L841990K769274k391299o272133
6490C796598m405900J004865L929840J836502k133192l861417k695381o97232
6482c225317M10619K59717q15827j931888j858278l37845J264734J651024J308083
6473c274978J388197J587635P58413p31900j142091o6295P59248j9551j473165
6464b214487j762952l02281K053010L874558L738484J234283j960368l325748
6456A334499k477859j458780j459481j274924j57085K05012j306803k378656l73901
$$ plain form
6516 3055161 850439 -4764815 -10052702 -10863377 -6901416 -1665938 1608503 2688093
6508 2688093 2800074 2044869 -159264 -2917840 -4171610 -3386143 -2220845 -1814836 -994766
6499 -994766 1506407 4356815 5234076 4675990 5848766 9690756 12460030 10068731 3796598
6490 3796598 -609302 395563 4325403 6161905 4028713 167296 -2528085 -3225317
6482 -3225317 -2814698 -2554981 -3370808 -5302696 -7160974 -7498819 -6234085 -4583061 -3274978
6473 -3274978 -1886781 -299146 459267 -272633 -1414724 -1481019 -721771 -741322 -2214487
6464 -2214487 -3977439 -4279720 -2226710 1647848 5386332 6620615 4660247 1334499
6456 1334499 -1143360 -2602140 -4061621 -5336545 -5493630 -5288618 -6595421 -8974077 -9347978
6447i347978L113535M139920K088263J9705l41836k67128l55495Q41559L252543
6438C143088L983899J613130j243601j926790j567438k328650l282608k189651
6430c798621L48980J747763J340955M98641j82516r02537p93852Q64813K272102
6421A395728J211946r56771r58887R64428J273889p89549j669953N16816K632850
6412C620497J583327q62895j412444m72940m51028j028046j02049J836183K251342
6403D961947J001350M58161J140126Q97927q61767j641720N3114K084366K011216
6394A0104720N78029l06586r86132k730527m316771l039981R41403L941334L189565
6385G375054P2908k040488j842789p63753m62365j008260j489120j389692r28343
$$ plain form
6447 -9347978 -6234443 -2094523 -6260 13445 -328391 -595519 -951014 -109455 3143088
6438 3143088 7126987 8740117 7496516 5569726 4002288 1673638 -1608970 -3798621
6430 -3798621 -3449641 -1701878 -360923 137718 -44798 -947335 -1741187 -876374 1395728
6421 1395728 2607674 1650903 692016 1656444 2930333 2140784 470831 987647 3620497
6412 3620497 5203824 4340929 2928485 2455545 2004517 976471 874422 2710605 4961947
6403 4961947 5963297 6421458 7561584 8459511 7597744 5956024 6009138 8093504 10104720
6394 10104720 10682749 10376163 9390031 6659504 2342733 -697248 244155 4185489 7375054
6385 7375054 7447962 5407474 3564685 2800932 2338567 1330307 -158813 -1548505 -2476848
6376b476848m77459j54716J2262j14221n10472o37648J68176J705776K670538
6367A85388J915560p1855j379638n52923J831491L479043K291589j621945n499357
6358E77353n980287k443978J879814L144062J246728l43117N45229J919050J010785
6349A555639j159024j211085J222123K683967J141124r01582l33041J813477K079939
6340F891537l24064k893621l694166l189610k256048r05028N68685J378832J792635
6331b630848K847224L922641K847152n72773l359957l140438j130135K32058O11681
6322c73395P40632L0565k076548l736142k643946L62730K428856K816293K994701
6313E43746L100912J762230m23054r37281K61638R9707k336430l594995j321241
$$ plain form
6376 -2476848 -2954307 -3109023 -3096761 -3210982 -3721454 -4359102 -4190926 -2485150 185388
6367 185388 2100948 2029093 649455 96532 1928023 5407066 7698655 6076710 577353
6358 577353 -5402934 -7846912 -5967098 -2823036 -1576308 -1919425 -1374196 544854 1555639
6349 1555639 396615 -814470 407653 3091620 4232744 3331162 2998121 4811598 6891537
6340 6891537 6567473 3673852 -20314 -3209924 -5465972 -6371000 -5802315 -4423483 -2630848
6331 -2630848 216376 4139017 6986169 6413396 3053439 -86999 -1217134 -985076 -373395
6322 -373395 367237 397802 -1678746 -5414888 -8058834 -7696104 -5267248 -2450955 543746
6313 543746 3644658 5406888 4983834 4046553 4308191 4407898 2071468 -1523527 -2844768
6304b844768J532659J282008n57471o3838K278981K332878p18115k919830j747155
6295a424651N20304J135425Q71316J430492J885802N60266j508862j880242l96890
6286A192960R86998J396069J643206J903218J118887q27368k170553j407009N97303
6277D433711J495019J68276j947750k444242q26452P39705K93386r69739l60848
6268E81066J786594J867635j562471m722067l383183J141476L834499K766239
6260B309788P02619Q2182j76289j864230m201884m961333l305504l42550K073372
6251i683829K547110J334234N62302J904029M089198M492662K992270J836947
6243A0074923J638126N64409j702830k550563o58003J380485R18366q21283j213626
$$ plain form
6304 -2844768 -1312109 -30101 -587572 -651410 1627571 3960449 3242334 322504 -1424651
6295 -1424651 -904347 231078 1102394 2532886 4418688 4978954 3470092 1589850 1192960
6286 1192960 2179958 3576027 5219233 7122451 8241338 7413970 5243417 3836408 4433711
6277 4433711 5928730 6097006 4149256 1705014 878562 1618267 1911653 941914 581066
6268 581066 2367660 4235295 2672824 -2049243 -5432426 -4290950 -456451 2309788
6260 2309788 3012407 3094589 2918300 1054070 -3147814 -8109147 -11414651 -11757201 -9683829
6251 -9683829 -7136719 -5802485 -5240183 -3336154 753044 5245706 8237976 10074923
6243 10074923 11713049 12277458 10574628 8024065 7366062 8746547 9664913 8843630 7630004
6234G630004l89851j63358o28449o38055j71659M01803J819476L934760M010959
6225A5805630K86861m229848n103661k461137n404P79737J256634J324505o41014
6216G012303l416182l385045l25140J764437Q98985k41372M41714J011796l61086
6207C400410j901400j707259j092737j400633r08417J600389L267916J165511
6199B423780k508589l338973j021666J230822K125986K923654L575787K543977
6191G954778L15513q20785p47736j664324l769422m289643j863985J086156J753992
6182b045456M19734p86396p50006K13646J366943J909304J373722L84676J73020
6173B259187R53324J590808J052009n20034k071592k366851r74774P86880Q53287
$$ plain form
6234 7630004 7240153 7076795 6448346 5810291 5638632 6040435 7859911 11794671 15805630
6225 15805630 16092491 11862643 6758982 4297845 4292441 5072178 6328812 7653317 7012303
6216 7012303 3596121 211076 -114064 1650373 2549358 2307986 2749700 3761496 3400410
6207 3400410 1499010 -208249 -1300986 -2701619 -3610036 -2009647 1258269 2423780
6199 2423780 -84809 -3423782 -4445448 -3214626 -1088640 1835014 5410801 7954778
6191 7954778 8270291 7449506 6701770 5037446 1268024 -3021619 -4885604 -3799448 -2045456
6182 -2045456 -1625722 -2412118 -3162124 -2948478 -1581535 327769 1701491 2086167 2259187
6173 2259187 3212511 4803319 5855328 5335294 3263702 896851 -77923 708957 1562244
6164A562244p32142j383233K27751J732348O33545j430651j076873J314172K064534
6155B911695j32215k537918k655334j002882Q35155J917178J277709j334765l517047
6146d238424k271796J267066K622648M64907j458590m00335J386413J134631K13282
6137a280198Q95667J631083k92670l373997l533213k97778K578214K611774J277481
6128B16363P05481O02443m23082k352940l689343l012355k28045L063411M566603
6119e51464L434979J168593l07256r09507j858035l376164l952456j905914K543875
6110e713349O478062O115388R59511m206554l905317J076196M241657J990376
6102G035970j746242j726542J131931K133354J69002j729798j977880k063258
$$ plain form
6164 1562244 830102 -553131 -325380 1406968 2040513 609862 -467011 847161 2911695
6155 2911695 2779480 241562 -2413772 -3416654 -2581499 -664321 613388 -721377 -4238424
6146 -4238424 -6510220 -5243154 -2620506 -2155599 -3614189 -4014524 -2628111 -1493480 -1280198
6137 -1280198 -384531 1246552 953882 -2420115 -5953328 -6251106 -3672892 -1061118 216363
6128 216363 921844 1524287 1101205 -1251735 -4941078 -7953433 -8181478 -5118067 -551464
6119 -551464 2883515 4052108 3744852 2835345 977310 -2398854 -6351310 -8257224 -5713349
6110 -5713349 764713 6880101 7839612 3633058 -272259 803937 5045594 7035970
6102 7035970 5289728 3563186 4695117 6828471 6997473 5267675 3289795 1226537
6094A226537k687252k334865l63088J687317K501903K043995R6930l219228n364150
6085f411901l337266J567612M433933L160347P09574l12990j266615l318047l657279
6076h432632K86592N488540O514378K832861j015794k007489j536953j525205
6068F04298j359721o8020J293717J347634P28032Q42849J367911P55539j185627
6059D326612k796070k824168k022191j877179k356411j799369P61111L792930
6051d794735M541698K190676r32358j822455j23154J678630J379473l03466p34219
6042A080090J231439L566166L313062K13982k763143k861919p28611O91388K5110
6033C767564j009916k68792J726558K360080L17726k569002l347421j378787J031767
$$ plain form
6094 1226537 -1460715 -3795580 -4158668 -2471351 30552 2074547 2171477 -1047751 -6411901
6085 -6411901 -9749167 -8181555 -3747622 -587275 122299 -190691 -1457306 -4775353 -8432632
6076 -8432632 -8146040 -2657500 3856878 6689739 5673945 3666456 2129503 604298
6068 604298 -755423 -823443 470274 1817908 2545940 3388789 4756700 5512239 4326612
6059 4326612 1530542 -1293626 -3315817 -5192996 -7549407 -9348776 -8587665 -4794735
6051 -4794735 -253037 1937639 1005281 -817174 -940328 738302 2117775 1814309 1080090
6042 1080090 2311529 5877695 9190757 9404739 6641596 3779677 3051066 3742454 3767564
6033 3767564 2757648 2488856 4215414 6575494 6893220 4324218 976797 -401990 629777
6024F29777J609716P90405M08691L49151j469760n152372p008135l738936K619912
6015a0961551O407961M935103J132532q12593k39750P15376P53178M14787L10048
6006B655091J70052l34638j000956j466582j495037r16054J71962J234746J773357
5997G91941J781991J403016N52151n81211j137452n18652N19944O27986k91744
5988C147970r46876o25195k98406j024527k020107j557602L59028J580243O20479
5979g64993j246637j727158n24388P65413J269609J560090J758758J046991j75878
5970A961807J84717K601939L922739J070371m196955o799835m412387L00710L559691
5961a807203M161482K832423M21253j953899k834097k022610j018844p04530J1254
$$ plain form
6024 629777 2239493 3029898 3438589 3787740 2317980 -2834392 -9842527 -13581463 -10961551
6015 -10961551 -4553590 381513 1514045 701452 461702 1177078 1930256 2345043 2655091
6006 2655091 2825143 2490505 1489549 22967 -1472070 -2388124 -2216162 -981416 791941
5997 791941 2573932 3976948 4529099 3947888 2810436 2291784 2811728 3439714 3147970
5988 3147970 2201094 1575899 1277493 252966 -1767141 -3324743 -2965715 -1385472 -764993
5979 -764993 -2011630 -3738788 -4263176 -3497763 -2228154 -668064 1090694 2137685 1961807
5970 1961807 2146524 4748463 8671202 9741573 5544618 -1255217 -5667604 -5366894 -1807203
5961 -1807203 2354279 5186702 5607955 3654056 819959 -1202651 -2221495 -2926025 -2914771
5952b914771J924048L373573K200273j053825l769162m510029l867576k489279
5944a1106748l34811J958993K908288K072588P38105Q3351p1016l0922Q10368
5935b971804K594564L742051K714910M56532o81713l19019m64626k145458l585314
5926f59877k956669j296692q28642j489683j387558j54785P23075R56154J968966
5917e125711L557555L006562n83475l632017k466299J300762K787382L30605l016533
5908c841169m095779k844809p94094Q97921J399477N68967l3731J388701L911519
5899c442997M549905K383643k38507j204512r18038k82671R31915K389607K360664
5890F529009L36119j593232j661704p98807m66775k39699N87355J102960O80830
$$ plain form
5952 -2914771 -990723 2382850 4583123 3529298 -239864 -4749893 -8617469 -11106748
5944 -11106748 -11441559 -9482566 -6574278 -4501690 -3763585 -3680234 -3751250 -3782172 -2971804
5935 -2971804 -377240 3364811 6079721 6536253 5854540 5535521 5070895 2925437 -659877
5926 -659877 -3616546 -4913238 -5741880 -7231563 -8619121 -8773906 -8050831 -7094677 -5125711
5917 -5125711 -1568156 1438406 854931 -2777086 -5243385 -3942623 -1155241 -824636 -3841169
5908 -3841169 -7936948 -10781757 -11575851 -10677930 -9278453 -8709486 -8743217 -7354516 -3442997
5899 -3442997 1106908 3490551 3252044 2047532 1129494 846823 1778738 4168345 6529009
5890 6529009 6865128 5271896 3610192 2811385 2344610 2104911 2692266 3795226 4476056
5881D476056P26486K035198K396024j72979l431819l566068p96692J142935N93245
5872C402386m88301n23290l69132q18327j135997r63923j014898j034007L18858
5863b626631K590042L174610J154484r51726q72243K17004N9417j086493j444859
5854B13605p86263o3818R11897K736078L834078J601639l227105n932862l229581
5845c942332K213098M740228K595131m47807p33163M03471o03914l458253l971972
5836c205513m94208K986965K293933q76936j617446P51864J904959n04811l080809
5827a842002j931548J378939K314993J55307j388448k38229J010178k94717k016346
5818b851873q9485M791744O880589K764760l739285o301100l899595r70166m97889
$$ plain form
5881 4476056 5202542 7237740 9633764 9460785 6028966 2462898 1666206 2809141 3402386
5872 3402386 2914085 2390795 2021663 1203336 67339 -896584 -1911482 -2945489 -2626631
5863 -2626631 -36589 3138021 4292505 3340779 2468536 2685540 2744957 1658464 213605
5854 213605 -572658 -636476 275421 3011499 6845577 8447216 5220111 -712751 -3942332
5845 -3942332 -1729234 3010994 5606125 5158318 4425155 4828626 4224712 766459 -3205513
5836 -3205513 -3699721 -712756 1581177 704241 -913205 -161341 1743618 1238807 -1842002
5827 -1842002 -3773550 -2394611 -79618 75689 -1312759 -1550988 -540810 -835527 -2851873
5818 -2851873 -2941358 1850386 8730975 11495735 7756450 1455350 -2444245 -3414411 -3912300
5809c912300n83686J229804L531692L299986O21426j461341j018864R11491K111833
5800D730041J293518j061379k761116j698449J196264K166721n12228l472139
5792a18767k461161J707436M389323L446065J024678o91097j890488k779380k279660
5783C46949l70773J042719R55785N68122N97620j72306k172861l328301j998893
5774d531939K68376Q91368l24599j631453j839768p94981J293317L388872L691966
5765D11159J693602q44523k126096k255056j865633n91986J477781K500002J110456
5756d90294j174863j764349l54749J193041J474902N06895r48320j543254j6981
5747c117972K721821L563452J098155j890864k005585J22347J366213J038443
$$ plain form
5809 -3912300 -4495986 -3266182 265510 3565496 4186922 2725581 1706717 2618208 4730041
5800 4730041 6023559 4962180 2201064 502615 1698879 3865600 3353372 -118767
5792 -118767 -2579928 -872492 3516831 6962896 7987574 7296477 5405989 2626609 346949
5783 346949 -23824 1018895 1974680 2542802 3140422 2968116 795255 -2533046 -4531939
5774 -4531939 -4263563 -3372195 -3696794 -5328247 -7168015 -7962996 -6669679 -3280807 411159
5765 411159 2104761 1260238 -865858 -3120914 -4986547 -5578533 -4100752 -1600750 -490294
5756 -490294 -1665157 -3429506 -3784255 -2591214 -1116312 -609417 -1557737 -3100991 -3117972
5747 -3117972 -396151 3167301 4265456 2374592 369007 491354 1857567 2896010
5739B896010J132099K215677K435564Q98547q54706j447068j374344j410305j338661
5730C152813r54367n85041j38824O95083J044049m45315l096615m315600k818261
5721g462078q6336J815388K154426J024357r61372j956611j68554L196212M463723
5712B019155K174849q67109j656578r36730j091241j952077j428171N19036J264826
5703a954040q10145l897984m698244j921373K437514M907225L790625R66777k2335
5694a201980J940166M144789L347304m17304m184249n418809l972204j348866
5686g111153P26755J277425O63703J76803M73800Q03385L34006m43921m53467
5677c552664N09920J921596L318110L897430K341047j355273m588229m611983
$$ plain form
5739 2896010 4028109 6243786 8679350 9577897 8723191 7276123 5901779 4491474 3152813
5730 3152813 2198446 1613405 1474581 2169664 3213713 2768398 -328217 -4643817 -7462078
5721 -7462078 -7548414 -5733026 -3578600 -2554243 -3515615 -5472226 -5640780 -2444568 2019155
5712 2019155 4194004 3326895 1670317 733587 -357654 -2309731 -3737902 -3218866 -1954040
5703 -1954040 -2764185 -6662169 -11360413 -13281786 -10844272 -5937047 -2146422 -1179645 -1201980
5694 -1201980 738186 4882975 8230279 7812975 3628726 -1790083 -5762287 -7111153
5686 -7111153 -6384398 -5106973 -4443270 -4266467 -3792667 -2989282 -2655276 -3099197 -3552664
5677 -3552664 -3042744 -1121148 2196962 6094392 8435439 7080166 2491937 -2120046
5669b120046k020683J55122O85450J234864K906113M157064L339095J283605k52561
5660I368023j185643k356881l328965k903183j266375J59767P42288J001427J254613
5651A485071J405698J790353K588373K610127N71787k315107l069325q22178J900912
5642F145711K570249J518289M13783k92813r33533j174784p58128n93140j424594
5633E471040k315941k059548j169488q05528p19539j87136K3742j062185k128285
5624d952868r98922J732028L193348K358504J004901M26194M8233k74627L58470
5615B895261J406850Q76928j077747j738797m45706j43265k186769l256085o41488
5606d310818K648262K211198p23817j334491J148523K840420J862668N88079N69714
$$ plain form
5669 -2120046 -4140729 -3985607 -3300157 -2065293 840820 4997884 8336979 9620584 9368023
5660 9368023 8182380 5825499 2496534 -406649 -1673024 -1513257 -770969 230458 1485071
5651 1485071 2890769 4681122 7269495 9879622 10451409 8136302 5066977 4244799 6145711
5642 6145711 8715960 10234249 10648032 10355219 9421686 8246902 7488774 6895634 5471040
5633 5471040 3155099 1095551 -73937 -879465 -1599004 -1786140 -1762398 -2824583 -4952868
5624 -4952868 -5951790 -4219762 -1026414 1332090 2336991 2763185 2811418 2536791 2895261
5615 2895261 4302111 5179039 4101292 2362495 1916789 1773524 -413245 -3669330 -4310818
5606 -4310818 -1662556 548642 -175175 -1509666 -361143 2479277 4341945 4930024 5499738
5597E499738k5620k221868l541847j961777N23583R47277k92592p61488N4036
5588a780558P44354Q26952J068437J427402Q94481n47473j507112j070769M8320
5579A04034O09265L27921r4593k6002L23510J97671o77687j619885j823706j340667
5569d020139o68329K88290J919453L641164L987962K367206L4042j098506l07633
5560F143510J355158K020399O78260j752993l311215l222431k613613k551255
5552c254180k394072j107573O97936J407750N24239j047686k201486j998278J58348
5543i215002L236153M558216K903440N58215K29311J174773R98939k7099J04657
5534D521603P71022m92712k780148j969422K658885O193216M608656L1492k878912
$$ plain form
5597 5499738 5474118 3252250 -289597 -2251374 -1727791 -780514 -1073106 -1834594 -1780558
5588 -1780558 -1036204 -209252 859185 2286587 3181068 2633595 1126483 55714 104034
5579 104034 713299 1041220 946627 920625 1244135 1441806 764119 -855766 -2679472 -4020139
5569 -4020139 -4688468 -4400178 -2480725 1160439 5148401 7515607 7549649 6451143 6143510
5560 6143510 7498668 9519067 10197327 8444334 5133119 1910688 -702925 -3254180
5552 -3254180 -5648252 -6755825 -6057889 -4650139 -4125900 -5173586 -7375072 -9373350 -9215002
5543 -9215002 -5978849 -1420633 1482807 2041022 2270333 3445106 4444045 4416946 4521603
5534 4521603 5292625 4799913 2019765 50343 2709228 8902444 13511100 13542592 10663680
5525A0663680k803651j514578m17099o1856j013349k656447k857409r13845J024361
5516e50193J307897J134332J407320K08191l430083n906485l355434K060728M476948
5507b646779K247235n33843l70381J597983K553496J807140N32153j02906L63756
5498E447854J361293J394404j97077j880533j854463p27446m16389j011456r34301
5489A181886J61202R02701N27080k80935p72516o52998L74066J880809K253726
5480E575021Q38681m27497K54288J297830q1792l364498n406383m911836l105856
5471i332042o70933K432325M559396L763937J646407J799832M017987M215467
5463A2432376R18177k462719l158113k574664k473253j786539K78201J681750
$$ plain form
5525 10663680 7860029 6345451 5928352 5866496 4853147 2196700 -660709 -1574554 -550193
5516 -550193 757704 1892036 3299356 3507547 77464 -5829021 -9184455 -7123727 -2646779
5507 -2646779 -399544 -933387 -1303768 294215 2847711 4654851 5187004 5084098 5447854
5498 5447854 6809147 8203551 8006474 6125941 4271478 3544032 3127643 2116187 1181886
5489 1181886 1343088 2245789 2772869 2491934 1719418 1066420 1440486 3321295 5575021
5480 5575021 6413702 5986205 6240493 7538323 7456531 4092033 -1314350 -6226186 -9332042
5471 -9332042 -10002975 -7570650 -3011254 752683 2399090 4198922 8216909 12432376
5463 12432376 13350553 10887834 7729721 5155057 2681804 895265 1173466 2855216
5455B855216R22096k28480j28562l16791k175560l542938k106574L17708N32458
5446c871427r88970j362103O383J409292K123556K370300J350083j229591k850691
5437c043168j024897K409025L416844J549684n6765j7112j48506j482820k614701
5428a012416k660084k473986k177468p13174J288762J493104j17283m35610J952339
5419d855816M194993L471663J141201R6618K16452n92754k252697k532471q08484
5410a921295Q58490O95944o61473j504639j143414j99149K90729k22757j141313
5401d948877r95181Q21117K643110J963167j344196m252767l925321j135239R36539
5392a0237648J086074J439396L609471N396098L589183q01822l110857j253792
$$ plain form
5455 2855216 3777312 3548832 3420270 3103479 927919 -2615019 -4721593 -4403885 -3871427
5446 -3871427 -4860397 -6222500 -6216117 -4806825 -2683269 -312969 1037114 -192477 -3043168
5437 -3043168 -4068065 -1659040 1757804 3307488 3250723 3233611 3085105 1602285 -1012416
5428 -1012416 -3672500 -6146486 -8323954 -9037128 -7748366 -6255262 -6372545 -6808155 -4855816
5419 -4855816 -660823 2810840 3952041 4048659 4265111 3672357 1419660 -1112811 -1921295
5410 -1921295 -1062805 -366861 -1028334 -2532973 -3676387 -3875536 -3584807 -3807564 -4948877
5401 -4948877 -5944058 -5122941 -2479831 -516664 -1860860 -6113627 -10038948 -11174187 -10237648
5392 -10237648 -9151574 -7712178 -4102707 1293391 4882574 4080752 969895 -283897
5384b83897J533185J585292l39319j402860j426865j963675k258004k05873L026952
5375a735064L507108M43333k144067j185910J304262J958833J029441Q61155J511472
5366E550563J073696p13207k176127k634715k953279l150994j942374P54133K859847
5357c332457K643929Q52376n38434p02716k68555K0026J6850j98035o36501j154568
5347c298085j265325o25573K54770L23266n34724r09599K34110J532822P92713
5338c495625j313432j337766K033720N302939M505762P35035j389945r4910J677162
5329F622940J010757j203117k379024j915951j137218r68411j275576j695574
5321b941174j817299j087231M54938J817651K157639J642733O86476o90453j957636
$$ plain form
5384 -283897 1249288 2834580 2495261 1092401 -334464 -2298139 -4556143 -4762016 -1735064
5375 -1735064 1772044 2215377 71310 -1114600 189662 2148495 3177936 4039091 5550563
5366 5550563 6624259 5911052 3734925 1100210 -1853069 -5004063 -6946437 -6192304 -3332457
5357 -3332457 -688528 163848 -374586 -1077302 -1345857 -1325831 -1308981 -1507016 -2143517 -3298085
5347 -3298085 -4563410 -5188983 -4934213 -4610947 -5145671 -6055270 -5821160 -4288338 -3495625
5338 -3495625 -4809057 -6146823 -4113103 1189836 5695598 6430633 5040688 4945778 6622940
5329 6622940 7633697 6430580 4051556 2135605 998387 29976 -1245600 -2941174
5321 -2941174 -4758473 -5845704 -5390766 -3573115 -1415476 227257 913733 223280 -1734356
5312a734356j733246L58039K397910K236994K36664j478399j879745j523759p69288
5303c889186M45050J203674K56529j534099j576158P51772K780731K168585O4794
5294F71692q89154j88528P80578J398375J999254K080921P02689j345221j947520
5285C263086o75431M45162k01002j796201k661525k346526j257840L65059J923760
5276b941458K127501O31083q15179l20835J573896K686575K111761Q22864l69713
5267E506495j637308k646603k122177R9704J934871J323149j081386k746859k370557
5258c740671r29338J73148O77516R18470Q73004M72438J74091M25872Q36751N54904
5248D36185n19664j361012q69937P66005J908381R80792j606437l454637k772270
$$ plain form
5312 -1734356 -3467602 -3109563 -711653 1525341 1762005 283606 -1596139 -3119898 -3889186
5303 -3889186 -3444136 -2240462 -1983933 -3518032 -5094190 -4342418 -1561687 606898 671692
5294 671692 -217462 -405990 374588 1772963 3772217 5853138 6555827 5210606 3263086
5285 3263086 2587655 3032817 2831815 1035614 -1625911 -3972437 -5230277 -4865218 -2941458
5276 -2941458 -813957 -182874 -998053 -1318888 255008 2941583 5053344 5876208 5506495
5267 5506495 3869187 1222584 -899593 -799889 1134982 2458131 1376745 -1370114 -3740671
5258 -3740671 -4670009 -4496861 -3819345 -2900875 -2027871 -1555433 -1381342 -955470 -118719 436185
5248 436185 -83479 -1444491 -2314428 -1548423 359958 1340750 -265687 -3720324 -6492594
5239f492594o67515K16951p27334j393256k72424J388871J961707K136903L148084
5230g00607L683763J492727k367047m027682k033630Q23807J795851J421344J052623
5221A141149N1919k194897l758128k485398O19939K935367L801921L927180K646484
5212F685536q75603m497914m768729j751379J097542K019032K476010L129120
5204C513615K181455p33697k600372j389908M07638n33033l181831l736832j280314
5195g353279J166527J105807l51728m36330J665288L844307L411228L29442k189784
5186A191478j205305K048635L375389R77601k349020l138551j322209Q47287J957900
5177B383205J869472O65413r46987j446846m05858N60360J53679p56728j090698
$$ plain form
5239 -6492594 -7160109 -6943158 -7670492 -9063748 -9336172 -7947301 -5985594 -3848691 -700607
5230 -700607 2983156 4475883 2108836 -1918846 -3952476 -3128669 -1332818 88526 1141149
5221 1141149 1193068 -1001829 -4759957 -7245355 -6625416 -3690049 111872 4039052 6685536
5212 6685536 5809933 1312019 -3456710 -5208089 -4110547 -2091515 384495 3513615
5204 3513615 5695070 4961373 2361001 971093 1378731 845698 -2336133 -6072965 -7353279
5195 -7353279 -6186752 -5080945 -5432673 -5869003 -4203715 -359408 3051820 3381262 1191478
5186 1191478 -13827 2034808 5410197 6387798 4038778 900227 -421982 425305 2383205
5177 2383205 4252677 4918090 3971103 2524257 2118399 2678759 2832438 2075710 985012
5168I85012j453687k151735j435553J568704L999864K647756j000970k622266
5160E37125j263860k2590o65707j344132k83977J648343L110302M022182L951942
5151I689628J592493k552602n312331m442947j342531J252606K555291L209238
5143D648845L099098J558827r84603k948158k914382p15951J966039K238489j034062
5134D914142m723826m186545O86117M573513L292674j054819l472010k522382
5126b493136p75676k59405n46506r23625j508659j802599n80293J839871L059843
5117c990185J540857j116879k031303m87125J522674J836048K67872j676943k386932
5108f521916j280852Q77029K323316J536961j088461l073100k256049O22064K694011
$$ plain form
5168 985012 -468675 -2620410 -4055963 -2487259 1512605 4160361 3159391 537125
5160 537125 -726735 -749325 -1415032 -2759164 -3043141 -1394798 1715504 5737686 9689628
5151 9689628 11282121 8729519 3417188 -1025759 -2368290 -1115684 1439607 4648845
5143 4648845 7747943 9306770 8322167 5374009 2459627 1743676 3709715 5948204 4914142
5134 4914142 190316 -3996229 -3310112 1263401 4556075 3501256 29246 -2493136
5126 -2493136 -3268812 -3528217 -4074723 -4998348 -6507007 -8309606 -8889899 -7050028 -3990185
5117 -3990185 -2449328 -3566207 -5597510 -6084635 -4561961 -2725913 -2458041 -4134984 -6521916
5108 -6521916 -7802768 -6925739 -4602423 -3065462 -4153923 -7227023 -9483072 -8861008 -6166997
5099f166997K434614J133391M87616K84276l40136o94841N28576K728011L705870
5090D100380K476609K28469j517551k264307k028724r90500M5440J01996p00819
5081e49007j290946j140598o51016j78243J85751N9235o90915j053041Q950J658427
5071c641403K003448P87704l88131n39239j95925K58637J152735K068339J853747
5062C359912P24315L96415J303409J581706n4451k107703k337346p91288N57189
5053B632158M78273l21270m17128M89752J010341k95023k539615l032661j135681
5044c130854K14511j129507k583153n66718L249784L852888O90647j337826M84695
5035b55533K992001K873262J398394O94746m02300l213923n420252m384384j694821
$$ plain form
5099 -6166997 -3732383 -2598992 -2111376 -1827100 -2167236 -2862077 -2333501 394510 4100380
5090 4100380 6576989 6805458 5287907 3023600 994876 4376 49816 151812 -549007
5081 -549007 -1839953 -2980551 -3631567 -3809810 -3624059 -3564824 -4255739 -5308780 -5299830 -3641403
5071 -3641403 -1637955 -850251 -1238382 -1777621 -1973546 -1714909 -562174 1506165 3359912
5062 3359912 4084227 4480642 5784051 7365757 7311306 5203603 2866257 2074969 2632158
5053 2632158 3110431 2789161 2372033 2861785 3872126 3577103 1037488 -1995173 -3130854
5044 -3130854 -2916343 -4045850 -6629003 -7195721 -3945937 -93049 597598 -740228 -255533
5035 -255533 2736468 5609730 7008124 7702870 7300570 4086647 -1333605 -5717989 -7412810
5026g412810n30326o54916Q8432J181641N07097j187422j049062J120728K567346
5017e369292J928139O01621k13245p66242q75028K72183J898715J756537p15910
5008a482522l208815l225495o88517K402747L845667K806649M90370r63750q84156
4999i07822o21096j105338j283384j33922J309795J557369R48104O57680O33040
4990A054426J75914n52463j084121j446388j213024M65533K600108K529784J58390
4981B688159p55800J859829M351268K318745k601972m921302k780820O77226K363434
4972C198767J790092o40758l924940n307720k641879J888130L670032J587184
4964c81092q36339m33476K137273M215403M119024K001269n38879j729756j638201
$$ plain form
5026 -7412810 -7943136 -8598052 -8509620 -7327979 -6820882 -8008304 -9057366 -7936638 -5369292
5017 -5369292 -3441153 -2839532 -3052777 -3819019 -4694047 -4421864 -2523149 -766612 -1482522
5008 -1482522 -4691337 -7916832 -8605349 -6202602 -2356935 449714 940084 -23666 -907822
4999 -907822 -1528918 -2634256 -3917640 -4051562 -2741767 -1184398 -236294 421386 1054426
4990 1054426 1230340 677877 -406244 -1852632 -3065656 -2600123 -15 2529769 2688159
4981 2688159 1932359 3792188 8143456 10462201 7860229 2938927 158107 835333 3198767
4972 3198767 4988859 4348101 423161 -4884559 -7526438 -5638308 -1968276 -381092
4964 -381092 -1217431 -1650907 486366 4701769 8820793 10822062 10283183 8553427 6915226
4955F915226k012379l115068k708527J00126K453288J646974q99022k267499k186391
4946b073272j687829m51279J179612N57520l013269n439985l516192j95902N41286
4937a4099310M83980L040702N716249L695850j437219l736519j973250K12011
4929h097506J454688K750246K254009k028049n759389l004563L365912M814475
4921d250177L45818k593188o68637J399514N62854l01975K86422k82996k097398
4912g599763j815377P0032m27782k232397l26747L748805K943011k540507m812401
4903a2993126k290703j842951m632769l318479K954709M936534k43576l259336
4895b0689697O26787L472285L34719j907694O26073O33553m775055o379572p39614
$$ plain form
4955 6915226 4902847 1787779 -920748 -820622 1632666 3279640 2380618 113119 -2073272
4946 -2073272 -3761101 -4212380 -3032768 -2475248 -5488517 -10928502 -14444694 -14640596 -14099310
4937 -14099310 -13615330 -10574628 -4858379 -1162529 -2599748 -6336267 -8309517 -8097506
4929 -8097506 -6642818 -3892572 -1638563 -3666612 -9426001 -12430564 -9064652 -4250177
4921 -4250177 -3904359 -6497547 -7166184 -5766670 -5203816 -5505791 -5219369 -5502365 -7599763
4912 -7599763 -9415140 -9345108 -9772890 -12005287 -12332034 -8583229 -5640218 -8180725 -12993126
4903 -12993126 -15283829 -17126780 -21759549 -25078028 -22123319 -17186785 -17430361 -20689697
4895 -20689697 -20062910 -16590625 -16255906 -18163600 -17537527 -16903974 -21679029 -28058601 -28798215
4886b8798215J259422n045650p500849j29292L533286m215439q724075j048493
4878e0669305J889372j0488646j7313337o275752r570817n1742931q3958649l4799918
4870b62929983P5483668J39305305R8491701J6099680j8848800l350584P374327
4863E1625314m599156j0667520J4648N003455n108556j1452381l853353L087371
4855B4049822r56176n950857l251709M21370o70953r19375K767152L801786m25827
4846A8865233k786507j48010J129033j485584j542862L070749M865763L65194
4838B2333009l351721j520474M65842j821653l685047q51059K412816J468016
4830A5449729p05598j14819R45918p39893k980824k699508j284606q55979l55098
$$ plain form
4886 -28798215 -27538793 -32584443 -40085292 -40214584 -36681298 -40896737 -49620812 -50669305
4878 -50669305 -48779933 -59268579 -76581916 -82857668 -92428485 -144171416 -228130065 -262929983
4870 -262929983 -187446315 -48141010 50350691 66450371 47601571 44250987 51625314
4863 51625314 47026158 36358638 36373286 41376741 36268185 24815804 20962451 24049822
4855 24049822 23093646 17142789 13891080 14312450 13641497 12722122 15489274 19291060 18865233
4846 18865233 16078726 15930716 17059749 15574165 14031303 17102052 21967815 22333009
4838 22333009 18981288 17460814 17926656 16105003 12419956 11568897 13981713 15449729
4830 15449729 14744131 14629312 15575230 14835337 11854513 9155005 7870399 7014420 6659322
4821F659322R08983J025924q7415N44113L043639L309858J53375k214076j430210
4812A1913513n31565j617736k339586j480447j553379k923092j937959K005009
4804A534758M221895K726588J537821K678280K250577j507723l783948j591775
4796H066473O49366q00870k444173q06708Q02731p39010j506966J996819M831656
4787A0049318J356081m375447m747051p90534P62936p95207o90567J379416J162298
4778C311243j318505j647042M69338P26155j500353k164596m33827P012j443993
4769c994568r15712K033228K548008q41481k724004K91849L499755J725321k092069
4760d69673j672158K619863M612319J832511j380618q35214J764719K010110p90047
$$ plain form
4821 6659322 7568305 8594229 8506814 9050927 12094566 15404424 15557799 13343723 11913513
4812 11913513 11381948 9764212 7424626 5944179 4390800 1467708 -470251 1534758
4804 1534758 5756653 8483241 10021062 12699342 14949919 13442196 9658248 8066473
4796 8066473 8715839 7914969 5470796 4664088 5466819 4727809 3220843 5217662 10049318
4787 10049318 11405399 7029952 2282901 1492367 2255303 1460096 769529 2148945 3311243
4778 3311243 1992738 345696 815034 1541189 40836 -2123760 -2557587 -2550575 -3994568
4769 -3994568 -4910280 -2877052 -329044 -1170525 -3894529 -3602680 -102925 1622396 -469673
4760 -469673 -2141831 478032 5090351 6922862 5542244 4707030 6471749 8481859 7691812
4751G691812k985010j885183N91506P50038j655433l169304j641855Q64389J290730
4742a48310l27284j701786j630488n84498P46580J608584J077805m16453q30471
4733b206321M51992J120265l05822j344548P45815L995105M232170J334195j093345
4724F929506j523304j622969j762158j53389K683624L163421J48573k633966j930682
4715C298656N29506J338284M26561l9103L68795M98133M13289J110444K057668
4706A0002233J636354j0108q09003J26197J014914l8670k183718k795148r91649
4697E951402J163791J560813R62951J439646K460893J192670k490274m218678
4689H023214q82930L956113M049676r86059n080247m020855m31523J033566n7232
$$ plain form
4751 7691812 4706802 2821619 3413125 4163163 2507730 -661574 -2303429 -1439040 -148310
4742 -148310 -475594 -2177380 -3807868 -4392366 -3645786 -2037202 -959397 -1375850 -2206321
4733 -2206321 -1754329 -634064 -939886 -2284434 -1538619 2456486 6688656 8022851 6929506
4724 6929506 5406202 3783233 2021075 1867686 4551310 7714731 7863304 5229338 3298656
4715 3298656 3828162 5166446 5593007 5553904 5922699 6420832 6834121 7944565 10002233
4706 10002233 11638587 11628479 10819476 10945673 11960587 11921917 9738199 6943051 5951402
4697 5951402 7115193 8676006 9638957 11078603 13539496 14732166 12241892 8023214
4689 8023214 7140284 11096397 15146073 14160014 9079767 5058912 4627389 5660955 5603723
4680E603723j014885q28587p29243j226213j451691j023157l19140P43069K144090
4671A897966K375451j0625l397516m153656j416644J490058J662247M21221N24315
4662f07183J433870L79953k514679l499250l49780M379978O600251N147920J626235
4653A2597315k161523m695023m428402j495333J266699J293480m49812j224769
4645G02632m64430M06460Q91562J238472M37155k068113l505599q40769L530254
4636C27624L904475l71161l683801k554980L2548Q27427J302546L097798L696646
4627F579122J170391j203101k16607J194051j086140m520075l587596Q33538K703865
4618A867448N69693q62427P76732K062084L07739k218835k818807k344479k287339
$$ plain form
4680 5603723 4588838 3760251 3031008 1804795 353104 -670053 -989193 -246124 1897966
4671 1897966 4273417 4262792 865276 -3288380 -4705024 -3214966 -1552719 -1131498 -607183
4662 -607183 826687 1206640 -1308039 -4807289 -5157069 -777091 5823160 10971080 12597315
4653 12597315 10435792 5740769 1312367 -182966 1083733 2377213 1927401 702632
4645 702632 238202 644662 1536224 2774696 3211851 1143738 -2361861 -3202630 327624
4636 327624 4232099 3860938 177137 -2377843 -2345295 -1517868 -215322 2882476 6579122
4627 6579122 7749513 6546412 6329805 7523856 6437716 1917641 -1669955 -836417 1867448
4618 1867448 2437141 1574714 2351446 4413530 4721269 2502434 -316373 -2660852 -4948191
4609d948191j827215j60727J373664J534776J007394O78387N68314J130799K689564
4600B046765L238875M38462l628866l888701L65898L901285L070262N35751J11457
4591F191188J132137J095053K76424J86449K93536k90626l28496J050980J701225
4582A1307870k79241k653061j996503R43491K335645P28939j731095k867247k429045
4573C359753r80622O85947J344862M97426p02403j096427j072597j108979l95594
4564E31366J279305K050479O44182j121343j000236O5347k43710j581655j785173
4555a161438p53826k48075l70177N06866K359999L096769J840267J8979j198675
4546D090689k113215k656566j739021O48861K557749K358246O76520o91234q77974
$$ plain form
4609 -4948191 -6775406 -6936133 -5562469 -4027693 -3020299 -2341912 -1773598 -642799 2046765
4600 2046765 5285640 5724102 2095236 -1793465 -1427567 2473718 5543980 6079731 6191188
4591 6191188 7323325 8418378 8694802 8881251 9174787 8884161 8555665 9606645 11307870
4582 11307870 11028629 8375568 6379065 7322556 9658201 10387140 8656045 5788798 3359753
4573 3359753 2379131 3065078 4409940 4907366 4204963 3108536 2035939 926960 531366
4564 531366 1810671 3861150 4505332 3383989 2383753 2449100 2205390 623735 -1161438
4555 -1161438 -1915264 -2163339 -2533516 -2026650 333349 3430118 5270385 5289364 4090689
4546 4090689 1977474 -679092 -2418113 -1769252 788497 3146743 3823263 3132029 2254055
4537B254055m74570o51231j968606l585354l823897k016421O22414K395634K692226
4528d555750J801507L77033l02173Q83107K832216K698859j69578k586540j634315
4519f55634J344700L023601K667032J863104J150846q8323j297020j328817q70097
4510E809392j446464k394020j629155P87563K618228K849290K382424J417106
4502A0394364q94125l841665n042509l665686j502878k93727o5872l59523q46778
4493f118399n48308J172346K665869J666083q31285j281968J155689L121908K013412
4484C015347m03414j048870J26552Q19154j86141j946106k712287j354308J505283
4475b184790L312382J990651j166303k790825j822384l54949J49446N96665J333594
$$ plain form
4537 2254055 1779485 1128254 -840352 -4425706 -8249603 -10266024 -9643610 -7247976 -4555750
4528 -4555750 -2754243 -2377210 -2679383 -1796276 1035940 3734799 3565221 978681 -655634
4519 -655634 689066 3712667 6379699 8242803 9393649 9305326 8008306 6679489 5809392
4510 5809392 4362928 1968908 339753 1127316 3745544 6594834 8977258 10394364
4502 10394364 9500239 5658574 616065 -3049621 -4552499 -4846226 -4912098 -5271621 -6118399
4493 -6118399 -6666707 -5494361 -2828492 -1162409 -1993694 -3275662 -2119973 1001935 3015347
4484 3015347 2611933 1563063 1689615 2508769 2322628 376522 -2335765 -3690073 -2184790
4475 -2184790 1127592 3118243 1951940 -838885 -2661269 -3016218 -2866772 -2270107 -936513
4466i36513P03103j627531k708405j67205L985753N867344M499895J839824n20229
4457A0936036k301373l275946l387385l475378l959044l520876r89376K137879
4449g835463L020761J029919j637154k628745j421657Q89792K451580J772270
4441d358697o92785k465552j675601P39391K475453K721790K344997K019622J656829
4432B765447J164203M19854r56685k488264k261684P89958M489709N255616K417195
4423A1595349r98280k070609j037837o0471l51608j432105k346198k591684k089932
4414a383375r87290L18614J222266J249140M63204n43659j138279r62874J46455
4405a615798J819568K458712K03079m141795o362237l311127K329120M498843
$$ plain form
4466 -936513 -233410 -1860941 -4569346 -4736551 -750798 5116546 9616441 11456265 10936036
4457 10936036 8634663 5358717 1971332 -1504046 -5463090 -8983966 -9973342 -7835463
4449 -7835463 -4814702 -3784783 -5421937 -8050682 -9472339 -8582547 -6130967 -4358697
4441 -4358697 -5051482 -7517034 -9192635 -8453244 -5977791 -3256001 -911004 1108618 2765447
4432 2765447 3929650 4349504 3392819 904555 -1357129 -567171 3922538 9178154 11595349
4423 11595349 10597069 8526460 7488623 7428152 7076544 5644439 3298241 706557 -1383375
4414 -1383375 -2370665 -2052051 -829785 419355 882559 338900 -799379 -1762253 -1615798
4405 -1615798 203770 2662482 2865561 -1276234 -7638471 -10949598 -8620478 -4121635
4397d121635J357286k412711k040606J384492L466121K728735J439144J336836
4389C137662J435842J47933k397313m551833m657848k456752L15436J342837M82777
4380g201259J40434J923524M151434M159722J996942J267n80285n84131q34092
4371C173556r59435n51169p8383j71860p26026r66022k14644J142727J553307
4362B202051J20867j496612o69425K325496M083265K637077n1327j528183k186081
4353E437128l079265l038876r78844J034789N20453j187377j131228J82837L6661
4344b203722j092850j36554K587151L014299N2961k088362l53089K485559K285836
4335D551229o54208l211373m184737m273153l297356p21026K091386K937942J671048
$$ plain form
4397 -4121635 -2764349 -5177060 -7217666 -5833174 -2367053 361682 1800826 3137662
4389 3137662 4573504 4721437 2324124 -2227709 -6885557 -9342309 -9026873 -7684036 -7201259
4380 -7201259 -7060825 -5137301 -985867 3173855 5170797 5172064 4591779 4007648 3173556
4371 3173556 2214121 1662952 1584569 1412709 686683 -279339 -493983 648744 2202051
4362 2202051 2322918 826306 156881 2482377 6565642 9202719 9151392 7623209 5437128
4353 5437128 2357863 -681013 -1659857 -625068 -104615 -1291992 -2423220 -2240383 -2203722
4344 -2203722 -3296572 -3433126 -845975 2168324 2221285 132923 -220166 2265393 4551229
4335 4551229 3897021 685648 -3499089 -7772242 -11069598 -11790624 -9699238 -6761296 -5090248
4326e090248P2776n63319j29882J137707K549464K848592J798235J008717J622687
4317E254729K184621O50029k301564l954706l112327j131086K91966O20601m5218
4308a542955j236015j716351l29425K395952M507218M680192L251413J378035
4300A1388064N4223k92276j96337q72345k530401l397733j750413J319206K731723
4291F453711J191370j353027k449073j913448j078177n20893J85735J084931J516709
4282C117838J210773P65071P49616Q85845M25516r27121k616922l518758k642272
4273b550414j02922K387302K677080M62865k075515k721663j783132j053012p70785
4264e530196M06467K290672K525543K94792j616387n27196K144956L078612J804182
$$ plain form
4326 -5090248 -5017472 -5580791 -5710673 -4572966 -2023502 825090 2623325 3632042 5254729
4317 5254729 7439350 8089379 5787815 1833109 -1279218 -2410304 -2118338 -1497737 -1542955
4308 -1542955 -2778970 -4495321 -4824746 -2428794 2078424 6758616 10010029 11388064
4300 11388064 11442287 11150011 10953674 10081329 7550928 4153195 2402782 3721988 6453711
4291 6453711 7645081 6292054 3842981 1929533 851356 330463 516198 1601129 3117838
4282 3117838 4328611 5093682 5843298 6729143 7154659 6227538 3610616 91858 -2550414
4273 -2550414 -2653336 -266034 2411046 2873911 798396 -1923267 -3706399 -4759411 -5530196
4264 -5530196 -5123729 -2833057 -307514 -12722 -1629109 -2156305 -11349 3067263 4871445
4255D871445L30678q75014k897291m651786l248439R84372L634165K201258k49114
4246A00274K24603K794613L719447J883578m85652j448880j000640J48715J038858
4237F974916K67001k507797n272704n702530l964508j855860q7368J585749K544563
4228h018538K124602J614236K742056M441315L916276J033332j212789j169302
4220E471188o43941j457565k427267j474143J050584K854332K434733J66002k315292
4211C658631l028638j238631J172470J499960J19261M40040L579065N556266K436976
4202A4195400l532186o356286m134448q25066O0332k66257N78876J697575Q47916
4193B265856j249489j809957l54653Q30805M31531n32731j321154k531114l642068
$$ plain form
4255 4871445 5202123 4327109 1429818 -3221968 -6470407 -5486035 -1851870 349388 100274
4246 100274 324877 3119490 6838937 8722515 8236863 6787983 5787343 5936058 6974916
4237 6974916 7241917 4734120 -538584 -6241114 -10205622 -12061482 -12148850 -10563101 -8018538
4228 -8018538 -5893936 -4279700 -1537644 2903671 6819947 7853279 6640490 5471188
4220 5471188 4827247 3369682 942415 -531728 518856 3373188 5807921 5973923 3658631
4211 3658631 629993 -608638 563832 2063792 2183053 2623093 6202158 11758424 14195400
4202 14195400 10663214 4306928 172480 -652586 -592254 -858511 -279635 1417940 2265856
4193 2265856 1016367 -793590 -1148243 -317438 114093 -418638 -1739792 -4270906 -7912974
4184g912974k396991J569952M862906M410129J662591K20499P48138J120075N29445
4175D813770J00988j89305j647304l541397l132794j20063K077795J043891j347014
4166a941433k134380j301354n48847j50017O92520J809373K314163J778711N1821
4157E70557k423730l417730q24867L085319L049309j473483m343778j827403J405287
4148f200519Q59462J850981J1796711K5105614K6351167J0584691q668326j6045128
4140D5634653j1563583n746442m001630l484313j915223j247133k560317l493470
4132A1622542k160543K32188J675180J495444j43576k383985l246914j473965
4124E616371J211012J938220N66600o48152q92782j444000k401081j888237N47537
$$ plain form
4184 -7912974 -10309965 -8740013 -3877107 533022 2195613 2416112 3164250 4284325 4813770
4175 4813770 4914758 4725453 3078149 -463248 -3596042 -3716105 -1638310 -594419 -1941433
4166 -1941433 -4075813 -5377167 -5926014 -6076031 -5383511 -3574138 -1259975 518736 570557
4157 570557 -1853173 -5270903 -6095770 -3010451 38858 -1434625 -5778403 -7605806 -6200519
4148 -6200519 -5341057 -3490076 8306635 33412249 59763416 70348107 61679781 45634653
4140 45634653 34071070 28324628 24322998 20838685 18923462 17676329 15116012 11622542
4132 11622542 9461999 9694187 11369367 12864811 12721235 10337250 7090336 5616371
4124 5616371 6827383 8765603 9332203 8684051 7791269 6347269 3946188 2057951 2605488
4115B605488K428558J696809m22006j451999j077391r04377j712100k480207j997060
4106c314285m44833Q73135J124516R67078J515943K339555J652343p91526k404477
4097A517449r73171J882225K623118O59106j173576j073445n26236j156504j756155
4088B2811k73941K699187M375895L147624J09993k462675l101277j881727j42989
4079B492901O00492R9237m02290J83192J265300J375213K71336o23380j81791
4070E080210P15722K63553j555673k467321r47485J172359R19516j246084j580497
4061C54300J268791L424228J020605l733372n208379k225944O39057M5367j687988
4052f103335q24268K280287M364736L794329J392235j632749m019110l933390
$$ plain form
4115 2605488 5034046 6730855 6308849 4856850 3779459 2875082 1162982 -1317225 -3314285
4106 -3314285 -3759118 -2885983 -1761467 -794389 721554 3061109 4713452 3921926 1517449
4097 1517449 544278 2426503 5049621 5708727 4535151 3461706 2935470 1778966 22811
4088 22811 -251130 2448057 6823952 9971576 10081569 7618894 4517617 2635890 2492901
4079 2492901 3093393 3192630 2790340 2973532 4238832 5614045 5885381 5262001 5080210
4070 5080210 5795932 6059485 4503812 2036491 1089006 2261365 3180881 1934797 354300
4061 354300 1623091 5047319 6067924 2334552 -2873827 -5099771 -4460714 -4415347 -6103335
4052 -6103335 -6927603 -4647316 -282580 3511749 4903984 3271235 -747875 -4681265
4044d681265q65688K541436L108973J284467K28881Q81321P76006j515964l507469
4035a749302k155074J607829L817065K375805p39088k249462j289169K03112J92658
4026A4374j088016j690785n11336J360375K099190J345469L23526J57115Q09074
4017B818986J441430J077868p83200l268722m140948k014157J411098K810592
4009f47053J355965j68624P37892K775317K802272L66206j758244j515796j39798
4000C808137l0142j467691k677146k446816j300711j01035J207163K793853L756724
3991C542336K890526N35829j410345j677731r35543l90018l5544O48201J014597
3982D182308j29903k304768l366811k180795M1996J558293J868104J072792q55678
$$ plain form
4044 -4681265 -5546953 -3005517 103456 1387923 1616804 2498125 3274131 1758167 -1749302
4035 -1749302 -3904376 -2296547 1520518 3896323 3157235 907773 -381396 -178284 14374
4026 14374 -1073642 -2764427 -3275763 -1915388 183802 1529271 1852797 2009912 2818986
4017 2818986 4260416 5338284 4555084 1286362 -2854586 -4868743 -3457645 -647053
4009 -647053 708912 540288 1278180 4053497 6855769 7221975 5463731 3947935 3808137
4000 3808137 3777995 2310304 -366842 -2813658 -4114369 -4215404 -3008241 -214388 3542336
3991 3542336 6432862 6968691 5558346 3880615 2945072 2555054 2519510 3167711 4182308
3982 4182308 4052405 1747637 -1619174 -3799969 -3757973 -2199680 -331576 741216 -114462
3973a14462k954226l009111k38405K876459L445978J993513J160998J302689K77606
3964D741039k284421l693160k306108j39494M04625Q2965P88192J784466P55734
3955A33838k233903m465280m067923j667400J296945L756832M493218K714351
3947c9322k10864j471619j29472J727440J895379P22251n0938J16057L09690j84045
3937B684557r85907j149334j32289J471794K171219J176599l79407p82779o6680
3928D007773M22459O28377J839767L634138L248775l98202m100608m078645j021632
3919D182202J069925L70670j095620j229871o19262o46683r87591n07650N75835
3910A111955R61302J93001q66156j340626j210783q16807k25363N40484R87761
$$ plain form
3973 -114462 -3068688 -6077799 -6316204 -3439745 6233 1999746 3160744 4463433 4741039
3964 4741039 2456618 -1236542 -3542650 -3682144 -3277519 -3194554 -2406362 -621896 133838
3955 133838 -2100065 -6565345 -10633268 -12300668 -11003723 -7246891 -2753673 -39322
3947 -39322 -250186 -1721805 -1851277 -123837 1771542 2493793 2442855 2558912 2868602 2684557
3937 2684557 1698650 549316 417027 1888821 4060040 5236639 4857232 4074453 4007773
3928 4007773 4430232 5058609 6898376 10532514 13781289 13383087 9282479 5203834 4182202
3919 4182202 5252127 5622797 4527177 3297306 2678044 2031361 1043770 536120 1111955
3910 1111955 2073257 2266258 1400102 59476 -1151307 -1968114 -2193477 -1652993 -665232
3901f65232L93327j251182k785817k786800j018832J285848K705188K939812K756508
3892A572820K867117K985742J974819p68376l823583m356894j216836K998943
3884B233752M360696K070843r56812k088371j704573j374742j344787j168037
3876B7969j155932j504517j196310N23528K538167L307954K958328K347647J207381
3867I054215q52962k527753k271228q92981m41376j056040j268694r28032j201490
3858b386341j849076j219984Q26517K497361K774653K123887N28906k277238m435148
3849c416463l173575P90268L356625K606500Q67894L1575j177075l172220l053561
3840f340032M29891L245776J766003r79997J08947L614979L644523l90769k596856
$$ plain form
3901 -665232 -271905 -1523087 -4308904 -7095704 -8114536 -6828688 -4123500 -1183688 1572820
3892 1572820 4439937 7425679 9400498 8632122 4808539 451645 -765191 2233752
3884 2233752 6594448 8665291 7708479 5620108 3915535 2540793 1196006 27969
3876 27969 -1127963 -2632480 -3828790 -3305262 -767095 2540859 5499187 7846834 9054215
3867 9054215 8201253 5673500 3402272 2509291 2067915 1011875 -256819 -1184851 -2386341
3858 -2386341 -4235417 -5455401 -4628884 -2131523 643130 2767017 3295923 1018685 -3416463
3849 -3416463 -6590038 -5799770 -2443145 163355 1031249 1062824 -114251 -3286471 -6340032
3840 -6340032 -5910141 -2664365 -898362 -1878359 -1769412 1845567 5490090 5099321 2502465
3831B502465k18425J838472r71058n361607n082510m5690M094071M029747K090816
3822B876281J501569K109214K015646Q82687j73525p40047j490887k609954k946275
3813A424709j206887K217534M933015M368670K35677m772987p019888n067909
3805d888066r80988J687325J384245k04209o33811K25392N88195j54914m51029
3796c427860P55304K011992J314304j026470k941163l247209k220370k46302K236990
3787f790784L796093L048948Q33211n30779m76079p35546k004346k235226J80021
3778d914487L208456L407186P16146j250831k4538K464635K499991o64696m037713
3769A404149m564711k235068P99725K990070M218995M539432L581897J462564
$$ plain form
3831 2502465 2284040 4122512 3151454 -2210153 -7292663 -7338353 -3244282 785465 2876281
3822 2876281 4377850 6487064 8502710 9385397 9211872 8471825 6980938 4370984 1424709
3813 1424709 217822 2435356 7368371 11737041 11972718 7199731 179843 -4888066
3805 -4888066 -5869054 -4181729 -2797484 -3001693 -3635504 -3410112 -2821917 -2976831 -3427860
3796 -3427860 -2672556 -660564 653740 -372730 -3313893 -6561102 -8781472 -9027774 -6790784
3787 -6790784 -2994691 54257 887468 356689 -119390 -854936 -2859282 -5094508 -4914487
3778 -4914487 -1706031 1701155 2417301 1166470 1141932 3606567 6106558 5441862 1404149
3769 1404149 -3160562 -5395630 -4595905 -1605835 2613160 7152592 10734489 12197053
3761A2197053q30965k435371l187849k921075j269899J198537K710004K081159
3753G541594J34704j389406j629423p92645L66044N66018j127372l426274l375688
3744c132448k70291K595906K117088k00866o45514J039031J677864j8446j696646
3735A465678j498786o97125q97092j323408o20765O55915J100653N78029j83828
3726a420729r59529j714713j845206p70566J257625L279019L897655J913007j816177
3717A820386l807670j668859K007669K538701j17428j432033K20571R30502j720397
3708a228558l862553j502972K473349K586464n74740j631680R00624K979753K184104
3699B323791J063168J980096L127887J829269j454946m427545n754484m995143
$$ plain form
3761 12197053 11366088 8930717 5742868 2821793 1551894 2750431 5460435 7541594
3753 7541594 7676298 6286892 4657469 3864824 4230868 4796886 3669514 243240 -3132448
3744 -3132448 -3402739 -806833 1310255 1109389 463875 1502906 3180770 3162324 1465678
3735 1465678 -33108 -730233 -1627325 -2950733 -3571498 -2915583 -1814930 -1236901 -1420729
3726 -1420729 -2380258 -4094971 -5940177 -6710743 -5453118 -2174099 1723556 3636563 1820386
3717 1820386 -1987284 -3656143 -1648474 890227 772799 -659234 -438663 491839 -1228558
3708 -1228558 -5091111 -6594083 -4120734 -1534270 -2109010 -3740690 -2840066 139687 2323791
3699 2323791 3386959 5367055 8494942 10324211 8869265 4441720 -1312764 -6307907
3691f307907k168625J017657J751644l82571k365565j677633O08887K156997K795085
3682d572031L685032M624305M324392K544615K44778j768214l073507l286377
3674B722993k646842k146633k026420j168490Q47679K264489J292460j150822
3666b011586k540174j985922p24273J62498P25585J005672P43017M99221J377069
3657b748893K969171L054646M16719l043123m295098k763918n62811O80296J529880
3648d763131K625877K627037K00437k778093k611520J205285M754962M607687
3640E868541J763353q71817k553201l715495l120916K54887L618196K922022r71301
3631C194269k953886j180328N41436n71784j841274k97700J813938Q76570j659332
$$ plain form
3691 -6307907 -8476532 -7458875 -5707231 -6089802 -8455367 -10133000 -9524113 -7367116 -4572031
3682 -4572031 -886999 3737306 8061698 10606313 10851091 9082877 6009370 2722993
3674 2722993 76151 -2070482 -4096902 -5265392 -4417713 -2153224 -860764 -2011586
3666 -2011586 -4551760 -6537682 -7261955 -7099457 -6373872 -5368200 -4625183 -4125962 -2748893
3657 -2748893 220278 3274924 3691643 648520 -3646578 -6410496 -6973307 -6293011 -4763131
3648 -4763131 -2137254 489783 690220 -2087873 -4699393 -3494108 1260854 5868541
3640 5868541 7631894 6760077 4206876 491381 -2629535 -2374648 1243548 4165570 3194269
3631 3194269 240383 -939945 -398509 -970293 -2811567 -3109267 -1295329 -418759 -2078091
3622b078091j443925J742416L831568K769865N96837q52491k131738l252237k388268
3613c206064Q49834L701128L579230J142937j220035k158326j602257j45328P84839
3604A725958J173j211534n192L646658N696277L061139j885247m163193k350098
3595D515941M76740J318845L60293o24708q99173r51851j200851j428258j267861
3586B99117q44040p40832j150922j324062n83755K60748k45973j724576j916999
3577g971294J3328J764025J034462r05004r19813J327412K824993J578741o68745
3568a921895j097022M52423J863085J925111J450164J347556J165411K37877p63344
3559D659366o51697K11639R4198j426028k289265o42416K208230L179717J399678
$$ plain form
3622 -2078091 -3522016 -1779600 2051968 4821833 5418670 4566179 2434441 -817796 -3206064
3613 -3206064 -2356230 1344898 4924128 6067065 4847030 2688704 1086447 941119 1725958
3604 1725958 1727131 515597 510405 4157063 9853340 12914479 11029232 6866039 4515941
3595 4515941 4992681 6311526 6671819 6047111 5147938 4196087 2995236 1566978 299117
3586 299117 -544923 -1285755 -2436677 -3760739 -4344494 -4083746 -4329719 -6054295 -7971294
3577 -7971294 -7957966 -6193941 -5159479 -6064483 -6984296 -5656884 -2831891 -1253150 -1921895
3568 -1921895 -3018917 -2566494 -703409 1221702 2671866 4019422 5184833 5422710 4659366
3559 4659366 4007669 4219308 4313506 2887478 598213 -44203 2164027 5343744 6743422
3550F743422r91485k073218k167533k046870j237537N29661J864574J481623K91264
3541B393901J086N48714P08250M46582O72313J139455P06210m68909j035369q28099
3531D284134j133237k273708k843562j864728o288J784366L094091L083197Q62538
3522D986803k298494l337337j340327Q83708Q48758K6512J101525L164732K709402
3513F745282j011999m592847m949835k840060r59246l64003r3819P54687J905295
3504e406545K524715K188527J290563O91072P31393P11497j16178j200117j191822
3495B23105J49116J492400J666198R53545K14051m00725j078400j319385l47498
3486A552407J443504K317506J009895j526437k750920j187836J834379L541373
$$ plain form
3550 6743422 5751937 3678719 1511186 -535684 -1773221 -1243560 621014 2102637 2393901
3541 2393901 2394987 2943701 3651951 4098533 4770846 5910301 6616511 6147602 5112233 4284134
3531 4284134 3150897 877189 -1966373 -3831101 -3837389 -2053023 1041068 4124265 4986803
3522 4986803 2688309 -649028 -1989355 -1105647 -256889 -230377 871148 4035880 6745282
3513 6745282 5733283 1140436 -3809399 -6649459 -7608705 -7972708 -8066527 -7311840 -5406545
3504 -5406545 -2881830 -693303 597260 1288332 2019725 2731222 2615044 1414927 223105
3495 223105 372221 1864621 3530819 4484364 4698415 4297690 3219290 1899905 1552407
3486 1552407 2995911 5313417 6323312 4796875 2045955 858119 2692498 6233871
3478F233871K631691J81807k201927l910520m624881l618816j081844R63510Q02031
3469d625078n54518q99273k18288k87682j120979o54094J403739K350663O29065
3460c976445j482546j447255l43335l74564n78936J301934L891262L428966l8196
3451C80885k084073n99137J155335K54435j148490q1254J609186L62850k489636
3442b639899k445945N43722J675936o90881k076583O61822L763908K340737j911251
3433g78434l495964j269366J289914K618637M316020N946356M425553Q9578k037694
3424A1104600K27327K188174n83664n195742o141254l732086k288067k118616
3416f539328L01314M684818O005887K483422j266052j342418J88104J10360m02680
$$ plain form
3478 6233871 8865562 9047369 6845442 2934922 -1689959 -5308775 -6390619 -5427109 -4625078
3469 -4625078 -5179596 -6078869 -6297157 -6584839 -7705818 -8359912 -6956173 -4605510 -3976445
3460 -3976445 -5458991 -6906246 -7249581 -7624145 -8203081 -6901147 -3009885 419081 380885
3451 380885 -1703188 -2302325 -1146990 -892555 -2041045 -2122299 -513113 -150263 -2639899
3442 -2639899 -5085844 -4542122 -2866186 -3557067 -5633650 -4971828 -1207920 1132817 -778434
3433 -778434 -4274398 -5543764 -4253850 -1635213 2680807 8627163 13052716 13142294 11104600
3424 11104600 11331927 13520101 12936437 7740695 1599441 -2132645 -4420712 -6539328
3416 -6539328 -6238014 -1553196 4452691 6936113 5670061 4327643 4515747 4626107 4223427
3407D223427J021824K750977J607596j669878l648177l382860k500077j400744
3399b997912N69415J994243O42558k246840k885582n11861J598271J277039K9309
3390b531360m74768q85047j630546j175472J105199K935448K242391J97705q99713
3381a116163r45725j177109j599603j366595m95175O35111K316945M362893N202677
3372E817256L898244J833160O75521L3783j012100j664737j050298n83972j824454
3363F122403l150796j899664Q58937J367095r65834k582375j485966j41029r00713
3354b777942j955776n94257J975199K339804J58921j418430l44208J895219K726287
3345B004817J479466n06408j497692q56092J80872n28278l224058n038026l244417
$$ plain form
3407 4223427 5245251 7996228 9603824 7933946 4285769 902909 -1597168 -2997912
3399 -2997912 -2428497 -434254 208304 -2038536 -4924118 -5435979 -3837708 -2560669 -2531360
3390 -2531360 -3006128 -3891175 -5521721 -6697193 -5591994 -2656546 -414155 -216450 -1116163
3381 -1116163 -2061888 -3238997 -4838600 -6205195 -6700370 -6065259 -3748314 614579 5817256
3372 5817256 9715500 11548660 12224181 12257964 11245864 9581127 8530829 7946857 6122403
3363 6122403 2971607 1071943 1930880 3297975 2332141 -250234 -1736200 -1877229 -2777942
3354 -2777942 -4733718 -5327975 -3352776 -1012972 -854051 -2272481 -2616689 -721470 2004817
3345 2004817 3484283 2977875 1480183 624091 804963 276685 -2947373 -7985399 -11229816
3336a1229816P22566K684103J233168o48387k49445J236011J430010P33073R14063
3327c174654J422648M39418j132861m19100K410853L651350J869110M71856K024135
3318G562755L379504L33106n075429o623073k698222J607185J901880k53754j196707
3309a062755n57115j64459k33322L29689J318035J564210R61634J00164j105462
3300A150619k518081k702638q91166J056402R64481l28145m30210O36069P65977
3291b296692l32521o07740P57204K086113K152944J809967J826159J447246J70752
3282G013432j064037j509937j634092j622510p57992P49906J269218K19990q32126
3273A831852p32897m17343o94769n20962P08883J273012n4963j064130J037707
$$ plain form
3336 -11229816 -10507250 -7823147 -6589979 -7238366 -7487811 -6251800 -4821790 -4088717 -3174654
3327 -3174654 -1752006 -1312588 -2445449 -2864549 -453696 3197654 5066764 5538620 7562755
3318 7562755 10942259 11275365 6199936 -423137 -3121359 -1514174 387706 133952 -1062755
3309 -1062755 -1619870 -1784329 -2017651 -1687962 -369927 1194283 2155917 2256081 1150619
3300 1150619 -1367462 -4070100 -4961266 -3904864 -2940383 -3268528 -3698738 -3062669 -2296692
3291 -2296692 -2629213 -3236953 -2479749 -393636 1759308 3569275 5395434 6842680 7013432
3282 7013432 5949395 4439458 2805366 1182856 424864 1174770 2443988 2663978 1831852
3273 1831852 1098955 681612 -13157 -534119 174764 1447776 1392813 328683 1366390
3264A366390M840824N963623K912294j144910k817783k129479r12620Q0905R34617
3255I093861R50850q33442l790099n648686m680060j521033J459539K524112J947459
3246d97499Q88656l39759j787371k216026m6282L539355M747035J950674j645622
3237D593161k250041o82001m90319k069674k296647l3264J775213P66616j243346
3228a930302j350656J95948J278522J644116K533173L494444K519583m92276k865561
3219E026991k550939o08413P07882R02494R29056R11875k7605j693486k246208
3210A351647o08368J581773J755453j58661j531049n69156J331314J723179N19086
3201E395218k22673N16157J371536O67916j494266l720635m815695m176439j689911
$$ plain form
3264 1366390 6207214 12170837 15083131 13938221 11120438 8990959 8078339 8159244 9093861
3255 9093861 10044711 9211269 5421170 -227516 -4907576 -6428609 -4969070 -2444958 -497499
3246 -497499 391157 51398 -1735973 -3951999 -3998281 -458926 4288109 6238783 4593161
3237 4593161 2343120 1661119 1170800 -898874 -3195521 -3228785 -1453572 -686956 -1930302
3228 -1930302 -3280958 -3085010 -1806488 -162372 2370801 5865245 8384828 7892552 5026991
3219 5026991 2476052 1867639 2575521 3478015 4407071 5318946 5291341 3597855 1351647
3210 1351647 743279 2325052 4080505 3921844 2390795 1821639 3152953 4876132 5395218
3201 5395218 5172545 5688702 7060238 7728154 6233888 2513253 -2302442 -6478881 -8168792
3192h168792J781769M311158M263047J809041j222658k822330k069701L32380
3184a786086K297634J892443m48099j747432K80557L991838N233052K411571j299641
3175A0825837j960972L0489O90554j962801n246994n566725k946386j53073J373169
3166d916902K373750L031884K068506p16403l188467l445578k084977o85361M39460
3157g124088J477828J616696L52364p17038K67253K260844K357778J8000k026260
3148a516623j550136N54073K210495K780599K593656J482872n95014k373761k301805
3139A284356n58732J048109J217183M42062O8775N79255J120554O72403o18762
3130E255203j633316j665136r28187L03261J884782K777353J491325j333542k534595
$$ plain form
3192 -8168792 -6387023 -2075865 2187182 3996223 2773565 -48765 -2118466 -1786086
3184 -1786086 511548 2403991 1955892 208460 489017 4480855 9713907 12125478 10825837
3175 10825837 8864865 8895354 9585908 7623107 2376113 -3190612 -6136998 -6290071 -4916902
3166 -4916902 -2543152 488732 2557238 1840835 -1347632 -4793210 -6878187 -7563548 -7124088
3157 -7124088 -5646260 -4029564 -3677200 -4394238 -4126985 -1866141 491637 509637 -1516623
3148 -1516623 -3066759 -2512686 -302191 2478408 5072064 6554936 5959922 3586161 1284356
3139 1284356 725624 1773733 2990916 3432978 3501753 4081008 5201562 5873965 5255203
3130 5255203 3621887 1956751 1028564 1331825 3216607 5993960 7485285 6151743 3617148
3121C617148m84889J993709J276332j727163k968517j258967P06926J221892J518004
3112C894475K147092J466304o65481j457373L21226J803225N59316j488836j659627
3103D920321j042012j940680l370604l014216j578038j037957l17729K670762
3095d710153N893031N114940O41845k749332k831003k033851j900428n94036K320045
3086h48942L442275O96592k835392l251784j082876O09202Q16772M82740L6119
3077a935294k36775P34916K843847L763692K252685M91120O19654J166035r4727
3068I605153j897062j721218n18049j076743k763141k318109L56191J656571R2539
3059A416132j525857r42751K96153K68003Q379R87941J804078K10680k981830
$$ plain form
3121 3617148 3132259 5125968 6402300 4675137 1706620 447653 1154579 2376471 3894475
3112 3894475 6041567 7507871 6842390 5385017 5706243 7509468 8068784 6579948 4920321
3103 4920321 3878309 1937629 -1432975 -4447191 -6025229 -7063186 -7380915 -4710153
3095 -4710153 1182878 6297818 6939663 4190331 1359328 -674523 -2574951 -3168987 -848942
3086 -848942 2593333 3289925 454533 -2797251 -3880127 -3270925 -2454153 -1971413 -1935294
3077 -1935294 -2172069 -1437153 1406694 5170386 7423071 7914191 8533845 9699880 9605153
3068 9605153 7708091 5986873 5468824 4392081 1628940 -689169 -332978 1323593 1416132
3059 1416132 -109725 -1052476 -756323 -488320 -479941 508000 2312078 2522758 -459072
3050d59072m562904k903918M64976K857773K818581R81040n77796l45745Q18199
3041i08866P71176p42247j492103n6197J923683K031876L07353j238495j321223
3032g25043k09776J315206K472448K566742J702469Q35275L18749o10053k023438
3023E642579k400774r08142Q45556J104327O53220J028549J328782l14721k781774
3014D197602k791268R5799K457709J850056j80368j140996j001432q98140p63305
3005A825657k86266l95123j616009k407641j276575O89664J540724J486432J813503
2996A374366J902226K06199k356749l062174j476742L6106K66769O06928J738732
2987g64339J966546L84488j060936p07331m811q39673k080401j575005q208L49530
$$ plain form
3050 -459072 -5021976 -7925894 -7460918 -4603145 -1784564 -803524 -1381320 -1727065 -908866
3041 -908866 -137690 -879937 -2372040 -2428237 -504554 1527322 1834675 596180 -725043
3032 -725043 -934819 380387 2852835 5419577 7122046 7957321 8276070 7666017 5642579
3023 5642579 3241805 2333663 3179219 4283546 4936766 5965315 7294097 6979376 4197602
3014 4197602 1406334 1502133 3959842 5809898 5629530 4488534 3487102 2588962 1825657
3005 1825657 1539391 1144268 -471741 -2879382 -4155957 -3466293 -1925569 -439137 1374366
2996 1374366 3276592 3482791 1126042 -1936132 -3412874 -3376768 -3109999 -2503071 -764339
2987 -764339 1202207 1586695 525759 -181572 -186383 -1026056 -3106457 -4681462 -4689670 -4340140
2977d340140k99581J56219J525096J206100j269772k960071j968286k68235l51883
2968h570553j442340j181541N94193J991156J975871J226956P05893R33531K067393
2959a699441L303590K918112L64897k364391l009749j976412j289189j276604
2951e029187m43515J485504K636189J655203m00634j549047j053611K74397Q11921
2942a612780q73954m255729o052340l264764K406478N390202K780311j879203
2934g361779l082722m5088L297535L927593K802980K285991K766908K700943Q22252
2925H114613k347094m621940l754989K45512M357527N085184K092527j398496
2917G772844k134572j71626J626330R76460j403631k820330j838437N6750N67784
$$ plain form
2977 -4340140 -4639721 -4483502 -2958406 -1752306 -3022078 -5982149 -7950435 -8218670 -8570553
2968 -8570553 -10012893 -11194434 -10600241 -8609085 -6633214 -5406258 -4700365 -3766834 -1699441
2959 -1699441 1604149 4522261 4887158 2522767 -486982 -2463394 -3752583 -5029187
2951 -5029187 -5472702 -3987198 -1351009 304194 -96440 -1645487 -2699098 -2424701 -1612780
2942 -1612780 -2486734 -6742463 -12794803 -16059567 -13653089 -8262887 -5482576 -7361779
2934 -7361779 -10444501 -10489589 -7192054 -3264461 -461481 1824510 4591418 7292361 8114613
2925 8114613 5767519 1145579 -2609410 -2363898 1993629 7078813 9171340 7772844
2917 7772844 5638272 5466646 7092976 8069436 6665805 3845475 2007038 2063788 2631572
2908B631572k26193k12068J258302K248644J507349O80093J369342J853940m57089
2899A0653892m372294n950708l980772j217248J80861J103101K347999K385532
2891A150363K80965j822678j609672j7366O58021L58264L82516M01178p29451
2882i47860k143486j961997n95001r2974m66344K14911J860861J812738p69279
2873c088431k992600k322599j24812Q00539K61522J28699J162636K513727L449094
2864b12225L634171K458878O0939j522704l74792K174347K540751m63689l791951
2855D503725l989928j497855L07628l28766j617901j114333Q71785J888943Q23729
2846a52973o64771n42092R56720J968544J467167l5496j661448k709193k411721
$$ plain form
2908 2631572 2405379 2193311 3451613 5700257 7207606 7887699 9257041 11110981 10653892
2899 10653892 6281598 330890 -3649882 -4867130 -4686269 -3583168 -1235169 1150363
2891 1150363 1431328 -391350 -2001022 -2018388 -1360367 -1002103 -619587 -218409 -947860
2882 -947860 -3091346 -5053343 -5648344 -5741318 -6207662 -5992751 -4131890 -2319152 -3088431
2873 -3088431 -6081031 -8403630 -8528442 -7727903 -7466381 -7337682 -6175046 -3661319 -212225
2864 -212225 3421946 5880824 5941763 4419059 4044267 6218614 8759365 8295676 4503725
2855 4503725 513797 -984058 -676430 -1005196 -2623097 -3737430 -2865645 -976702 -152973
2846 -152973 -817744 -1359836 -403116 1565428 3032595 2997099 1335651 -1373542 -3785263
2837c785263p14585P90762L79044j213727j470680L02490K037179K188580J694616
2828B08416J480341M73735j822721k985778q78510K172623J862027j798658m129873
2819e418398k274385J147053K202118P90024l67561L958P81435Q40734K93596
2810b001426m56926j234475j510926n84635J210580K259812J233658j257802k938162
2801e280302k026003Q36556L118654L115485J695705Q03407Q07407M94163n50061
2792C015011j140188n34817K00606j05778p49873k13104J335020J986559N94849
2783D388285j714913k841408j877085K75263J953660K065232O72424j287617k738863
2774a105022l106159k519508j556501o92326J27491J277375K738078L818679L768039
$$ plain form
2837 -3785263 -4499848 -3709086 -3330042 -4543769 -6014449 -5711959 -3674780 -1486200 208416
2828 208416 1688757 2162492 339771 -2646007 -3524517 -1351894 510133 -1288525 -5418398
2819 -5418398 -7692783 -6545730 -4343612 -3553588 -3921149 -3917191 -3135756 -2295022 -2001426
2810 -2001426 -2458352 -3692827 -5203753 -5788388 -4577808 -2317996 -1084338 -2342140 -5280302
2801 -5280302 -7306305 -6469749 -3351095 -235610 1460095 2263502 3070909 3565072 3015011
2792 3015011 1874823 1340006 1540612 1434834 684961 471857 1806877 3793436 4388285
2783 4388285 2673372 -168036 -2045121 -1769858 183802 2249034 2921458 1633841 -1105022
2774 -1105022 -4211181 -6730689 -8287190 -8979516 -8852025 -7574650 -4836572 -1017893 2750146
2765B750146K445416K91792j905980l032427k211925m7377J351169N35209j476995
2756a300972k526796k035476j189897o72638K43749J985406L381725K883403M68826
2747A237330k180192l152320j955414o697Q64187P35234J456070L403024L951568
2738D352790J155326k431226k651661J16024J398112m20349j649410N13358L193524
2729C576488K233710j459162l529810k405350l92245M67425L26828k07126p32013
2720b121255j60327K046041L827252K459752j304582l708999k980889j225505
2712c168512o92339p88986l8705J190265J531208P80885j88532p57800p99173
2703b931689l40475L06276O97249Q30491Q67016L90721r39214k141126j774412
$$ plain form
2765 2750146 5195562 5487354 3581374 548947 -1662978 -1710355 -359186 176023 -1300972
2756 -1300972 -3827768 -5863244 -7053141 -7725779 -7482030 -5496624 -2114899 768504 1237330
2747 1237330 -942862 -4095182 -6050596 -6057293 -5193106 -4457872 -3001802 401222 4352790
2738 4352790 5508116 3076890 425229 541253 1939365 1519016 -130394 382964 3576488
2729 3576488 5810198 4351036 821226 -1584124 -1976369 -1508944 -1182116 -1389242 -2121255
2720 -2121255 -2281582 -235541 3591711 6051463 4746881 1037882 -1943007 -3168512
2712 -3168512 -3860851 -4649837 -4688542 -3498277 -1967069 -1186184 -1374716 -2132516 -2931689
2703 -2931689 -3272164 -2965888 -2268639 -1438148 -571132 -180411 -1119625 -3260751 -5035163
2694e035163j14910J043304Q78461K55733j31224n11090o87175O6425J267474
2685b968165J384146L43391k03789J42992l68575k388286l634532k043354J129861
2676h606311L139638L063054J603530o86566l011852l719583k268401n92888m70840
2667a1550219q68055j06583Q52094J49888j128040k93014K173696K796484N09485
2658g464264j516808o25246J730642K824083K548122K267768J708750k97556k832247
2649a656756l332541j226033R32215P51183r64791j617088m59708O65759L98992
2640f508768J31002J843882M441064M394910O45920l157435k991226K50616J996534
2631A046499P6866k807407l150622j101930L82980m06973k190477k635353r84139
$$ plain form
2694 -5035163 -5150073 -4106769 -3228308 -2972575 -3103799 -3614889 -4302064 -4235639 -2968165
2685 -2968165 -1584019 -1240628 -1444417 -1301425 -1670000 -4058286 -7692818 -9736172 -8606311
2676 -8606311 -5466673 -2403619 -800089 -1486655 -4498507 -8218090 -10486491 -11079379 -11550219
2667 -11550219 -12418274 -12524857 -11672763 -11522875 -12650915 -12943929 -10770233 -7973749 -7464264
2658 -7464264 -8981072 -9606318 -7875676 -5051593 -2503471 -235703 1473047 1175491 -1656756
2649 -1656756 -4989297 -6215330 -5283115 -4531932 -5496723 -7113811 -7573519 -6907760 -6508768
2640 -6508768 -6377766 -4533884 -92820 4302090 4948010 1790575 -1200651 -950035 1046499
2631 1046499 1123365 -1684042 -4834664 -5936594 -5553614 -5960587 -8151064 -10786417 -11770556
2622a1770556J409568K707850K484348J860858J811778J939291J413819M71592
2614B328548r42J7773k07564o43896l85013O80938J347020P88593k35163o15672
2604C074622n67806j204942k789444m143134l848488j766467O57631J646978Q40728
2595h100322l15041j78698J272956K556317K338370O38259j218155j440580P61482
2586c685412L837576M746068K219278j383358k714511j440005j45720n68739j634476
2577g69299j413971M40783K542752K979354P83956k574439l647754p79444K973507
2568E35445L091797k84269k444495r19085J202180M52759j803203k217468r96734
2559c383073r45245k334976k579188q34241N70311j5645j102911o10427J191969
$$ plain form
2622 -11770556 -10360988 -7653138 -5168790 -3307932 -1496154 443137 1856956 2328548
2614 2328548 2327606 2345379 2137815 1493919 1108906 1789844 3136864 3925457 3690294 3074622
2604 3074622 2506816 1301874 -1487570 -5630704 -9479192 -11245659 -10588028 -8941050 -8100322
2595 -8100322 -8415363 -8594061 -7321105 -4764788 -2426418 -1788159 -3006314 -4446894 -3685412
2586 -3685412 152164 4898232 7117510 5734152 3019641 1579636 1433916 865177 -769299
2577 -769299 -2183270 -1742487 800265 3779619 4563575 1989136 -1658618 -2438062 535445
2568 535445 3627242 3342973 898478 -20607 1181573 1634332 -168871 -2386339 -3383073
2559 -3383073 -4328318 -6663294 -9242482 -10076723 -9506412 -9522057 -10624968 -11235395 -10043426
2550a0043426K515820K376489J033285p73619k100100k111246q29872R22482K505334
2541f504853L637406L658892J887336q87746k455108j475274R91014K752434K606798
2532D210899Q26534j609151l592322m232706l278494j101514J749508M536114
2524b491132O024627N147461K301556p37772k537026l037171k751614j877830
2516D1099o61073K31093M06034K53598J48685l17294j598402l028560l161762
2507g686582j386615J127064K288939J115964r32404j128063J363760M001226
2499a236711L728169J027865o14303M38811J770081P23512j570895k129436p69577
2490A367516p3510r89439j375388K38432J930502J163321j324653k461837r76693
$$ plain form
2550 -10043426 -7527606 -5151117 -4117832 -4891451 -6991551 -9102797 -9932669 -9010187 -6504853
2541 -6504853 -2867447 791445 2678781 1791035 -664073 -2139347 -1148333 1604101 4210899
2532 4210899 5037433 3428282 -164040 -4396746 -7675240 -8776754 -7027246 -2491132
2524 -2491132 3533495 8680956 10982512 10244740 7707714 4670543 1918929 41099
2516 41099 -619974 -388881 17153 270751 419436 102142 -1496260 -4524820 -7686582
2507 -7686582 -9073197 -7946133 -5657194 -4541230 -5473634 -6601697 -5237937 -1236711
2499 -1236711 2491458 3519323 2905020 3343831 5113912 5837424 4266529 2137093 1367516
2490 1367516 1294006 304567 -1070821 -832389 1098113 2261434 936781 -1525056 -2501749
2481b501749J315770K220172J466247O0049j156951j623647q99973O24671J518913
2472A023502P68958q35810j555700p72467M82128R63202M85449k74382o34966
2463c50086m25479m2556J2784j6480Q69139K846395M100981K599951q89223l167913
2453E537513k665809j492149k124976l524299k646690Q57760L823573L608047
2445A372970R08574j948011l582848l571670j771255Q88135K315824J630182O38699
2436c119400J265348K399672J461457j281094k492317m63796K246191K297445
2428B313506R3154j086853K54965K025584J579658r51279l093511k952105r04283
2419b721164J270315K194950J695376L01500j434554k910536l265532k028971
$$ plain form
2481 -2501749 -1185979 1034193 2500440 2560489 1403538 -220109 -1120082 -495411 1023502
2472 1023502 1792460 956650 -599050 -1371517 -889389 73813 559262 284880 -350086
2463 -350086 -775565 -818121 -805337 -821817 47322 2893717 6994698 9594649 8705426 5537513
2453 5537513 2871704 1379555 -745421 -4269720 -6916410 -6058650 -2235077 1372970
2445 1372970 2281544 333533 -3249315 -6820985 -8592240 -7704105 -5388281 -3758099 -3119400
2436 -3119400 -1854052 545620 2007077 725983 -1766334 -2230130 16061 2313506
2428 2313506 2406660 1319807 1574772 3600356 5180014 4228735 1135224 -1816881 -2721164
2419 -2721164 -1450849 744101 2439477 2740977 1306423 -1604113 -4869645 -6898616
2411f898616r7430P92243J28226n22257M71331K485370L384160K207460j13655
2402A836832k455327m271911m565369k190747J773394L876329K311132k85515
2394c971182j85374K266868L424955J853336M5331J10187P97008L74430j65756
2385D549803P71810J917465Q11728j852214k695236o95374J091496k3969k472316
2376A403193k775069l88530J859823J689373k09666j896860k630317k643576j680402
2367g272031N95889K920598K906033N6082k897491l001601p27089R42796O60535
2358e816279l5704J76708L18567p07186j728451r40191J178623K441135J873516
2349c239262M94615l58276r0205J226156K598945K424189N09220r91925l50282
$$ plain form
2411 -6898616 -6996046 -6203803 -6075577 -6597834 -6126503 -3641133 -256973 1950487 1836832
2402 1836832 -618495 -4890406 -9455775 -11646522 -9873128 -5996799 -3685667 -3971182
2394 -3971182 -4156556 -1889688 1535267 3388603 3433934 3544121 4341129 4715559 4549803
2385 4549803 5321613 7239078 8050806 6198592 3503356 2807982 3899478 3875509 1403193
2376 1403193 -1371876 -1760406 99417 1788790 1579124 -317736 -2948053 -5591629 -7272031
2367 -7272031 -6676142 -3755544 -849511 -793429 -3690920 -6692521 -7419610 -6476814 -5816279
2358 -5816279 -5851983 -5675275 -5356708 -6063894 -7792345 -8732536 -7553913 -5112778 -3239262
2349 -3239262 -2744647 -3102923 -3193128 -1966972 631973 3056162 3565382 2573457 2223175
2340B223175R76381M89496j400877k341028k250340l068437m270166k691508J955565
2331a0377739N317099M357105J685815J130133K020715J472017j9440M17060K585580
2322H588345L176045J093545j145812j926056k726151m528186n342221l395018
2314f205509m10609O39253l54961q99429N09137K809309M047187L312139J187224
2305D633741p94814j309275n04001J32599l91584j324186j292079k15943N88209
2296d77333Q2861j207942j675409l44811J847524K830988J840656N49732Q78364
2287D324630K131620J771777q82474l340037l038138n21218J425381R92674j144629
2278A719586k913519k756759r78987M43397N8806j019726n51457J224421J514249
$$ plain form
2340 2223175 3199556 3689052 2288175 -52853 -2303193 -5371630 -9641796 -12333304 -10377739
2331 -10377739 -5060640 -703535 982280 2112413 4133128 5605145 5585705 6002765 8588345
2322 8588345 11764390 12857935 11712123 9786067 7059916 2531730 -2810491 -6205509
2314 -6205509 -6616118 -5976865 -6331826 -7231255 -6722118 -3912809 134378 3446517 4633741
2305 4633741 3838927 2529652 2025651 2158250 1766666 442480 -849599 -1065542 -477333
2296 -477333 -394472 -1602414 -3277823 -3622634 -1775110 1055878 2896534 3446266 4324630
2287 4324630 6456250 8228027 7345553 4005516 967378 446160 1871541 2864215 1719586
2278 1719586 -1193933 -3950692 -4929679 -4486282 -4427476 -5447202 -5998659 -4774238 -3259989
2269c259989n28615j698762O25969L792606L151215j002769l686186k604461j130932
2260f341924k328575l835814j837019K491387M444483K593661K30509q874O77778
2251c914388L97247l54619n16554q20565k037238k651145q09962K444288M304062
2242c958874L953857K900932J960531M44165j474836k089757p08709J066579J562177
2233C656065R34504K7502j019209k024494k202920j491250j023603j205764q71287
$$ plain form
2269 -3259989 -3788604 -5487366 -4861397 -1068791 2082424 1079655 -2606531 -5210992 -6341924
2260 -6341924 -8670499 -12506313 -14343332 -11851945 -7407462 -4813801 -4583292 -4592166 -3914388
2251 -3914388 -3517141 -3871760 -4388314 -5208879 -7246117 -9897262 -10707224 -8262936 -3958874
2242 -3958874 -5017 2895915 4856446 5300611 3825775 1736018 1027309 2093888 3656065
2233 3656065 4590569 4618071 3598862 1574368 -628552 -2119802 -3143405 -4349169 -5220456
$$ [...]
##END NTUPLES=NMR SPECTRUM
##END=
