##TITLE=31Pdec_DE-87_ch_5
 CDCl3, 64 sc
 23.4.2025
##JCAMPDX= 6.0         $$ Bruker NMR JCAMP-DX V2.0
##DATA TYPE= NMR SPECTRUM
##DATA CLASS= NTUPLES
##ORIGIN= UXNMR, Bruker Analytische Messtechnik GmbH
##OWNER= root
$$ XWIN-NMR		Version 3.5
$$ Wed Apr 23 14:17:42 2025 Russian Standard Time (UT+4h)  she@DPX200
##.OBSERVE FREQUENCY= 81.013821
##.OBSERVE NUCLEUS= ^31P
##.ACQUISITION MODE= SIMULTANEOUS
##.ACQUISITION SCHEME= undefined
##.AVERAGES= 64
##.DIGITISER RES= 17
##SPECTROMETER/DATA SYSTEM= spect
##.PULSE SEQUENCE= zgpg30
##.SOLVENT NAME= CDCl3
##.SHIFT REFERENCE= (INTERNAL, CDCl3, 0, 198.062)
##AUDIT TRAIL= $$ (NUMBER, WHEN, WHO, WHERE, WHAT)
$$ ##TITLE= Audit trail, XWIN-NMR		Version 3.5
$$ ##JCAMPDX= 5.01
$$ ##ORIGIN= Bruker BioSpin GmbH
$$ ##OWNER= she
$$ F:/spectra/data/she/nmr/P31/2/pdata/1/auditp.txt
$$ ##AUDIT TRAIL=  $$ (NUMBER, WHEN, WHO, WHERE, WHAT)
(   1,<2025-04-23 14:16:44.46 +0400>,<she>,<DPX200>,
      <created by zg, POWCHK disabled, PULCHK disabled
       configuration hash MD5:
       00 E9 B6 7A A2 85 ED C7 34 08 36 98 17 FE 4E 26
       data hash MD5: 32K
       6F B8 4E 60 4E F5 35 B6 3C 5E 02 83 D1 B0 B8 72>)
(   2,<2025-04-23 14:16:46.78 +0400>,<she>,<DPX200>,
      <Start of raw data processing
       efp BC_mod = 2 LB = 1.5 FT_mod = 6 PKNL = 1 PHC0 = 1560.568 PHC1 = -342.7069 SI = 64K 
       data hash MD5: 64K
       AE 83 73 88 C6 E6 43 D8 C6 80 FD A7 E0 CF 35 A1>)
(   3,<2025-04-23 14:17:03.87 +0400>,<she>,<DPX200>,
      <pk PHC0 = 5.879064 PHC1 = 0 
       data hash MD5: 64K
       4C 82 C9 B5 06 99 D5 17 4D 20 35 B3 59 A2 AA 1F>)
(   4,<2025-04-23 14:17:11.14 +0400>,<she>,<DPX200>,
      <abs ABSG = 5 
       data hash MD5: 64K
       88 CB 0E 57 06 72 0D D5 57 46 E8 08 B0 5B 7E 34>)
$$ ##END=
$$ 
$$ hash MD5
$$ 6D 27 1E F0 B9 00 A7 D9 4E 64 AC 97 E0 68 6C 54
##$RELAX= 
##$RELAX= 
##$RELAX= 
##$RELAX= 
##$RELAX= 
##$RELAX= 
##$RELAX= 
##$RELAX= 
$$ Bruker specific parameters
$$ --------------------------
##$DU= <F:/spectra>
##$EXPNO= 2
##$NAME= <P31>
##$PROCNO= 1
##$TYPE= <nmr>
##$USER= <she>
##$AMP= (0..31)
100 100 100 100 100 100 100 100 100 100 100 100 100 100 100 100 100 100 
100 100 100 100 100 100 100 100 100 100 100 100 100 100 
##$AQSEQ= 0
##$AQ_mod= 1
##$AUNM= <au_zg>
##$AUTOPOS= <>
##$BF1= 81.014009
##$BF2= 200.13
##$BF3= 200.13
##$BF4= 200.13
##$BF5= 200.13
##$BF6= 200.13
##$BF7= 200.13
##$BF8= 200.13
##$BYTORDA= 1
##$CFDGTYP= 0
##$CFRGTYP= 5
##$CHEMSTR= <none>
##$CNST= (0..31)
1 1 145 1 1 1 1 1 1 1 1 1 1 1 1 1 1 1 1 1 1 1 1 1 1 1 1 1 1 1 1 1 
##$CPDPRG= <waltz16>
##$CPDPRG1= <>
##$CPDPRG2= <waltz16>
##$CPDPRG3= <>
##$CPDPRG4= <mlev>
##$CPDPRG5= <mlev>
##$CPDPRG6= <mlev>
##$CPDPRG7= <mlev>
##$CPDPRG8= <mlev>
##$CPDPRGB= <>
##$CPDPRGT= <>
##$D= (0..31)
0 1 0 0 0 0 0 0 0 0.06 0 0.03 2e-05 3e-06 0 0 0.0002 0 0 0 0 0 0 0 0 0 
0 0 0 0 0 0 
##$DATE= 1745403403
##$DBL= (0..7)
120 120 120 11 120 120 24 19 
##$DBP= (0..7)
150 150 150 150 150 150 150 150 
##$DBP07= 0
##$DBPNAM0= <>
##$DBPNAM1= <>
$$ [...]
##$SUBNAM3= <"">
##$SUBNAM4= <"">
##$SUBNAM5= <"">
##$SUBNAM6= <"">
##$SUBNAM7= <"">
##$SUBNAM8= <"">
##$SUBNAM9= <"">
##$SW= 400.765351723535
##$SWIBOX= (0..15)
0 1 3 0 0 0 0 0 0 0 0 0 0 0 0 0 
##$SW_h= 32467.5324675325
##$TD= 32768
##$TD0= 1
##$TE= 0
##$TE2= 300
##$TE3= 300
##$TEG= 300
##$TL= (0..7)
0 120 53 12 22 120 120 120 
##$TP= (0..7)
150 150 150 150 150 150 150 150 
##$TP07= 0
##$TPNAME0= <>
##$TPNAME1= <>
##$TPNAME2= <>
##$TPNAME3= <>
##$TPNAME4= <>
##$TPNAME5= <>
##$TPNAME6= <>
##$TPNAME7= <>
##$TPOAL= (0..7)
0.5 0.5 0.5 0.5 0.5 0.5 0.5 0.5 
##$TPOFFS= (0..7)
0 0 0 0 0 0 0 0 
##$TUNHIN= 0
##$TUNHOUT= 0
##$TUNXOUT= 0
##$USERA1= <user>
##$USERA2= <user>
##$USERA3= <user>
##$USERA4= <user>
##$USERA5= <user>
##$V9= 5
##$VALIST= <valist>
##$VCLIST= <CCCCCCCCCCCCCCC>
##$VD= 0
##$VDLIST= <DDDDDDDDDDDDDDD>
##$VPLIST= <PPPPPPPPPPPPPPP>
##$VTLIST= <TTTTTTTTTTTTTTT>
##$WBST= 1024
##$WBSW= 4
##$XGAIN= (0..3)
0 0 0 0 
##$XL= 0
##$YL= 0
##$YMAX_a= 5706
##$YMIN_a= -25829
##$ZGOPTNS= <>
##$ZL1= 120
##$ZL2= 120
##$ZL3= 120
##$ZL4= 120
##$ABSF1= 198.0616
##$ABSF2= -202.7028
##$ABSG= 5
##$ABSL= 3
##$ALPHA= 0
##$AQORDER= 0
##$ASSFAC= 0
##$ASSFACI= 0
##$ASSFACX= 0
##$ASSWID= 0
##$AUNMP= <proc_1d>
##$AZFE= 0.1
##$AZFW= 0.5
##$BCFW= 0
##$BC_mod= 2
##$BYTORDP= 0
##$COROFFS= 0
##$CY= -3
##$DATMOD= 1
##$DC= 0
##$DFILT= <>
##$DTYPP= 0
##$F1P= 0
##$F2P= 0
##$FCOR= 1
##$FTSIZE= 65536
##$FT_mod= 6
##$GAMMA= 0
##$GB= 0
##$INTBC= 1
##$INTSCL= 9.790993e-09
##$ISEN= 30
##$LB= 1.5
##$LEV0= 0
##$LPBIN= 0
##$MAXI= 10000
##$MC2= 0
##$MEAN= 0
##$ME_mod= 0
##$MI= 50
##$NCOEF= 0
##$NC_proc= -8
##$NLEV= 6
##$NOISF1= 182.463
##$NOISF2= 159.3651
##$NSP= 0
##$NTH_PI= 0
##$NZP= 0
##$OFFSET= 198.0616
##$PC= 4
##$PHC0= 1566.447
##$PHC1= -342.7069
##$PH_mod= 1
##$PKNL= yes
##$PPARMOD= 0
##$PSCAL= 0
##$PSIGN= 0
##$REVERSE= no
##$SF= 81.0140089999434
##$SI= 65536
##$SIGF1= 159.3651
##$SIGF2= -187.1042
##$SINO= 113.3802
##$SIOLD= 16384
##$SREGLST= <1H.CDCl3>
##$SSB= 0
##$STSI= 65536
##$STSR= 0
##$SW_p= 32467.5324675325
##$SYMM= 0
##$S_DEV= 0
##$TDeff= 32768
##$TDoff= 0
##$TI= <>
##$TILT= no
##$TM1= 0
##$TM2= 0
##$TOPLEV= 0
##$USERP1= <user>
##$USERP2= <user>
##$USERP3= <user>
##$USERP4= <user>
##$USERP5= <user>
##$WDW= 1
##$XDIM= 65536
##$YMAX_p= 286603204
##$YMIN_p= -35455890
$$ End of Bruker specific parameters
$$ ---------------------------------
##NTUPLES= NMR SPECTRUM
##VAR_NAME=  FREQUENCY,     SPECTRUM/REAL,   SPECTRUM/IMAG
##SYMBOL=    X,             R,               I
##VAR_TYPE=  INDEPENDENT,   DEPENDENT,       DEPENDENT
##VAR_FORM=  AFFN,          ASDF,            ASDF
##VAR_DIM=   65536,         65536,           65536
##UNITS=     HZ,            ARBITRARY UNITS, ARBITRARY UNITS
##FACTOR=    0.49542278885378, 1,            1
##FIRST=     16045.7642231865, 0,            0
##LAST=      -16421.768244346, 0,            0
##MIN=       -16421.768244346, -35455890,    0
##MAX=       16045.7642231865, 286603204,    0
$$ Real data points
##PAGE= N=1
##DATA TABLE= (X++(R..R)), XYDATA
$$ [...]
7501E025074K197380q83845m422676n070902k442271J098498K929502K132764
7493E63524P1191r79146m96026k78039j483309k566239j779215j70665J79246
7484f938678l90653n8709J156501J878581K251981L080674K820873o13011m980219
7475a792660n021854L9722M272501K563415k796468n721082l982491k46173K637559
7466a0047531L934752L454804J076580j758231k594515q68365J342398K111938
7458c348170J815877J766925J975875J459574J88233m99961M23596K325889L604031
7449I711869L336656J844527j07753k016014l467615l931062l150365j432137
7441G88106O79497K525368K961346Q80483l013673n764801m892383j383128J320403
$$ plain form
7501 5025074 7222454 6338609 1915933 -3154969 -5597240 -4498742 -1569240 563524
7493 563524 634715 -344431 -840457 -1118496 -2601805 -5168044 -6947259 -7117924 -6938678
7484 -6938678 -7329331 -7388040 -6231539 -4352958 -2100977 979697 3800570 3187559 -1792660
7475 -1792660 -6814514 -6774792 -2502291 61124 -2735344 -8456426 -12438917 -12685090 -10047531
7466 -10047531 -6112779 -2657975 -1581395 -3339626 -5934141 -6802506 -5460108 -3348170
7458 -3348170 -1532293 234632 2210507 3670081 3858314 3358353 3781949 6107838 9711869
7449 9711869 13048525 14893052 14785299 12769285 9301670 5370608 2220243 788106
7441 788106 1467603 3992971 6954317 7834800 4821127 -943674 -5836057 -7219185 -5898782
7432e898782J369693K95794M55736J921711K638823R64441k553462n493596n437202
7423a1736844k217211J470059K563625J100585J42287J660403L807268L574403
7415C64575J084252p85403p06965m10183j211322j452043O65605L348747L140359
7406D037622J40883j748606n20550R61822m53684l169459l397039j238923m22674
7397e810608k069553k696520J08621L384173K882671o25007k350893j21385K981462
7388d317039L123672O61934p07173J187490M208533M293583L57902l896741l953133
7379I59028K5328L223309K137142j277160k656792q41506J491509J815652K12186
7370E088696j792122k774130j767832R99426L353442K884223O2745j802666n56947
$$ plain form
7432 -5898782 -4529089 -4233295 -3777559 -1855848 782975 1747416 -806046 -6299642 -11736844
7423 -11736844 -13954055 -12483996 -9920371 -8819786 -8677499 -7017096 -3209828 364575
7415 364575 1448827 663424 -43541 -453724 -1665046 -3117089 -2451484 897263 4037622
7406 4037622 4178505 2429899 1909349 2871171 2417487 -751972 -4149011 -5387934 -5810608
7397 -5810608 -7880161 -10576681 -10468060 -7083887 -4201216 -4826223 -7177116 -7298501 -4317039
7388 -4317039 -1193367 -531433 -1238606 -51116 4157417 8451000 8808902 4912161 959028
7379 959028 984356 4207665 6344807 5067647 2410855 1569349 3060858 4876510 5088696
7370 5088696 3296574 522444 -1245388 -245962 3107480 5991703 6054448 4251782 3694835
7361C694835K053194K679443O02355j629574j665874k49527R4246j296771k267226
7352B015101j123864N23383L5615j851317j645590J442924L751926K549546K34170
7343E931894L25438J682552O75794k221965k704824L10221K503373O62090k486824
7334D677749k549180K55684K159508J472196P630m73053m53631j011534j947102
7325B138267k284227j657599p09268m62835j279506k208529j803423K9089J563488
7316f674543J232778m01501j341467n31515J096727J879442J237337J04961l12620
7307c710401K6645K13701K0853L81023J589052K095643N07719j908370k559953
7298c344088j131810J56792O3909j05184P84216J501618M40105j622959k357679
$$ plain form
7361 3694835 5748029 8427472 9029827 7400253 5734379 5484852 5579098 4282327 2015101
7352 2015101 891237 1414620 1450235 -401082 -2046672 -603748 3148178 5697724 5931894
7343 5931894 6257332 7939884 8615678 6393713 3688889 3999110 6502483 7164573 4677749
7334 4677749 2128569 2384253 4543761 6015957 6023587 5550534 5096903 4085369 2138267
7325 2138267 -145960 -1803559 -2512827 -2975662 -4255168 -6463697 -8267120 -8238031 -6674543
7316 -6674543 -5441765 -5843266 -7184733 -7716248 -6619521 -4740079 -3502742 -3397781 -3710401
7307 -3710401 -3683756 -3470055 -3449202 -3068179 -1479127 616516 1124235 -784135 -3344088
7298 -3344088 -4475898 -4319106 -4255197 -4360381 -3576165 -2074547 -1634442 -3257401 -5615080
7289e615080p54572J980781L802714L307582O80852j983552k177149K65047K658396
7280B165019K595792P47278m72643k27054P0676q96841k483713k748191n69149
7271a818826K861863M700473L194123k05435k336587j986478q59751o82807r50464
7262A916111l86131Q30115J577638J549297J249640R52828P31021Q81196J338867
7253A0640582J225992j41115k247213l972323m615518l975694k323976o96597
7245f105862j21758j33263O70161K209571K750721J747816Q59884J115769J198613
7236D191652j5151j344325j510378j357867j804399j738806m78085j21954k236575
7227f415888m071319j985452K555107M662411L191235J748273K329579K606738
$$ plain form
7289 -5615080 -6369652 -4388871 -586157 2721425 3402277 1418725 -758424 -493377 2165019
7280 2165019 4760811 5508089 5035446 4808392 4879068 3982227 1498514 -1249677 -1818826
7271 -1818826 1043037 5743510 8937633 8732198 6395611 4409133 3549382 2866575 1916111
7262 1916111 1529980 2360095 3937733 5487030 6736670 7689498 8420519 9301715 10640582
7253 10640582 11866574 11725459 9478246 5505923 890405 -3085289 -5409265 -6105862
7245 -6105862 -6227620 -6360883 -5690722 -3481151 -730430 1017386 1877270 2993039 4191652
7236 4191652 4176501 2832176 1321798 -36069 -1840468 -3579274 -4057359 -4179313 -6415888
7227 -6415888 -10487207 -12472659 -9917552 -5255141 -2063906 -315633 2013946 4620684
7219D620684Q09479j050741r99842m53028j071604j332419O33569L073857K908459
7210G138414O47467l08785J187160K513805J130347k299374n122949n408513k977703
7201c500131Q95427M102089M845441K983511K12168j334854q84949L42282M53562
7192H114546q46384j748031q41708N38853L8173j929898k306759J05372K519011
7183C643175J993885m39387j501876l13445R56069O02159o71393j536224j898278
7174H34685k222838k243596j325469L57648J729757J918057J177616N19592L51104
7165A096556j51896j746489l478793l424151j236614J282508K681667L527866
7157a449346M540923M463428J703675k454260m414206k537930O42076J408308
$$ plain form
7219 4620684 5430163 4379422 3379580 2926552 1854948 522529 1156098 4229955 7138414
7210 7138414 7785881 7477096 8664256 11178061 12308408 10009034 4886085 -522428 -3500131
7201 -3500131 -2604704 1497385 6342826 9326337 9538505 8203651 7318702 7660984 8114546
7192 8114546 7268162 5520131 4678423 5217276 5255449 3325551 1018792 1124164 3643175
7183 3643175 5637060 5197673 3695797 3382352 4338421 4940580 4269187 2732963 834685
7174 834685 -1388153 -3631749 -4957218 -4599570 -2869813 -951756 225860 745452 1096556
7165 1096556 944660 -801829 -4280622 -7704773 -8941387 -7658879 -4977212 -1449346
7157 -1449346 3091577 7555005 9258680 6804420 2390214 -147716 494360 1902668
7149A902668p13960k517157j088912K474988M054964J394549k837566m047818
7141a378244j433672J180774P68095q35980p9735K778184M056316K039301r22970
7132F172069k172742j965981j729002j329764j4738J347974J145915l80749j301069
7123b28087o74968M95193J076482J077012P65768p1466j299365j969285j545266
7114b373982p42972k74444M07603J968672L460197L216083J294504m80238j046294
7105E429129j147780j452708j312520l48546K95478k34647o99603L38700J709613
7096B577116J031835j364670k460593r74988O98217K17666j158295o70614J687340
7087d16986L235720K373465K36562j393217k034610j929644r99554P21038K340119
$$ plain form
7149 1902668 1188708 -1328449 -2417361 57627 4112591 5507140 2669574 -1378244
7141 -1378244 -2811916 -1631142 -863047 -1699027 -1778762 999422 5055738 7095039 6172069
7132 6172069 3999327 2033346 304344 -1025420 -1040158 307816 1453731 1072982 -228087
7123 -228087 -903055 -407862 668620 1745632 2511400 2439934 1140569 -828716 -2373982
7114 -2373982 -3116954 -3391398 -2983795 -1015123 2445074 5661157 6955661 6475423 5429129
7105 5429129 4281349 2828641 1516121 1167575 1463053 1228406 528803 867503 2577116
7096 2577116 3608951 2244281 -216312 -1191300 -493083 -275417 -1433712 -2104326 -416986
7087 -416986 2818734 5192199 5428761 4035544 2000934 71290 -928264 -207226 2132893
7078B132893K607168J057191j528868l612052l910023k350916j22672J400910
7070d326369J672034Q80820m86135j514260j089025O87034J823994N64400j988314
7061c775821k912307j354264L24212L9775j054795n77450J330696K260144J165717
7052d554093k46181j18088J171303J934025J301618l47027k091882k763825j465152
7043g179302J118446K638770J556050p76133j792287j120494p34257j713388k664286
7034a0666881k026391l58707Q13645J254049J746703K342004K333032J671705
7026b890841J089027Q19448K85721q40380k109574k906264k922324k117929r06239
7017a2499355j58685j80318Q1312J736993L946403M430728K255471r49954k892591
$$ plain form
7078 2132893 4740061 5797252 4268384 656332 -3253691 -5604607 -5727279 -4326369
7070 -4326369 -2654335 -1773515 -2259650 -3773910 -4862935 -4175901 -2351907 -1787507 -3775821
7061 -3775821 -6688128 -8042392 -7718180 -7678405 -8733200 -9310650 -7979954 -5719810 -4554093
7052 -4554093 -4800274 -4918362 -3747059 -1813034 -511416 -858443 -2950325 -5714150 -7179302
7043 -7179302 -6060856 -3422086 -1866036 -2642169 -4434456 -5554950 -6289207 -8002595 -10666881
7034 -10666881 -12693272 -13051979 -12238334 -10984285 -9237582 -6895578 -4562546 -2890841
7026 -2890841 -1801814 -982366 -696645 -1537025 -3646599 -6552863 -9475187 -11593116 -12499355
7017 -12499355 -12658040 -12838358 -12757046 -11020053 -7073650 -2642922 -387451 -1337405 -4229996
7008d229996k770674j185154J012401L046992M113868L757537K203861J24432
7000F073267j584286j936482o34039J195890J985027J611468J237979J128346
6992I077170J93241j604886k169103j47729K403432K343416j29949j657349n30789
6983G777454Q74686m24892l718851n421919l536191K18195K627846K116071m31597
6974H0802k769030k828488k81270K727427L331822J282704m15665O58105K921572
6965D707979L010996O49100j229355j147632r01452j795022k097473k46961J911182
6956B861362J747705p3706r75614n92414n59642j153406j221868q74934j176980
6947b019497j549813n88997P95709L15509j694733k569507j653033q11008n07202
$$ plain form
7008 -4229996 -7000670 -8185824 -7173423 -4126431 -12563 3744974 5948835 6073267
7000 6073267 4488981 2552499 1918460 3114350 5099377 6710845 7948824 9077170
6992 9077170 9270411 7665525 5496422 5348693 7752125 10095541 9965592 8308243 7777454
6983 7777454 8652140 8227248 4508397 -913522 -4449713 -4231518 -1603672 512399 80802
6974 80802 -2688228 -5516716 -5797986 -3070559 261263 1543967 1128302 1786407 4707979
6965 4707979 7718975 8368075 7138720 5991088 5089636 3294614 1197141 950180 2861362
6956 2861362 4609067 4535361 3559747 2967333 2407691 1254285 32417 -842517 -2019497
6947 -2019497 -3569310 -4158307 -3362598 -3047089 -4741822 -7311329 -8964362 -9775370 -10282572
6938a0282572O87085K316791K163591Q76214J625013L864253K895640k056541
6930B089474n046169k184555K241574K903630J468416J922401K612638j10272
6922E897137l809207l205512N79032J785683j24147l63993J610101Q28994l509611
6913c11523n255065j187549L463010L310916N54128k2064J349613J652463Q73894
6904D427823O95334M56089j074911k327218j344944N82690J253567J234761J817847
6895E721038J861129L62382m54703J217434K546174J99879l400125l287594l2223
6886D733391J114271j245906k820773j085172R49210L00427j324520j041901O08102
6877A87129J363771J002334Q28485J138145J239160P43422m56896k091948k578097
$$ plain form
6938 -10282572 -9595487 -7278696 -5115105 -4238891 -2613878 1250375 4146015 2089474
6930 2089474 -2956695 -5141250 -2899676 3954 1472370 3394771 6007409 5897137
6922 5897137 2087930 -1117582 -538550 1247133 1122986 758993 2369094 3198088 -311523
6913 -311523 -5566588 -6754137 -3291127 19789 573917 551853 1901466 3553929 4427823
6904 4427823 5123157 5579246 4504335 2177117 832173 1414863 2668430 3903191 5721038
6895 5721038 7582167 7944549 7489846 8707280 11253454 11453333 8053208 4765614 4733391
6886 4733391 5847662 4601756 1780983 695811 1645021 1945448 620928 -420973 187129
6877 187129 1550900 2553234 3381719 4519864 5759024 6502446 6045550 3953602 1375505
6868A375505j97882L701134M985759J866247k322321l421483j667901k99081n19275
6859C500702p43236j71309j24653j396970k602627k165853n17388O68470N92354
6850b960510m6581l6244J167810K805423L169803J249278j720811l142977k037415
6841a552224l25574k26368j137416o88257J335223K291488P75908p27575O49123
6832C94328L435494L479106l3154l324201l451155j958017j524746j650704k13836
6823d846885K415197L691587K606472O12523q04446j314957p90344O64876J725066
6814C959089R21534j066986j960584r14589O27584J240864R99466M81338l6184
6805D251532j66715K09357R4822j351640k746013j871032O64787J717350K60572
$$ plain form
6868 1375505 1177623 4878757 9864516 11730763 9408442 5986959 4319058 4019977 3500702
6859 3500702 2757466 2586157 2461504 1064534 -1538093 -3703946 -4221334 -3552864 -2960510
6850 -2960510 -3007091 -3043335 -1875525 929898 4099701 5348979 3628168 485191 -1552224
6841 -1552224 -1877798 -2104166 -3241582 -3929839 -2594616 -303128 472780 -254795 394328
6832 394328 3829822 7308928 7275774 3951573 500418 -1457599 -2982345 -4633049 -4846885
6823 -4846885 -2431688 1259899 3866371 4478894 3674448 2359491 1569147 2234023 3959089
6814 3959089 4880623 3813637 1853053 938464 1566048 2806912 3806378 4287716 4251532
6805 4251532 4084817 4294174 4388996 3037356 291343 -1579689 -914902 802448 1063020
6796A063020r88207K2105J309036J19475k503752l199955j244771P18208O54626
6787d050215m56159m79256J263250L600391M623031L105274j65881k516966j894514
6778C028955P17690K358995J596680r0400o83051k75362m99636j786606k366358
6769B000907o30490K082207K430604o33963l845502l451142k38457J498235j00439
6760h88040k247612k077314o54534n07291j410902j311444l1579Q79521J299730
6751f949465K560747M347155M396276J905623j088399k506749k404779j668623
6743a408214o30637P4903o28125k221233k309864N5893K516219K668677J521163
6734c61218J368265J650409m936l145158m273882j913223J092199J753797R66637
$$ plain form
6796 1063020 74813 96918 1405954 1525429 -978323 -4178278 -5423049 -4704841 -4050215
6787 -4050215 -4506374 -4985630 -3722380 -121989 4501042 7606316 7440435 4923469 3028955
6778 3028955 3746645 6105640 7702320 7611920 6928869 6653507 6153871 4367265 2000907
6769 2000907 1370417 3452624 5883228 5249265 1403763 -2047379 -2285836 -787601 -888040
6760 -888040 -3135652 -5212966 -5867500 -6374791 -7785693 -9097137 -9128716 -8249195 -6949465
6751 -6949465 -4388718 -41563 4354713 6260336 5171937 2665188 260409 -1408214
6743 -1408214 -2038851 -1963948 -2592073 -4813306 -7123170 -7067277 -4551058 -1882381 -361218
6734 -361218 1007047 2657456 2652520 -492638 -4766520 -6679743 -5587544 -3833747 -2867110
6725b867110J334733K798267L005403J230895o46223j141756r44792j081346j094310
6716E93761j47557J219858J676407R25290j097o9670P52231J675135J875693J272781
6706I772832O49434O16663M97799q52119k849829l080665l87332K952567L594696
6697A0914046J144726j736658k980740l072654l104955k746602j271653N90296
6689b264194J236355K49449j100393j295700K8932J857909K533664J149722j265567
6680A130177k372075r37095J670114K955448J953368j47715j630708j763211r65881
6671a07578k84061n62876j395007j115604J134520L460343K800701r99383m198973
6662a267918l523280l99873J048584k83448j275409L17385K188831J027863k031289
$$ plain form
6725 -2867110 -1532377 1265890 4271293 5502188 4855965 3714209 2769417 1688071 593761
6716 593761 446204 1666062 3342469 4267759 4266662 4196992 4949223 6624358 8500051 9772832
6706 9772832 10422266 11038929 11536728 10684609 7834780 4754115 4366783 7319350 10914046
6697 10914046 12058772 10322114 7341374 4268720 1163765 -1582837 -2854490 -2264194
6689 -2264194 -1027839 -778390 -1878783 -3174483 -3145551 -1287642 1246022 2395744 1130177
6680 1130177 -1241898 -2178993 -508879 2446569 4399937 4252222 2621514 858303 -107578
6671 -107578 -391639 -954515 -2349522 -3465126 -2330606 1129737 3930438 2931055 -1267918
6662 -1267918 -4791198 -5191071 -4142487 -4425935 -5701344 -5383959 -3195128 -2167265 -4198554
6653d198554k665204K44717K825159J890064n62604p43604J231018K073218O75380
6644G69590o21340k19246M01352l96292j701758j921878j456892j593969k024220
6635h764653j490544j44679P67926J254243K562027M575079N106230K719907r92125
6626E593411l103076k650036j156810k40752L2667K02621R2077n46119p79634
6617b555651N67381K622521K749446P4468k606345k029658J221078L503043K911449
6608F457732J131299J89697l23841j561618k804793k443424o39851P95472Q78745
6599A679418L61085K56248O61447J108247J129807L55635j185614k663695k881831
6590a179253j341473J267366L528739M161692K822770M19440j519958j938554
$$ plain form
6653 -4198554 -6863758 -6619041 -3793882 -1903818 -2466422 -3210026 -1979008 94210 769590
6644 769590 148250 -70996 330356 -65936 -1767694 -3689572 -5146464 -6740433 -8764653
6635 -8764653 -10255197 -10399876 -9631950 -8377707 -5815680 -1240601 3865629 6585536 5593411
6626 5593411 2490335 -159701 -1316511 -1557263 -1524596 -1321975 -1229898 -1776017 -2555651
6617 -2555651 -1988270 634251 3383697 3458165 851820 -1177838 43240 3546283 6457732
6608 6457732 7589031 7778728 7454887 5893269 3088476 645052 5201 800673 1679418
6599 1679418 2040503 2296751 2958198 4066445 5196252 5551887 4366273 1702578 -1179253
6590 -1179253 -2520726 -1253360 2275379 6437071 9259841 9679281 8159323 6220769
6582F220769p18464J430479K973877K199380p75537l129494k361360j5678M6029
6573E870001k597006l951636j688636J069308N66191j805670k073703n6089R65376
6564c701864l9101p80011k39680q6671p73441k67743J859272K760890Q05910j411637
6554a874076j019072Q12854J214280J13853n59515n13370q21204j115668j96513
6545c958431J095891O66308j204435j869043l62948J146889P25495q05350j730837
6536f296461j814204j513900n54929J111131K161575J474773J50786K80586J964093
6527c036550L094728K217009K66267r35084q39072k16012J82193K32371Q1436
6518A047286j65036m72106r02278j410638j461864m11611J309351K091903J059881
$$ plain form
6582 6220769 5502305 6932784 9906661 12106041 11330504 8201010 5839650 5823972 5870001
6573 5870001 3272995 -678641 -2367277 -1297969 -731778 -2537448 -4611151 -4667240 -3701864
6564 -3701864 -3740965 -4520976 -4760656 -4847327 -5620768 -5888511 -4029239 -1268349 -462439 -1874076
6554 -1874076 -2893148 -2080294 -866014 -752161 -1311676 -1825046 -2646250 -3761918 -3958431
6545 -3958431 -2862540 -2196232 -3400667 -5269710 -5632658 -4485769 -3760274 -4565624 -6296461
6536 -6296461 -8110665 -9624565 -10179494 -9068363 -6906788 -5432015 -5281229 -5000643 -3036550
6527 -3036550 58178 2275187 2541454 1606370 767298 551286 733479 965850 1047286
6518 1047286 882250 410144 -492134 -1902772 -3364636 -3776247 -2466896 -374993 684888
6509F84888m74336n65936P54701J792891J880521K035725K744178K989599K178759
6500A4020990J168554M18250q90230k540432k301802N99943L011403J697272j775112
6491A3408836l217089j877378o77617q90599p55024J69695l54094k675574l360430
6482b29274l89338L017910K803572j89922k086722j736012j281646k071106l126242
6473e288780l292507k409801o03600J597888K861027K464450J450180Q76585J36849
6464b207709j253189j853879o44417N43573j04490o96235J497211M684739M507777
6455D473381J032152j004924L48996J356598j049216m364013m747022k717107
6447f671155j438127j835971k549760k828225k499137o39473K770045N116331
$$ plain form
6509 684888 210552 -355384 399317 2192208 4072729 6108454 8852632 11842231 14020990
6500 14020990 15189544 15607794 14717564 12177132 9875330 10475273 13486676 15183948 13408836
6491 13408836 10191747 8314369 7636752 6746153 5991129 6160824 5806730 3131156 -229274
6482 -229274 -618612 2399298 5202870 5012948 2926226 1190214 -91432 -2162538 -5288780
6473 -5288780 -8581287 -10991088 -11594688 -9996800 -7135773 -4671323 -3221143 -2344558 -2207709
6464 -2207709 -3460898 -5314777 -5959194 -5415621 -5520111 -6216346 -4719135 -34396 4473381
6455 4473381 5505533 4500609 4849605 6206203 5156987 792974 -3954048 -6671155
6447 -6671155 -8109282 -9945253 -12495013 -15323238 -17822375 -18461848 -15691803 -10575472
6439a0575472M025473J091233q1255J100456J991053J157201J10050K85889Q80913
6430a4459N01819q65013k194661k351946n24369K672528M491076K496792j802695
6421B409072l876885j695168J606585K002816j85102j384175p6303J511326J165285
6412A477451j77696l18152O74279P89040l86127n63791J858791M835336M851225
6403A3040356J468981k236767l811013l889025l807270k938740l02515K536670
6395F0677K677862p4604k414070j407560K088526M545002L524211j71054l593576
6386E235414m448571k906389p60033R09037K446518L922184M117529K288723j72599
6377A0631813j394642j594847k223717l094583k591252p89986J4877j257074k568628
$$ plain form
6439 -10575472 -6549999 -5458766 -5540021 -4439565 -2448512 -1291311 -1181261 -895372 -14459
6430 -14459 487360 -377653 -2572314 -4924260 -5448629 -2776101 1714975 4211767 2409072
6421 2409072 -1467813 -3162981 -1556396 446420 261318 -1122857 -1199160 312166 1477451
6412 1477451 1299755 981603 1655882 2444922 2058795 1495004 3353795 8189131 13040356
6403 13040356 14509337 12272570 8461557 4572532 765262 -2173478 -2475993 60677
6395 60677 2738539 2663935 249865 -1157695 930831 5475833 9000044 8828990 5235414
6386 5235414 786843 -2119546 -2879579 -1970542 475976 4398160 8515689 10804412 10631813
6377 10631813 9237171 7642324 5418607 2324024 -267228 -1057214 -1042337 -2299411 -4868039
6368d868039j661599O60558J769724Q09518n53469n86316O66147J958117K230766
6359D25407J278827k54680j299416j130543L8702J203407J336508L06099p42005
6350A162306m03242J037064J354936q04504l456313l338336l70149J968402J229589
6341a620247j101388k360575k314211k201981j745873M29128L858052N905032
6333a152063M682945R98470k754800m639779m149195k130712L6838J531323K173665
6324e403308J637556j17568j415118j9099L133104L857971N75504k330321m53533
6315e34812L484817L280110r57868k590984J079565M326935J965941k657409l338898
6306D057397n60592M77533j090371j174360J352105K382017m63659l819686l848509
$$ plain form
6368 -4868039 -6529638 -5869080 -4099356 -3289838 -3843307 -4429623 -3763476 -1805359 425407
6359 425407 1704234 1449554 150138 -980405 -941703 261704 1598212 1904311 1162306
6350 1162306 759064 1796128 3151064 2346560 -1109753 -4448089 -4818238 -2849836 -1620247
6341 -1620247 -2721635 -5082210 -7396421 -9598402 -11344275 -10915147 -7057095 -1152063
6333 -1152063 3530882 4529352 1774552 -2865227 -7014422 -9145134 -9108296 -7576973 -5403308
6324 -5403308 -3765752 -3883320 -5298438 -5317537 -2184433 1673538 2249042 -81279 -534812
6315 -534812 2950005 6230115 5272247 2681263 3760828 8087763 10053704 7396295 4057397
6306 4057397 3496805 3974338 2883967 1709607 3061712 5443729 4980070 1160384 -2688125
6297b688125j502281J28343N05870Q21098R76551L62090j49107K50694K54718
6288a040149j304052k486588o60987K862915L927986J360192j343310r03956J748789
6279B160840L528434L102027J301015p42142k199281k293601j050137J30160j05378
6270C831937j271463j653058n57255R28537J450511Q75997j8398q06210j757490
6261A023108k862887l094223j486140R56268J609231n01554k687055j572952K184887
6252f431317M302723K549248j62355J44142L075789M728745L050324j20983k264106
6243H872210l013028l131876k703895j611301m83712J49965P81952J830000K379197
6234C069512J284432r46861k569801k578227j202389J086576L669898N148100
$$ plain form
6297 -2688125 -4190406 -4062063 -3556193 -2735095 -1758544 -1396454 -1545561 -1294867 -1040149
6288 -1040149 -2344201 -4830789 -5491776 -2628861 1299125 2659317 1316007 412051 2160840
6279 2160840 5689274 8791301 10092316 9350174 7150893 4857292 3807155 3937315 3831937
6270 3831937 2560474 907416 350161 1278698 2729209 3605206 3586808 2780598 1023108
6261 1023108 -1839779 -4934002 -6420142 -5463874 -3854643 -4356197 -7043252 -8616204 -6431317
6252 -6431317 -2128594 420654 258299 402441 3478230 8206975 11257299 11136316 8872210
6243 8872210 5859182 2727306 23411 -1587890 -2071602 -1921637 -1139685 690315 3069512
6234 3069512 4353944 3407083 837282 -1740945 -2943334 -1856758 1813140 6961240
6226F961240M290180J829633k06930j210712k260467l232593k042605J642560
6218E770306M147908K000028k801604m897758k708282j38680m76740j945120j261580
6209b311522J091897K072231J042649L73185J356231K324493J482080m19807j286988
6200E724449m33069P70504N67598j193760k598105j574978J333412L002600J441652
6191G040303j569555k987578k531729k096619k048843j010636P75231J071713
6183c357713o03483j895439j553609j451275k771518l117629k86226L333649L640316
6174h062927Q95124o33142J190768L849628M221661K404936O01811J94297Q57238
6165E519394J244134M0207k582874m547895m123394k251847j049871n24538R72709
$$ plain form
6226 6961240 11251420 13081053 12874123 11663411 9402944 6170351 4127746 5770306
6218 5770306 9918214 11918242 9116638 4218880 1510598 1371918 895178 -1049942 -2311522
6209 -2311522 -1219625 852606 1895255 2268440 3624671 5949164 7431244 7011437 5724449
6200 5724449 5291380 6061884 6629482 5435722 2837617 1262639 2596051 5598651 7040303
6191 7040303 5470748 2483170 -48559 -2145178 -4194021 -5204657 -4429426 -3357713
6183 -3357713 -3961196 -5856635 -7410244 -8861519 -11633037 -14750666 -15036892 -11703243 -8062927
6174 -8062927 -7167803 -7800945 -6610177 -2760549 1461112 3866048 4467859 4662156 5519394
6165 5519394 6763528 6803735 4220861 -327034 -4450428 -6702275 -7752146 -8276684 -7303975
6156g303975L239801L928861K252657K49737o60046j688613l654374m456484j977148
6147a0069584K123450M082141K741755M09427n61771o3549Q22916J417617J576657
6138B479059J344896R13411M65360J8586l95438p67447j438310k620561l406758
6129c407202k460129k48744Q36037l29798j617836m06022K588624M014692K110194
6120A079816j311833l123636k008993P14681K596589K369889J128596P81344J242864
6111C469317M37595k247966m189404k773838Q10006K990375K303710M82429n56347
6102G25877p54697p99491p12978j69500O95721J173414M87769j097492j614243
6093b065620O65504M005344M155886J22911l457447k318562J354700K411492L98242
$$ plain form
6156 -7303975 -4064174 -135313 2117344 2367081 1707035 18422 -3635952 -8092436 -10069584
6147 -10069584 -7946134 -3863993 -1122238 -712811 -1274582 -1338131 -515215 902402 2479059
6138 2479059 3823955 4737366 5202726 5221312 4825874 4058427 2620117 -444 -3407202
6129 -3407202 -5867331 -6116075 -5280038 -5609836 -7227672 -7633694 -5045070 -1030378 1079816
6120 1079816 -232017 -3355653 -5364646 -4649965 -2053376 316513 1445109 2226453 3469317
6111 3469317 3906912 1658946 -2530458 -5304296 -4494290 -1503915 799795 1282224 725877
6102 725877 -28820 -828311 -1541289 -1710789 -1015068 158346 646115 -451377 -2065620
6093 -2065620 -1400116 2605228 6761114 6884025 3426578 1108016 2462716 4874208 5272450
6084E272450q31294p6669K6244j075350m83212K097415K539157p10680k973890
6075C784171o04144K505880O80280m438876o143293k377751K208516L439778J895962
6066I50523k50623k144950k960380j521391J287297K624270J474078j59738p59098
6057a460012j244207k195586j947608N62550L227119L376077J601572P55990J820197
6048D496092K753393J461203j468358l429543k742409o31048R0106j420571k622518
6039c513653r17954K383518L481435J368742p65154j83549J720554J946511K16705
6030E737155j243126j134858k60237K65923K50834m4586l59470m54504n03614
6021B253517j131400k292687k730955j580091R7662O31911J56974K67102J426192
$$ plain form
6084 5272450 4441156 4364487 4390731 3315381 2832169 4929584 7468741 6758061 3784171
6075 3784171 3180027 5685907 6366187 1927311 -4215982 -6593733 -4385217 -945439 950523
6066 950523 699900 -1445050 -4405430 -5926821 -4639524 -2015254 -541176 -700914 -1460012
6057 -1460012 -2704219 -4899805 -6847413 -6284863 -3057744 318333 1919905 2675895 4496092
6048 4496092 7249485 8710688 7242330 3812787 1070378 439330 529436 -891135 -3513653
6039 -3513653 -4431607 -2048089 1433346 2802088 2036934 1853385 3573939 5520450 5737155
6030 5737155 4494029 3359171 3098934 3364857 3615691 3571105 3211635 2757131 2253517
6021 2253517 1122117 -1170570 -3901525 -5481616 -5383954 -4752043 -4595069 -4327967 -2901775
6012b901775K266099J743530O08490P6863R3433k03271q97107j128197m52789
6003g94724L28743Q0120j091676j614512k03098K342635L803057L201229J939658
5994G991432J654144J843382Q90182j105375k279691j970806j842771l058058
5986B122439m008601k682656k12785M08026r76645j058824J783333M292600K649076
5977B315963j693429l636929j468258J082616N67209j511430j617591N89550K461165
5968b911134K395266J106818m18743j805792k338615j329564L95821J117521M49034
5959c339388m71287p64791k33669J449946L912493M900138K516589j373001k766914
5950C830116r47549O34801l42491j991343j778279j86703J011538J395663P54929
$$ plain form
6012 -2901775 -635676 1107854 1716344 1793207 1886640 1683369 786262 -341935 -794724
6003 -794724 -465981 -385861 -1477537 -3092049 -3295147 -952512 2850545 6051774 7991432
5994 7991432 9645576 11488958 12379140 11273765 8994074 7023268 5180497 2122439
5986 2122439 -1886162 -4568818 -4781603 -4373577 -5350222 -6409046 -4625713 -333113 2315963
5977 2315963 622534 -3014395 -4482653 -3400037 -2832828 -4344258 -5961849 -5372299 -2911134
5968 -2911134 -515868 590950 172207 -1633585 -3972200 -5301764 -4905943 -3788422 -3339388
5959 -3339388 -3810675 -4575466 -4809135 -3359189 553304 5453442 7970031 6597030 3830116
5950 3830116 2882567 3517368 3174877 1183534 -594745 -781448 230090 1625753 2380682
5941B380682j900218n631222o555970k735280K121845L316432J578493R00307
5933f524931J645766O86645k129693k886068L5496L060542K805167O69377k52369
5924b890068R1844l29705j930245l199916k972915j320800Q29903J909616Q24099
5915h988187j266853j835135m43830N62684k40816j187933m22476J246946K145844
5906a0429756K348658K566364K345651J423197R60425J252982L16783k624127
5898a839823m444139k277216J489682K373027O01792K20652K019663K448531R9640
5889F91809j852759j317911o10955j608761j966802M07782K818344J908491m82358
5880b013120l00373J765226J467331j547319k817977l58019K063782R48107j707423
$$ plain form
5941 2380682 480464 -5150758 -11706728 -14442008 -12320163 -9003731 -7425238 -6524931
5933 -6524931 -4879165 -4192520 -6322213 -9208281 -9172785 -6112243 -3307076 -2637699 -2890068
5924 -2890068 -2798224 -3127929 -5058174 -8258090 -11231005 -12551805 -11721902 -9812286 -8988187
5915 -8988187 -10255040 -12090175 -12534005 -11971321 -12212137 -13400070 -13822546 -12575600 -10429756
5906 -10429756 -8081098 -5514734 -3169083 -1745886 -785461 467521 784304 -1839823
5898 -1839823 -6283962 -8561178 -7071496 -4698469 -4096677 -3876025 -1856362 592169 691809
5889 691809 -1160950 -2478861 -3089816 -4698577 -6665379 -6257597 -3439253 -1530762 -2013120
5880 -2013120 -2313493 -548267 919064 -628255 -3446232 -3804251 -1740469 -792362 -2499785
5871b499785k114334n51367N0910m73140N36497L494928M997206K465760j959360
5862C947315l872397j841563J355674K400940R60547q47279j487796j356127j208842
5853a949528o49103Q30947K159757J681409j58862q17609R20840K915790K323780
5844G257421n93433k788162k243942m3831J570481J976823K250537L025103L209387
5835A3620384J254104k513535n498633n358756k597126J58286J232066J099656
5827A396446O08246k10736r16114k18780J732855K309477k23566l476707l637769
5818b636648p87029J301998O84425l96863N02968K416933K924724J707866L42801
5809F061175j14244K53520R53846J069914m22678k958426m047977k153232R30531
$$ plain form
5871 -2499785 -4614119 -5165486 -5114576 -5587716 -5051219 -1556291 3440915 5906675 3947315
5862 3947315 74918 -1766645 -410971 1989969 2950516 2103237 615441 -740686 -1949528
5853 -1949528 -2598631 -1767684 392073 2073482 1914620 1097011 2017851 4933641 7257421
5844 7257421 6663988 3875826 1631884 1588053 3158534 5135357 7385894 10410997 13620384
5835 13620384 14874488 12360953 6862320 1503564 -1093562 -935276 296790 1396446
5827 1396446 2004692 1793956 877842 659062 2391917 4701394 4477828 1001121 -2636648
5818 -2636648 -3423677 -2121679 -1437254 -1834117 -1331149 1085784 4010508 5718374 6061175
5809 6061175 5946931 6200451 7154297 8224211 7801533 4843107 795130 -1358102 -427571
5800d27571K069316N43455j553184k088131p96387J021373J548833j43364k674850
5791b500510l246579j140503Q76860K22671j785668k065732m41467O61703N92188
5782h827037J243984L110783L803003J806862q47254j400985J955J246800J424216
5773A562327J283890J293647Q21257q66445l502663n471194m549669p7024N322303
5764d183571P511628N028521M56264k762896l458440k255689m4583J755587J266098
5755C312919j497866l495617j980688J679953L504322J933886n43416r40042P34530
5746B707981K043656J061439j775146m094321l671665o30637K464179L243612
5738A349098K007646Q59965P47673N29399q64802k469343k282632M9324K217378
$$ plain form
5800 -427571 1641745 2185200 632016 -1456115 -2252502 -1231129 317704 174340 -2500510
5791 -2500510 -5747089 -6887592 -6010732 -5788061 -7573729 -9639461 -10080928 -9419225 -8827037
5782 -8827037 -7583053 -4472270 -669267 1137595 290341 -1110644 -1108689 138111 1562327
5773 1562327 2846217 4139864 4961121 4094676 592013 -4879181 -9428850 -9505874 -4183571
5764 -4183571 3328057 8356578 8812842 6049946 2591506 335817 291234 2046821 3312919
5755 3312919 1815053 -1680564 -3661252 -1981299 1523023 3456909 2913493 1973451 2707981
5746 2707981 4751637 5813076 4037930 -56391 -3728056 -4358693 -1894514 1349098
5738 1349098 3356744 4216709 4964382 5493781 4628979 2159636 -122996 -73672 2143706
5729B143706J410685k343162n519028m663765n34569K561142J917307n55928j446426
5720g030038m50165K9753r42485j497973j36740J847938K288376J206089N27366
5711d157879J240140K196938J951759P80225J46575N94515J119066Q06298J67784
5702D845421J32896M34473J38794n78474n76934K59337N74175m94616k066623
5693B668449k666266j584259J016806L897024M549624J389842l153787m240228
5685A877205q09302K338063R40860k612254k889076N06682K610813N94245k563375
5676f139k947055q18554R65071J150354O26154L10621L29503M49567J63540q59903
5666f36841j757786j093948Q56187J937567J126664P1565L53915Q64591k28148
$$ plain form
5729 2143706 3554391 1211229 -4307799 -8971564 -9506133 -6944991 -5027684 -5583612 -7030038
5720 -7030038 -7480203 -7450450 -8392935 -9890908 -10027648 -8179710 -5891334 -4685245 -4157879
5711 -4157879 -2917739 -720801 1230958 2011183 2157758 2752273 3871339 4677637 4845421
5702 4845421 4978317 5412790 5551584 4973110 4396176 4655513 5229688 4735072 2668449
5693 2668449 2183 -1582076 -565270 3331754 7881378 9271220 6117433 1877205
5685 1877205 1067903 3405966 4346826 1734572 -1154504 -647822 1962991 2557236 -6139
5676 -6139 -2953194 -3771748 -2806677 -1656323 -1030169 -719548 -390045 59522 223062 -636841
5666 -636841 -2394627 -3488575 -2632388 -694821 431843 503408 857323 1721914 1493766
5657A493766k108136k176521J36263K536358K984940J878983O44510l61451j661499
5648C367213l246611m274136l927185k116446M24206K404531K684864J323795
5640c359769o8017L66850K652766M565472L906444J025946j688309k749249k807832
5631A844302k647029j569657R11763L066856K654687J71800j617421j360475l74220
5622A080606k7989M6807M68815P89120O89335P90623J102409L08513j965920l700539
5612d18220l065596j235551o36985j336557j404310l06719N25881N13601Q09060
5603f555396J754212J797462J92101j167772l50917J531681J850294K73812j070947
5594a745470j032294p87121j286339j495235m57261N65357j17292j654767j569299
$$ plain form
5657 1493766 -614370 -2790891 -2654628 -118270 2866670 4745653 5390163 5028712 3367213
5648 3367213 120602 -4153534 -8080719 -10197165 -9772959 -7368428 -4683564 -3359769
5640 -3359769 -3427786 -3060936 -408170 4157302 8063746 9089692 7401383 4652134 1844302
5631 1844302 -802727 -2372384 -1460621 1606235 4260922 4432722 2815301 1454826 1080606
5622 1080606 1052617 1099424 1568239 2357359 3046694 3837317 4939726 5248239 3282319 -418220
5612 -418220 -3483816 -4719367 -5356352 -6692909 -8097219 -8403938 -7878057 -7364456 -6555396
5603 -6555396 -4801184 -3003722 -2811621 -3979393 -4330310 -2798629 -948335 -674523 -1745470
5594 -1745470 -2777764 -3564885 -4851224 -6346459 -6803720 -6238363 -6355655 -8010422 -9579721
5585i579721O50489K907579L608470L391857L146470K327475M80938j199432j426724
5576D307401p70118n01877n46208k56285k38253j345009k487052j725657N77681
5567b985377J913174J154434j20908l08362J74030K35905k25777q91184j714806
5558b768871k132719r93879J620367L650077L246111Q94518j482829k682708k668962
5549c318895j792245n98598J30556K5477m27792m98266Q2376J102868J941798
5540c352721J711752K48429j103789q63960M22074P99896j75244q19476j01148
5531c234187P26778K23171r84572j195722J42721K170399L703756L831729K236074
5522G620147m20117k922011m335476l774953k77157N178573Q281134N093493k422785
$$ plain form
5585 -9579721 -8929232 -6021653 -2413183 978674 4125144 6452619 6933557 5734125 4307401
5576 4307401 3537283 3035406 2489198 2232913 1994660 649651 -1837401 -3563058 -2985377
5567 -2985377 -1072203 82231 -38677 -347039 -173009 62896 -162881 -1054065 -2768871
5558 -2768871 -4901590 -5895469 -4275102 -625025 2621086 3515604 2032775 -649933 -3318895
5549 -3318895 -5111140 -5709738 -5579182 -5553705 -5981497 -6479763 -6397387 -5294519 -3352721
5540 -3352721 -1640969 -1392540 -2496329 -3360289 -2938215 -2138319 -2313563 -3133039 -3234187
5531 -3234187 -2507409 -2284238 -3268810 -4464532 -4321811 -2151412 1552344 5384073 7620147
5522 7620147 7200030 4278019 -57457 -3832410 -4109567 1069006 9350140 14443633 12020848
5513A2020848p537933o343288j526763K201789L167753J904365r87821l719297
5505h20347l327573K03567K568509Q90974j875792j639500N43647R77188l13849
5496b793176n82575m6432j222731l258132k432864J222465L002867O02114k416873
5487g925337k174619L35671J936468K037033K119571K598946K641389J949500
5479C518622J022924L49797J59596K15891k64714j411638j840445n96998P61209
5470A914244K69629j029083o74081Q20159P37032q19836p91180J375545K474445
5461D276874J080339k0551R99749J645093k45307k297296j625419O4225o24132
5452C253575l074000l924564k475835r09218j35158Q31850J899692J815470R41256
$$ plain form
5513 12020848 4482915 -1860373 -3387136 -1185347 1982406 3886771 2898950 -820347
5505 -820347 -4147920 -3944353 -1375844 -484870 -2360662 -4000162 -3456515 -2479327 -2793176
5496 -2793176 -3375751 -3422183 -4644914 -7903046 -10335910 -9113445 -6110578 -5508464 -7925337
5487 -7925337 -10099956 -9764285 -7827817 -5790784 -3671213 -1072267 1569122 3518622
5479 3518622 4541546 4891343 5050939 5266830 5002116 3590478 1750033 1153035 1914244
5470 1914244 2183873 1154790 480709 1300868 2037900 1218064 426884 1802429 4276874
5461 4276874 5357213 5336662 6336411 7981504 7736197 5438901 3813482 3877707 3253575
5452 3253575 179575 -3744989 -6220824 -7130042 -7265200 -6433350 -4533658 -2718188 -1776932
5443a776932R77820J804742J428173o35791k481739k740714k140239j683551j285413
5434h533644p25191j94130N62157K034237L473563L190163Q68605j716676k794932
5425c835848k283629j012979N31244K033078K766804K003780j07870k289803k856922
5416e052145j158473J418998K477773J138708r82100j742415p11785R89107K109613
5407a512719J864607J71578j792582k204767o63570J271322K289622K713887K805680
5398D943058J586659j010626k655612j596003L31847L43551q34348l51616J608960
5389B365870J869408j92342j077218J212256L436438J783270k122168l353815
5381C921699q41748J204465m76099l618498l838436o30440K478049L003726K102517
$$ plain form
5443 -1776932 -799112 1005630 2433803 1798012 -683727 -3424441 -5564680 -7248231 -8533644
5434 -8533644 -9258835 -9452965 -8890808 -6856571 -3383008 -192845 675760 -1040916 -3835848
5425 -3835848 -6119477 -7132456 -6601212 -4568134 -1801330 202450 94580 -2195223 -5052145
5416 -5052145 -6210618 -4791620 -2313847 -1175139 -2157239 -3899654 -4611439 -3622332 -1512719
5407 -1512719 351888 523466 -1269116 -3473883 -4137453 -2866131 -576509 2137378 4943058
5398 4943058 6529717 5519091 2863479 1267476 1599323 1942874 1108526 756910 2365870
5389 2365870 4235278 4042936 2965718 4177974 7614412 9397682 7275514 3921699
5381 3921699 3079951 4284416 3808317 189819 -3648617 -4279057 -1801008 1202718 3305235
5372C305235J704989J571782P18287j55591N7417L17767j222788l830923m873487
5363b407312l799031k505052j503587Q09010M022764M653477J464459j540185
5355h05457n85345K138977J919479j334751l522240k739953r94794J00656J211851
5346d611577K480814K548527J228965L6708p42811k473257m790959m984927k156478
5337a3464995Q75134J559981R85104J307183K090055J602544J93071j62769R96401
5328d018291K000355J435532k32291j403672r39270Q08177K193959J950591P04100
5319B499190J4216N9446l10560j143956q80790J043794K853581K719981R38164
5310G793066j142696k815225l547302k537290l21523O52596r93147l061526k326329
$$ plain form
5372 3305235 5010224 6582006 7300293 7144702 7202119 7519886 6297098 2466175 -2407312
5363 -2407312 -6206343 -8711395 -10214982 -9405972 -5383208 -729731 734728 -805457
5355 -805457 -1390802 748175 2667654 1332903 -2189337 -4929290 -5924084 -5823428 -4611577
5346 -4611577 -2130763 417764 1646729 1683437 940626 -1532631 -6323590 -11308517 -13464995
5337 -13464995 -12589861 -11029880 -10044776 -8737593 -6647538 -5044994 -4851923 -5014692 -4018291
5328 -4018291 -2017936 -582404 -814695 -2218367 -3157637 -2349460 -155501 1795090 2499190
5319 2499190 2513406 2572852 2262292 1118336 237546 1281340 4134921 6854902 7793066
5310 7793066 6650370 3835145 287843 -2249447 -2570970 -1918374 -2911521 -5973047 -8299376
5301h299376J052619L746176L609335J743352J24940p05674r02197j56157J336786
5292A549804J935142K36425k660359m059154k959118j145842n52734q52582o89080
5283i197498j37803k08579m78615O16384K970625M492179M265799L772793L831094
5274I926379K803681j70730k486831j481669J109885J415461q06322k119987p97000
5265G392867J188499J686461O37466j489786m212097n478047l118636J203734
5257b189539K984330J004541j134849j012404p67774k170127k634326J59320L262678
5248b498150K616319l83599j337292k3085J08738j328495j017332J613836K655101
5239D06041L9060k913734k568251J5159J646347J575440Q32294m60271k186494
$$ plain form
5301 -8299376 -7246757 -3500581 108754 1852106 1977046 1271372 369175 213018 1549804
5292 1549804 3484946 3721371 1061012 -2998142 -5957260 -7103102 -7655836 -8508418 -9197498
5283 -9197498 -9335301 -9543880 -10022495 -9406111 -6435486 -1943307 2322492 6095285 9926379
5274 9926379 12730060 12559330 10072499 8590830 9700715 11116176 10309854 8189867 7392867
5265 7392867 8581366 10267827 10905293 9415507 5203410 -274637 -3393273 -2189539
5257 -2189539 794791 1799332 664483 -347921 -1115695 -3285822 -5920148 -5760828 -2498150
5248 -2498150 118169 -265430 -1602722 -1625807 -1517069 -2845564 -3862896 -2249060 406041
5239 406041 445101 -2468633 -5036884 -5021725 -3375378 -1799938 -967644 -1427915 -3614409
5230c614409k600233o13583J653307J537909o7239l65587M44634m57808l196663
5221g279672m044112q68070L451892N020853L791628K111429O43582j204536k253135
5212f30141n94451K560171L528061J295402j005185q31371L81109J70156j148739
5203C725012j759585j412391q56671J95132K037379L118390J791065q87001k466287
5194C485043k432842j889584q85260J150944L020131K883774J486495J174067
5186G992768J850341J186569j042880k321392j566329m51844R6947J020915J828563
5177H593658L34845k677341k847485J192014M709393L585882L92240k27380J020402
5168A4076228J08298l098493m889805l929883k434319j420121M17856K699321
$$ plain form
5230 -3614409 -6214642 -6828225 -5174918 -3637009 -3704248 -4069835 -3625201 -4083009 -7279672
5221 -7279672 -11323784 -12191854 -8739962 -3719109 72519 2183948 2827530 1622994 -630141
5212 -630141 -1224592 1335579 4863640 6159042 5153857 4322486 4703595 4873751 3725012
5203 3725012 1965427 553036 -303635 -108503 1928876 5047266 6838331 5951330 3485043
5194 3485043 1052201 -837383 -1722643 -571699 2448432 5332206 6818701 7992768
5186 7992768 9843109 11029678 9986798 7665406 6099077 5647233 5744180 6765095 8593658
5177 8593658 8928503 6251162 3403677 4595691 9305084 12890966 13283206 13055826 14076228
5168 14076228 14184526 11086033 6196228 2266345 -167974 -1588095 -1170239 1529082
5160A529082K859774Q40350Q3037K003997L166605M76522l776791n139454l251273
5151a208151j530497j555744j274348P62545K521657J688649k73553J7284K573411
5142A721253L627777J255265j521894j262340P58822J068231j85198n8989J360950
5133F763877Q06231k057520l364291j447747M05041k9765j46067J818481K332243
5124E080483j326203m793828k567976K833271M413831J487798l02654R77805J190517
5115F993044j299598k226926P28147L268226J483204j800106k042039q5571M75272
5106E493653l55024l09656j60000k288078n020133l772663J595510N188487K643436
5097C015532l001209n392079k759092R13207J772810M45128j61789O84920J196970
$$ plain form
5160 1529082 4388856 5229206 5312243 7316240 10482845 10959367 7182576 2043122 -1208151
5151 -1208151 -2738648 -4294392 -5568740 -4806195 -2284538 -595889 -869442 -852158 1721253
5142 1721253 5349030 6604295 5082401 3820061 4578883 5647114 5461916 5402927 6763877
5133 6763877 7570108 5512588 2148297 700550 1105591 1075826 929759 2748240 5080483
5124 5080483 3754280 -1039548 -3607524 -774253 3639578 5127376 4824722 5802527 6993044
5115 6993044 5693446 3466520 4194667 7462893 8946097 7145991 5103952 5018381 5493653
5106 5493653 5138629 4828973 4668973 2380895 -2639238 -6411901 -4816391 372096 3015532
5097 3015532 14323 -5377756 -8136848 -7223641 -5450831 -5005703 -5167492 -4482572 -3285602
5088c285602M38590k56934K03180P68606K42480l85896M69943K088861K300758
5079B583986P85942o07190p42045m23049o28138j252117j765770j610012j3836
5070c672229K926251N094185M118611M20219l128092m565182m219496k961765
5062e987498j156995M52334P54790l49456j865749k943294l006687j435365J141945
5053a4395975K275727P57250q32780M34109K895727K566477k06190q52544K174547
5044e183652M889520L956318J045234j092280k809617m954495n651339l344675
5036a3144986n39682o49349k574516k100640J830376N463617N183547J807824
5028d723809q65317n45261J355605J829412P1076j713326j723194j283838k401561
$$ plain form
5088 -3285602 -2847012 -3103946 -2900766 -2132160 -1889680 -2275576 -1805633 283228 2583986
5079 2583986 3369928 2762738 2020693 1597644 969506 -282611 -2048381 -3658393 -3672229
5070 -3672229 -745978 4348207 8466818 8887037 5758945 1193763 -3025733 -5987498
5062 -5987498 -7144493 -6692159 -5937369 -6286825 -8152574 -11095868 -14102555 -15537920 -14395975
5053 -14395975 -12120248 -11362998 -12195778 -11761669 -8865942 -6299465 -6505655 -7358199 -5183652
5044 -5183652 -294132 3662186 4707420 3615140 805523 -4148972 -9800311 -13144986
5036 -13144986 -13684668 -14334017 -16908533 -19009173 -17178797 -11715180 -6531633 -4723809
5028 -4723809 -5589126 -6134387 -4778782 -2949370 -2878294 -4591620 -6314814 -7598652 -10000213
5019a0000213l907995k869698O63921L470101L799277L051604K459882J465470
5011a867651J90865J30172J146443R77529q67146j810217l37507J557797J673752
5002G94037M85459p82806j997401k492168q11599K101662K676370k57324l267267
4993c551037l222685j297223K8331O36215J031245L06851j337787j198070J820887
4984f783273M572913M084951J746581K13314p76806k275519k914236j482453k2467
4975c636995o66106j843128j233808j4427m42826j611698j419479m84728k75855
4966a1629050L05565K414834L641530J357364k141478k384189O40153K822971
4958d972300J957011l81309k092226k316706q79007J121422J385064m55572j641704
$$ plain form
5019 -10000213 -13908208 -16777906 -16113985 -12643884 -8844607 -5793003 -3333121 -1867651
5011 -1867651 -1676786 -1546614 -400171 577358 -289788 -2100005 -2437512 -879715 794037
5002 794037 1279496 496690 -1500711 -3992879 -4804478 -2702816 -26446 -283770 -3551037
4993 -3551037 -6773722 -8070945 -8042614 -7406399 -6375154 -6068303 -7406090 -8604160 -6783273
4984 -6783273 -2210360 1874591 3621172 3834486 3057680 782161 -2132075 -3614528 -3636995
4975 -3636995 -4303101 -6146229 -7380037 -7394464 -7837290 -9448988 -10868467 -11353195 -11629050
4966 -11629050 -11323485 -8908651 -5267121 -3909757 -6051235 -8435424 -7795271 -4972300
4958 -4972300 -3015289 -3396598 -5488824 -7805530 -8684537 -7563115 -6178051 -6633623 -8275327
4949h275327n63583M29089p92721k286111j584507J78606J140039K134851L563451
4940f056213K883108m95660k152749N51481L116658R79767k607724k265571L38453
4931e708450L23232j315351m24738J760351J086026j168868p10261J361829Q58464
4922c937766j108986n15349J202537K9170j832554L86685L797742J587943m583580
4913d974158o505439k670320R44390K213050L928759M635509K63304n593365n195068
4904a2953338j14377J309444q18065Q35371N006422L012436l531189l215833M566884
4895e902245P204013Q01650l626041r26390L252m808264o452206j789514l94029
4886a5889774m410340k408465O935895P868619l803783r740354j319181L991173
$$ plain form
4949 -8275327 -8838910 -8409821 -9202542 -11488653 -13073160 -12894554 -11754515 -9619664 -6056213
4940 -6056213 -3173105 -3668765 -5821514 -5270033 -2153375 -1173608 -3781332 -6046903 -5708450
4931 -5708450 -5385218 -6700569 -7125307 -5364956 -4278930 -5447798 -6158059 -4796230 -3937766
4922 -3937766 -5046752 -5562101 -4359564 -4330394 -6162948 -5776263 -1978521 -390578 -4974158
4913 -4974158 -11479597 -14149917 -13205527 -10992477 -7063718 -2428209 -2164905 -7758270 -12953338
4904 -12953338 -13067715 -11758271 -12576336 -11740965 -6734543 -3722107 -7253296 -10469129 -5902245
4895 -5902245 1301768 2103418 -1522623 -2449013 -2445761 -7254025 -13706231 -15495745 -15889774
4886 -15889774 -20300114 -22708579 -15772684 -7904065 -11707848 -21448202 -22767383 -18776210
4878a8776210l502341n717756N575565N694552j3274480n455220O2825580J34397805
4870A61767495J15966624Q869085q1606649q1544677l1295647o921067j6812810
4863F8422354k0444229p104710j038280q533514j0329262j312173K535911l074680
4855A9121417m011880L705027O661151l23401n318584j514255K232795p37622
4847A9814648m123575k452297o94350l136879m939385j578060L015365L642374
4839I547841J411705m43123j727794k775174k427570r38224l8690P67457L033830
4830F410258M789369K759649j414670l096765j949107j222234j062259P39825
4822E954066K631709J275628j346338m65481K564372J987707j965307k933336
$$ plain form
4878 -18776210 -22278551 -27996307 -22420742 -16726190 -30000670 -35455890 27369690 161767495
4870 161767495 277734119 286603204 204996555 123451878 92156231 85235164 68422354
4863 68422354 47978125 40873415 39835135 31301621 20972359 19660186 22196097 19121417
4855 19121417 15109537 18814564 25475715 25152314 19833730 18319475 20552270 19814648
4847 19814648 15691073 13238776 12544426 9407547 4468162 2890102 5905467 9547841
4839 9547841 10959546 10516423 8788629 6013455 3585885 2647661 2608971 3376428 6410258
4830 6410258 11199627 13959276 12544606 9447841 7498734 6276500 5214241 5954066
4822 5954066 8585775 9861403 8515065 8049584 10613956 12601663 10636356 7703020
4814G703020O72421L087109J064936j668336j945888j642385k099652j050759
4806D120466J966319L338653J450519n03051l32286j59384j543960k570392k206218
4797C560666k478934l902203l661273p77072J657651J749545J678970L007301
4789H34651L730779K449804J048895P64976j49330k385655l333365j391924J204626
4780B773457K058813J500989J71067k199277l960499k057883K607864M914461
4772E808992K791217O0052k86312m89493k682955m290467k689007o2064N34932
4763a305105J08145O86752J051253k71506j173647M21985K145448R28448j493631
4754A098142j497014K60199L84188j196155j501023J03840J224540Q42808N72490
$$ plain form
4814 7703020 8375441 11462550 12527486 10859150 8913262 7270877 5171225 4120466
4806 4120466 6086785 9425438 10875957 10372906 10040620 9881236 8337276 5766884 3560666
4797 3560666 1081732 -2820471 -6481744 -7258816 -5601165 -3851620 -2172650 834651
4789 834651 4565430 7015234 8064129 8829105 8679775 6294120 2960755 1568831 2773457
4780 2773457 4832270 6333259 6504326 4305049 344550 -1713333 894531 5808992
4772 5808992 8600209 8660261 8373949 7884456 5201501 911034 -1777973 -1840037 -1305105
4763 -1305105 -1196960 -510208 541045 269539 -904108 -482123 1663325 2591773 1098142
4754 1098142 -398872 -138673 245515 -950640 -2451663 -2347823 -1123283 -280475 292015
4745B92015J454535K570214K931816K380504Q44999j278299k562719k183386j306836
4736C142843j243143j411109q22657j45904m15992j100028j247665j062622o61158
4727d967435Q44256L118397L560135P98980k684186l836025l042486k340651j587017
4718a0136032N65047L291202M267194K961136Q67789p37966j370590q27244J24365
4709i95099r40r19548m14451J630383J835220j453553m429629k814165J740367
4700e821415M116015K853354Q11029m7122m77220j137283j543194j658685j733766
4691d638287j110672L80379J023068j49167q88650J013362L611048L396533N87859
4682C225473j717014k217019j530821O89186M434171O516443L868175j150058
$$ plain form
4745 292015 1746550 4316764 7248580 9629084 10474083 9195784 6633065 4449679 3142843
4736 3142843 1899700 488591 -334066 -479970 -895962 -1995990 -3243655 -4306277 -4967435
4727 -4967435 -4123179 -1004782 2555353 3354333 670147 -3165878 -6208364 -8549015 -10136032
4718 -10136032 -9570985 -6279783 -2012589 948547 1816336 1078370 -292220 -1119464 -995099
4709 -995099 -996039 -1915587 -2330038 -699655 1135565 -317988 -4747617 -7561782 -5821415
4700 -5821415 -1705400 1147954 1958983 1911861 1434641 297358 -1245836 -2904521 -4638287
4691 -4638287 -5748959 -5368580 -4345512 -4494679 -5383329 -4369967 -758919 2637614 3225473
4682 3225473 1508459 -708560 -2239381 -1550195 2883976 9400419 13268594 12118536
4674A2118536l481614k670175k374293l207858j910956J886572L962840K124796
4666F447848n98923j272580r58240j289136j405624n61875q5586o28925q08463
4657a161504l30682j034487l135074l961525k199303J05204J433080K936476M891494
4648b456321N031325K700651P55771P98204M30226j954790l716406k679451j353447
4639b444238k377869l275930m85294M067864N431338K926247K27197o93493j161674
4630B214148j987555k299636k028504j888721j071916J565172M222594L668152
4622B393734K04021k296477j783181k51853J12732j18838K45308O09166m6170
4613i31558j229925j857282j770926j151551L89927K798715M424614L348889m9389
$$ plain form
4674 12118536 8636922 5966747 3592454 384596 -1526360 360212 4323052 6447848
4666 6447848 5848925 4576345 3618105 2328969 923345 361470 275884 -353041 -1161504
4657 -1161504 -1492186 -2526673 -5661747 -9623272 -11822575 -11717371 -10284291 -7347815 -2456321
4648 -2456321 2575004 5275655 6031426 6829630 7259856 5305066 1588660 -1090791 -2444238
4639 -2444238 -4822107 -8098037 -8583331 -4515467 915871 3842118 4069315 3375822 2214148
4630 2214148 226593 -2073043 -4101547 -5990268 -7062184 -5497012 -1274418 2393734
4622 2393734 2597755 301278 -1481903 -1733756 -1621024 -1739862 -1494554 -885388 -931558
4613 -931558 -2161483 -4018765 -5789691 -6941242 -6551315 -3752600 672014 4020903 3971514
4604C971514k859550k673329n55551J9433k386062m988448m356792j108415J217407
4595a3719793J461072J977615L979819N059073L060430l11572k025016j758335
4587b276707j070837l34809R54846K085446J829332N34748l77005l06197M60054
4578A498871J416564J437552n42562l134617l050734J83371K653360J497727q62611
4569A096921r37829K16152m51769k164055j775430L38828Q12669p84591j340772
4560d989876L05222J727737J411741Q13918J015975R98752K90812K7778M03222
4551B005281J45193o95348n44756M70374M42725m71891J85104K462407K925181
4542F924270J04592k589978j799212R70634K101489J014881j35529j59960L14575
$$ plain form
4604 3971514 1111964 -1561365 -2116916 -2097483 -4483545 -9471993 -13828785 -14937200 -13719793
4595 -13719793 -12258721 -10281106 -6301287 -1242214 1818216 1506644 -518372 -2276707
4587 -2276707 -3347544 -3682353 -2727507 -642061 1187271 1722019 1345014 1038817 1498871
4578 1498871 2915435 4352987 3810425 675808 -2374926 -2191555 461805 1959532 1096921
4569 1096921 159092 375244 -76525 -2240580 -4016010 -3677182 -2864513 -3649104 -4989876
4560 -4989876 -4684654 -2956917 -1545176 -731258 284717 1283469 1574281 1602059 2005281
4551 2005281 2150474 1455126 910370 1380744 1823469 1351578 1536682 3999089 6924270
4542 6924270 7028862 4438884 2639672 3610306 5711795 6726676 6591147 6431187 6745762
4533F745762O19641P45994R45982J611964K572303K275377m46383l564185l512074
4524G994381m95949Q94526k023792n990075o208231k396826J915897M127722M119623
4515A937276K659164P50210l47269l92088o71903j880846k666019j654739L65821
4506a900393J701934J929272J507009N35370p67489j537907j367847q45961l40512
4497a086524L02319M75389o92288k067864j318814J241803K531620J477650O31559
4488A494850J541462K160884R83336o2091L26966k78500l390101n423519k763186
4479e409899J830971K988395Q24336j77761R46010P54962j675570k759339o88284
4470c366179J190137l72883l437668l690397k79831L400778L909910J447398n02719
$$ plain form
4533 6745762 7365403 8111397 9057379 10669343 13241646 15517023 15070640 11506455 7994381
4524 7994381 7498432 8392958 6369166 379091 -5829140 -8225966 -6310069 -2182347 1937276
4515 1937276 4596440 5346650 4999381 4607293 3935390 2054544 -611475 -2266214 -1900393
4506 -1900393 -198459 1730813 3237822 3773192 3005703 1467796 99949 -746012 -1086524
4497 -1086524 -784205 -308816 -1001104 -3068968 -4387782 -3145979 -614359 863291 1494850
4488 1494850 3036312 5197196 6180532 6118441 6445407 6166907 2776806 -2646713 -5409899
4479 -5409899 -3578928 -590533 233803 56042 1002052 1757014 81444 -2677895 -3366179
4470 -3366179 -2176042 -2548925 -5986593 -9676990 -9956821 -6556043 -2646133 -1198735 -1701454
4461a701454Q41067L927868M490689J318365j869643j842862l51073m81770j339380
4452B991807l17402J472571P90389j902394l055523j920937j042563j127096m12901
4443d524049P01700l59370k979194l222288m25134J274585j44415j317443L21546
4434a0674062K108480J258006j23806Q10524K281382J215468r48028n86707J843704
4425b815039K549742M54570j686974j856871p46589P92443K824502M398871L571563
4416G486218L93787k297736k213994l21340P30912n5779j165377p22281J129485
4407B963895K359678J595450q7466o20108L89624J639691K322294K671298K495943
4398A5730299J116587r89263k336059k583508k793236l356674l594407l460226
$$ plain form
4461 -1701454 -860387 3067481 7558170 8876535 7006892 5164030 4812957 4331187 2991807
4452 2991807 2674405 4146976 4937365 3034971 -20552 -1941489 -2984052 -4111148 -4524049
4443 -4524049 -3822349 -4181719 -7160913 -10383201 -10808335 -9533750 -9678165 -10995608 -10674062
4434 -10674062 -8565582 -7307576 -7431382 -6620858 -4339476 -3124008 -4072036 -4658743 -2815039
4425 -2815039 -265297 189273 -1497701 -3354572 -4101161 -3308718 -484216 3914655 7486218
4416 7486218 7880005 5582269 3368275 3046935 3777847 3722068 2556691 1834410 2963895
4407 2963895 5323573 6919023 6831557 6211449 6601073 8240764 10563058 13234356 15730299
4398 15730299 16846886 15857623 13521564 10938056 8144820 4788146 1193739 -2266487
4390b266487l360913k301498R13878M382372M456972J289104o80206O81276J928541
4381E043039k62329l753273m520158k628742j016961n42006R996N69809J56820
4372f943805l78874N90460K243242K158182K6284k054600k520433j286395J413954
4363f751985M620058N926895L971276J075008O01506K086260J965670r06003l577521
4354I011164l478372j819976j247305k052441k237646l72955K776946N173877
4346E753292N432429L778144J290940j260199l264977l720451k370745r93813
4338D644620j480080k775047k303406m50269k38212j919830j995612P08218K348940
4329c460678K80401k168827r43411K238643L059821J430993M48979Q15755J066545
$$ plain form
4390 -2266487 -5627400 -7928898 -7015020 -2632648 1824324 3113428 2433222 3114498 5043039
4381 5043039 4780710 1027437 -3492721 -6121463 -7138424 -7680430 -7670434 -7100625 -6943805
4372 -6943805 -7322679 -6732219 -4488977 -2330795 -2304511 -4359111 -6879544 -8165939 -6751985
4363 -6751985 -2131927 3794968 7766244 8841252 9442758 11529018 13494688 12588685 9011164
4354 9011164 5532792 3712816 2465511 413070 -1824576 -2197531 579415 5753292
4346 5753292 11185721 14963865 16254805 14994606 11729629 8009178 5638433 4644620
4338 4644620 3164540 389493 -1913913 -2364182 -2602394 -4522224 -6517836 -5809618 -3460678
4329 -3460678 -3180277 -5349104 -6292515 -4053872 -994051 436942 885921 1701676 2768221
4320B768221J424194K597739K534256n82278l747656k903467K57828J070007M1718
4311C460562J496541M800628M564546K62227k162856l30772N44230l004055o408979
4302C222072m792868r75157k20243j658625r08179K048658L527829K632761J669096
4293D545344J292162Q8307j651054k040032j220525j146805j896446j593143n239
4284c627431R51673N25615M7952J53139k17115j326658j565273M4892K056007
4275b957199K491437J301928j33482j000061j365309j062217L42696K223516K778572
4266B619881J273926l57171K31666K170607K170764n09047k480058j191625J077659
4257E006602P61924j639556l026293k772497k484566j957397J78363K343989J400385
$$ plain form
4320 2768221 4192415 6790154 9324410 8742132 4994476 2091009 2348837 3418844 3460562
4311 3460562 4957103 9757731 14322277 14584504 12421648 12090876 12635106 9631051 3222072
4302 3222072 -1570796 -2545953 -2766196 -4424821 -5333000 -3284342 243487 2876248 4545344
4293 4545344 5837506 5925813 4274759 2234727 1014202 -132603 -2029049 -3622192 -3627431
4284 -3627431 -2675758 -2150143 -2102191 -1949052 -2166167 -3492825 -5058098 -5013206 -2957199
4275 -2957199 -465762 836166 702684 -297377 -1662686 -2724903 -2382207 -158691 2619881
4266 2619881 3893807 3536636 3768302 5938909 8109673 7600626 5120568 3928943 5006602
4257 5006602 5768526 4128970 1102677 -1669820 -4154386 -6111783 -5933420 -3589431 -2189046
4248b189046j571333j796249J824594M633703L206813o3640j572361j536552j815911
4239h79982k358911k548354k844129k586102M39047N577872Q039522N206153Q04543
4230H849659p20953n86933k205640m408736l345252N67712K839034J592069n12979
4221B067981j170892j146344j385308r61973O71862J870640Q93416j409405k313344
4212b883367m04791K573537L533967J820848P8178K39912L09792k147220m720578
4203a599722k784178K680130N141742J899250j826635r21755K371522L049066
4195H009420J034210l38469m73600j348528l096078l980992l469171j971178Q41679
4186d792707M337039N517058K727292r62908j414765J067218K880583K212887
$$ plain form
4248 -2189046 -3760379 -5556628 -3732034 901669 4108482 4044842 2472481 935929 -879982
4239 -879982 -3238893 -5787247 -8631376 -11217478 -10778431 -5200559 2838963 8045116 8849659
4230 8849659 8128706 7541773 5336133 927397 -2417855 -1850143 988891 2580960 2067981
4221 2067981 897089 -249255 -1634563 -2596536 -1924674 -54034 839382 -570023 -2883367
4212 -2883367 -3288158 -714621 2819346 4640194 4718372 4958284 5268076 3120856 -1599722
4203 -1599722 -4383900 -1703770 3437972 5337222 3510587 2588832 4960354 8009420
4195 8009420 9043630 8705161 8231561 6883033 3786955 -194037 -3663208 -5634386 -4792707
4186 -4792707 -455668 5061390 7788682 6825774 5411009 6478227 9358810 11571697
4178A1571697K09166j367253j261452P34596K561867J560950j265711j985636
4170A0758224n7622N60142j588643k814848j193961M0809o69436K04704L702889
4161H942258M828902J722242L69423M008979O520506L693123J479125M122016
4153C5686574M798398o72653k589568N783973J2975412R964421J2488811L5191989
4145A13627357N2925585K4628233m1309548q3396797o3606420j5184965P356875
4138d959680k313398j1448965n116591J506068j066088k632456K910569O579526
4130a6541015L042392o1116K190314L649169M32597j773146M21127J677061r01778
4121g864395j767628K006746M265908P04291l125377j402533K369751K116086
$$ plain form
4178 11571697 11780863 10413610 9152158 9886754 12448621 14009571 12743860 10758224
4170 10758224 10700602 11260744 9672101 6857253 5663292 5704101 5034665 5239369 8942258
4161 8942258 13771160 15493402 15862825 19871804 26392310 30085433 31564558 35686574
4153 35686574 40484972 39812319 37222751 43006724 55982136 65946557 78435368 113627357
4145 113627357 166552942 191181175 149871627 66474830 2868410 -12316555 -4959680
4138 -4959680 -7273078 -18722043 -23838634 -22332566 -23398654 -26031110 -23120541 -16541015
4130 -16541015 -13498623 -13559739 -11369425 -7720256 -7287659 -9060805 -8639678 -6962617 -7864395
4121 -7864395 -9632023 -7625277 -3359369 -2655078 -5780455 -7182988 -4813237 -2697151
4113b697151j036351k229817r28667L13400R69540J526955R54289q49507j510225
4104e487534k47621K17119j370595k016981L19716K789020K180861j80049j213692
4095e009756n60928N15987J646299K271295J092467j185375j700384j464P03004
4086b228855j082327k316229m99800K084321K131580J34262j425428j834316j446512
4077f483304j5161J747934J705597k52645j207879M6941N86496j608304l654371
4068i134696k212783J130211K695417K313720K113612J919443K05238j780578
4060b750416j208015J528950L036303J922966K66705j61508j83235j050732k320688
4051i19670k832265k356280j499884p36229N4478J297919K869666L649824K718017
$$ plain form
4113 -2697151 -3733502 -5963319 -6891986 -6578586 -5609046 -4082091 -3127802 -3977309 -5487534
4104 -5487534 -5735155 -5518036 -6888631 -8905612 -8585896 -5796876 -3616015 -3796064 -5009756
4095 -5009756 -5570684 -5054697 -3408398 -1137103 -44636 -1230011 -2930395 -2931859 -2228855
4086 -2228855 -3311182 -5627411 -6127211 -4042890 -1911310 -1777048 -3202476 -5036792 -6483304
4077 -6483304 -6498465 -4750531 -3044934 -3297579 -4505458 -4458517 -3872021 -5480325 -9134696
4068 -9134696 -11347479 -10217268 -7521851 -5208131 -3094519 -1175076 -969838 -2750416
4060 -2750416 -3958431 -2429481 606822 2529788 2796493 2634985 2451750 1401018 -919670
4051 -919670 -3751935 -6108215 -7608099 -8344328 -8289850 -6991931 -4122265 -472441 2245576
4042B245576R20380K6158K89497L66185k70934p20384o80659q88046j079652k4965
4032A83156J605906J134315k010835m635747l937005j043760J288659K209564
4024e205747K065054M90797k278663l884392k204612J647790M544414M716183
4016a09176K685320J17832j145815m60496L13035j153112l598595l118230N56932
4007e912305K496081j29677k988770q48162M107895N256868J210951k770521k750683
3998b328323n22596P38161Q36256Q42127L79024j158474k722796k818395j408724
3989h163740M66667J862347K015381N56503j563546k487722j614561m19368l33344
3980i681383o62820L15684K576436L862872K435541m20344j623797j0286K321961
$$ plain form
4042 2245576 3165956 3192114 3481611 3847796 3576862 2856478 2175819 1287773 208121 183156
4032 183156 1789062 2923377 912542 -3723205 -7660210 -8703970 -7415311 -5205747
4024 -5205747 -3140693 -2649896 -4928559 -8812951 -11017563 -9369773 -4825359 -109176
4016 -109176 2576144 2693976 1548161 1087665 1400700 247588 -3351007 -6469237 -5912305
4007 -5912305 -3416224 -3545901 -6534671 -7382833 -3274938 1981930 3192881 422360 -2328323
3998 -2328323 -2850919 -2112758 -1276502 -434375 -55351 -1213825 -3936621 -6755016 -8163740
3989 -8163740 -7697073 -5834726 -3819345 -3262842 -4826388 -7314110 -8928671 -9348039 -9681383
3980 -9681383 -10344203 -10028519 -7452083 -3589211 -1153670 -1574014 -3197811 -3208097 -886136
3971h86136K879898J709365L92714m99440j167368j037743J06989M44751j417834
3962E25196l025052r28872L151914L584958p81286m287473k695692Q65738J434338
3953b156231l86276p23267R57538K073635J728750J054288K16254j106185j625133
3944C3373m17725M93554q63810k545622j760418K4803l57686j726798m27178K685664
3934d861843L081921M20551o52494J267873J621091k014056m915681k492328J906472
3925f638494J687789k958615n123617r26370N279831O731811K433437k498075
3917b012303l467133j201212N83627N34639M51946J158535P91904j402452k698730
3908g261179j078690Q01662m39645k956299k189555J754487M218547L288095J810610
$$ plain form
3971 -886136 1993762 3703127 4095841 3596401 2429033 1391290 1498279 1943030 525196
3962 525196 -2499856 -3428728 -276814 3308144 2526858 -1760615 -4456307 -3590569 -2156231
3953 -2156231 -2542507 -3265774 -2308236 -234601 1494149 2548437 2764691 1658506 33373
3944 33373 -384352 109202 -754608 -3300230 -5060648 -5035845 -5393531 -7120329 -7547507 -4861843
3934 -4861843 -1779922 -1359371 -2011865 -743992 877099 -1136957 -6052638 -8544966 -6638494
3925 -6638494 -4950705 -7909320 -13032937 -13959307 -8679476 -1947665 485772 -2012303
3917 -2012303 -5479436 -6680648 -6097021 -5562382 -5110436 -3951901 -3159997 -4562449 -7261179
3908 -7261179 -8339869 -7538207 -7977852 -10934151 -13123706 -11369219 -7150672 -3862577 -2051967
3899b051967J518226M66032j997271k774661k01413K569168K348364M58369m77394
3890a42547p88151j475348r80995J819634M013281K290076j597237l143907j600207
3881a605401j23902k42668k77051P28793J277766L41894r22202j238166p68307
3872b829244L598J035648J923963K003280J485933R92410J19987j683229l043795
3863H551j797340J500066L541742K546023M57314k08648K39499l2369j252708
3854E002130k159986k358073k519411k509331j340144O04179J170665n92979k449081
3845g152031j630971J256189L017660K445878J780529K813419L903569K733297
3837I167539K28654q50662k37934k22968j638932k651654j955437n12861O77771
$$ plain form
3899 -2051967 -533741 -67709 -2064980 -4839641 -5041054 -2471886 -123522 334847 -142547
3890 -142547 -930698 -2406046 -3387041 -1567407 2445874 4735950 3138713 -5194 -1605401
3881 -1605401 -1729303 -1971971 -2249022 -1520229 -242463 99431 -822771 -2060937 -2829244
3872 -2829244 -2825646 -1789998 133965 2137245 3623178 4615588 4735575 3052346 8551
3863 8551 -1788789 -288723 3253019 5799042 6256356 6047708 6287207 6254838 5002130
3854 5002130 2842144 484071 -2035340 -4544671 -5884815 -5280636 -4109971 -4702950 -7152031
3845 -7152031 -8783002 -7526813 -4509153 -2063275 -282746 2530673 6434242 9167539
3837 9167539 9396193 8545531 8307597 8084629 6445697 3794043 1838606 1325745 2003516
3828B003516J983833L120820K231912j173819m316561m336297k087055o67030
3820c240681j115423j693447r43502O09203J833909K309204J870525K81546j832679
3811a921345k612632o84536K682924M077651J484769k938506m818663k545466
3803g275804J062283K621037J881644L59287j457173l131189k599713R87749M079430
3794c472449K597768j518979k359144J072902L195073N90441k834610k372156
3786e101154L84579R83971p31428j376724J27807J571277J231747n10241k355780
3777e775946k583986K0225L603984L942982K15579k705437q75625K824779L365644
3768B032199J145327l0146p280j450833l490064k544623Q52418K252972P53485
$$ plain form
3828 2003516 3987349 7108169 9340081 8166262 3849701 -486596 -2573651 -3240681
3820 -3240681 -4356104 -6049551 -6993053 -6383850 -4549941 -2240737 -370212 -88666 -1921345
3811 -1921345 -4533977 -5218513 -2535589 1542062 3026831 88325 -4730338 -7275804
3803 -7275804 -6213521 -3592484 -1710840 -1351553 -2808726 -5939915 -8539628 -7551879 -3472449
3794 -3472449 -874681 -2393660 -4752804 -3679902 -484829 105612 -2728998 -5101154
3786 -5101154 -4716575 -3732604 -4464032 -5840756 -5712949 -4141672 -2909925 -3420166 -5775946
3777 -5775946 -8359932 -8339707 -4735723 -792741 -577162 -3282599 -4158224 -1333445 2032199
3768 2032199 3177526 3147380 3140100 1689267 -1800797 -4345420 -3493002 -1240030 -486545
3759d86545K77693K372195L591267J837385j98068k22773J38960l65761K53470
3750G197823K652759L326986J75637l073978k215199R38374J809764J59479p37595
3741A0234050k02143o90767k886837m350868l184810r3528L103210M679918L375779
3732I984004k1725k223997j039489J418520J695743J47871l3565J631928J927540
3723A3486830j058751n056791o702833n085541j346458K934316N791642N358107
3715H320521J911860j686539k811096j533614M10884J917087K661621K014308
3707A1205032m58208l447911m458103k763869q58203j534572l804408l630944
3699i751186N05050M777602M696792J114048j232352l21667J420928J890316J791753
$$ plain form
3759 -486545 -208852 2163343 5754610 7591995 7393927 7171154 7310114 6944353 7197823
3750 7197823 9850582 13177568 13353205 10279227 8064028 9002402 10812166 10971645 10234050
3741 10234050 10031907 9341140 6454303 2103435 -1081375 -1174903 1928307 6608225 9984004
3732 9984004 9962279 7738282 6698793 8117313 9813056 9960927 9927362 11559290 13486830
3723 13486830 12428079 7371288 668455 -4417086 -5763544 -2829228 2962414 8320521
3715 8320521 10232381 8545842 5734746 4201132 4612016 6529103 9190724 11205032
3707 11205032 10746824 7298913 2840810 76941 -781262 -2315834 -6120242 -9751186
3699 -9751186 -9246136 -4468534 228258 1342306 109954 -211713 1209215 3099531 4891284
3690D891284J415404q41708m561067n849496k913119L45758L1913j572959j16066
3681i170056L153956L422706O05945n42648J340407K029686p72753l281029j673300
3672d887086K140245L972004L185268J871637Q86096j12718o51348l86238n36262
3663E481598j897248k927958k134554p75928p26394j157404j03955J806951K090655
3654c44237K84782j543077j895685j142026O6424J470512K340112J931108Q80353
3645B048266M82649O92882M72144j46593j60894L60632K24055p76939j418858
3636A777344r66415k7799O87223J030643P35481m01701j418290p74239J463780
3627B106027L210105K626005L958k743838l722721k346156J08534J464105R92523
$$ plain form
3690 4891284 6306688 5464980 903913 -4945583 -7858702 -7512944 -7481031 -9053990 -9170056
3681 -9170056 -6016100 -2593394 -1987449 -2530097 -1189690 839996 67243 -3213786 -4887086
3672 -4887086 -2746841 1225163 4410431 6282068 7168164 7055446 6404098 6017860 5481598
3663 5481598 3584350 656392 -1478162 -2254090 -2980484 -4137888 -4241843 -2434892 -344237
3654 -344237 -59455 -1602532 -3498217 -4640243 -4573819 -3103307 -763195 1167913 2048266
3645 2048266 2530915 3223797 3695941 3549348 3388454 3749086 3973141 3196202 1777344
3636 1777344 810929 783130 1470353 2500996 3236477 2834776 1416486 642247 2106027
3627 2106027 5316132 7942137 7946095 5202257 1479536 -866620 -758086 706019 1698542
3618A698542K57046O76764J261291L08823j638211k587389k109224j250688m5789
3609c428835K146246M019064L111080k58412k679750k144259k73621Q70943J568405
3600B930861K663321L332774K291022l39708l438802n656995n361099k012201
3592e590827J876910K748300O40032j020066q00930p22397j304213J20204L731089
3583c21898M767378O85418l524380k224956K080227K669714j083066l673758k550786
3574c176107p33835l10651M48496K328407L050860J720465P01442J156037R51009
3565F136123r99446k289737j144141N85803Q15097L79966N75111O07648k10412
3556D456012n90810J24404J65541j619013l473013l602030k731309j761378K10937
$$ plain form
3618 1698542 1955588 2632352 3893643 4202466 2564255 -23134 -2132358 -3383046 -3428835
3609 -3428835 -1282589 2736475 5847555 5589143 2909393 765134 491513 1362456 2930861
3600 2930861 5594182 8926956 11217978 10878270 7439468 1782473 -3578626 -5590827
3592 -5590827 -3713917 -965617 -325585 -1345651 -2146581 -2868978 -4173191 -4052987 -321898
3583 -321898 4445480 5130898 1606518 -618438 1461789 4131503 3048437 -625321 -3176107
3574 -3176107 -3909942 -4220593 -3772097 -1443690 1607170 3327635 4029077 5185114 6136123
3565 6136123 5136677 2846940 1702799 2288602 3103699 3483665 4058776 4666424 4456012
3556 4456012 3865202 3989606 4155147 2536134 -936879 -4538909 -7270218 -9031596 -8820659
3547h820659L125823M200408J865824j139448j660194o69330p03763j141789J80546
3538d762582K380190K521795L40895j484037j306661O5729J363531J824187R30395
3529A873442o57291j022421J22381J81387k315557m562184l374201j56906J610828
3520h300522J895259K871652L724027J600813k732769m972476l277514r1414K199761
3511g083183L372396L014285M69566k243223j766404J369334K938680J437099
3503A508550K4094P29906J243559l88416k087601j574632l13974n51834j330463
3494b740811n92594J065931J734284J396554J122778P54071j22532n01869L76790
3485B492602J263374J054936J029092K423726L394092J340354k669465m726977
$$ plain form
3547 -8820659 -5694836 -1494428 371396 -768052 -2428246 -3097576 -3801339 -4943128 -4762582
3538 -4762582 -2382392 139403 480298 -1003739 -2310400 -2244671 -881140 943047 1873442
3529 1873442 1216151 193730 316111 497498 -1818059 -6380243 -9754444 -9911350 -8300522
3520 -8300522 -6405263 -3533611 190416 1791229 -941540 -5914016 -9191530 -9282944 -7083183
3511 -7083183 -3710787 -696502 -226936 -2470159 -4236563 -2867229 71451 1508550
3503 1508550 1532644 2262550 3506109 3117693 1030092 -544540 -858514 -1410348 -2740811
3494 -2740811 -3333405 -2267474 -533190 863364 1986142 2740213 2617681 2115812 2492602
3485 2492602 3755976 4810912 5840004 8263730 11657822 12998176 10328711 5601734
3477E601734l101872l2207J553339J141724J86670P449O18681J039379N76443
3468G591340k97672q35449j334110k290517k728167j473189Q8345o37465k929269
3459d846153k937656L16148K645826O84629l010152l854279j629802N03285J379513
3450a0748641K316154L341516K841071Q68978m11263J05840J314249J987814J826091
3441C441809N24653j916244l871682l239379k80982K332743K562685Q32114j034329
3432f48612j489589k84435R94972J00587k872694m663720k678792J401113L801452
3423f339718L446953K331172J935288J817911J375798N85349p89704k504043k775973
3414i16967m28656K277483J843566j358487l194836j562843R36649J288626K19681
$$ plain form
3477 5601734 2499862 2467655 4020994 5162718 5349388 5356837 5975518 7014897 7591340
3468 7591340 7293668 6458219 5124109 2833592 105425 -1367764 -1279419 -1916884 -4846153
3459 -4846153 -7783809 -7467661 -4821835 -4137206 -7147358 -11001637 -12631439 -12128154 -10748641
3450 -10748641 -8432487 -5090971 -2249900 -1380922 -1792185 -1686345 -372096 1615718 3441809
3441 3441809 3966462 2050218 -1821464 -5060843 -5341825 -3009082 -446397 385717 -648612
3432 -648612 -2138201 -2422636 -1427664 -1327077 -4199771 -8863491 -11542283 -10141170 -6339718
3423 -6339718 -2892765 -561593 1373695 3191606 4567404 5152753 4363049 1859006 -916967
3414 -916967 -1345623 931860 2775426 1416939 -1777897 -3340740 -2404091 -1115465 -895784
3405h95784J63829J164277J168219n21684k154282j881998J2037J524645J129802
3396b90939o34668j852812j411430P7893J643961L076912L962323L022369k799
3387G590810k820465k867469o55756R64970N49289p36803j438448j503673j539772
3378b457317j850301k287569k016694N2011L323004M918934K879941p86463k392766
3369f17220j348105l12251r27974j943890j710353k32222J567437K686600K111349
3360g26629k7059j584877q13908P70810L95549j583985k300728j132920l23817
3351g327564n47828K93353K707130L754074J502770j664970k349975l61453K251650
3342a742813M146874M771319L569623J032942j114013k149071k885684l021060
$$ plain form
3405 -895784 -731955 432322 1600541 1078857 -1075425 -2957423 -2945386 -1420741 -290939
3396 -290939 -925607 -2778419 -4189849 -4111956 -2467995 608917 4571240 7593609 7590810
3387 7590810 4770345 1902876 1247120 2212090 2761379 2024576 586128 -917545 -2457317
3378 -2457317 -4307618 -6595187 -8611881 -8559870 -5236866 -317932 2562009 1775546 -617220
3369 -617220 -1965325 -2277576 -3205550 -5149440 -6859793 -7092015 -5524578 -2837978 -726629
3360 -726629 -753688 -2338565 -3152473 -2381663 -1986114 -3570099 -5870827 -7003747 -7327564
3351 -7327564 -7875392 -7582039 -4874909 -1120835 381935 -1283035 -3633010 -3994463 -1742813
3342 -1742813 2404061 7175380 10745003 11777945 10663932 8514861 5629177 2608117
3334B608117p94189L092005M459244J272984k507947k046027J523836L026846
3326A0634869O31334k486099l257795j955138k33990J008121J354193P80999J99144
3317F675638K44496k42748k410002m499048l585864l61805R91758j208264l314911
3308g710750j606828K057772K935536N24113p03187J783034M372810K387307k836847
3299A202960n355813k629682J442088K401089P73479l81547n23820r36316r81331
3290d988893R26030L441324L487401J309805L46751J595730K221224Q12574k56065
3281H895881M10621L08725k265173m234437k114918K263587M202618K504088j54708
3272I816284j774250k421639k067625n41519P34038O84j985836k863406k034317
$$ plain form
3334 2608117 1813928 4905933 9365177 10638161 8130214 6084187 7608023 10634869
3326 10634869 11266203 8780104 5522309 3567171 3333181 4341302 5695495 6476494 6675638
3317 6675638 6920134 6677386 4267384 -231664 -3817528 -4179333 -3187575 -4395839 -7710750
3308 -7710750 -9317578 -7259806 -4324270 -3800157 -4503344 -2720310 1652500 4039807 1202960
3299 1202960 -4152853 -6782535 -5340447 -2939358 -2165879 -2547426 -3071246 -4007562 -4988893
3290 -4988893 -4062863 -621539 2865862 4175667 4522418 6118148 8339372 9151946 8895881
3281 8895881 9306502 9615227 7350054 3115617 1000699 3264286 7466904 9970992 9816284
3272 9816284 8042034 5620395 3552770 3011251 3745289 3745973 1760137 -1103269 -3137586
3263c137586p22691O86433K572057L736508K237336j107905k831584j276237J219357
3254A375688J572331k12083j475207k87227K289401L122435L72912l966806n888452
3245c097008m093909j291910K3740Q02652K636275M074499K730483l83573j932622
3236e31373j068960q7454m42428r89147m80206N66425R38507J5853j946491l442521
3226g467795k434335Q34998K992754J746658n08742j78754J925839K210859M60526
3217d17992j69655Q14366J88794k867420m297990j150802L682606N506454L841179
3208E129540J587935K65797r70273k621275l685771l121586j152818Q11015J256911
3199b500525K04486l81385J005199K957234K860634P02990j098198j504359j751920
$$ plain form
3263 -3137586 -3860277 -3173844 -601787 3134721 5372057 4264152 1432568 156331 1375688
3254 1375688 2948019 2735936 1260729 973502 3262903 6385338 6758250 2791444 -3097008
3245 -3097008 -7190917 -8482827 -8459087 -7656435 -5020160 -945661 1784822 1401249 -531373
3236 -531373 -1600333 -1687787 -2130215 -3119362 -3599568 -3033143 -2094636 -2078783 -4025274 -7467795
3226 -7467795 -9902130 -9067132 -6074378 -4327720 -4836462 -5015216 -3089377 -878518 -417992
3217 -417992 -587647 226719 415513 -2451907 -6749897 -7900699 -4218093 1288361 5129540
3208 5129540 6717475 6983272 6012999 3391724 -294047 -3415633 -4568451 -3757436 -2500525
3199 -2500525 -2296039 -2677424 -1672225 1285009 4145643 4848633 3750435 2246076 494156
3190D94156k238281j587270L68195J637100J249208O24583O08395M3009j277438
3181g8343j248249J030686L139404K890351J479414Q42122L40176j308374k930297
3172D156890k549674n73656J158090K019790K064130O21275k072348l584938k324959
3163a085400k44438K38897K02762J837554L839958L238196P98250J46093J622698
3154A0594570J599381j205556l145611j388793J416206J073488k024042l788316
3146C131327k189668O92829J980390J077311p04295j895811j787262p04760J45037
3137b54902k14656j282138j543644m48836P93510R36605M96161P60050J389766
3128F31916O58597j500401k529164p55516J609476J216370j449153k532014l52355
$$ plain form
3190 494156 -1744125 -3331395 -2963200 -1326100 -76892 547691 1156086 1199095 -78343
3181 -78343 -1326592 -295906 2843498 5733849 7213263 8055385 8395561 7087187 4156890
3172 4156890 1607216 1033560 2191650 4211440 6275570 6896845 4824497 1239559 -1085400
3163 -1085400 -1329838 -1090941 -888179 949375 4789333 8027529 8825779 8971872 10594570
3154 10594570 12193951 10988395 7842784 6453991 7870197 8943685 6919643 3131327
3146 3131327 941659 1634488 3614878 4692189 3987894 2092083 304821 -399939 -254902
3137 -254902 -469558 -1751696 -3295340 -3744176 -2950666 -2014061 -1517900 -757850 631916
3128 631916 1290513 -209888 -2739052 -3494568 -1885092 -668722 -2117875 -4649889 -5002244
3119e002244K294094K379042P32478J72539J311841K273340J655820p2288j799149
3110C945473k968665l545513l607885l046877j546929P57096K762785L370975
3102c879540K776662J739179Q1142k368955l832204k126273J647309L665759K271551
3093b5370l65909k091118l074657l259974j265703K167000L379240J241690j60004
3084c454805K235446M953617L156963j464121l223102j054578J023330J187608
3076C360358J626099K783553J709309k125065m465391k370715J288123K254066
3068D060337O37815o79380q68149j236562k037225k076199r27535M79042J185536
3059a462320R47599J98494J804J117616K489181J897633j072519l982840m375441
$$ plain form
3119 -5002244 -2708150 -329108 403370 575909 1887750 4161090 5816910 5744622 3945473
3110 3945473 976808 -2568705 -6176590 -9223467 -10770396 -10013300 -7250515 -3879540
3102 -3879540 -1102878 636301 717443 -1651512 -5483716 -7609989 -5962680 -2296921 -25370
3093 -25370 -391279 -2482397 -5557054 -8817028 -10082731 -7915731 -4536491 -3294801 -3454805
3084 -3454805 -1219359 3734258 6891221 5427100 2203998 1149420 2172750 3360358
3076 3360358 4986457 7770010 9479319 7354254 2888863 518148 1806271 4060337
3068 4060337 4698152 4018772 3150623 1914061 -123164 -2199363 -3126898 -2647856 -1462320
3059 -1462320 -514721 -316227 -314423 803193 3292374 5190007 4117488 134648 -4240793
3050d240793k508111l67893Q75551J371117J465696J185484M55209o33256j354442
3041c751438m02435K366797M424159K745344j940576n036219l389439Q29006K979417
3032a175384J481674j142299k037761j049334J51008O20112R30621J649348J927255
3023A355240M78533k128533l392334j777509J314403L323204L186737J262440
3015C622181j833996m622848m560992r03075L253220M333641K806593J641130
3007C735854J388649L57251j037555m40557J678226J894628m92835k022558q93833
2998D167270J62240q97303j692707p1003J452011j28193k884097l168522j779882
2989d840186k062632l470055k259290J689412L713246J034966l264937m457292
$$ plain form
3050 -4240793 -6748904 -7116797 -6241246 -4870129 -3404433 -2218949 -1763740 -2396996 -3751438
3041 -3751438 -4153873 -1787076 2637083 5382427 3441851 -1594368 -4983807 -4154801 -1175384
3032 -1175384 306290 -836009 -2873770 -3923104 -3772096 -3151984 -2221363 -572015 1355240
3023 1355240 1833773 -294760 -3687094 -5464603 -4150200 -826996 2359741 3622181
3015 3622181 1788185 -2834663 -7395655 -8298730 -5045510 -711869 2094724 3735854
3007 3735854 5124503 5481754 4444199 4003642 5681868 7576496 7083661 5061103 4167270
2998 4167270 4329510 3432207 1739500 1668497 3120508 2992315 108218 -3060304 -4840186
2989 -4840186 -6902818 -10372873 -12632163 -10942751 -7229505 -6194539 -9459476 -13916768
2981a3916768j639325K356599M533959M049970K263900J159389J046957K68632
2973A23313j826085k922994q45121K539449L371146J224058o32266l58919L54027
2964A026608j03966q23764q30109j100076k349801l082524j791818N73556K092322
2955f389572K357779J924913Q51333m04328j50419K192611L980658K173084k090937
2946D445122m325246k414728Q64636J907097P13197l04152l10707n30731j281981
2937a237493j030507Q76437K439957J444442j351811l027313k100871P3112J384295
2928b529752J136698Q6619m91576L21137K013245K487487L58058k652910l377590
2919b648584j396191O07823J173094J997200M103845M900843J809978l040540
$$ plain form
2981 -13916768 -15556093 -13199494 -8665535 -4615565 -2351665 -1192276 -145319 123313
2973 123313 -1702772 -4625766 -5470887 -2931438 439708 1663766 1031500 672581 1026608
2964 1026608 922642 98878 -731231 -1831307 -4181108 -7263632 -9055450 -8481894 -6389572
2955 -6389572 -4031793 -2106880 -1255547 -1659875 -1810294 382317 4362975 6536059 4445122
2946 4445122 119876 -2294852 -1430216 476881 1190078 885926 575219 44488 -1237493
2937 -1237493 -2268000 -1391563 1048394 2492836 1141025 -1886288 -3987159 -3914047 -2529752
2928 -2529752 -1393054 -1306435 -1798011 -1476874 536371 3023858 3381916 729006 -2648584
2919 -2648584 -4044775 -3436952 -2263858 -266658 3837187 8738030 10548008 7507468
2911G507468n007959l036224n09832j50350r11049n12571J181860K290483J185723
2902B037549j803905m233427l507108r372K657207K018079L3052n5328J285162
2893a578091J196812k35439m8193K055205K520005l79536l544709l750314j980532
2884e744792p09190Q1865J353425K148243J483604R58446K107480K986154J089249
2875E754484j755604j558727J465152L047546J481060l08215k36105k51999k047030
2866E590562l467544k263922m40712j113737k902486j666370K656193N119008
2858A510992K662090j531877k668161q73994j76649k019235l124593o08072L409872
2849c419627M455304J732710j114722j359857o55120j719841l708338l529986
$$ plain form
2911 7507468 2499509 -536715 -1046547 -1196897 -2107946 -2620517 -1438657 851826 2037549
2902 2037549 233644 -3999783 -7506891 -7516263 -4859056 -2840977 -2807925 -2863253 -1578091
2893 -1578091 -381279 -616718 -664911 1390294 3910299 3530763 -13946 -3764260 -5744792
2884 -5744792 -6453982 -6372117 -5018692 -2870449 -1386845 -428399 1679081 4665235 5754484
2875 5754484 3998880 2440153 3905305 6952851 8433911 8125696 7889591 7637592 5590562
2866 5590562 2123018 -140904 -581616 -1695353 -4597839 -6264209 -3608016 1510992
2858 1510992 4173082 2641205 -26956 -900950 -1077599 -3096834 -6221427 -6829499 -3419627
2849 -3419627 1035677 2768387 1653665 293808 -361312 -2081153 -5789491 -9319477
2841i319477q84656J110897O87631j38214P36030J960998J242641m29277p1251
2832e104678K469871M017030K627059j5839j527899j758322j588443r00393N22987
2823a258627J534659R23520o60472j624235j533721q69361M59619K553529L954516
2814C479427K621017j287475n002279n837721l439471M19054L166366K884601
2806b996481p5143k814317k473801P03352L799061M501871K894903M25948j392274
2797B573119j511935k32980N57162l64947j417172l45070J881980K056780j78166
2788C018771j396540L59837K467576J775726p92593k089762j269227Q2782R76702
2779C133272J636738J868563J079579l70652j461925j778253j348949o0194J603193
$$ plain form
2841 -9319477 -10204133 -9093236 -8405605 -8543819 -7807789 -5846791 -4604150 -5033427 -5104678
2832 -5104678 -2634807 1382223 4009282 3993443 2465544 707222 -881221 -1781614 -1258627
2823 -1258627 276032 1199552 539080 -1085155 -2618876 -3488237 -3028618 -475089 3479427
2814 3479427 6100444 4812969 -189310 -6027031 -9466502 -9047448 -5881082 -2996481
2806 -2996481 -3071624 -5885941 -8359742 -7656390 -3857329 644542 3539445 3965393 2573119
2797 2573119 1061184 828204 1385366 1020419 -396753 -741823 1140157 3196937 3018771
2788 3018771 1622231 1982068 4449644 6225370 5432777 3343015 2073788 2156570 3133272
2779 3133272 4770010 6638573 7718152 7347500 5885575 4107322 2758373 2698179 4301372
2770D301372K255332J290172j72969j042881j539279j723111p38565J026413J281638
2761D938122p13561k349287j604765k77899m54115m65388J851740M242638K980507
2752H147992q65000k933844k246423j363041p85598J141997L004133J249435k821366
2743B528285l415933N05014K696474o01171m361516k574063K645629M889312K732574
2734E044605p1912j101310r62831k60939O12211J9383k541551l971987j435043
2725d669374K660149L569631R21580j607009k251014k368648k338664q86800J397860
2716e572289K166692J323270R88478J208837o3365k164685j535209K223016M517636
2707C092381K230150j763234l104147j729233l29480J58949M25569K92891n59691
$$ plain form
2770 4301372 6556704 7846876 7673907 6631026 5091747 3368636 2630071 3656484 4938122
2761 4938122 4224561 1875274 270509 -7390 -461505 -926893 924847 5167485 8147992
2752 8147992 7282992 4349148 2102725 739684 -45914 1096083 4100216 5349651 2528285
2743 2528285 -887648 -382634 2313840 1712669 -2648847 -5222910 -2577281 2312031 5044605
2734 5044605 4972693 3871383 2908552 2647613 3259824 3279207 737656 -3234331 -4669374
2725 -4669374 -2009225 1560406 2481986 874977 -1376037 -3744685 -6083349 -6970149 -5572289
2716 -5572289 -3405597 -2082327 -1093849 114988 51623 -2113062 -3648271 -1425255 3092381
2707 3092381 5322531 3559297 455150 -1274083 -1603563 -1444614 -1019045 -726154 -1285845
2698a285845r46719n1407M87622q19932j976730N748M004802N566291K919375
2689G903205p99884k011730p81381O29550J069754P45204l34947k255350m032586
2680A31835m127378k350801l91115n0499j302686k423402j994283m66967N62565
2671a2412731M77656L83271J443564L174337M110340L686008K487237R47379q78945
2662C418116k119149j266639J488189L384726K057727j319365l486926l260349
2654a103670k271844j608614k52107K119567L270663J510057j051591j028166
2646d15705J355708K714904J525995k21061o85965n80427r76790j368033j288220
2637F0406j547075k265363j840266K93795J920199J265429J68672J411155M200238
$$ plain form
2698 -1285845 -2232564 -2283971 -1796349 -2616281 -4593011 -4587263 -582461 4983830 7903205
2689 7903205 7103321 5091591 4310210 4939760 6009514 6754718 6419771 4164421 131835
2680 131835 -3995543 -6346344 -6737459 -6787958 -8090644 -10514046 -12508329 -12975296 -12412731
2671 -12412731 -11935075 -11551804 -10108240 -6933903 -2823563 862445 3349682 4297061 3418116
2662 3418116 1298967 32328 1520517 4905243 6962970 5643605 2156679 -1103670
2654 -1103670 -3375514 -4984128 -5236235 -3116668 153995 1664052 612461 -415705
2646 -415705 940003 3654907 5180902 4959841 4273876 3693449 2716659 1348626 60406
2637 60406 -1486669 -3752032 -5592298 -5298503 -3378304 -2112875 -1944203 -533048 3667190
2628C667190N162375L113420Q2961k063685l323466l855502l199840j741016q28496
2619b986059p79348m80512N09696J131266O76379o3607k13649r6443l36752o27004
2609c266033j05016J471710L180731L390081J257978j745721k794838j168237
2601B20655M17065n71322k778881l029021j082260L95646K05082j7600R29540
2592e311096J980232J989833J345194N30404p29250k023448k046886p36761L66439
2583d635339P11916J551355L201937L811294K282959L66323J05363Q52336N86459
2574H834603j041270k588448k813310j548385N08314J916648J427493l82190j466851
2565B846604r04086J15584L11990k31295j034748j784403j511067N50713K705700
$$ plain form
2628 3667190 8829565 11942985 12025946 9962261 6638795 2783293 -416547 -2157563 -2986059
2619 -2986059 -3765407 -4245919 -3736223 -2604957 -1928578 -1992185 -2205834 -2302277 -2639029 -3266033
2609 -3266033 -3371049 -1899339 1281392 4671473 5929451 4183730 1388892 220655
2601 220655 637720 66398 -2712483 -5741504 -6823764 -6428118 -6223036 -6240636 -5311096
2592 -5311096 -3330864 -1341031 4163 534567 -194683 -2218131 -4265017 -5001778 -4635339
2583 -4635339 -3923423 -2372068 829869 4641163 6924122 7290445 7395808 8248144 8834603
2574 8834603 7793333 5204885 2391575 843190 1351504 3268152 4695645 4313455 2846604
2565 2846604 1942518 2058102 2370092 2138797 1104049 -680354 -2191421 -1640708 1064992
2556A064992K044715j097398k819350j163333J110830J120983O3935K91990J139937
2547A757301P87869j26668k9877M95368L34563N17344J909941K351738q0320k898643
2537E018616k591595n30138p00909k736162k555014L78000J999845N05428j041793
2528b253722l38140Q17670P11304P54753K003576K610129J325570M7629K90299
2519E969068L90048j073677k218531j194949K64796j82159j460998j305534k86888
2510a098824j88302l03220J007639K595577K078975N116j194106j481733k600843
2501a179721l755133k129529J918500M192576K362311r93465k512345k297727
2493d394533k184995k135435o96793K135314M434553M362559J807212j457924
$$ plain form
2556 1064992 3109707 2012309 -807041 -1970374 -859544 261439 325374 617364 1757301
2547 1757301 2545170 2418502 2388625 2883993 3218556 3735900 5645841 7997579 7917259 5018616
2537 5018616 2427021 1896883 1195974 -1540188 -4095202 -3717202 -1717357 -1211929 -2253722
2528 -2253722 -2591862 -1774192 -1062888 -308135 1695441 4305570 5631140 5678769 5969068
2519 5969068 6359116 5285439 3066908 1871959 2136755 1954596 493598 -811936 -1098824
2510 -1098824 -1287126 -1590346 -582707 2012870 4091845 4096961 2902855 1421122 -1179721
2501 -1179721 -4934854 -7064383 -5145883 -953307 1409004 415539 -2096806 -4394533
2493 -4394533 -6579528 -8714963 -9411756 -7276442 -2841889 1520670 3327882 1869958
2485A869958k955862j836246j82887o16567k461475k322994P96304L309509J734022
2476b666238k252121l856076j347883K299660L744089K820850J256142L7294o36072
2467f00355l31814Q90019J442671k06735k875707l378443o41219K419426K493528
2458g88629K37537q70965N17145K232948K448770K246670K873776K803342R7475
2449A1798069l680616m894210k810460l79173R4612o18749j054394j122337q02701
2440c469959N32953K006108J079271k400143m508219k393202J048058J221510
2432f883623r92417n52633L618086O648846N002061J286108m89880o29663j522320
2423E484565k747967k358049j124165j359132k481755j872884J50159L92998j715854
$$ plain form
2485 1869958 -1085904 -2922150 -3105037 -3721604 -6183079 -8506073 -7709769 -4400260 -2666238
2476 -2666238 -4918359 -8774435 -10122318 -7822658 -4078569 -1257719 -1577 35717 -600355
2467 -600355 -932169 -42150 1400521 1193786 -1681921 -5060364 -5701583 -3282157 -788629
2458 -788629 -551092 -1422057 -904912 1328036 3776806 6023476 8897252 11700594 11798069
2449 11798069 8117453 3223243 412783 33610 128222 -490527 -1544921 -2667258 -3469959
2440 -3469959 -2937006 -930898 148373 -2251770 -6759989 -9153191 -8105133 -6883623
2432 -6883623 -7876040 -8428673 -4810587 1838259 6840320 8126428 7636548 7006885 5484565
2423 5484565 2736598 378549 -745616 -2104748 -4586503 -6459387 -6309228 -5916230 -7632084
2414g632084k793435r53057J278826J554887J670370L899287O065366M090181
2406G180341j695945o284205n958769j978207J800619K921166J771768O02849
2398a640383J217132K723442K291980p72854l157442j737690J711144K817291
2390C452620Q20109q31092p6254J003976l354k218570l176757k076772J0619J550208
2380a545267J283911p33338k243124r19770K097315L225456J616368L27916J172032
2371D281499J822333J78715j723498j223739L32048J09760j229646j098660K4852
2362A473664m11443j824199r23932K405719M149524K330397K34019J440673M595881
2353A3470303N476691K381969k521022n913566n865268k791336P78538K080730
$$ plain form
2414 -7632084 -10425519 -11378576 -10099750 -8544863 -6874493 -2975206 3090160 7180341
2406 7180341 5484396 -799809 -6758578 -8736785 -6936166 -4015000 -2243232 -1640383
2398 -1640383 -423251 2300191 4592171 3819317 661875 -1075815 635329 3452620
2390 3452620 4272729 3441637 3365383 4369359 4366005 2147435 -1029322 -3106094 -3095475 -1545267
2380 -1545267 -261356 -994694 -3237818 -4157588 -2060273 1165183 2781551 3109467 4281499
2371 4281499 6103832 6282547 4559049 3335310 3667358 3777118 2547472 1448812 1473664
2362 1473664 1062221 -761978 -1685910 719809 4869333 7199730 7433749 8874422 13470303
2353 13470303 18946994 21328963 18807941 12894375 7029107 4237771 5016309 7097039
2345G097039N50682k122306m188598m833409l445733j31724K904921L010756P74712
2336c83660l69751R65317K328501J699949N51570O60676P45892q63894k471163
2327B863437j391925J224584J581319j089168l348424k500042K8781J214629L38400
2318a078409q51008p54360L38609Q99690K43122l03017Q93041K885916K721043
2309D994627k55021k739695j958683J46330r3881k347331k903602m64642K191368
2300c430530K618537J564989O64106J46871r5453K71840O16496m64573k412856
2291e20573k649074n81956R19781j41480j626999p29956J446031J735612n2770
2282b201384j066434J81647K129702K824582J874378l26932l053447m547591k981814
$$ plain form
2345 7097039 7647721 5525415 1336817 -3496592 -6942325 -7074049 -4169128 -1158372 -383660
2336 -383660 -753411 211906 2540407 4240356 4791926 5452602 6198494 5334600 2863437
2327 2863437 1471512 2696096 4277415 3188247 -160177 -2660219 -2631438 -1416809 -1078409
2318 -1078409 -1929417 -2683777 -2345168 -1445478 -1202356 -1505373 -612332 2273584 4994627
2309 4994627 4739606 1999911 41228 187558 93677 -2253654 -5157256 -5621898 -3430530
2300 -3430530 -811993 752996 1417102 1563973 1468520 1740360 2356856 1892283 -520573
2291 -520573 -3169647 -3751603 -2831822 -2973302 -4600301 -5330257 -3884226 -2148614 -2201384
2282 -2201384 -3267818 -3086171 -956469 1868113 3742491 3415559 362112 -4185479 -7167293
2273g167293R91106M110228L834566R12473j893586k755883j877196l69790J096448
2264c118927K411283L144567K286018l11028k595107k023377J007168L208750
2256D009347K732618J363657Q94322j94412l541621o393311m492551J000512L944500
$$ plain form
2273 -7167293 -6176187 -2065959 1768607 2681080 787494 -1968389 -3845585 -4215375 -3118927
2264 -3118927 -707644 2436923 4722941 4411913 1816806 -206571 800597 4009347
2256 4009347 6741965 8105622 8999944 8805532 5263911 -1129400 -5621951 -4621439 -676939
$$ [...]
##END NTUPLES=NMR SPECTRUM
##END=
