##TITLE=31Pdec_DE-87_ch_4_TFA
 CDCl3, 64 sc
 23.4.2025
##JCAMPDX= 6.0         $$ Bruker NMR JCAMP-DX V2.0
##DATA TYPE= NMR SPECTRUM
##DATA CLASS= NTUPLES
##ORIGIN= UXNMR, Bruker Analytische Messtechnik GmbH
##OWNER= root
$$ XWIN-NMR		Version 3.5
$$ Wed Apr 23 14:05:17 2025 Russian Standard Time (UT+4h)  she@DPX200
##.OBSERVE FREQUENCY= 81.013821
##.OBSERVE NUCLEUS= ^31P
##.ACQUISITION MODE= SIMULTANEOUS
##.ACQUISITION SCHEME= undefined
##.AVERAGES= 64
##.DIGITISER RES= 17
##SPECTROMETER/DATA SYSTEM= spect
##.PULSE SEQUENCE= zgpg30
##.SOLVENT NAME= CDCl3
##.SHIFT REFERENCE= (INTERNAL, CDCl3, 0, 198.062)
##AUDIT TRAIL= $$ (NUMBER, WHEN, WHO, WHERE, WHAT)
$$ ##TITLE= Audit trail, XWIN-NMR		Version 3.5
$$ ##JCAMPDX= 5.01
$$ ##ORIGIN= Bruker BioSpin GmbH
$$ ##OWNER= she
$$ F:/spectra/data/she/nmr/P31/2/pdata/1/auditp.txt
$$ ##AUDIT TRAIL=  $$ (NUMBER, WHEN, WHO, WHERE, WHAT)
(   1,<2025-04-23 14:04:24.93 +0400>,<she>,<DPX200>,
      <created by zg, POWCHK disabled, PULCHK disabled
       configuration hash MD5:
       00 E9 B6 7A A2 85 ED C7 34 08 36 98 17 FE 4E 26
       data hash MD5: 32K
       58 01 22 7E A0 43 57 05 23 DE 23 FF C3 68 F5 33>)
(   2,<2025-04-23 14:04:27.71 +0400>,<she>,<DPX200>,
      <Start of raw data processing
       efp BC_mod = 2 LB = 1.5 FT_mod = 6 PKNL = 1 PHC0 = 1558.58 PHC1 = -342.7069 SI = 64K 
       data hash MD5: 64K
       9A BD 04 40 38 A1 24 1E C7 F4 FA FA 0B 1E C6 90>)
(   3,<2025-04-23 14:04:42.54 +0400>,<she>,<DPX200>,
      <pk PHC0 = 1.987574 PHC1 = 0 
       data hash MD5: 64K
       61 EA C7 4A ED 92 32 5B B9 E2 C0 B8 89 FA A2 BB>)
(   4,<2025-04-23 14:04:48.10 +0400>,<she>,<DPX200>,
      <abs ABSG = 5 
       data hash MD5: 64K
       24 9C EA 45 32 4C AC 47 1B 50 DE F5 BF 2F 2C 35>)
$$ ##END=
$$ 
$$ hash MD5
$$ B9 6A CF A8 09 3C 2D C0 B8 D6 EE C3 39 82 1B FD
##$RELAX= 
##$RELAX= 
##$RELAX= 
##$RELAX= 
##$RELAX= 
##$RELAX= 
##$RELAX= 
##$RELAX= 
$$ Bruker specific parameters
$$ --------------------------
##$DU= <F:/spectra>
##$EXPNO= 2
##$NAME= <P31>
##$PROCNO= 1
##$TYPE= <nmr>
##$USER= <she>
##$AMP= (0..31)
100 100 100 100 100 100 100 100 100 100 100 100 100 100 100 100 100 100 
100 100 100 100 100 100 100 100 100 100 100 100 100 100 
##$AQSEQ= 0
##$AQ_mod= 1
##$AUNM= <au_zg>
##$AUTOPOS= <>
##$BF1= 81.014009
##$BF2= 200.13
##$BF3= 200.13
##$BF4= 200.13
##$BF5= 200.13
##$BF6= 200.13
##$BF7= 200.13
##$BF8= 200.13
##$BYTORDA= 1
##$CFDGTYP= 0
##$CFRGTYP= 5
##$CHEMSTR= <none>
##$CNST= (0..31)
1 1 145 1 1 1 1 1 1 1 1 1 1 1 1 1 1 1 1 1 1 1 1 1 1 1 1 1 1 1 1 1 
##$CPDPRG= <waltz16>
##$CPDPRG1= <>
##$CPDPRG2= <waltz16>
##$CPDPRG3= <>
##$CPDPRG4= <mlev>
##$CPDPRG5= <mlev>
##$CPDPRG6= <mlev>
##$CPDPRG7= <mlev>
##$CPDPRG8= <mlev>
##$CPDPRGB= <>
##$CPDPRGT= <>
##$D= (0..31)
0 1 0 0 0 0 0 0 0 0.06 0 0.03 2e-05 3e-06 0 0 0.0002 0 0 0 0 0 0 0 0 0 
0 0 0 0 0 0 
##$DATE= 1745402664
##$DBL= (0..7)
120 120 120 11 120 120 24 19 
##$DBP= (0..7)
150 150 150 150 150 150 150 150 
##$DBP07= 0
##$DBPNAM0= <>
##$DBPNAM1= <>
$$ [...]
##$SUBNAM3= <"">
##$SUBNAM4= <"">
##$SUBNAM5= <"">
##$SUBNAM6= <"">
##$SUBNAM7= <"">
##$SUBNAM8= <"">
##$SUBNAM9= <"">
##$SW= 400.765351723535
##$SWIBOX= (0..15)
0 1 3 0 0 0 0 0 0 0 0 0 0 0 0 0 
##$SW_h= 32467.5324675325
##$TD= 32768
##$TD0= 1
##$TE= 0
##$TE2= 300
##$TE3= 300
##$TEG= 300
##$TL= (0..7)
0 120 53 12 22 120 120 120 
##$TP= (0..7)
150 150 150 150 150 150 150 150 
##$TP07= 0
##$TPNAME0= <>
##$TPNAME1= <>
##$TPNAME2= <>
##$TPNAME3= <>
##$TPNAME4= <>
##$TPNAME5= <>
##$TPNAME6= <>
##$TPNAME7= <>
##$TPOAL= (0..7)
0.5 0.5 0.5 0.5 0.5 0.5 0.5 0.5 
##$TPOFFS= (0..7)
0 0 0 0 0 0 0 0 
##$TUNHIN= 0
##$TUNHOUT= 0
##$TUNXOUT= 0
##$USERA1= <user>
##$USERA2= <user>
##$USERA3= <user>
##$USERA4= <user>
##$USERA5= <user>
##$V9= 5
##$VALIST= <valist>
##$VCLIST= <CCCCCCCCCCCCCCC>
##$VD= 0
##$VDLIST= <DDDDDDDDDDDDDDD>
##$VPLIST= <PPPPPPPPPPPPPPP>
##$VTLIST= <TTTTTTTTTTTTTTT>
##$WBST= 1024
##$WBSW= 4
##$XGAIN= (0..3)
0 0 0 0 
##$XL= 0
##$YL= 0
##$YMAX_a= 3897
##$YMIN_a= -17737
##$ZGOPTNS= <>
##$ZL1= 120
##$ZL2= 120
##$ZL3= 120
##$ZL4= 120
##$ABSF1= 198.0616
##$ABSF2= -202.7028
##$ABSG= 5
##$ABSL= 3
##$ALPHA= 0
##$AQORDER= 0
##$ASSFAC= 0
##$ASSFACI= 0
##$ASSFACX= 0
##$ASSWID= 0
##$AUNMP= <proc_1d>
##$AZFE= 0.1
##$AZFW= 0.5
##$BCFW= 0
##$BC_mod= 2
##$BYTORDP= 0
##$COROFFS= 0
##$CY= -3
##$DATMOD= 1
##$DC= 0
##$DFILT= <>
##$DTYPP= 0
##$F1P= 0
##$F2P= 0
##$FCOR= 1
##$FTSIZE= 65536
##$FT_mod= 6
##$GAMMA= 0
##$GB= 0
##$INTBC= 1
##$INTSCL= 9.790993e-09
##$ISEN= 30
##$LB= 1.5
##$LEV0= 0
##$LPBIN= 0
##$MAXI= 10000
##$MC2= 0
##$MEAN= 0
##$ME_mod= 0
##$MI= 50
##$NCOEF= 0
##$NC_proc= -8
##$NLEV= 6
##$NOISF1= 182.463
##$NOISF2= 159.3651
##$NSP= 0
##$NTH_PI= 0
##$NZP= 0
##$OFFSET= 198.0616
##$PC= 4
##$PHC0= 1560.568
##$PHC1= -342.7069
##$PH_mod= 1
##$PKNL= yes
##$PPARMOD= 0
##$PSCAL= 0
##$PSIGN= 0
##$REVERSE= no
##$SF= 81.0140089999434
##$SI= 65536
##$SIGF1= 159.3651
##$SIGF2= -187.1042
##$SINO= 113.3802
##$SIOLD= 16384
##$SREGLST= <1H.CDCl3>
##$SSB= 0
##$STSI= 65536
##$STSR= 0
##$SW_p= 32467.5324675325
##$SYMM= 0
##$S_DEV= 0
##$TDeff= 32768
##$TDoff= 0
##$TI= <>
##$TILT= no
##$TM1= 0
##$TM2= 0
##$TOPLEV= 0
##$USERP1= <user>
##$USERP2= <user>
##$USERP3= <user>
##$USERP4= <user>
##$USERP5= <user>
##$WDW= 1
##$XDIM= 65536
##$YMAX_p= 198328753
##$YMIN_p= -151155002
$$ End of Bruker specific parameters
$$ ---------------------------------
##NTUPLES= NMR SPECTRUM
##VAR_NAME=  FREQUENCY,     SPECTRUM/REAL,   SPECTRUM/IMAG
##SYMBOL=    X,             R,               I
##VAR_TYPE=  INDEPENDENT,   DEPENDENT,       DEPENDENT
##VAR_FORM=  AFFN,          ASDF,            ASDF
##VAR_DIM=   65536,         65536,           65536
##UNITS=     HZ,            ARBITRARY UNITS, ARBITRARY UNITS
##FACTOR=    0.49542278885378, 1,            1
##FIRST=     16045.7642231865, 0,            0
##LAST=      -16421.768244346, 0,            0
##MIN=       -16421.768244346, -151155002,   0
##MAX=       16045.7642231865, 198328753,    0
$$ Real data points
##PAGE= N=1
##DATA TABLE= (X++(R..R)), XYDATA
$$ [...]
##PAGE= N=2
##DATA TABLE= (X++(I..I)), XYDATA
$$ plain form
7492 -27202 539360 559675 870150 1193002 433585 -1206560 -2171810 -1813996 -954644 219149
7482 219149 2906690 7397637 11623656 13169225 11540259 7585061 2241874 -2875627
7474 -2875627 -5355257 -4523701 -3112524 -4218114 -7106721 -8212469 -6178736 -3667895
7466 -3667895 -3652316 -5782409 -7339323 -6506413 -3887215 -1741662 -2245130 -5460499 -8574609
7457 -8574609 -8403768 -5306775 -3187408 -4587863 -7293187 -7497208 -5099062 -3357094 -3574457
7448 -3574457 -3005667 796544 5772731 7647173 5488996 2734804 2488278 3651552 2781959
7439 2781959 -1138391 -5031760 -4846100 261952 6992088 10879785 10192968 7101688 5162840
7430 5162840 5813966 7490406 7929835 6702879 5257980 5059014 6244052 7906474 9204204
$$ packed form
7492b7202N66562K0315L10475L22852p59417j640145r65250L57814Q59352J173793
7482B19149K687541M490947M226019J545569j628966l955198n343187n117501
7474b875627k479630Q31556J411177j105590k888607j105748K033733K510841
7466c667895J5579k130093j556914Q32910K619198K145553n03468l215369l114110
7457h574609J70841L096993K119367j400455k705324k04021K398146J741968k17363
7448c574457N68790L802211M976187J874442k158177k754192k46526J163274q69593
7439B781959l920350l893369J85660N108052O730136L887697o86817l091280j938848
7430E162840O51126J676440M39429j226956j444899j98966J185038J662422J297730
$$ plain form
7421 9204204 10152042 11429342 13223696 14373200 13423723 10815595 8948384 9160470 9620437
7412 9620437 7705151 3844351 1082366 964857 2123929 3442402 6044979 10484467
7404 10484467 14061921 13590591 9932376 7192231 7535555 9106696 9274014 7630093 5090441
7395 5090441 2249542 -7890 -22947 2672062 5875617 6934753 5930047 5138319 5717821
7386 5717821 6563405 6454756 5722959 5244440 4978537 4271393 2917877 1281068 -240685
7377 -240685 -1478605 -2582544 -4016149 -5953616 -7521689 -7292224 -4840630 -1267866 1995749
7368 1995749 4172733 4828694 3832877 2252091 1935852 3055613 3311096 1222346 -954553
7359 -954553 -7030 3126056 4088367 1445307 -899027 659069 4071437 4647617 1714586
$$ packed form
7421I204204R47838J277300J794354J149504r49477k608128j867211K12086M59967
7412I620437j915286l860800k761985j17509J159072J318473K602577M439488
7404A0484467L577454m71330l658215k740145L43324J571141J67318j643921k539652
7395E090441k840899k257432j5057K695009L203555J059136j004706p91728N79502
7386E717821Q45584j08649p31797m78519k65903p07144j353516j636809j521753
7377b40685j237920j103939j433605j937467j568073K29465K451594L572764L263615
7368A995749K176984O55961r95817j580786l16239J119761K55483k088750k176899
7359i54553R47523L133086R62311k643060k344334J558096L412368N76180k933031
$$ plain form
7350 1714586 -880835 -337317 1996357 3268522 2352349 -163978 -3106439 -5030566 -5074870
7341 -5074870 -4214509 -4235573 -5045035 -4703919 -2655542 -947133 -1271917 -2627977 -3098695
7332 -3098695 -2245987 -457930 2259133 5154972 6067641 3923028 635006 -1511597 -3092988
7323 -3092988 -5776441 -8408686 -7876597 -3771607 531426 1965174 838767 -667742
7315 -667742 -1179107 -667536 155267 420200 145733 688131 2931332 5480067 6379025
7306 6379025 6070339 6302732 6474821 4110051 -659928 -4354543 -5025967 -4747732 -5502407
7297 -5502407 -5622166 -2902341 1130744 3134497 2647664 1949137 2235736 2771160 3205827
7288 3205827 3954039 4448560 3587601 2034778 1738893 2813048 2970913 600769 -3335021
$$ packed form
7350A714586k595421N43518K333674J272165r16173k516327k942461j924127m4304
7341e074870Q60361k1064q09462L41116K048377J708409l24784j356060m70718
7332c098695Q52708J788057K717063K895839R12669k144613l288022k146603j581391
7323c092988k683453k632245N32089M104990M303033J433748j126407j506509
7315f67742n11365N11571Q22803K64933k74467N42398K243201K548735Q98958
7306F379025l08686K32393J72089k364770m769979l694615o71424K78235p54675
7297e502407j19759K719825M033085K003753m86833o98527K86599N35424M34667
7288C205827P48212M94521q60959j552823k95885J074155J57865k370144l935790
$$ plain form
7279 -3335021 -6910935 -9071309 -9374993 -7658490 -4880588 -3022683 -3139729 -4241300 -4720020
7270 -4720020 -4168549 -3266525 -2581516 -2127274 -1757916 -1514295 -1558951 -1780665 -1581397 -572799
7260 -572799 492308 487475 -55191 819465 3223597 4126938 1277829 -2897449 -3911284
7251 -3911284 -1103274 1854113 2187490 769162 -835999 -2913467 -5691078 -7455128
7243 -7455128 -6696412 -4554000 -3179732 -2767699 -1903168 27157 2338696 4253886 5227109
7234 5227109 4743724 3117864 1867068 2003103 2557469 2131762 1268098 1619697 3029268
7225 3029268 3233311 863199 -2669648 -4995386 -5529206 -5519003 -5830739 -5640703 -3547826
7216 -3547826 540220 5102592 8390665 9544761 8440805 5498041 2153365 362348
$$ packed form
7279c335021l575914k160374l03684J716503K777902J857905j17046j101571m78720
7270d720020N51471R02024O85009M54242L69358K43621m4656k21714J99268J008598
7260e72799J065107m833n42666Q74656K404132R03341k849109m175278j013835
7251c911284K808010K957387L33377j418328j605161k077468k777611j764050
7243g455128P58716K142412J374268M12033Q64531J930325K311539J915190R73223
7234E227109m83385j625860j250796J36035N54366m25707q63664L51599J409571
7225C029268K04043k370112l532847k325738n33820J0203l11736J90036K092877
7216c547826M088046M562372L288073J154096j103956k942764l344676j791017
$$ plain form
7208 362348 491891 658716 -405745 -893069 1489420 5168693 5901565 2538365 -1505091
7199 -1505091 -3487332 -4846545 -7560252 -9907875 -8771731 -4305202 679510 4741564
7191 4741564 8283935 10875021 11227356 9716630 8189145 7152375 5619051 3827738
7183 3827738 3474063 4746040 5684298 5341342 5191638 6239092 6965566 5774686 3625298
7174 3625298 2288158 1403459 -373292 -1959498 -207796 5641698 11723484 13209651
7166 13209651 9530776 4596109 1942593 1232633 320286 -855300 -649165 612344 345079
7157 345079 -1917917 -2644322 1036272 6848806 10312401 10706611 10834492 11621440 10800851
7148 10800851 7470571 4314495 3662566 4104212 3072290 852120 -103582 1330851 3939742
$$ packed form
7208C62348J29543J66825j064461m87324K382489L679273P32872l363200m043456
7199a505091j982241j359213k713707k347623J136144M466529M984712M062054
7191D741564L542371K591086L52335j510726j527485j036770j533324j791313
7183C827738l53675J271977R38258l42956j49704J047454P26474j190880k149388
7174C625298j337140q84699j776751j586206J751702N849494O081786J486167
7166A3209651l678875m934667k653516p09960r12347j175586K06135J261509k67265
7157C45079k262996p26405L680594N812534L463595L94210J27881P86948q20589
7148A0800851l330280l156076o51929M41646j031922k220170r55702J434433K608891
$$ plain form
7139 3939742 5876235 6031071 4421885 2402881 1882464 3375568 5364820 6209819 5943367
7130 5943367 5648789 5957988 6691771 7101288 6205600 4042881 2604369 3739196 5925051
7121 5925051 5528224 2059759 -588754 325870 2538740 2866105 2394536 4011704 6616524
7112 6616524 6118347 1798076 -2385516 -3322087 -1978050 -159041 2458073 6219750 9241280
7103 9241280 9694909 8546945 7670373 6578939 3609390 -310423 -1861052 202326 3044084
7094 3044084 3551818 2643126 3746412 7373294 9581090 7010656 1713770 -1278679 -511805
7085 -511805 503420 -1169642 -3904109 -4701651 -3828537 -3528593 -3678962 -1974882 1943492
7076 1943492 5513019 6700470 6056967 5016092 4411509 5034268 7253473 9424624 9072944
$$ packed form
7139C939742J936493J54836j609186k019004n20417J493104J989252Q44999k66452
7130E943367k94578L09199P33783M09517q95688k162719j438512J134827K185855
7121E925051l96827l468465k648513R14624K212870L27365m71569J617168K604820
7112F616524m98177m320271m183592r36571J344037J819009K617114L761677L021530
7103I241280M53629j147964q76572j091434k969549l919813j550629K063378K841758
7094C044084N07734r08692J103286L626882K207796k570434n296886k992449P66874
7085e11805J015225j673062k734467p97542Q73114K99944j50369J704080L918374
7076A943492L569527J187451o43503j040875o04583O22759K219205K171151l51680
$$ plain form
7067 9072944 6596698 5383584 6921346 8150127 5575522 114705 -4337060 -5783577
7059 -5783577 -5355571 -4702029 -4490195 -5033482 -6249314 -6954354 -5837033 -3199162 -488957
7050 -488957 1646950 3456019 4479526 3529562 565411 -2669319 -4305752 -3872749 -2129869
7041 -2129869 -251102 791752 837996 553051 278933 -682723 -2755720 -4646918 -4579603
7032 -4579603 -2699133 -811619 142703 763122 1292130 910524 -460541 -1360651 -859064
7023 -859064 -132260 -739239 -2192331 -2465103 -435927 3124187 6566604 8508015 8356551
7014 8356551 6610694 4572581 3226803 2480991 1651945 188707 -2263651 -5659991 -8962983
7005 -8962983 -10714544 -10862448 -10975898 -11781752 -11772250 -9707823 -7276353 -7025449 -8177714
$$ packed form
7067I072944k476246j213114J537762J228781k574605n460817m451765j446517
7059e783577M28006O53542K11834n43287j215832p05040J117321K637871K710205
7050d88957K135907J809069J023507r49964k964151l234730j636433M33003J742880
7041b129869J878767J042854M6244k84945k74118r61656k072997j891198O7315
7032d579603J880470J887514R54322O20419N29008l81606j371065r00110N01587
7023h59064P26804o06979j453092k72772K029176L560114L442417J941411j51464
7014H356551j745857k038113j345778p45812q29046j463238k452358l396340l302992
7005h962983j751561j47904j13450q05854R502K064427K431470K50904j152265
$$ plain form
6996 -8177714 -7100032 -2360274 2973310 5044530 3418390 568733 -1120623 -634261
6988 -634261 1657944 3602512 2388977 -1877372 -4936447 -3160743 1181404 2295960
6980 2295960 -1592154 -6127884 -6987107 -5038369 -3540247 -2850566 -890244 2449357 4572608
6971 4572608 3899954 1792484 168709 -775783 -1529707 -1562792 -23695 2659135 5049104
6962 5049104 6270833 6524039 6255813 5507577 4129023 2300600 734896 225025 701708
6953 701708 931196 -181946 -1969972 -2541635 -1289935 6085 -729884 -3316147 -5656013
6944 -5656013 -6192435 -5127169 -3450352 -1796988 -479873 91837 -532957 -2575903 -5799159
6935 -5799159 -9221881 -11266874 -10875101 -8606684 -6096486 -4278212 -2656608 -417438
$$ packed form
6996h177714J077682M739758N333584K071220j626140k849657j689356M86362
6988f34261K292205J944568j213535m266349l059075J775704M342147J114556
6980B295960l888114m535730q59223J948738J498122O89681J960322L339601K123251
6971D572608o72654k107470j623775r44492p53924l3085J539097K682830K389969
6962E049104J221729K53206k68226p48236j378554j828423j565704n09871M76683
6953G01708K29488j113142j788026n71663J251700J296020p35969k586263k339866
6944e656013n36422J065266J676817J653364J317115N71710o24794k042946l223256
6935e799159l422722k044993L91773K268417K510198J818274J621604K239170
$$ plain form
6927 -417438 2434206 5323392 7797214 9504160 10091787 9695037 8986733 8123049 6283335
6918 6283335 3208396 644835 817060 3375507 5235033 4011233 610390 -2190501
6910 -2190501 -2776554 -1550783 308381 1823840 2459281 2452744 2670955 3336641 3369343 1974558
6900 1974558 339989 351876 1877187 2952116 2795892 2856756 4210293 5631897 5508929
6891 5508929 4385663 3991763 4460011 4277796 2969941 2234678 3770897 6930934 9371640
6882 9371640 9676600 8528461 7161821 5475463 2656426 -517544 -1610615 183139
6874 183139 1978248 375858 -3843018 -6469818 -5317264 -2391303 -101541 1758227
6866 1758227 3739460 4360558 2661122 1008680 2119992 4521113 4313475 872986 -2532288
$$ packed form
6927d17438K851644K889186K473822J706946N87627l96750p08304q63684j839714
6918F283335l074939k563561J72225K558447J859526j223800l400843k800891
6910b190501n86053J225771J859164J515459O35441o537K18211O65686L2702j394785
6900A974558j634569J1887J525311J074929j56224O0864J353537J421604j22968
6891E508929j123266l93900M68248j82215j307855p35263J536219L160037K440706
6882I371640L04960j148139j366640j686358k819037l173970j093071J793754
6874A83139J795109j602390m218876k626800J152554K925961K289762J859768
6866A758227J981233O21098j699436j652442J111312K401121k07638l440489l405274
$$ plain form
6857 -2532288 -3715402 -3834081 -4226650 -4187560 -2966750 -1291403 301529 2265168 4088489
6848 4088489 4086231 2518434 2314666 4808790 7159988 6364111 3776307 2895566 4207287
6839 4207287 5280839 5096717 5105561 6071845 6757345 6317240 5678485 5637390 5340543 3689042
6829 3689042 1126633 -812573 -1092789 9984 977268 -111071 -3759668 -7770649 -8781614
6820 -8781614 -5716580 -1108822 1559866 1453436 824894 2067673 4918480 6998139 6931901
6811 6931901 6048529 6349230 7610213 7924448 6805709 5853384 5938113 5711506 3983529
6802 3983529 1870327 1113344 1574970 1905722 1572886 766755 -548095 -1931327 -2029677
6793 -2029677 -554806 577398 25442 -474502 1152632 3373360 2944215 36930 -1939457
$$ packed form
6857b532288j183114j18679l92569L9090J220810J675347J592932J963639J823321
6848D088489k258j567797k03768K494124K351198p95877k587804q80741J311721
6839D207287J073552j84122Q844R66284O85500m40105o38755m1095k96847j651501
6829C689042k562409j939206k80216J102773R67284j088339l648597m010981j010965
6820h781614L065034M607758K668688j06430o28542J242779K850807K079659o6238
6811F931901q83372L00701J260983L14235j118739r52325Q4729k26607j727977
6802C983529k113202p56983M61626L30752l32836q06131j314850j383232r8350
6793b029677J474871J132204n51956m99944J627134K220728m29145k907285j976387
$$ plain form
6784 -1939457 -1534552 -775737 -1008776 -732179 1166389 3072305 3205536 2049011 653441
6775 653441 -1090630 -2766454 -2405438 585314 3277570 2421242 -1320028 -4338420 -4327785
6766 -4327785 -1815031 1504578 4090521 4991469 4693165 4977132 6595314 7896183 7089385
6757 7089385 4863624 3238661 2827476 2892921 3163638 3836162 4640844 5598176 7602500
6748 7602500 10289501 10650865 6523722 646077 -1906714 -185090 1891481 1546609 543126
6739 543126 1428171 3491811 4449863 3828433 2421112 80137 -3498971 -6726649 -7174082
6730 -7174082 -4509128 -776462 2064863 3595099 4312012 4999005 6528110 8860214 10232315
6721 10232315 8768329 5180259 2518108 2649890 4175417 4709479 4195696 4521438 6235139
$$ packed form
6784a939457M04905P58815k33039K76597J898568J905916J33231j156525j395570
6775F53441j744071j675824L61016K990752K692256q56328l741270l018392J0635
6766d327785K512754L319609K585943R00948k98304K83967J618182J300869q06798
6757G089385k225761j624963m11185O5445K70717O72524Q04682R57332K004324
6748G602500K687001L61364m127143n877645k552791J721624K076571l44872j003483
6739E43126Q85045K063640R58052o21430j407321k340975l579108l227678m47433
6730g174082K664954L732666K841325J530236P16913O86993J529105K332104J372101
6721A0232315j463986l588070k662151J31782J525527N34062n13783L25742J713701
$$ plain form
6712 6235139 7371767 6170151 3678510 2408571 3035087 3939142 3932109 3664053 3662040 2749742
6702 2749742 56016 -2547561 -2181275 1187340 4789145 7092283 9399245 12514375
6694 12514375 14286387 12599665 9269208 8280962 10535827 12790856 12118860 9231997
6686 9231997 6547365 4881451 3549094 2479085 2376669 3062324 3131607 1567005 -1056557
6677 -1056557 -3082087 -3048051 -786032 2015343 2690188 155676 -3370306 -4342813 -1894816
6668 -1894816 1220500 2232813 1777033 2677868 6044196 9855750 11307772 9559007 6125599
6659 6125599 3392448 2837365 3990042 4966432 4566248 3789711 4507401 6581905 7350420
6650 7350420 4575414 -747441 -5261446 -6660461 -5642188 -4560234 -4697792 -5180891 -4477953
$$ packed form
6712F235139J136628j201616k491641j269939O26516R04055p033k68056k013r12298
6702B749742k693726k603577L66286L368615L601805K303138K306962L115130
6694A2514375J772012j686722l330457r88246K254865K255029o71996k886863
6686I231997k684632j665914j332357j070009j02416O85655O9283j564602k623562
6677a056557k025530L4036K262019K801375O74845k534512l525982r72507K447997
6668a894816L115316J012313m55780R00835L366328L811554J452022j748765l433408
6659F125599k733151n55083J152677R76390m00184p76537P17690K074504P68515
6650G350420k775006n322855m514005j399015J018273J081954j37558m83099P02938
$$ plain form
6641 -4477953 -2577733 -1154028 -1458154 -2742004 -3437499 -3373476 -3698064 -4675996 -4916849
6632 -4916849 -3416430 -1315279 -527717 -1078064 -1042848 588975 1991742 441158 -3932264
6623 -3932264 -7440692 -6695025 -2505377 1325336 2741386 3056472 3549156 3050404 712913
6614 712913 -1091361 296892 3179933 3294929 31539 -2736619 -2576125 -1597863 -2266366
6605 -2266366 -3593439 -3719977 -3288408 -3457019 -3008321 -642319 1674937 1101537 -1452191
6596 -1452191 -2396623 -495841 2242816 4081144 4720059 3426577 -339102 -4174030 -4254892
6587 -4254892 -554910 2677081 2766844 1745710 2134627 2879092 1918421 189759 75246
6578 75246 1496396 2497167 2734843 3555382 5007990 5497531 4640298 4083525 4655322
$$ packed form
6641d477953J900220J423705l04126j283850o95495O4023l24588r77932k40853
6632d916849J500419K101151P87562n50347L5216J631823J402767j550584m373422
6623c932264l508428P45667M189648L830713J416050L15086M92684m98752k337491
6614G12913j804274J388253K883041J14996l263390k768158J60494R78262o68503
6605b266366j327073j26538M31569j68611M48698K366002K317256n73400k553728
6596a452191r44432J900782K738657J838328O38915j293482l765679l834928q0862
6587d254892L699982L231991Q9763j021134L88917P44465r60671j728662j14513
6578G5246J421150J000771K37676Q20539J452608M89541q57233n56773N71797
$$ plain form
6569 4655322 4549198 1679610 -3173227 -7033414 -8370469 -8762063 -10259939 -11955927 -10646072
6560 -10646072 -5117058 1734513 6043051 6961666 6128148 4548569 2366997 864266
6552 864266 1540021 3030585 2170090 -913463 -1934053 1628465 6703266 9102168 9162697
6543 9162697 9798119 10985421 10092666 6857761 4170278 3681057 3935230 3516305 3085843
6534 3085843 3262480 3100147 2104021 1622732 2627572 3820050 3680821 3107078 4171894
6525 4171894 6983289 9432981 9783756 8222649 5981236 3946166 2147164 -38335
6517 -38335 -3045174 -6046734 -7193626 -5597913 -2634999 -476312 279537 588189 929901
6508 929901 599660 -763489 -2149487 -2434804 -1954272 -1914781 -2495235 -2434451 -800065 1366854
$$ packed form
6569D655322j06124k869588m852837l860187j337055l91594j497876j695988J309855
6560a0646072N529014O851571M308538R18615q33518j579579k181572j502731
6552H64266O75755J490564q60495l083553j020590L562518N074801K398902O0529
6543I162697O35422J187302q92755l234905k687483m89221K54173m18925m30462
6534C085843J76637j62333r96126m81289J004840J192478j39229n73743J064816
6525D171894K811395K449692L50775j561107k241413k035070j799002k185499
6517c8335l006839l001560j146892J595713K962914K158687P55849L08652L41712
6508I29901l30241j363149j385998k85317M80532L9491n80454O0784J634386K166919
$$ plain form
6498 1366854 1795760 -451920 -3472898 -4130367 -1460789 1949752 2649833 186794 -2677500
6489 -2677500 -3732278 -3910621 -5156342 -6995201 -7180082 -5330239 -3655895 -3575135 -3748355
6480 -3748355 -2659299 -1339405 -1803326 -4044814 -6455242 -8253252 -9411572 -8842512 -5142794
6471 -5142794 664844 5257047 6541903 5654017 5048886 5872194 7367760 7610823 4913243
6462 4913243 -18451 -3602046 -2950817 285126 1873396 602990 -836850 -613676 132700
6453 132700 763290 2807490 6252435 7947175 6502502 5330948 7257971 9187363 6566841
6444 6566841 869451 -2431747 -2042036 -1665559 -3006895 -3471074 -1723041 -347924 -1006236
6435 -1006236 -1373457 504589 2490868 1971359 265618 235463 1626013 1937786 466823
$$ packed form
6498A366854M28906k247680l020978o57469K669578L410541P00081k463039k864294
6489b677500j054778j78343j245721j838859j84881J849843J674344Q0760j73220
6480c748355J089056J319894m63921k241488k410428j798010j158320N69060L699718
6471e142794N807638M592203J284856q87886o05131Q23308J495566K43063k697580
6462D913243m931694l583595O51229L235943J588270j270406j439840K23174P46376
6453A32700O30590K044200L444945J694740j444673j171554J927023J929392k620522
6444F566841n697390l301198L89711L76477j341336m64179J748033J375117o58312
6435a006236l67221J878046J986279n19509j705741l0155J390550L11773j470963
$$ plain form
6426 466823 -1450097 -3166896 -4940373 -6069053 -5415491 -3608702 -2556719 -2738834 -2779527
6417 -2779527 -1794610 -569211 -131638 -357831 -324941 620041 2163105 3013329 2028444
6408 2028444 -270855 -2139646 -3063130 -4477187 -7019509 -8587796 -7075622 -4098871
6400 -4098871 -3583634 -6653936 -10098010 -10473281 -7906725 -4852734 -2568501 -401453 1942834
6391 1942834 3054218 1452659 -2011263 -4355754 -3497864 -652293 934834 -546483
6383 -546483 -4003907 -7254516 -9177357 -9855493 -9756800 -9314374 -8361100 -5604545 48579
6374 48579 7026464 11484088 11308223 8406594 5727597 3502174 338410 -3224957 -4860478
6365 -4860478 -3828715 -1841332 -424549 475605 1017139 789479 298452 1067932 3090357
$$ packed form
6426D66823j916920j716799j773477j128680O53562J806789J051983j82115m0693
6417b779527R84917J225399M37573k26193L2890R44982J543064Q50224r84885
6408B028444k299299j868791r23484j414057k542322j568287J512174K976751
6400d098871N15237l070302l444074l75271K566556L053991K284233K167048K344287
6391A942834J111384j601559l463922k344491Q57890K845571J587127j481317
6383e46483l457424l250609j922841o78136R8693M42426R53274K756555N653124
6374D8579O977885M457624j75865k901629k678997k225423l163764l563367j635521
6365d860478J031763J987383J416783R00154N41534k27660m91027P69480K022425
$$ plain form
6356 3090357 3801439 1071864 -3748718 -7089557 -6913890 -4281366 -1705252 -831362 -1372547
6347 -1372547 -1635172 -338835 1776278 2738142 2068344 1771636 3752792 6987131 8481669
6338 8481669 6887365 4075701 2883665 4022048 5646557 5656198 3926030 2060624 1136838
6329 1136838 364506 -1451703 -3686638 -4447351 -3502856 -3089389 -4708480 -6354940 -4800775
6320 -4800775 -276711 3240158 3030607 1054755 905576 2665106 3087594 754391 -1464622
6311 -1464622 -365944 2963639 4615541 3214203 1359060 1407090 2236581 1693815 501863
6302 501863 1377795 4748331 7650133 7445680 4986172 3156961 3387769 4669258 5358896
6293 5358896 4794374 3208814 1002872 -1458504 -3626430 -4791423 -4681723 -4178660 -5025283
$$ packed form
6356C090357P11082k729575m820582l340839J75667K632524K576114Q73890n41185
6347a372547k62625J296337K115113R61864o69798k96708J981156L234339J494538
6338H481669j594304k811664j192036J138383J624509R641j730168j865406r23786
6329A136838p72332j816209k234935p60713R44495M13467j619091j646460J554165
6320d800775M524064L516869k09551j975852j49179J759530M22488k333203k219013
6311a464622J098678L329583J651902j401338j855143M8030Q29491n42766j191952
6302E01863Q75932L370536K901802k04453k459508j829211K30808J281489O89638
6293E358896n64522j585560k205942k461376k167926j164993J09700N03063q46623
$$ plain form
6284 -5025283 -8137515 -12159266 -14345905 -13155440 -9548547 -5720327 -3340098 -3207695
6276 -3207695 -5354719 -8397597 -9646354 -7462214 -3481904 -1134609 -1664890 -2835228
6268 -2835228 -2004783 778546 3535328 4963650 5051587 4057340 2539209 1926959 3252506
6259 3252506 5334814 6012092 5345660 5531293 6995550 6981645 3671051 -305151 -905812
6250 -905812 1964613 4723000 5037967 3734910 2009373 -147975 -2029335 -1634332 1342799
6241 1342799 4002813 3529287 677967 -1473238 -1127552 1077431 3275179 3492169 831046
6232 831046 -3141660 -5359316 -4788845 -3616778 -3764961 -4231329 -3738849 -3782906 -6079923
6223 -6079923 -8587042 -7645234 -3396718 479506 2144469 2934840 3118214 581655 -4713474
$$ packed form
6284e025283l112232m021751k186639J190465L606893L828220K380229J32403
6276c207695k147024l042878j248757K184140L980310K347295n30281j170338
6268b835228Q30445K783329K756782J428322Q7937r94247j518131o12250J325547
6259C252506K082308O77278o66432J85633J464257j3905l310594l976202o00661
6250i05812K870425K758387L14967j303057j725537k157348j881360L95003K977131
6241A342799K660014m73526k851320k151205L45686K204983K197748K16990k661123
6232H31046l972706k217656N70471J172067j48183m66368M92480m4057k297017
6223f079923k507119R41808M248516L876224J664963P90371J83374k536559n295129
$$ plain form
6214 -4713474 -8756476 -8445786 -5707670 -4037769 -3323168 -1206187 2048322 3511757 1984428
6205 1984428 -486724 -1680958 -1520527 -924180 -239387 508039 1100825 1495579 1921141
6196 1921141 2379278 2787813 3679583 5919217 9513078 13295933 15899623 16584375 15269694
6187 15269694 12420573 8949248 5686038 2821062 146415 -2217424 -3625696 -3424647
6179 -3424647 -1627985 723376 2030027 1513870 63124 -976286 -1647798 -2933339 -4593606
6170 -4593606 -5084701 -3951567 -2424706 -860822 2233861 7028894 10237870 8636217
6162 8636217 3557109 -642830 -1884683 -1586990 -1114840 -12909 1858347 3187364 3248270
6153 3248270 3024789 3353967 3768013 4008638 4709123 5453894 4162669 52914 -4323885
$$ packed form
6214d713474m043002L10690K738116J669901P14601K116981L254509J463435j527329
6205A984428k471152j194234J60431N96347O84793P47426N92786L94754M25562
6196A921141M58137M08535Q91770K239634L593861L782855K603690O84752j314681
6187A5269694k849121l471325l263210k864976k674647k363839j408272K01049
6179c424647J796662K351361J306651n16157j450746j039410o71512j285541j660267
6170d593606m91095J133134J526861J563884L094683M795033L208976j601653
6162H636217n079108m199939j241853K97693M72150J101931J871256J329017O0906
6153C248270k23481L29178M14046K40625P00485P44771j291225m109755m376799
$$ plain form
6144 -4323885 -5810271 -4353056 -2379929 -1460671 -1307776 -1339110 -1412950 -1331985 -1114877 -1447755
6134 -1447755 -2544867 -3097060 -1905530 -45514 454016 -203656 155975 2119857 3671853
6125 3671853 3396968 2471934 2218029 1642147 -781910 -4311905 -6988436 -8599962 -10409281
6116 -10409281 -12283819 -12357915 -9888207 -6543313 -4180538 -2917263 -2197777 -2200761 -2900676
6107 -2900676 -2944502 -1193373 1069532 1102002 -1992268 -6143334 -8801025 -9540495 -9748744
6098 -9748744 -10594348 -12061860 -13510877 -14259696 -13496813 -10365706 -4904673 1049331 4633445
6089 4633445 4419079 1999914 351881 502351 717543 -694579 -2979862 -4318696 -4621172
6080 -4621172 -5389800 -7152800 -8658435 -8780064 -7793433 -6374927 -4662221 -2953940 -2197559
$$ packed form
6144d323885j486386J457215J973127R19258J52895l1334p3840Q0965K17108l32878
6134a447755j097112n52193J191530J860016M99530o57672L59631J963882J551996
6125C671853k74885r25034k53905n75882k424057l529995k676531j611526j809319
6116a0409281j874538p4096K469708L344894K362775J263275P19486k984o99915
6107b900676m3826J751129K262905L2470l094270m151066k657691p39470k08249
6098i748744q45604j467512j449017p48819P62883L131107N461033N954004L584114
6089D633445k14366k419165j648033J50470K15192j412122k285283j338834l02476
6080d621172p68628j763000j505635j21629R86631J418506J712706J708281P56381
$$ plain form
6071 -2197559 -2926518 -4504351 -6134383 -7817882 -9536021 -10312209 -9198001 -6783322 -4677261
6062 -4677261 -3573920 -2644145 -864769 1722398 4240364 5963095 6660147 6009233 3233835
6053 3233835 -1777949 -6807992 -8067270 -3962716 2563028 7014667 8181465 8165687 8191021
6044 8191021 7302991 5612677 5436047 7478177 8809944 7116260 4559200 4480507 6247965
6035 6247965 6814382 5946005 5975221 6981659 6317006 3236453 257218 -907379 -1350195
6026 -1350195 -1850108 -1078046 1571409 4368893 6205795 8345743 11281622 12628304 10631130
6017 10631130 7410379 5906599 5487700 3611815 492670 -1041993 263823 2753978
6009 2753978 4384653 4367318 2742776 430157 -802773 -451023 -658583 -3302339 -6553440
$$ packed form
6071b197559p28959j577833j630032j683499j718139p76188J114208K414679K106061
6062d677261J103341R29775J779376K587167K517966J722731O97052o50914k775398
6053C233835n011784n030043j259278M104554O525744M451639J166798j5778K5334
6044H191021q88030j690314j76630K042130J331767j693684k557060p8693J767458
6035F247965N66417q68377K9216J006438o64653l080553k979235j164597m42816
6026a350195m99913P72062K649455K797484J836902K139948K935879J346682j997174
6017A0631130l220751j503780m18899j875885l119145j534663J305816K490155
6009B753978J630675j7335j624542k312619j232930L51750k07560k643756l251101
$$ plain form
6000 -6553440 -7049180 -4910515 -3514054 -4326765 -5175013 -4168018 -2247499 -814335 404209
5991 404209 1837451 2911264 3794158 5955673 9408773 11589589 10768281 8603488 7430343
5982 7430343 6925725 5614008 3915727 3166362 2940204 2008651 959438 1070664 1255128
5973 1255128 -813912 -4541406 -6368720 -4589362 -1715802 -1041953 -2880423 -5301381
5965 -5301381 -6874008 -7494411 -7855651 -9107563 -11771465 -14131759 -13211578 -8540207 -3568407
5956 -3568407 -1902714 -3284040 -4800546 -4889343 -4134138 -2916233 -781080 1688254 2558667
5947 2558667 942150 -1740722 -3610446 -4183491 -3690269 -1932098 934714 3342076 3467373
5938 3467373 1341682 -1044351 -1637034 165339 3405035 6217397 7009025 5862860 4481380
$$ packed form
6000f553440m95740K138665J396461q12711q48248J006995J920519J433164J218544
5991D04209J433242J073813Q82894K161515L453100K180816q21308k164793j173145
5982G430343n04618j311717j698281p49365k26158r31553j049213J11226J84464
5973A255128k069040l727494j827314J779358K873560O73849j838470k420958
5965e301381j572627o20403l61240j251912k663902k360294R20181M671371M971800
5956c568407J665693j381326j516506q8797P55205J217905K135153K469334Q70413
5947B558667j616517k682872j869724n73045M93222J758171K866812K407362J25297
5938C467373k125691k386033n92683J802373L239696K812362P91628j146165j381480
$$ plain form
5929 4481380 3896034 2709766 -1089412 -6753348 -10842135 -11126313 -8994324 -7194671 -6493419
5920 -6493419 -5739915 -4211116 -2375250 -838292 17505 -384997 -2126111 -3690706 -3053361
5911 -3053361 -240305 2398932 2915696 1686554 219622 -750885 -1265943 -1273987 -699480
5902 -699480 181077 992556 1307424 314045 -2298080 -4712712 -4063797 -397475 2150114
5893 2150114 116765 -4552578 -6845609 -4952139 -1577572 638841 1929680 3001715
5885 3001715 2832163 647424 -1804291 -1911050 768917 4401112 6961364 7459885 6020068
5876 6020068 3700429 1519062 -823795 -4201323 -7867885 -9792818 -9629009 -9028734 -8156310
5867 -8156310 -4889988 675503 4226841 2899634 136215 730041 3224172 2462432 -1383654
$$ packed form
5929D481380n85346j186268l799178n663936m088787k84178K131989J799653P01252
5920f493419P53504J528799J835866J536958Q55797m02502j741114j564595O37345
5911c053361K813056K639237N16764j229142j466932r70507n15058q044N74507
5902f99480Q80557Q11479L14868r93379k612125k414632O48915L666322K547589
5893B150114k033349m669343k293031J893470L374567K216413J290839J072035
5885C001715j69552k184739k451715j06759K679967L632195K560252M98521j439817
5876F020068k319639k181367k342857l377528l666562j924933J63809O00275Q72424
5867h156310L266322N565491L551338j327207k763419N93826K494131p61740l846086
$$ plain form
5858 -1383654 -2417514 1657349 5730353 5042632 1599178 -379993 -994819 -2568781 -4445443
5849 -4445443 -4558863 -4024364 -5469099 -7947048 -7961414 -5164292 -2988547 -3468706 -5058228
5840 -5058228 -6015588 -6569242 -6908188 -6037930 -3796292 -1695591 -846167 -980008 -1860716
5831 -1860716 -3310462 -3562864 -524704 4429556 6855882 4817778 1360933 -183586
5823 -183586 -581301 -2159390 -4415470 -5100605 -4017742 -2676254 -1125323 1832202 5498239
5814 5498239 7073904 5057405 977537 -2681950 -4920060 -6344834 -7895431 -9466008
5806 -9466008 -9245808 -5303875 1128293 5326919 4096065 231287 -574620 3022330 6626890
5797 6626890 6237370 2839265 -297664 -2283514 -4517700 -7595472 -10498996 -12099691
$$ packed form
5858a383654j033860M074863M073004o87721l443454j979171o14826j573962j876662
5849d445443j13420N34499j444735k477949j4366K797122K175745m80159j589522
5840e058228r57360n53654l38946Q70258K241638K100701Q49424j33841q80708
5831a860716j449746k52402L038160M954260K426326k038104l456845j544519
5823a83586l97715j578089k256080o85135J082863J341488J550931K957525L666037
5814E498239J575665k016499m079868l659487k238110j424774j550597j570577
5806i466008K20200L941933O432168M198626j230854l864778q05907L596950L604560
5797F626890l89520l398105l136929j985850k234186l077772k903524j600695
$$ plain form
5789 -12099691 -11739586 -8980859 -4536436 -1076076 -1223862 -4420688 -7114048 -6525578 -3279154
5780 -3279154 23170 1769352 2199942 2107741 1720342 829074 -646115 -2435385 -3990310
5771 -3990310 -4691760 -4249138 -3096537 -2290236 -2741397 -4325251 -5694160 -5149755 -2055957
5762 -2055957 2354705 5715880 6487980 5382262 4572570 5270949 6401026 6096778 4245299
5753 4245299 2798557 3412565 5448119 6774144 6163567 4363925 2926850 2456140 2164254
5744 2164254 994946 -995780 -2550001 -2545060 -1084608 1061424 3614213 6497593 8571225
5735 8571225 7981172 4423240 125969 -2325221 -2585030 -2136645 -1865406 -1265674 -17047
5726 -17047 882786 226261 -1656809 -2891356 -1858068 1223869 4654410 7070450 8454392
$$ packed form
5789a2099691L60105K758727M444423L460360j47786l196826k693360N88470L246424
5780c279154L302324J746182M30590r2201l87399q91268j475189j789270j554925
5771c990310p01450M42622J152601Q06301m51161j583854j368909N44405L093798
5762b055957M410662L361175P72100j105718q09692O98379J130077l04248j851479
5753D245299j446742O14008K035554J326025o10577j799642j437075m70710k91886
5744B164254j169308j990726j554221M941J460452K146032K552789K883380K073632
5735H571225n90053l557932m297271k451190k59809M48385K71239N99732J248627
5726a7047Q99833o56525j883070j234547J033288L081937L430541K416040J383942
$$ plain form
5717 8454392 9088556 8257966 5136307 796270 -2098314 -2109966 -413593 1144760 2110245
5708 2110245 2825688 3258171 3650637 4988454 7216585 8226872 6646359 4607366 5161224
5699 5161224 7404249 7148306 2815831 -2275177 -4647904 -4987376 -5815780 -6993058 -6176100
5690 -6176100 -2792123 996477 3254626 4203844 4797612 4892360 3619722 836613 -2397268
5681 -2397268 -4532624 -4564235 -2677192 -70905 1905593 2501487 1769142 599709 516634
5672 516634 2537350 5737502 7610030 6557741 3720574 1805989 2355687 4518554 6120632
5663 6120632 5502660 2695931 -647233 -2622539 -2710047 -1941588 -1439266 -1277625 -924010
5654 -924010 -165809 741687 1360840 1284735 577356 15117 118280 38898 -1328055 -3007312
$$ packed form
5717H454392O34164q30590l121659m340037k894584j1652J696373J558353R65485
5708B110245P15443M32483L92466J337817K228131J010287j580513k038993N53858
5699E161224K243025k55943m332475n091008k372727l39472q28404j177278Q16958
5690f176100L383977L788600K258149R49218N93768R4748j272638k783109l233881
5681b397268k135356l1611J887043K606287J976498N95894p32345j169433q3075
5672E16634K020716L200152J872528j052289k837167j914585N49698K162867J602078
5663F120632o17972k806729l343164j975306q7508P68459N02322J61641L53615
5654i24010P58201R07496O19153p6105p07379n62239J03163p9382j366953j679257
$$ plain form
5644 -3007312 -2462115 782378 3777949 3704781 1254247 -1083950 -2581729 -4044824 -5288519
5635 -5288519 -5428971 -5023666 -5193481 -4890996 -2055127 2174506 3600853 629358 -2996805
5626 -2996805 -3097210 -543274 515577 -1547594 -4400921 -5538667 -5153967 -5055120 -6343834
5617 -6343834 -8531205 -10038677 -9529216 -7303033 -4915277 -2871914 189010 4877612
5609 4877612 8883332 9347985 6610264 3397525 838896 -2046877 -4898865 -5212908 -2192149
5600 -2192149 1257563 2210446 1372839 1075930 1432956 975656 -97195 -52727 1420013
5591 1420013 2812015 3193583 2780370 1306737 -1577977 -4040250 -2976690 1797800 6682647
5582 6682647 8868552 9502950 10755267 12096302 11796091 10209790 8754589 6940439 3603871
$$ packed form
5644c007312N45197L244493K995571p3168k450534k338197j497779j463095j243695
5635e288519j40452M05305j69815L02485K835869M229633J426347k971495l626163
5626b996805j00405K553936J058851k063171k853327j137746L84700R8847j288714
5617f343834k187371j507472N09461K226183K387756K043363L060924M688602
5609D877612M005720M64653k737721l212739k558629k885773k851988l14043L020759
5600b192149L449712R52883q37607k96909L57026m57300j072851M4468J472740
5591A420013J392002L81568m13213j473633k884714k462273J063560M774490M884847
5582F682647K185905O34398J252317J341035l00211j586301j455201j814150l336568
$$ plain form
5573 3603871 442983 798805 4490474 7078129 5506169 1914370 289966 1459474
5565 1459474 3227577 3798918 3004170 1289469 -364943 -102075 3216963 8078136 11425531
5556 11425531 11711471 9751310 6896770 3791473 871337 -1356961 -2841878 -3746397
5548 -3746397 -3601622 -1842055 725615 2313202 2370543 2164691 2685787 3314220 3305631 3233037
5538 3233037 3768729 4153091 3411136 2360368 2641303 4008917 4469775 3415428 2786767
5529 2786767 4152841 6035426 5572958 2190282 -1676918 -3253965 -1842924 1101430
5521 1101430 3240953 2924722 668705 -942410 50639 2413204 3151869 1556601 51849
5512 51849 454513 1397722 887822 -357708 -317336 723660 627107 -794947 -1139159 850036
$$ packed form
5573C603871l160888L55822L691669K587655j571960l591799j624404J169508
5565A459474J768103N71341p94748j714701j654412K62868L319038M861173L347395
5556A1425531K85940j960161k854540l105297k920136k228298j484917r04519
5548c746397J44775J759567K567670J587587N7341k05852N21096O28433q589p2594
5538C233037N35692L84362p41955j050768K80935J367614M60858j054347o28661
5529B786767J366074J882585m62468l382676l867200j577047J411041K944354
5521A101430K139523l16231k256017j611115R93049K362565P38665j595268j504752
5512E1849M02664R43209n09900j245530M0372J040996r6553j422054l44212J989195
$$ plain form
5502 850036 3286227 4031810 3601081 3582651 3641154 2077389 -1245232 -4351343 -5574802
5493 -5574802 -5258375 -4775030 -4655775 -4023409 -1670641 2254692 5703819 6513320 4930842
5484 4930842 3431588 3528044 3919115 2829060 1062967 999807 2957399 4432566 3322283
5475 3322283 471292 -1630929 -1651620 -191883 1449916 2411010 2492324 2045767 1753372
5466 1753372 2136744 3043594 3597585 2764275 228378 -3138835 -5906717 -7388544 -8082992
5457 -8082992 -8586177 -8454632 -6712277 -3386452 -9783 1533439 434074 -2679815 -6444584
5448 -6444584 -9753388 -12262267 -14035408 -14840447 -14166954 -12086974 -9629770 -7797495 -6409782
5439 -6409782 -4547207 -2279177 -1313072 -3143353 -6558154 -8055953 -5745864 -2174898
$$ packed form
5502H50036K436191P45583m30729j8430N8503j563765l322621l106111j223459
5493e574802L16427M83345J19255O32366K352768L925333L449127Q09501j582478
5484D930842j499254R6456L91071j090055j766093o3160J957592J475167j110283
5475C322283k850991k102221k0691J459737J641799R61094Q1314m46557k92395
5466A753372L83372R06850N53991q33310k535897l367213k767882j481827o94448
5457h082992n03185J31545J742355L325825L376669J543222j099365l113889l764769
5448f444584l308804k508879j773141q05039O73493K079980K457204J832275J387713
5439f409782J862575K268030R66105j830281l414801j497799K310089L570966
$$ plain form
5431 -2174898 -1526727 -4001959 -5385679 -3273500 -937017 -2352215 -5755845 -6323098 -4088487
5422 -4088487 -3989879 -7478497 -9559300 -6526142 -1720388 29146 -492519 48587 779904
5413 779904 -1421176 -5265318 -6389832 -4639940 -4101365 -5721571 -5856150 -3261877 -1554664
5404 -1554664 -2409944 -1969252 2419614 6679167 5723096 1131516 -1735905 -1745039 -2044304
5395 -2044304 -3655727 -4183942 -2664889 -1046475 -246595 1238735 3662215 4434491 1899005
5386 1899005 -1902603 -4026622 -4273591 -4333845 -4747611 -4504312 -2974558 -837950 743050
5377 743050 1170494 885448 1166134 3060058 6227208 9152685 10517463 9946305 7659542
5368 7659542 4231814 731367 -1697080 -2607627 -2235630 -1019529 182009 -43263 -2232840
$$ packed form
5431b174898O48171k475232j383720K112179K336483j415198l403630n67253K234611
5422d088487R8608l488618k080803L033158M805754J749534n21665N41106P31317
5413G79904k201080l844142j124514J749892N38575j620206j34579K594273J707213
5404a554664q55280M40692M388866M259553r56071m591580k867421r134k99265
5395b044304j611423n28215J519053J618414P99880J485330K423480P72276k535486
5386A899005l801608k124019k46969o0254m13766K43299J529754K136608J581000
5377G43050M27444k85046K80686J893924L167150K925477J364778n71158k286763
5368G659542l427728l500447k428447r10547L71997J216101J201538k25272k189577
$$ plain form
5359 -2232840 -4551377 -4189882 -730475 3034441 4244773 3017283 1740626 2158791 3923740
5350 3923740 5514167 5820982 4944927 3771246 2646013 619134 -3302651 -8102561 -11039730
5341 -11039730 -10670439 -8760171 -8184094 -9375941 -10001772 -8133708 -4618489 -1816677 -804819
5332 -804819 -637240 -28672 1172300 2385491 3408503 4454142 5305528 5087101 3051325
5323 3051325 -684501 -5154542 -8894622 -10341141 -8653831 -4676698 -715946 1217623
5315 1217623 921508 -438552 -1870922 -3067779 -3670069 -3093081 -1545293 -387001 -490048
5306 -490048 -590435 1426918 5316032 7942546 7048672 4445599 3708729 5281605 6182169
5297 6182169 4769757 3148847 3584587 5029513 5446233 5628774 7689769 10748831 11419443
$$ packed form
5359b232840k318537L61495L459407L764916J210332j227490j276657M18165J764949
5350C923740J590427L06815q76055j173681j125233k026879l921785m799910k937169
5341a1039730L69291J910268N76077j191847o25831J868064L515219K801812J011858
5332h04819J67579O08568J200972J213191J023012J045639Q51386k18427k035776
5323C051325l735826m470041l740080j446519J687310L977133L960752J933569
5315A217623k96115j360060j432370j196857o02290N76988J547788J158292j03047
5306d90048j00387K017353L889114K626514q93874k603073p36870J572876R00564
5297F182169j412412j620910M35740J444926M16720J82541K060995L059062O70612
$$ plain form
5288 11419443 8606330 4896084 2664950 1356903 -620569 -3520264 -6573241 -8790650
5280 -8790650 -9010515 -7192970 -5788875 -7099980 -8974073 -6654475 -81298 4536550
5272 4536550 2782107 -1849217 -3041293 96709 3620827 5191757 5509946 4650702 1576148
5263 1576148 -2689129 -5179529 -4755270 -2889653 -702256 1830889 3694405 3050881 204466
5254 204466 -2356252 -3399982 -4031430 -5158143 -6517832 -8370828 -11187135 -13243057 -11727790
5245 -11727790 -7120513 -3373715 -2605344 -2683967 -1518286 -548549 -1771436 -3948701 -4414546
5236 -4414546 -2845476 -798286 1100673 3178023 4865905 4872803 2773995 -728010 -4298823
5227 -4298823 -5901284 -3749079 1263293 5326016 5358124 1987595 -2004332 -4777318 -5877694
$$ packed form
5288A1419443k813113l710246k231134j308047j977472k899695l052977k217409
5280h790650k19865J817545J404095j311105j874093K319598O573177M617848
5272D536550j754443m631324j192076L138002L524118J570930L18189q59244l074554
5263A576148m265277k490400M24259J865617K187397K533145J863516o43524k846415
5254B04466k560718j043730o31448j126713j359689j852996k816307k055922J515267
5245a1727790M607277L746798P68371p8623J165681R69737j222887k177265m65845
5236d414546J569070K047190J898959K077350J687882O898k098808l502005l570813
5227d298823j602461K152205N012372M062723L2108l370529l991927k772986j100376
$$ plain form
5218 -5877694 -5361145 -4223186 -4428956 -6726448 -9265241 -9777066 -8261261 -6391847 -5347983
5209 -5347983 -5238901 -5328785 -3862721 560986 6211675 8863483 6848714 3394825 2075164
5200 2075164 2343548 2057246 1799049 3023920 3828472 1010085 -4332662 -7552266 -6902501
5191 -6902501 -5243527 -4755328 -3903718 -1019565 2567283 4910450 6304936 7750736 8621883
5182 8621883 7851139 5920973 3873605 1420065 -2448536 -7657325 -12793741 -15960666
5174 -15960666 -15584178 -11769507 -7394814 -6170325 -8576652 -11095221 -10423891 -7057070
5166 -7057070 -3689009 -1638868 -309576 1014024 2384674 3461618 3458088 1795624 -156630
5157 -156630 540776 4525463 7840844 5900986 -600888 -6064485 -6496339 -3484414 -910735
$$ packed form
5218e877694N16549J137959k05770k297492k538793n11825J515805J869414J043864
5209e347983J09082q9884J466064M423707N650689K651808k014769l453889j319661
5200B075164K68384k86302k58197J224871Q04552k818387n342747l219604O49765
5191f902501J658974M88199Q51610K884153L586848K343167J394486J445800Q71147
5182H621883p70744j930166k047368k453540l868601n208789n136416l166925
5174a5960666L76488L814671M374693J224489k406327k518569O71330L366821
5166g057070L368061K050141J329292J323600J370650J076944l530j662464j952254
5157a56630O97406L984687L315381j939858o501874n463597m31854L011925K573679
$$ plain form
5148 -910735 183524 1629481 4198215 6086971 5817059 4864984 5964640 9475560 12962479
5139 12962479 14310592 13658904 11821449 8640589 4250417 402244 -1584398 -3227976
5131 -3227976 -6707012 -10678252 -11263938 -7738093 -4191461 -4047423 -5617883 -5422405 -3817315
5122 -3817315 -4187412 -7332966 -9742931 -7969399 -2746590 1911319 2563522 -941834 -5568335
5113 -5568335 -7734767 -6560833 -4295670 -3057235 -2253322 -535850 1000535 40054 -2958233
5104 -2958233 -4745842 -3700732 -1682329 -572769 415960 2229164 2940403 -181696 -6511645
5095 -6511645 -12276412 -14647830 -13831499 -11342403 -8126048 -4722718 -1804453 129472
5087 129472 994328 1109633 1619052 4270400 9264951 13606371 13565972 9244070 4827088
$$ packed form
5148i10735J094259J445957K568734J888756k69912r52075J099656L510920L486919
5139A2962479J348113o51688j837455l180860m390172l848173j986642j643578
5131c227976l479036l971240n85686L525845L546632J44038j570460J95478J605090
5122c817315l70097l145554k409965J773532N222809M657909O52203l505356m626501
5113e568335k166432J173934K265163J238435Q03913J717472J536385r60481k998287
5104b958233j787609J045110K018403J109560R88729J813204P11239l122099o329949
5095f511645n764767k371418Q16331K489096L216355L403330K918265J933925
5087A29472Q64856J15305N09419K651348M994551M341420m0399m321902m416982
$$ plain form
5078 4827088 3417274 3390233 1388054 -2532945 -4981150 -4034934 -1773910 -1468670 -3807746
5069 -3807746 -6850105 -8717300 -9159962 -8805278 -7992184 -6692462 -4942128 -2804646 -195278
5060 -195278 2618905 4403426 3718129 779150 -2145119 -2957720 -1791839 26611 2282292
5051 2282292 5497837 8601861 9185321 6727607 3621750 1917887 839815 -1018025
5043 -1018025 -2753051 -2510845 -674027 540143 112613 -1143936 -2443647 -3386189 -2895893
5034 -2895893 -295766 2479712 2279596 -1019276 -3867798 -3446046 -662014 2145065 4344239
5025 4344239 6430425 8091094 8617045 8136961 6996539 4899407 1984531 -268106 -664350
5016 -664350 19035 440871 984728 2890474 5512233 6430858 4779274 2974000 4049488
$$ packed form
5078D827088j409814k7041k002179l920999k448205R46216K261024L05240k339076
5069c807746l042359j867195m42662L54684Q13094J299722J750334K137482K609368
5060a95278K814183J784521o85297k938979k924269q12601J165881J818450K255681
5051B282292L215545L104024N83460k457714l105857j703863j078072j857840
5043a018025j735026K42206J836818J214170m27530j256549j299711r42542M90296
5034b895893K600127K775478k00116l298872k848522M21752K784032K807079K199174
5025D344239K086186J660669N25951m80084j140422k097132k914876k252637l96244
5016f64350O83385M21836N43857J905746K621759R18625j651584j805274J075488
$$ plain form
5007 4049488 7812752 10757214 10121492 7230181 5697497 6521264 6806905 4330051 1366650
4998 1366650 1586076 4311393 5054764 1713237 -2976827 -5818571 -6768927 -6797659 -5198479
4989 -5198479 -1301088 3338890 6771797 8983489 10358281 9674034 6116793 1839282
4981 1839282 -163443 171104 698271 631185 769223 759775 -1003486 -4433322 -6976595
4972 -6976595 -6570430 -4020642 -1899218 -1918249 -3616583 -5096595 -5025283 -3968144 -3274139
4963 -3274139 -2963973 -2053728 -755152 -265091 -191214 1167108 3298830 3351048 902863
4954 902863 -370961 2166841 6480400 9702400 12145066 14366123 13831997 8885425 3294581
4945 3294581 1908075 3571957 3271129 -8775 -2588781 -2455631 -1206575 239375 2948073
$$ packed form
5007D049488L763264K944462o35722k891311j532684Q23767K85641k476854k963401
4998A366650K19426K725317P43371l341527m690064k841744r50356k8732J599180
4989e198479L897391M639978L432907K211692J374792o84247l557241m277511
4981A839282k002725L34547N27167o7086J38038r448j763261l429836k543273
4972f976595M06165K549788K121424j9031j698334j480012P1312J057139O94005
4963c274139L10166R10245J298576M90061P3877J358322K131722N2218k448185
4954I02863j273824K537802M313559L222000K442666K221057n34126m946572n590844
4945C294581j386506J663882l00828l279904k580006J33150J249056J445950K708698
$$ plain form
4936 2948073 6414067 8022077 6993639 5436536 4940730 5231160 6206777 8024908 9219429
4927 9219429 8006041 5330398 3615289 3155775 2883285 3357517 5187323 6104613 4276704
4918 4276704 3074304 7121405 14468383 18372755 16488961 12712522 10289337 8947649
4910 8947649 8622844 9910423 10783280 8855233 6645246 8310292 11852448 11723659 8440240
4901 8440240 7487342 9168481 8709120 6478660 7888303 12120959 11804086 5847359 1505293
4892 1505293 1290502 -321430 -4204103 -3531874 2504763 5457552 2999807 3220340 8133940
4883 8133940 9086575 5358413 8775789 20593656 24865763 17552664 18411677 36308070
4875 36308070 50644804 55097253 90109904 185616877 287723619 299551721 201132089
$$ packed form
4936B948073L465994J608010j028438j557103m95806K90430R75617J818131J194521
4927I219429j213388k675643j715109m59514k72490M74232J829806R17290j827909
4918D276704j202400M047101P346978L904372j883794l776439k423185j341688
4910H947649l24805J287579Q72857j928047k209987J665046L542156j28789l283419
4901H440240r52898J681139m59361k230460J409643M232656l16873n956727m342066
4892A505293k14791j611932l882673O72229O036637K952789k457745K20533M913600
4883H133940R52635l728162L417376J1817867M272107p313099Q59013J7896393
4875C6308070J4336734M452449L5012651R5506973J02106742J1828102r8419632
$$ plain form
4868 201132089 78494802 17499863 14423029 16238562 5249417 1989674 11439609
4861 11439609 13921560 2851828 -6248336 -5718221 -5777369 -11408057 -13337846 -7140867
4853 -7140867 -1743233 -3294668 -6382992 -6177504 -5656941 -6471051 -4951229 -1379261 -2195526
4844 -2195526 -8993318 -15006534 -15777003 -14148949 -12065361 -6944478 572379 4447273
4836 4447273 2742752 1243124 3805391 6588145 5722146 3659091 3668271 4129865 2460897
4827 2460897 -374157 -2729471 -4944848 -6365955 -4531327 21345 2911858 2393250
4819 2393250 1924705 3865732 5510315 4127624 1260404 -899332 -3035350 -5660374
4811 -5660374 -6628900 -4708073 -2087745 -707347 512351 2526028 3871236 3753432 3737727
$$ packed form
4868B01132089j22637287o0994939l076834J815533j0989145l259743R449935
4861A1439609K481951j1069732r100164N30115n9148n630688j929789O196979
4853g140867N397634j551435l088324K05488N20563q14110J519822L571968q16265
4844b195526o797792o013216p70469J628054K083588N120883P516857L874894
4836D447273j704521j499628K562267K782754q65999k063055R180M61594j668968
4827B460897k835054k355314k215377j421107J834628M552672K890513n18608
4819B393250m68545J941027J644583j382691k867220k159736k136018k625024
4811e660374r68526J920827K620328J380398J219698K013677J345208j17804j5705
$$ plain form
4802 3737727 4085231 2181213 -2828765 -7370116 -8020036 -5604385 -2560761 311829 2240511
4793 2240511 1391773 -1822554 -3686925 -2139956 336159 1146317 1306208 2055377 1664275
4784 1664275 -870905 -2504367 -645837 1799024 175066 -5145311 -9706183 -11008095
4776 -11008095 -9786427 -6734093 -1978441 2828306 5474903 6145331 6677950 7197777 6078326
4767 6078326 3125571 440071 -225831 540949 699507 -1067207 -3813428 -4887867 -3050511
4758 -3050511 -821805 -1724967 -5158407 -6817564 -4891866 -2689067 -3784991 -7712659
4750 -7712659 -12069003 -15482137 -16334018 -12186930 -3704121 3758358 5935565 4775904
4742 4775904 4710451 6372094 7570520 8001255 8677907 8425052 5405732 1112520 -1405002
$$ packed form
4802C737727L47504j904018n009978m541351o49920K415651L043624K872590J928682
4793B240511q48738l214327j864371J546969K476115Q10158J59891P49169l91102
4784A664275k535180j633462J858530K444861j623958n320377m560872j301912
4776a1008095J221668L052334M755652M806747K646597O70428N32619N19827j119451
4767F078326k952755k685500o65902P66780J58558j766714k746221j074439J837356
4758c050511K228706r03162l433440j659157J925698K202799j095924l927668
4750g712659m356344l413134q51881M147088Q482809P462479K177207j159661
4742D775904o5453J661643J198426M30735O76652k52855l019320m293212k517522
$$ plain form
4733 -1405002 -2556724 -5210532 -9059565 -10394311 -7924924 -4791655 -3695223 -3398369
4725 -3398369 -1513781 1779018 4252486 4224479 1800571 -1190904 -2303811 -849013 980644
4716 980644 696212 -1361225 -3036841 -3522474 -3400367 -2522941 -508313 1218571 681338
4707 681338 -1510813 -2836368 -2445085 -1477348 -176972 2234965 4724402 4692471 1750904
4698 1750904 -1480776 -2979714 -3093639 -2262964 -58010 2505575 2788225 350938 -1587809
4689 -1587809 -392762 2413169 3755022 3349654 3239899 4169884 4589319 2952866 -382494
4680 -382494 -3451980 -4279299 -2632911 -465962 86317 -897226 -1779267 -2038713 -2429758
4671 -2429758 -2559571 -862975 2230690 3679980 1917626 -580318 -673811 1277228 2725036
$$ packed form
4733a405002j151722k653808l849033j334746K469387L133269J096432K96854
4725c398369J884588L292799K473468k8007k423908k991475j112907J454798J829657
4716I80644k84432k057437j675616m85633J22107Q77426K014628J726884n37233
4707F81338k192151j325555L91283R67737J300376K411937K489437l1931k941567
4698A750904l231680j498938j13925Q30675K204954K563585K82650k437287j938747
4689a587809J195047K805931J341853m05368j09755R29985M19435j636453l335360
4680c82494l069486q27319J646388K166949N52279r83543q82041k59446l91045
4671b429758j29813J696596L093665J449290j762354k497944r3493J951039J447808
$$ plain form
4662 2725036 2909283 3030943 3308185 2462437 136476 -2289990 -3684836 -4409363 -5200919
4653 -5200919 -6080955 -6769771 -7135743 -6849760 -5538592 -3770136 -3104115 -4463529 -6747270
4644 -6747270 -7575699 -5470071 -1257005 2531975 3655909 1876824 -1026545 -2916040
4636 -2916040 -3102873 -2697437 -3246292 -4894294 -5828886 -3862888 1070975 6215765 8338580
4627 8338580 6872542 4295626 3283038 4004160 4640108 4192878 3917027 5499142 8330903
4618 8330903 9712103 8199927 5749209 5328868 6896417 7322099 4466100 -255974 -3993036
4609 -3993036 -5692121 -6261137 -6717802 -7306864 -7559730 -6338652 -2937063 969601 2116432
4600 2116432 -18653 -1344150 1962566 7843542 10580876 8240095 4725446 3953920
$$ packed form
4662B725036J84247J21660K77242q45748k325961k426466j394846p24527p91556
4653e200919q80036o88816l65972K85983J311168J768456O66021j359414k283741
4644f747270q28429K105628M213066L788980J123934j779085k903369j889495
4636b916040j86833M05436n48855j648002r34592J965998M933863N144790K122815
4627H338580j466038k576916j012588P21122O35948m47230k75851J582115K831761
4618H330903J381200j512176k450718m20341J567549M25682k855999m722074l737062
4609c993036j699085n69016m56665n89062k52866J221078L401589L906664J146831
4600B116432k135085j325497L306716N880976K737334k340781l514649p71526
$$ plain form
4592 3953920 5130563 5303579 4050525 3297550 3836856 4357838 3659836 2112960 742197
4583 742197 35755 90445 1229254 3761378 7031786 9152507 8356115 4851205 843933
4574 843933 -1554360 -1878078 -630413 1718989 4176931 4859278 2823364 -96074 -674311
4565 -674311 2488014 7886363 12672622 14391038 12121108 7409145 3489618 2168314
4557 2168314 2080560 1291367 378650 896973 1932121 994893 -2057959 -4788681 -5764178
4548 -5764178 -5551299 -4100205 -409352 4401761 6878734 5682005 3775554 4470366 7253817
4539 7253817 9146538 8497298 5912931 2888236 902308 647792 1059026 207537 -2243965
4530 -2243965 -4861660 -6880761 -8703111 -9637987 -7981996 -4396770 -2252541 -2990440 -4062071
$$ packed form
4592C953920J176643J73016j253054p52975N39306N20982o98002j546876j370763
4583G42197p06442N4690J138809K532124L270408K120721p96392l504910m007272
4574H43933k398293l23718J247665K349402K457942O82347k035914k919438n78237
4565f74311L162325N398349M786259J718416k269930m711963l919527j321304
4557B168314q7754p89193r12717N18323J035148r37228l052852k730722r75497
4548e764178K12879J451094L690853M811113K476973j196729j906451O94812K783451
4539G253817J892721o49240k584367l024695j985928k54516M11234q51489k451502
4530b243965k617695k019101j822350r34876J655991L585226K144229p37899j071631
$$ plain form
4521 -4062071 -3533986 -3652273 -6790682 -10407544 -9882447 -5036116 -160853 1822988 1887268
4512 1887268 1770053 1519747 686243 -451752 -1516132 -2252381 -1931800 -48491 2407571
4503 2407571 3873818 4335063 5134471 6889869 8964047 10624274 11230889 9711223 5609364
4494 5609364 550637 -2961229 -4262751 -4727111 -5374542 -5687133 -4840149 -2893733 -603065
4485 -603065 1191794 2114525 2653361 3379886 3412833 1098400 -2828896 -4553605 -1463056
4476 -1463056 4214255 8012667 8269428 6495151 4045680 1137416 -1553941 -3093333
4468 -3093333 -3892080 -4767256 -4743859 -2241000 1820135 4635147 5159798 4701595 4069810
4459 4069810 2861081 1632925 1871721 3249494 3559771 2086760 643035 611710 1285045
$$ packed form
4521d062071N28085j18287l138409l616862N25097M846331M875263J983841O4280
4512A887268j17215k50306q33504j137995j064380p36249L20581J883309K456062
4503B407571J466247M61245P99408J755398K074178J660227O06615j519666m101859
4494E609364n058727l511866j301522m64360o47431l12591Q46984J946416K290668
4485f03065J794859R22731N38836P26525L2947k314433l927296j724709L090549
4476a463056N677311L798412K56761j774277k449471k908264k691357j539392
4468c093333p98747q75176K3397K502859M061135K815012N24651m58203o31785
4459D069810j208729j228156K38796J377773L10277j473011j443725l1325O73335
$$ plain form
4450 1285045 1731372 1966948 1752464 705842 88629 1682561 4249957 4281765 1348520
4441 1348520 -700358 430346 1924851 644930 -1699479 -1555338 636743 1480518 221508
4432 221508 -590857 176226 379788 -1760818 -4769782 -5907155 -4561500 -2584605 -1944364
4423 -1944364 -2685515 -3035593 -1449429 1508160 3822089 4538724 4600992 4964990 5280700
4414 5280700 5087352 4837420 4724507 3884717 1976535 260339 -213993 -221012 -744612 -1114722
4404 -1114722 -457618 367557 406301 965287 3637816 6596924 5923632 1029186 -3948711
4395 -3948711 -5191616 -3467348 -1992378 -1833692 -1425221 134178 1376886 497717 -2110011
4386 -2110011 -4219721 -4361664 -3328671 -2978312 -4182565 -6473988 -9142614 -11632931 -12979826
$$ packed form
4450A285045M46327K35576k14484j046622o17213J593932K567396L1808k933245
4441A348520k048878J130704J494505j279921k344409J44141K192081Q43775j259010
4432B21508q12365P67083K03562k140606l008964j137373J345655J976895O40241
4423a944364p41151l50078J586164K957589K313929P16635O2268L63998L15710
4414E280700j93348k49932j12913q39790j908182j716196m74332p019n23600l70110
4404a114722O57104Q25175L8744N58986K672529K959108o73292m894446m977897
4395c948711j242905J724268J474970J58686M08471J559399J242708q79169k607728
4386b110011k109710j41943J032993L50359j204253k291423k668626k490317j346895
$$ plain form
4377 -12979826 -12149189 -9478168 -6873803 -5902024 -6150160 -5817246 -3495403 522374 3896655
4368 3896655 3588956 -894710 -5723738 -6326568 -3152685 -1299091 -3251177 -4938196 -1598766
4359 -1598766 4683630 7019685 2691385 -3389281 -4802826 -574046 5034112 7688229
4351 7688229 6494179 3344353 172556 -2868521 -6664105 -10949751 -13844438 -14063489
4343 -14063489 -12543686 -10912535 -9326908 -7090092 -4593145 -3200978 -3673479 -5741292
4335 -5741292 -8452239 -9940611 -8220660 -3810100 -210273 172818 -805740 -232095 1132826
4326 1132826 557614 -1435063 -1628117 324874 1204800 -195726 -1047347 422325 1796515
4317 1796515 742545 -1045358 -986724 224411 734714 1324664 3537805 5846505 5458836
$$ packed form
4377a2979826Q30637K671021K604365R71779k48136L32914K321843M017777L374281
4368C896655l07699m483666m829028o02830L173883J853594j952086j687019L339430
4359a598766O282396K336055m328300o080666j413545M228780N608158K654117
4351G688229j194050l149826l171797l041077l795584m285646k894687k19051
4343a4063489J519803J631151J585627K236816K496947J392167m72501k067813
4335e741292k710947j488372J719951M410560L599827L83091r78558N73645J364921
4326A132826n75212j992677j93054J952991Q79926j400526q51621J469672J374190
4317A796515j053970j787903N8634J211135N10303N89950K213141K308700l87669
$$ plain form
4308 5458836 2874207 995048 402112 -714711 -2149367 -1311830 1904606 3698254 1592381
4299 1592381 -1945487 -3347687 -2953261 -3439193 -4907482 -4672658 -1527577 2507851 4993139
4290 4993139 5428887 4277116 1731870 -1334250 -2807862 -1408925 1447293 3348926
4282 3348926 3884515 4347839 4820793 3628146 246881 -3029881 -3487770 -947294 2615088
4273 2615088 5227172 5565029 2733939 -2706025 -7967474 -10023653 -8430960 -5163343
4265 -5163343 -2175530 -443686 -634158 -2627128 -4498994 -4113914 -2101419 -1371960 -3150528
4256 -3150528 -5277898 -5179952 -2932871 -533443 563946 430796 288767 1583255 4276244
4247 4276244 5983567 4376865 472814 -2434514 -3159041 -3406422 -3882195 -2894025 -80577
$$ packed form
4308E458836k584629j879159n92936j116823j434656Q37537L216436J793648k105873
4299A592381l537868j402200L94426m85932j468289K34824L145081M035428K485288
4290D993139M35748j151771k545246l066120j473612J398937K856218J901633
4282C348926N35589M63324M72954j192647l381265l276762m57889K540476L562382
4273B615088K612084L37857k831090n439964n261449k056179J592693L267617
4265e163343K987813J731844j90472j992970j871866L85080K012495P29459j778568
4256c150528k127370R7946K247081K399428J097389j33150j42029J294488K692989
4247D276244J707323j606702l904051k907328p24527k47381m75773R88170K813448
$$ plain form
4238 -80577 1840272 1162759 -73010 -88015 -1057434 -5242240 -9958620 -10836475 -8668530
4229 -8668530 -8345517 -11371465 -14024960 -13492707 -11551852 -10755667 -10620528 -9684591 -8623274
4220 -8623274 -8930829 -10068960 -9893650 -7174501 -2639174 1754039 4103822 4072027 3327319
4211 3327319 3528557 4214405 4173280 4210142 6055079 8664232 8658331 5254299 1926048 1761809
4201 1761809 3584765 4350506 3316482 1889681 879808 -94922 -1280608 -2295146 -2402126
4192 -2402126 -625195 3386096 8118692 11186511 12027465 12019366 11580409 9418707 5588112
4183 5588112 2918821 3812178 7354333 10954107 13120911 13449719 11902479 9644129 8784199
4174 8784199 9817888 10986890 11218081 11529579 12425490 12536735 11307240 10242404 9900848
$$ packed form
4238h0577J920849o77513j235769j5005r69419m184806m716380q77855K167945
4229h668530L23013l025948k653495N32253J940855P96185J35139R35937J061317
4220h623274l07555j138131J75310K719149M535327M393213K349783l1795p44708
4211C327319K01238O85848m1125L6862J844937K609153n901l404032l328251j64239
4201A761809J822956P65741j034024j426801j009873r74730j185686j014538j06980
4192b402126J776931M011291M732596L067819Q40954q099m38957k161702l830595
4183E588112k669291Q93357L542155L599774K166804L28808j547240k258350q59930
4174H784199J033689J169002K31191L11498Q95911J11245j229495j064836l41556
$$ plain form
4165 9900848 8773736 6951037 7225724 10137915 11876159 10162706 8128331 8780828 10141316
4156 10141316 10289950 12308254 18405859 23868997 23804737 21462277 22109892 23910509 25132516
4147 25132516 34724657 60105348 85850410 83345442 47547929 7791586 -7608074
4140 -7608074 -3456072 -2346919 -10245262 -14694784 -10095602 -5455575 -7030339 -9588857
4132 -9588857 -8526500 -7705587 -10204589 -11592727 -8137810 -3717354 -3003711 -4213695 -3832202
4123 -3832202 -3001797 -4062918 -5377607 -4665905 -3779524 -5405342 -8025787 -8494143 -7072518
4114 -7072518 -5968152 -5212254 -3781791 -2696701 -3252153 -3907484 -2489574 -45395 818857
4105 818857 113927 -275875 -382536 -1875620 -4576264 -6269845 -5918102 -4752273 -4265479
$$ packed form
4165I900848j127112j822699K74687K912191J738244j713453k034375O52497J360488
4156A0141316J48634K018304O097605N463138o4260k342460O47615J800617J222007
4147B5132516R592141K5380691K5745062k504968l5797513l9756343j5399660
4140g608074M152002J109153p898343m449522M599182M640027j574764k558518
4132i588857J062357Q20913k499002j388138L454917M420456P13643j209984L81493
4123c832202Q30405j061121j314689P11702Q86381j625818k620445m68356J421625
4114g072518J104366P55898J430463J085090n55452o55331J417910K444179Q64252
4105H18857p04930l89802j06661j493084k700644j693581L51743J165829M86794
$$ plain form
4096 -4265479 -4833307 -5884659 -6000607 -3714974 289990 2907013 2139825 -321592 -1735871
4087 -1735871 -2008234 -2680006 -3709820 -3828977 -3140879 -2826241 -2874766 -2451701 -2036364 -2976515
4077 -2976515 -5226893 -7425410 -8765148 -9081877 -7919542 -5526273 -3933981 -4747903 -6474480
4068 -6474480 -6384358 -4550906 -3633167 -4923774 -6976674 -8059058 -7758953 -6271516 -4266958
4059 -4266958 -3346874 -4413876 -5652227 -4360350 -779226 2128046 2686589 2012982 1590145
4050 1590145 1893309 3529292 6877739 9946225 9359933 4697471 -341446 -2218285 -1114624
4041 -1114624 627187 1507712 1224360 35376 -873065 50193 2641884 4873961 5518270
4032 5518270 5300892 4764637 3172950 717499 -384197 1281820 4122213 5850088 6391540
$$ packed form
4096d265479n67828j051352j15948K285633M004964K617023p67188k461417j414279
4087a735871k72363o71772j029814j19157O88098L14638m8525M23065M15337r40151
4077b976515k250378k198517j339738l16729J162335K393269J592292q13922j726577
4068f474480R0122J833452R17739j290607k052900j082384L00105J487437K004558
4059d266958R20084j067002j238351J291877L581124K907272N58543o73607m22837
4050A590145L03164J635983L348447L068486n86292m662462n038917j876839J103661
4041a114624J741811Q80525k83352j188984r08441R23258K591691K232077O44309
4032E518270k17378n36255j591687k455451j101696J666017K840393J727875N41452
$$ plain form
4023 6391540 6729861 6514174 5059157 3528216 3666161 4891357 4854988 2756363 275505
4014 275505 -744522 40783 2008414 4069710 4476571 1767741 -3391511 -8263579 -10440402
4005 -10440402 -9600156 -6875636 -3582675 -1023328 -436171 -1993438 -4158750 -5067251 -4609438
3996 -4609438 -4191934 -4166399 -2834918 772895 4227580 4044520 601078 -1900962 -1273298
3987 -1273298 -456260 -2859930 -6918399 -8156406 -5250993 -1030265 1577086 1493113 -1691943
3978 -1691943 -7132916 -11189744 -10427252 -6656000 -5160765 -7088901 -7699873 -3763659 1403317
3969 1403317 2845211 479626 -2304340 -3863382 -4995826 -6405716 -8253740 -10608871
3961 -10608871 -12193292 -10774786 -6962459 -4937234 -6627908 -7974425 -4503506 2000085
$$ packed form
4023F391540L38321k15687j455017j530941J37945J225196l6369k098625k480858
4014B75505j020027P85305J967631K061296M06861k708830n159252m872068k176823
4005a0440402Q40246K724520L292961K559347N87157j557267k165312r08501M57813
3996d609438M17504K5535J331481L607813L454685j83060l443442k502040O27664
3987a273298Q17038k403670m058469j238007K905413M220728K607351q3973l185056
3978a691943n440973m056828P62492L771252J495235j928136o10972L936214N166976
3969A403317J441894k365585k783966j559042j132444j409890j848024k355131
3961a0608871j584421J418506L812327K025225j690674j346517L470919O503591
$$ plain form
3953 2000085 6589512 8647077 11276776 14617451 15296001 12483356 9324065 7593729
3945 7593729 5618815 2685345 1066817 1836700 2518988 1117490 -678492 -570959 682048
3936 682048 870413 -498459 -2475670 -4145636 -4243477 -1461512 3054477 5541894 3965455
3927 3965455 884748 128109 2152338 4518675 5416441 4706739 2817677 746015 185203
3918 185203 1655979 3285308 3223970 2375240 2732651 3790360 2984216 -390337 -3908656
3909 -3908656 -5142627 -4365974 -3459124 -3407352 -3748507 -3701064 -2954136 -1654337 -344465
3900 -344465 37236 -1323717 -4147210 -6818478 -7735905 -6982778 -6002858 -5510813 -4799876
3891 -4799876 -3578396 -2989173 -3573575 -3684777 -1840673 543606 1253779 1274130 3618996
$$ packed form
3953B000085M589427K057565K629699L340675O78550k812645l159291j730336
3945G593729j974914k933470j618528P69883O82288j401498j795982J07533J253007
3936F82048J88365j368872j977211j669966r7841K781965M515989K487417j576439
3927C965455l080707p56639K024229K366337Q97766p09702j889062k071662n60812
3918A85203J470776J629329o1338q48730L57411J057709q06144l374553l518319
3909c908656j233971P76653R06850N1772l41155M7443P46928J299799J309872
3900c44465L81701j360953k823493k671268r17427P53127R79920M92045P10937
3891d799876J221480N89223n84402j11202J844104K384279P10173K0351K344866
$$ plain form
3882 3618996 8256179 11450812 10821615 7963387 5044524 2064711 -757388 -1020103 2674050
3873 2674050 7670910 10215864 10091844 9839019 10543091 10950748 10059634 8242498 6082505
3864 6082505 3874323 1941777 110027 -2389546 -5196629 -6192302 -4265174 -1516400
3856 -1516400 -803767 -2240220 -4171792 -6292385 -9140530 -11535105 -11667775 -10443885 -10605033
3847 -10605033 -12278620 -12382805 -9237275 -5169377 -3427323 -4576656 -7018563 -9188853
3839 -9188853 -10027338 -8863454 -6277864 -4209731 -4191275 -5976240 -8245740 -9866512 -10272339
3830 -10272339 -9615663 -8853820 -8932594 -9889355 -11374198 -13289511 -14685776 -13201105 -7929328
3821 -7929328 -2173433 -411517 -2474832 -3802460 -1958497 480143 682957 -384458
$$ packed form
3882C618996M637183L194633o29197k858228k918863k979813k822099k62715L694153
3873B674050M996860K544954j24020k52825P04072M07657q91114j817136k159993
3864F082505k208182j932546j831750k499573k807083r95673J927128K748774
3856a516400P12633j436453j931572k120593k848145k394575j32670J223890j61148
3847a0605033j673587j04185L145530M067898J742054j149333k441907k170290
3839i188853q38485J163884K585590K068133J8456j784965k269500j620772m05827
3830a0272339O56676P61843p8774r56761j484843j915313j396265J484671N271777
3821g929328N755895J761916k063315j327628J843963K438640K02814j067415
$$ plain form
3813 -384458 -870141 -1767942 -4599821 -7724808 -8509335 -7673528 -7874458 -8924626 -8271492
3804 -8271492 -6055027 -5710126 -8597009 -11470695 -10966967 -7921478 -5289869 -3986043 -3081232
3795 -3081232 -2470629 -2630461 -2479866 -205963 3579394 5735966 4434605 1536977 205471
3786 205471 1246287 2811532 2982551 1692980 535839 1377807 4595312 7882910 7571458
3777 7571458 2515811 -3659728 -5840291 -3164615 109443 62028 -2274359 -3035213 -860096
3768 -860096 1852977 2518795 1218031 -300605 -973839 -1112907 -1576131 -2789927 -4226236
3759 -4226236 -4807727 -4228063 -3527827 -3617599 -3654293 -2039376 1118278 3799989 4435021
3750 4435021 3281621 1354990 -661718 -2060787 -2027984 -668632 808966 1502856 1587678
$$ packed form
3813c84458m85683q97801k831879l124987p84527Q35807k00930j050168O53134
3804h271492K216465L44901k886883k873686N03728L045489K631609J303826R04811
3795c081232O10603j59832J50595K273903L785357K156572j301361k897628j331506
3786B05471J040816J565245J71019j289571j157141Q41968L217505L287598l11452
3777G571458n055647o175539k180563K675676L274058m7415k336387p60854K175117
3768h60096K713073O65818j300764j518636o73234j39068m63224j213796j436309
3759d226236n81491N79664P00236q9772l6694J614917L157654K681711O35032
3750D435021j153400j926631k016708j399069L2803J359352J477598O93890Q4822
$$ plain form
3741 1587678 1383087 780519 34619 -132485 147214 -266527 -1597724 -2460626 -2137007
3732 -2137007 -2121848 -3849364 -5971948 -5827012 -3180853 -707194 -685709 -2685407 -4790305
3723 -4790305 -5906813 -6282321 -6408809 -6057958 -4570370 -2155056 -443172 -783655 -2066516
3714 -2066516 -1750193 480850 1939530 1012790 108648 2418638 7079457 10156992 9797200
3705 9797200 7690741 5555324 3037308 -219236 -2959833 -4070250 -4196766 -4470602 -5027954
3696 -5027954 -5740204 -6973956 -8542055 -9123468 -7811061 -5299018 -2785322 -779950 378422
3687 378422 214981 -837994 -1516700 -1733373 -2894339 -5142154 -6210580 -4729290 -2868299
3678 -2868299 -3425355 -5668183 -6676411 -5900115 -5567686 -6906962 -8727329 -9863100 -10417468
$$ packed form
3741A587678k04591o02568p45900j67104K79699m13741j331197q62902L23619
3732b137007J5159j727516k122584J44936K646159K473659K1485j999698k104898
3723d790305j116508l75508j26488L50851J487588K415314J711884l40483j282861
3714b066516L16323K231043J458680r26740r04142K309990M660819L077535l59792
3705I797200k106459k135417k518016l256544k740597j110417j26516k73836n57352
3696e027954p12250j233752j568099n81413J312407K512043K513696K005372J158372
3687C78422j63441j052975o78706k16673j160966k247815j068426J481290J860991
3678b868299n57056k242828j008228P76296L32429j339276j820367j135771n54368
$$ plain form
3669 -10417468 -10162904 -8196952 -4975979 -2541015 -1835842 -1677467 -1141385 -986778 -1810625
3660 -1810625 -2777052 -3249364 -3699409 -3771113 -1554192 3493118 8684898 11029504 10468623
3651 10468623 8441503 5094345 382191 -3594596 -4420998 -2876549 -1767853 -1597191
3643 -1597191 -241898 3037593 6176476 7482632 7661964 7770374 7404401 6106199 4794191
3634 4794191 4638648 5816619 8046706 10832097 12559754 11180624 6830695 2291254
3626 2291254 -115057 -721303 -924264 -1108782 -1087645 -859680 136774 2698888 5588212
3617 5588212 5652580 1930773 -2272826 -3449328 -2265838 -1549306 -1584228 -505145 1469359
3608 1469359 1472066 -2080906 -7432058 -11733531 -13440836 -12310460 -8957801 -4878665 -1532960
$$ packed form
3669a0417468K54564J965952L220973K434964P05173J58375N36082J54607q23847
3660a810625r66427m72312m50045p1704K216921N047310N191780K344606n60881
3651A0468623k027120l347158m712154l976787q26402J544449J108696J70662
3643a597191J355293L279491L138883J306156J79332J08410l65973j298202j312008
3634D794191j55543J177971K230087K785391J727657j379130m349929m539441
3626B291254k406311o06246k02961j84518K1137K27965R96454K562114K889324
3617E588212O4368l721807m203599j176502J183490P16532l4922J079083J974504
3608A469359K707l552972n351152m301473j707305J130376L352659M079136L345705
$$ plain form
3599 -1532960 760137 2009513 1307610 -1923594 -6010908 -8284229 -7845879 -5311213 -830116
3590 -830116 4881103 8333880 5910229 -701887 -5203573 -4065771 -201086 2038528
3582 2038528 2220509 2019394 1081323 -2021099 -6283328 -8778641 -8106884 -5226365 -1602623
3573 -1602623 1465131 2442201 718232 -2014144 -3344507 -3086675 -3223024 -4983294 -7211554
3564 -7211554 -7690106 -5321704 -1221671 1835548 1682337 -941087 -3140470 -3392296 -3076522
3555 -3076522 -3853611 -5269885 -6280063 -7375718 -9254147 -10801939 -10715543 -10111316 -10995368
3546 -10995368 -12667968 -12207970 -8515037 -3585824 385349 2971402 4197402 3495728
3538 3495728 1071598 -1142903 -1105261 1266060 4061720 5014221 3281898 230456 -1851320
$$ packed form
3599a532960K293097J249376p01903l231204m087314k273321M38350K534666M481097
3590h30116N711219L452777k423651o612116m501686J137802L864685K239614
3582B038528J81981k01115r38071l102422m262229k495313O71757K880519L623742
3573a602623L067754R77070j723969k732376j330363K57832j36349j760270k228260
3564g211554m78552K368402M100033L057219j53211k623424k199383k51826L15774
3555c076522p77089j416274j010178j095655j878429j547792Q6396O04227q84052
3546a0995368j672600M59998L692933M929213L971173K586053J226000p01674
3538C495728k424130k214501L7642K371321K795660R52501j732323l051442k081776
$$ plain form
3529 -1851320 -2402232 -3208382 -5473272 -7389464 -6282732 -2409220 1263845 2589877 1725006
3520 1725006 -346157 -2576816 -3457037 -2224414 -561568 -868383 -2737330 -3423172 -1883821
3511 -1883821 279070 2188365 4868914 8000723 8661288 5372476 1014401 -659318
3503 -659318 278174 998195 341551 -287905 184946 960547 784083 -539627 -2201365
3494 -2201365 -3185240 -3150551 -2885401 -3340246 -4067967 -3709697 -2271165 -1362683 -1583306 -1471404
3484 -1471404 -103418 1074641 439938 -1444680 -3279453 -5166436 -7288127 -7991645 -5793319
3475 -5793319 -2453919 -1409571 -3352647 -5682368 -6304031 -5708889 -4979503 -3868473 -1708564
3466 -1708564 1203378 3889083 5378431 4731152 1444611 -3547155 -7928547 -9598790
$$ packed form
3529a851320n50912q06150k264890j916192J106732L873512L673065J326032q64871
3520A725006k071163k230659q80221J232623J662846l06815j868947o85842J539351
3511a883821K162891J909295K680549L131809O60565l288812m358075j673719
3503f59318R37492P20021o56644o29456M72851P75601j76464j323710j661738
3494b201365r83875L4689K65150m54845p27721L58270J438532R08482k20623J11902
3484a471404J367986J178059o34703j884618j834773j886983k121691p03518K198326
3475e793319L339400J044348j943076k329721o21663N95142P29386J111030K159909
3466a708564K911942K685705J489348o47279l286541m991766m381392j670243
$$ plain form
3458 -9598790 -8193750 -5261067 -3121759 -2895146 -3113321 -1047684 3889526 8932753 10989868
3449 10989868 9870469 7463828 4955136 2456360 389222 -716497 -1310960 -2035641
3441 -2035641 -2390663 -1796822 -1188093 -1594432 -1930206 -577043 1327540 866984 -2394822
3432 -2394822 -5796350 -7570107 -8807132 -10619554 -11737717 -10263805 -6288585 -1781973
3424 -1781973 1068462 1166641 -569648 -1699495 -1054627 -322645 -934347 -857665 2029528
3415 2029528 4511722 1055421 -7348181 -12955526 -11828733 -9136862 -10701255 -14541719
3407 -14541719 -15596814 -14423161 -15101266 -17363646 -17395304 -15067373 -13825649 -13659155 -10686119
3398 -10686119 -4663665 -699929 -1315901 -2233948 862144 5846262 8023105 6963519
$$ packed form
3458i598790J405040K932683K139308K26613k18175K065637M937210N043227K057115
3449A0989868j119399k406641k508692k498776k067138j105719n94463p24681
3441b035641l55022N93841O08729m06339l35774J353163J904583m60556l261806
3432b394822l401528j773757j237025j812422j118163J473912L975220M506612
3424a781973K850435R8179j736289j129847O44868P31982o11702P6682K887193
3415B029528K482194l456301q403602n607345J126793K691871j564393l840464
3407a4541719j055095J173653o78105k262380l1658K327931J241724J66494K973036
3398a0686119O022454L963736o15972r18047L096092M984118K176843j059586
$$ plain form
3390 6963519 5527254 4539797 2519935 -540023 -2714622 -3074048 -2383210 -1213598 293595
3381 293595 970268 -878178 -5159203 -9548918 -11588420 -10493312 -7257250 -3855346 -2021169
3372 -2021169 -2075201 -3145407 -4531663 -5880183 -6111369 -4076292 -834766 924878 848858
3363 848858 1882366 5489713 8429588 7111191 3222426 1494693 2899344 3868295 2219447
3354 2219447 129403 226054 1740771 2093617 298070 -2487742 -4256423 -3194373 815520
3345 815520 4848334 4963965 895194 -2792674 -1708313 3220255 6920561 5732645 653274
3336 653274 -4335555 -6039252 -4382141 -1802286 -550689 -749463 -1334197 -2025817 -3009377
3327 -3009377 -3280233 -1502449 1282593 2111640 103263 -2123186 -2215620 -1204453 -1216043
$$ packed form
3390F963519j436265r87457k019862l059958k174599l59426O90838J169612J507193
3381B93595O76673j848446m281025m389715k039502J095108L236062L401904J834177
3372b021169n4032j070206j386256j348520k31186K035077L241526J759644p6020
3363H48858J033508L607347K939875j318397l888765j727733J404651R68951j648848
3354B219447k090044R6651J514717L52846j795547k785812j768681J062050M009893
3345H15520M032814J15631m068771l687868J084361M928568L700306j187916n079371
3336F53274m988829j703697J657111K579855J251597j98774n84734o91620r83560
3327c009377k70856J777784K785042Q29047k008377k226449r2434J011167j1590
$$ plain form
3318 -1216043 -1942376 -1534596 281485 2213789 3641185 4629981 4330336 1723767 -2029375
3309 -2029375 -4061671 -3027166 -378747 1785196 2703468 2512341 1302043 -620371 -2313966
3300 -2313966 -2707320 -1448605 575723 1421538 -402987 -3917001 -6046012 -5037033 -2594505
3291 -2594505 -1367424 -1349692 -523012 1809234 4538955 7090140 9732443 11566259 10832239
3282 10832239 7869784 5422716 5080983 5545795 5462071 5736197 7416335 9126456 8683893
3273 8683893 6224930 3914397 3246613 4141513 6020075 8168172 9344518 8406268 5400306
3264 5400306 1472216 -1825036 -2800550 -581932 3081669 4396664 1753293 -1563740
3256 -1563740 -1043712 3129759 6133115 4550579 67491 -3485392 -4586337 -4292134 -3852047
$$ packed form
3318a216043p26333M07780J816081J932304J427396R88796k99645k606569l753142
3309b029375k032296J034505K648419K163943R18272j91127j210298j922414j693595
3300b313966l93354J258715K024328Q45815j824525l514014k129011J008979K442528
3291b594505J227081J7732Q26680K332246K729721K551185K642303J833816p34020
3282A0832239k962455k447068l41733M64812q3724K74126J680138J710121m42563
3273H683893k458963k310533o67784Q94900J878562K148097J176346r38250l005962
3264E400306l928090l297252r75514K218618L663601J314995k643371l317033
3256a563740N20028M173471L003356j582536m483088l552883j100945K94203M40087
$$ plain form
3247 -3852047 -3846396 -4711514 -6296486 -7241455 -6372349 -4662007 -4328610 -5796317 -7123637
3238 -7123637 -7149889 -7624195 -10607686 -14679066 -15926735 -12916898 -8616676 -6377297 -5786695
3229 -5786695 -4286474 -1672908 -467664 -1872640 -3809265 -3901549 -2507264 -1347328 -528513
3220 -528513 1062235 2849162 2204003 -2112931 -7319955 -8917393 -5823584 -2136299 -2703585
3211 -2703585 -7270646 -10553858 -8661060 -3778940 -972801 -1692039 -2943695 -2499135 -1976051
3202 -1976051 -3820962 -7557361 -10614372 -11500289 -10806277 -10043579 -10452019 -11977888 -12760510
3193 -12760510 -10883637 -7209005 -4801074 -4806526 -5043536 -3906714 -3165155 -4693448 -6634207
3184 -6634207 -5820678 -2676212 -593477 -1123515 -2684925 -3681494 -4159765 -4564282 -5416922
$$ packed form
3247c852047N651q65118j584972r44969Q69106J710342L33397j467707j327320
3238g123637k6252m74306k983491m071380j247669L009837M300222K239379N90602
3229e786695J500221K613566J205244j404976j936625r2284J394285J159936Q18815
3220e28513J590748J786927o45159m316934n207024j597438L093809L687285n67286
3211b703585m567061l283212J892798M882120K806139p19238j251656M44560N23084
3202a976051j844911l736399l057011q85917O94012P62698m08440j525869p82622
3193a2760510J876873L674632K407931n452k37010J136822P41559j528293j940759
3184f634207Q13529L144466K082735n30038j561410r96569m78271m04517q52640
$$ plain form
3175 -5416922 -7957781 -12414627 -15967753 -15559632 -12714938 -12086430 -14680737 -16245965 -13710825
3166 -13710825 -9592495 -7766845 -7835150 -6452894 -2192467 3529965 8776172 11940143
3158 11940143 11741016 8786679 5972905 5080054 4234728 1184669 -2259303 -2198441 1595428
3149 1595428 5281119 6479741 6921296 8577128 10080153 8887257 5113143 1183215
3141 1183215 -1304221 -2605961 -3312287 -3459766 -3186489 -3065337 -3454981 -4183222 -5075083
3132 -5075083 -6231792 -7479585 -7951613 -6721988 -3869515 -610987 1706753 2517485 1931731
3123 1931731 257169 -1960300 -3870726 -5012117 -5838831 -6765110 -6895079 -4848609 -1007217
3114 -1007217 2313696 3524275 3533268 4088142 5288564 5762687 4629372 2209032 -699213
$$ packed form
3175e416922k540859m456846l553126M08121K844694O28508k594307j565228K535140
3166a3710825M118330J825650o8305J382256M260427N722432N246207L163971
3158A1940143j99127k954337k813774q92851q45326l050059l443972O0862L793869
3149A595428L685691J198622M41555J655832J503025j192896l774114l929928
3141A183215k487436j301740p06326j47479K73277J21152l89644p28241q91861
3132e075083j156709j247793m72028J229625K852473L258528K317740Q10732n85754
3123A931731j674562k217469j910426j141391q26714r26279j29969K046470L841392
3114a007217L320913J210579Q993N54874J200422M74123j133315k420340k908245
$$ plain form
3105 -699213 -3067695 -3454442 -892480 3713850 7894358 9719441 9305963 8246027 7971393
3096 7971393 8701292 9616213 9908546 9626500 9252073 8559997 6650046 3445320 363656
3087 363656 -1184256 -1351913 -1138516 -732685 308598 1529879 1592844 213114 -910523
3078 -910523 114111 3002910 5403823 5462394 3797526 2493780 2385653 2242211 1010297
3069 1010297 -256548 -17031 886614 -41581 -3149964 -5637924 -5343825 -3723773 -3457983
3060 -3457983 -4440939 -4219717 -1861259 622353 817012 -1598705 -5059486 -7538379 -7549692
3051 -7549692 -4991754 -1640004 -102106 -1615987 -4889318 -7137369 -6296814 -2707162
3043 -2707162 1085145 2691571 2341366 2292287 3575904 4614311 3809769 1965086 674068
$$ packed form
3105f99213k368482l86747K561962M606330M180508J825083m13478j059936k74634
3096G971393P29899R14921K92333k82046l74427o92076j909951l204726l081664
3087C63656j547912j67657K13397M05831J041283J221281O2965j379730j123637
3078i10523J024634K888799K400913N8571j664868j303746j08127j43442j231914
3069A010297j266845K39517R03645r28195l108383k487960K94099J620052K65790
3060c457983r82956K21222K358458K483612J94659k415717l460781k478893j1313
3051g549692K557938L351750J537898j513881l273331k248051Q40555L589652
3043b707162L792307J606426l50205m9079J283617J038407q04542j844683j291018
$$ plain form
3034 674068 -305945 -2013142 -3629573 -3462960 -2280428 -2925189 -6179813 -9579598 -11287452
3025 -11287452 -12702368 -15574838 -18522193 -18713091 -15969757 -12785947 -10418664 -7215348
3017 -7215348 -1662632 4428000 7260572 5279362 931082 -2033090 -2186151 -820732
3009 -820732 484212 1453306 2406507 3362669 4324462 5295271 5424191 3406402 -355326
3000 -355326 -3267114 -3496095 -2326246 -2181693 -3412958 -4714568 -5606479 -6334834 -6117054
2991 -6117054 -3973614 -955553 943930 1920377 3742827 5994027 6005993 3307033 1145709
2982 1145709 2140665 4845340 6177497 5094602 2329294 -1270457 -4217685 -4276516 -1229925
2973 -1229925 1712228 1553586 -553737 -1084699 1221740 4576487 6967867 7581154 6267068
$$ packed form
3034F74068r80013j707197j616431J66613J182532o44761l254624l399785j707854
3025a1287452j414916k872470k947355j90898K743334L183810K367283L203316
3017g215348N552716O090632K832572j981210m348280k964172j53061J365419
3009h20732J304944R69094R53201R56162R61793R70809J28920k017789l761728
3000c55326k911788k28981J169849J44553j231265j301610q91911p28355K17780
2991f117054K143440L018061J899483R76447J822450K251200J1966k698960k161324
2982A145709R94956K704675J332157j082895k765308l599751k947228n8831L046591
2973a229925K942153j58642k107323n30962K306439L354747K391380O13287j314086
$$ plain form
2964 6267068 3921273 2801454 4170120 6035498 5483720 2881619 1368745 2396764
2956 2396764 4385966 5887309 7173972 7946757 6366727 2043846 -2193612 -3524501
2948 -3524501 -2680167 -2346102 -3181707 -3623230 -3099602 -3064451 -4349577 -5368667 -4189065
2939 -4189065 -1452244 160121 -714104 -2463241 -2747278 -1600960 -1232151 -2848875 -4886538
2930 -4886538 -5043055 -3347739 -2282443 -3996207 -8015766 -11662235 -12340455 -9612470 -5474404
2921 -5474404 -2508494 -1489016 -1013116 359462 2182112 2865231 1915024 690908 886892
2912 886892 2595792 3986738 3098341 265165 -1686796 -593945 2036437 2660164 329878
2903 329878 -2260161 -2856411 -2435749 -2670949 -3074693 -2842452 -3392916 -6121814 -9149770
$$ packed form
2964F267068k345795j119819J368666J865378n51778k602101j512874J028019
2956B396764J989202J501343J286663P72785j580030m322881m237458j330889
2948c524501Q44334L34065q35605m41523N23628L5151j285126j019090J179602
2939d189065K736821J612365q74225j749137k84037J146318L68809j616724k037663
2930d886538j56517J695316J065296j713764m019559l646469o78220K727985M138066
2921e474404K965910J019478M75900J372578J822650O83119r50207j224116J95984
2912H86892J708900J390946q88397k833176j951961J092851K630382O23727k330286
2903C29878k590039n96250M20662k35200m03744K32241n50464k728898l027956
$$ plain form
2894 -9149770 -9693768 -8729988 -9531636 -11876472 -11898748 -8443502 -5419825 -5982629 -7899996
2885 -7899996 -7239331 -3921152 -827054 520298 566453 -321412 -1637915 -1678898 527266
2876 527266 3121488 3822275 3422775 3989638 4507914 1981879 -3096944 -6145359 -4436279
2867 -4436279 -511779 1803427 1991037 1599593 958488 -374477 -1586946 -1608442 -1153020
2858 -1153020 -1534061 -2246057 -1903279 -899969 -798585 -1445762 -1125327 432457 1624233
2849 1624233 1822072 2143836 2748195 2003676 -400221 -2069665 -1522343 -914477 -2659661
2840 -2659661 -5203073 -5371715 -3822040 -4380243 -7870318 -10333716 -8657198 -4808695 -2420378
2831 -2420378 -1634179 -43702 2732311 4391196 3572009 1670178 605631 547695 529080
$$ packed form
2894i149770n43998R63780q01648k344836k2276L455246L023677n62804j917367
2885g899996O60665L318179L094098J347352M6155q87865j316503m0983K206164
2876E27266K594222P00787l99500N66863N18276k526035n078823l048415J709080
2867d436279L924500K315206J87610l91444o41105j332965j212469k1496M55422
2858a153020l81041p11996L42778J003310J01384o47177L20435J557784J191776
2849A624233J97839L21764O04359p44519k403897j669444N47322O07866j745184
2840b659661k543412j68642J549675n58203l490075k463398J676518L848503K388317
2831b420378P86199J590477K776013J658885q19187j901831j064547n7936j8615
$$ plain form
2822 529080 100223 -450522 -971259 -1887271 -3648960 -5689230 -6201443 -3835261 125301
2813 125301 2440310 1579629 -418155 -909596 -242441 -540001 -1794572 -1763757 127865
2804 127865 1436305 427473 -872498 769706 5164974 8460157 7451903 2884128
2796 2884128 -1807732 -4199695 -4788967 -5494339 -6979521 -8145997 -8172875 -7858972 -8032673
2787 -8032673 -7570674 -4663295 99872 3621863 3739613 1454332 -741752 -1394805 -292554
2778 -292554 2323529 5415542 7003988 5910644 3380386 1869880 2394113 3912030 5040815
2769 5040815 5419495 5473568 5723609 6458343 7482854 8066499 7531194 5923903 3918800
2760 3918800 2297630 1737521 2570589 4180928 5080472 4368701 2930460 2416263 3069833
$$ packed form
2822E29080m28857n50745n20737r16012j761689k040270n12213K366182L960562
2813A25301K315009q60681j997784m91441O67155k97560j254571L0815J891622
2804A27865J308440j008832j299971J642204M395268L295183j008254m567775
2796B884128m691860k391963n89272p05372j485182j166476k6878L13903j73701
2787h032673M61999K907379M763167L521991J17750k285281k196084o53053J102251
2778b92554K616083L092013J588446j093344k530258j510506N24233J517917J128785
2769E040815L78680N4073K50041P34734J024511N83645n35305j607291k005103
2760C918800j621170n60109Q33068J610339Q99544p11771j438241n14197O53570
$$ plain form
2751 3069833 3322439 1711574 -1395170 -4235783 -5357294 -4611285 -2832808 -1000317 273931
2742 273931 800389 836131 1247021 3187581 6797890 10070112 9920121 5259239 -1238482
2733 -1238482 -5233579 -4788429 -2031660 -816780 -3095939 -7509609 -10972332 -11420130 -9371994
2724 -9371994 -7118033 -6355727 -6687527 -6619625 -5685105 -4756897 -4216017 -3079330 -950458
2715 -950458 112510 -2487216 -8047088 -12492254 -12950005 -10811882 -9012384 -7862303 -5678676
2706 -5678676 -2528476 -625568 -1008544 -2377439 -3728293 -5681621 -8299644 -10000744
2698 -10000744 -9973252 -9435729 -8965504 -6904254 -2434828 2029516 4087238 4949801 6820384
2689 6820384 8548351 7597998 5069832 4521350 6168408 6594729 4661302 3496856 5382537
$$ packed form
2751C069833K52606j610865l106744k840613j121511P46009J778477J832491J274248
2742B73931N26458L5742M10890J940560L610309L272222j49991m660882o497721
2733a238482l995097M45150K756769J214880k279159m413670l462723m47798K048136
2724i371994K253961P62306l31800O7902R34520R28208N40880J136687K128872
2715i50458J062968k599726n559872m445166m57751K138123J799498J150081K183627
2706e678676L150200J902908l82976j368895j350854j953328k618023j701100
2698a0000744K7492N37523M70225K061250M469426M464344K057722Q62563J870583
2689F820384J727967r50353k528166n48482J647058M26321j933427j164446J885681
$$ plain form
2680 5382537 8283783 8954077 6396126 1113108 -5607083 -10247017 -8762289 -2083977
2672 -2083977 3374115 3219041 12266 -1775891 -2133096 -3277628 -4369782 -3159324 -898738
2663 -898738 -750452 -2284078 -2195279 -165940 509772 -1434418 -3131162 -2275845 -520963
2654 -520963 -626171 -2715287 -4847393 -5608187 -5126121 -4758997 -6113238 -9171530 -11678999
2645 -11678999 -11888412 -11147844 -11634731 -12422068 -10756457 -6845840 -3979865 -3580242 -3502528
2636 -3502528 -2077647 -581221 -376148 -567028 -169068 -98120 -1262556 -2831872 -4003262
2627 -4003262 -5340360 -6641406 -5630133 -953230 5062950 8761477 9227282 8353662 7895930
2618 7895930 8054916 8133922 7197303 4724177 1556031 -597191 -1185135 -1221034 -1300969 -924251
$$ packed form
2680E382537K901246O70294k557951n283018o720191m639934J484728O678312
2672b083977N458092j55074l206775j788157l57205j144532j092154J210458K260586
2663h98738J48286j533626Q8799K029339O75712j944190j696744Q55317J754882
2654e20963j05208k089116k132106p60794M82066L67124j354241l058292k507469
2645a1678999k09413P40568m86887p87337J665611L910617K865975L99623P7714
2636c502528J424881J496426K05073j90880L97960P0948j164436j569316j171390
2627d003262j337098j301046J011273M676903O016180L698527M65805q73620m57732
2618G895930J58986P9006r36619k473126l168146k153222n87944l5899p9935L76718
$$ plain form
2608 -924251 -294270 -555675 -1226313 133594 4077195 7500651 7830662 6776699 7318259
2599 7318259 8830792 8327762 5455692 3128556 3540360 6117564 9146187 11067925 10463367
2590 10463367 7204601 3671313 2652433 3935867 4909661 4414294 3763803 3797342 3318433
2581 3318433 1290685 -1281817 -2689721 -2467304 -1223585 408188 1890280 2564062 1951081
2572 1951081 90626 -2379785 -4261425 -4505700 -3483984 -2817269 -3192900 -3348329 -2287010
2563 -2287010 -1283298 -2042592 -3852940 -4493339 -3297820 -1424472 223912 1316250 1109274
2554 1109274 -464767 -1357258 267454 2708476 2725290 610121 -223257 1000541 996127
2545 996127 -2013728 -5145808 -5391163 -3931373 -3240643 -2803361 -1010175 858166 177484
$$ packed form
2608i24251O29981k61405o70638J359907L943601L423456L30011j053963N41560
2599G318259J512533n03030k872070k327136M11804K577204L028623J921738o04558
2590A0463367l258766l533288j018880J283434R73794m95367o50491L3539m78909
2581C318433k027748k572502j407904K22417J243719J631773J482092O73782o12981
2572A951081j860455k470411j881640k44275J021716O66715l75631j55429J061319
2563b287010J003712p59294j810348o40399J195519J873348J648384J092338k06976
2554A109274j574041q92491J624712K441022J6814k115169q33378J223798m414
2545I96127l009855l132080k45355J459790O90730M37282J793186J868341o80682
$$ plain form
2536 177484 -2685605 -4883024 -5174181 -4518740 -3289142 -1058871 1108273 1321779 -17489
2527 -17489 -706052 -619775 -1982453 -5036257 -6729608 -5288990 -3178710 -3292646 -4564341
2518 -4564341 -4069995 -1832469 -515772 -1139023 -2044007 -2065365 -2078881 -2942352 -4151760
2509 -4151760 -5247542 -6563927 -7710599 -7198898 -4745620 -2263934 -1195140 -453621 1290305
2500 1290305 2816429 2108182 -178433 -1639964 -1958637 -2865843 -4267142 -3765333 -1160822
2491 -1160822 -249549 -3921986 -9752575 -13005587 -12406563 -10296709 -8317107 -5931941 -2744627
2482 -2744627 566212 3627269 6197006 6684502 3647063 -879245 -2578788 -516011
2474 -516011 1196088 -848635 -4285324 -3997272 1369014 8290567 12811700 13850440 12615559
$$ packed form
2536A77484k863089k197419k91157O55441J229598K230271K167144K13506j339268
2527a7489o88563Q6277j362678l053804j693351J440618K110280j13936j271695
2518d564341M94346K237526J316697o23251r04984k1358j3516q63471j209408
2509d151760j095782j316385j146672N11701K453278K481686J068794P41519J743926
2500A290305J526124p08247k286615j461531l18673r07206j401299N01809K604511
2491a160822R11273l672437n830589l253012N99024K109854J979602K385166L187314
2482b744627L310839L061057K569737M87496l037439m526308j699543K062777
2474e16011J712099k044723l436689K88052N366286O921553M521133J038740j234881
$$ plain form
2465 12615559 10913931 10095019 10074552 9341622 7117675 5080992 5309801 6751194 5777152
2456 5777152 767057 -5595048 -9486868 -10036213 -9120404 -8134043 -6458580 -2939882 2245247
2447 2245247 7354448 10092945 8983910 4614488 -238995 -2547011 -1754275 -212114
2439 -212114 -340173 -1790302 -2295122 -1017311 342300 101658 -1272193 -2624332 -4298998
2430 -4298998 -7048641 -9582427 -9525549 -6877613 -4285294 -3303783 -2566648 -740515 864800
2421 864800 496780 -837829 -732605 802682 1188465 -1143027 -4931760 -8015965 -9422592
2412 -9422592 -9296807 -8339498 -7807947 -8751172 -10716751 -12327646 -13430510 -15207215 -17530869
2403 -17530869 -17860307 -14187599 -8108496 -3387439 -1841406 -2041977 -2019193 -1804102 -2664015
$$ packed form
2465A2615559j701628q18912k0467p32930k223947k036683K28809J441393r74042
2456E777152n010095o362105l891820n49345R15809R86361J675463L518698N185129
2447B245247N109201K738497j109035m369422m853483k308016P92736J542161
2439b12114j28059j450129n04820J277811J359611k40642j373851j352139j674666
2430d298998k749643k533786N6878K647936K592319R81511P37135J826133J605315
2421H64800l68020j334609J05224J535287L85783k331492l788733l084205j406627
2412i422592J25785R57309N31551r43225j965579j610895j102864j776705k323654
2403a7530869l29438L672708O079103M721057J546033k00571K2784K15091q59913
$$ plain form
2394 -2664015 -4690579 -6136697 -5253565 -2365834 251309 663491 -833762 -2472157 -3348737
2385 -3348737 -4099979 -5056116 -4919031 -2413140 1279766 3132614 1556145 -1896870 -4428664
2376 -4428664 -4719360 -3339407 -1464702 -173703 -441070 -2542277 -5312510 -6914957 -6742816
2367 -6742816 -6005932 -6075056 -6669446 -6127863 -3391665 474134 2807897 1697869 -1889140
2358 -1889140 -4703865 -4566650 -2774311 -2219403 -3409443 -3871821 -1826279 1202056 2429891
2349 2429891 1206521 -831688 -1963173 -1491061 325516 1984758 1355867 -1662435 -3903835
2340 -3903835 -2361453 1782664 4799979 5519533 5979494 7109048 7195095 5587711 4514421
2331 4514421 5247843 5432795 2993595 458207 2010891 7338465 11675899 11733828 8796819
$$ packed form
2394b664015k026564j446118Q83132K887731K617143M12182j497253j638395q76580
2385c348737p51242r56137J37085K505891L692906J852848j576469l453015k531794
2376d428664k90696J379953J874705J290999k67367k101207k770233j602447J72141
2367f742816P36884o9124n94390N41583K736198L865799K333763j110028l587009
2358a889140k814725J37215J792339N54908j190040m62378K045542L028335J227835
2349B429891j223370k038209j131485M72112J816577J659242o28891l018302k241400
2340c903835J542382M144117L017315P19554M59961J129554Q6047j607384j073290
2331D514421P33422J84952k439200k535388J552684N327574M337434N7929k937009
$$ plain form
2322 8796819 5861347 4327965 4122754 4857310 5768184 5831835 4741185 2975719 822655
2313 822655 -1566417 -3251116 -3183591 -2068722 -2013610 -3802134 -5873675 -6618996 -6400369
2304 -6400369 -6490388 -7105004 -7467572 -7091261 -6073880 -4566195 -2766588 -1317700 -1151405
2295 -1151405 -2756034 -5546817 -7971011 -8700896 -8107091 -8000978 -9298591 -10599765 -9960296
2286 -9960296 -7274170 -3635930 701074 5638855 9023925 7973047 3146418 -854837
2278 -854837 -920793 640102 -489702 -4643282 -7780800 -6573721 -1891636 2835149 5078003
2269 5078003 4562328 2441290 134993 -1283113 -1295782 -46869 1592189 2361890 1591979
2260 1591979 -56945 -1250885 -1479354 -1531661 -2471629 -4494078 -6683072 -7569641 -6352931
$$ packed form
2322H796819k935472j533382k05211P34556R10874O3651j090650j765466k153064
2313H22655k389072j684699O7525J114869N5112j788524k071541p45321K18627
2304f400369r0019o14616l62568L76311J017381J507685J799607J448888J66295
2295a151405j604629k790783k424194p29885N93805J06113j297613j301174O39469
2286i960296K686126L638240M337004M937781L385070j050878m826629m001255
2278h54837o5956J560895j129804m153580l137518J207079M682085M726785K242854
2269E078003n15675k121038k306297j418106j2669J248913J639058P69701p69911
2260A591979j648924j193940k28469n2307r39968k022449k188994q86569J216710
$$ plain form
2251 -6352931 -4117292 -3156997 -4187207 -5115365 -4050964 -2598587 -3853181 -7527479 -9931677
2242 -9931677 -9231350 -7829901 -8442212 -10562955 -12359333 -13335691 -13063641 -9980348 -4346773
$$ packed form
2251f352931K235639R60295j030210r28158J064401J452377j254594l674298k404198
2242i931677P00327J401449o12311k120743j796378r76358K72050L083293N633575
$$ [...]
##END NTUPLES=NMR SPECTRUM
##END=
