##TITLE=31Pdec_DE-87_ch_4
 CDCl3, 64 sc
 22.4.2025
##JCAMPDX= 6.0         $$ Bruker NMR JCAMP-DX V2.0
##DATA TYPE= NMR SPECTRUM
##DATA CLASS= NTUPLES
##ORIGIN= UXNMR, Bruker Analytische Messtechnik GmbH
##OWNER= root
$$ XWIN-NMR		Version 3.5
$$ Tue Apr 22 16:29:21 2025 Russian Standard Time (UT+4h)  she@DPX200
##.OBSERVE FREQUENCY= 81.013821
##.OBSERVE NUCLEUS= ^31P
##.ACQUISITION MODE= SIMULTANEOUS
##.ACQUISITION SCHEME= undefined
##.AVERAGES= 64
##.DIGITISER RES= 17
##SPECTROMETER/DATA SYSTEM= spect
##.PULSE SEQUENCE= zgpg30
##.SOLVENT NAME= CDCl3
##.SHIFT REFERENCE= (INTERNAL, CDCl3, 0, 198.062)
##AUDIT TRAIL= $$ (NUMBER, WHEN, WHO, WHERE, WHAT)
$$ ##TITLE= Audit trail, XWIN-NMR		Version 3.5
$$ ##JCAMPDX= 5.01
$$ ##ORIGIN= Bruker BioSpin GmbH
$$ ##OWNER= she
$$ F:/spectra/data/she/nmr/P31/2/pdata/1/auditp.txt
$$ ##AUDIT TRAIL=  $$ (NUMBER, WHEN, WHO, WHERE, WHAT)
(   1,<2025-04-22 16:27:50.26 +0400>,<she>,<DPX200>,
      <created by zg, POWCHK disabled, PULCHK disabled
       configuration hash MD5:
       00 E9 B6 7A A2 85 ED C7 34 08 36 98 17 FE 4E 26
       data hash MD5: 32K
       0B 47 E4 7E 00 46 75 8D 3C D5 92 B2 BD 39 BF B9>)
(   2,<2025-04-22 16:27:52.70 +0400>,<she>,<DPX200>,
      <Start of raw data processing
       efp BC_mod = 2 LB = 1.5 FT_mod = 6 PKNL = 1 PHC0 = 1563.486 PHC1 = -342.7069 SI = 64K 
       data hash MD5: 64K
       9D 9E C0 DE F2 D9 F5 AA 02 66 81 6B E0 6D DC BE>)
(   3,<2025-04-22 16:28:09.93 +0400>,<she>,<DPX200>,
      <pk PHC0 = -0.7941771 PHC1 = 0 
       data hash MD5: 64K
       05 C5 B4 3D 90 48 A2 B0 FB A3 2C 5B 89 99 DF 80>)
(   4,<2025-04-22 16:28:27.10 +0400>,<she>,<DPX200>,
      <pk PHC0 = -6.399999 PHC1 = 0 
       data hash MD5: 64K
       24 02 A4 14 F1 BD 15 DB 78 D4 6D B6 02 46 C1 D1>)
(   5,<2025-04-22 16:28:30.76 +0400>,<she>,<DPX200>,
      <abs ABSG = 5 
       data hash MD5: 64K
       EB 60 F7 D9 98 8A 75 46 B4 8A A4 72 A4 07 22 01>)
(   6,<2025-04-22 16:28:48.84 +0400>,<she>,<DPX200>,
      <pk PHC0 = 2.287999 PHC1 = 0 
       data hash MD5: 64K
       23 BE AB 43 CC E8 B2 26 1A 26 D9 94 3D 4C 2C D3>)
$$ ##END=
$$ 
$$ hash MD5
$$ 01 74 55 30 4A 9E 17 04 E2 37 66 57 A8 8A 63 7F
##$RELAX= 
##$RELAX= 
##$RELAX= 
##$RELAX= 
##$RELAX= 
##$RELAX= 
##$RELAX= 
##$RELAX= 
$$ Bruker specific parameters
$$ --------------------------
##$DU= <F:/spectra>
##$EXPNO= 2
##$NAME= <P31>
##$PROCNO= 1
##$TYPE= <nmr>
##$USER= <she>
##$AMP= (0..31)
100 100 100 100 100 100 100 100 100 100 100 100 100 100 100 100 100 100 
100 100 100 100 100 100 100 100 100 100 100 100 100 100 
##$AQSEQ= 0
##$AQ_mod= 1
##$AUNM= <au_zg>
##$AUTOPOS= <>
##$BF1= 81.014009
##$BF2= 200.13
##$BF3= 200.13
##$BF4= 200.13
##$BF5= 200.13
##$BF6= 200.13
##$BF7= 200.13
##$BF8= 200.13
##$BYTORDA= 1
##$CFDGTYP= 0
##$CFRGTYP= 5
##$CHEMSTR= <none>
##$CNST= (0..31)
1 1 145 1 1 1 1 1 1 1 1 1 1 1 1 1 1 1 1 1 1 1 1 1 1 1 1 1 1 1 1 1 
##$CPDPRG= <waltz16>
##$CPDPRG1= <>
##$CPDPRG2= <waltz16>
##$CPDPRG3= <>
##$CPDPRG4= <mlev>
##$CPDPRG5= <mlev>
$$ [...]
##$SUBNAM3= <"">
##$SUBNAM4= <"">
##$SUBNAM5= <"">
##$SUBNAM6= <"">
##$SUBNAM7= <"">
##$SUBNAM8= <"">
##$SUBNAM9= <"">
##$SW= 400.765351723535
##$SWIBOX= (0..15)
0 1 3 0 0 0 0 0 0 0 0 0 0 0 0 0 
##$SW_h= 32467.5324675325
##$TD= 32768
##$TD0= 1
##$TE= 0
##$TE2= 300
##$TE3= 300
##$TEG= 300
##$TL= (0..7)
0 120 53 12 22 120 120 120 
##$TP= (0..7)
150 150 150 150 150 150 150 150 
##$TP07= 0
##$TPNAME0= <>
##$TPNAME1= <>
##$TPNAME2= <>
##$TPNAME3= <>
##$TPNAME4= <>
##$TPNAME5= <>
##$TPNAME6= <>
##$TPNAME7= <>
##$TPOAL= (0..7)
0.5 0.5 0.5 0.5 0.5 0.5 0.5 0.5 
##$TPOFFS= (0..7)
0 0 0 0 0 0 0 0 
##$TUNHIN= 0
##$TUNHOUT= 0
##$TUNXOUT= 0
##$USERA1= <user>
##$USERA2= <user>
##$USERA3= <user>
##$USERA4= <user>
##$USERA5= <user>
##$V9= 5
##$VALIST= <valist>
##$VCLIST= <CCCCCCCCCCCCCCC>
##$VD= 0
##$VDLIST= <DDDDDDDDDDDDDDD>
##$VPLIST= <PPPPPPPPPPPPPPP>
##$VTLIST= <TTTTTTTTTTTTTTT>
##$WBST= 1024
##$WBSW= 4
##$XGAIN= (0..3)
0 0 0 0 
##$XL= 0
##$YL= 0
##$YMAX_a= 16984
##$YMIN_a= -26246
##$ZGOPTNS= <>
##$ZL1= 120
##$ZL2= 120
##$ZL3= 120
##$ZL4= 120
##$ABSF1= 198.0616
##$ABSF2= -202.7028
##$ABSG= 5
##$ABSL= 3
##$ALPHA= 0
##$AQORDER= 0
##$ASSFAC= 0
##$ASSFACI= 0
##$ASSFACX= 0
##$ASSWID= 0
##$AUNMP= <proc_1d>
##$AZFE= 0.1
##$AZFW= 0.5
##$BCFW= 0
##$BC_mod= 2
##$BYTORDP= 0
##$COROFFS= 0
##$CY= -3
##$DATMOD= 1
##$DC= 0
##$DFILT= <>
##$DTYPP= 0
##$F1P= 0
##$F2P= 0
##$FCOR= 1
##$FTSIZE= 65536
##$FT_mod= 6
##$GAMMA= 0
##$GB= 0
##$INTBC= 1
##$INTSCL= 9.790993e-09
##$ISEN= 30
##$LB= 1.5
##$LEV0= 0
##$LPBIN= 0
##$MAXI= 10000
##$MC2= 0
##$MEAN= 0
##$ME_mod= 0
##$MI= 50
##$NCOEF= 0
##$NC_proc= -8
##$NLEV= 6
##$NOISF1= 182.463
##$NOISF2= 159.3651
##$NSP= 0
##$NTH_PI= 0
##$NZP= 0
##$OFFSET= 198.0616
##$PC= 4
##$PHC0= 1558.58
##$PHC1= -342.7069
##$PH_mod= 1
##$PKNL= yes
##$PPARMOD= 0
##$PSCAL= 0
##$PSIGN= 0
##$REVERSE= no
##$SF= 81.0140089999434
##$SI= 65536
##$SIGF1= 159.3651
##$SIGF2= -187.1042
##$SINO= 113.3802
##$SIOLD= 16384
##$SREGLST= <1H.CDCl3>
##$SSB= 0
##$STSI= 65536
##$STSR= 0
##$SW_p= 32467.5324675325
##$SYMM= 0
##$S_DEV= 0
##$TDeff= 32768
##$TDoff= 0
##$TI= <>
##$TILT= no
##$TM1= 0
##$TM2= 0
##$TOPLEV= 0
##$USERP1= <user>
##$USERP2= <user>
##$USERP3= <user>
##$USERP4= <user>
##$USERP5= <user>
##$WDW= 1
##$XDIM= 65536
##$YMAX_p= 231420947
##$YMIN_p= -123053389
$$ End of Bruker specific parameters
$$ ---------------------------------
##NTUPLES= NMR SPECTRUM
##VAR_NAME=  FREQUENCY,     SPECTRUM/REAL,   SPECTRUM/IMAG
##SYMBOL=    X,             R,               I
##VAR_TYPE=  INDEPENDENT,   DEPENDENT,       DEPENDENT
##VAR_FORM=  AFFN,          ASDF,            ASDF
##VAR_DIM=   65536,         65536,           65536
##UNITS=     HZ,            ARBITRARY UNITS, ARBITRARY UNITS
##FACTOR=    0.49542278885378, 1,            1
##FIRST=     16045.7642231865, 0,            0
##LAST=      -16421.768244346, 0,            0
##MIN=       -16421.768244346, -123053389,   0
##MAX=       16045.7642231865, 231420947,    0
$$ Real data points
##PAGE= N=1
##DATA TABLE= (X++(R..R)), XYDATA
$$ [...]
##PAGE= N=2
##DATA TABLE= (X++(I..I)), XYDATA
7517C700824Q30349J29293k996118n126555l962172p53789J767505K677236L050568
7508f82859L538129L304729J684852m59639j911852k634538l035209k572184o09299
7499c377870J831549K906505K464311K008879K077376J611772L59666l15872n0674
7490I515642o64643k982072m415436k205818K110471M203916K495384l87505j695106
7481E974833j514102j096154o62929p0443J81957k1M37310K078602L700317L777011
7471A2806381K512789J251585N94106J94696k22704p48819j641119k741528l058320
7462H947067j969992l52753M99967M82400J19177p43088k102390k412935k48367
7453B219086K741753K931824n97082m573062n623824l850496j224816J337902
$$ y = [3700824, 4531173, 4660466, 1664348, -3462207, -7424379, -8178168, -6410663, -3733427, -682859, 2855270, 6159999, 7844851, 7385212, 5473360, 2838822, -196387, -2768571, -3377870, -1546321, 1360184, 3824495, 5833374, 7910750, 9522522, 9882188, 9566316, 9515642, 8850999, 5868927, 1453491, -752327, 1358144, 5562060, 8057444, 7669939, 5974833, 4460731, 3364577, 2701648, 2631205, 2813162, 2813141, 3250451, 5329053, 9029370, 12806381, 15319170, 16570755, 17164861, 17359557, 17136853, 16388034, 14746915, 12005387, 8947067, 6977075, 6624322, 7124289, 7606689, 7725866, 6982778, 4880388, 2467453, 2219086, 4960839, 7892663, 7295581, 2722519, -2901305, -6751801, -7976617, -6638715]
7445f638715L430847L654964J327026j399708j810857m21745J60020l33306K89537
7436a741937K201186K502918o6418k591440k273833o01570n20532j514192p99076
7427e404894J689201K973383J634033l37279q97324o30662j032327k003637k246016
7418f255522j004123J340109L488846L754285J551164j348072k320143r37525
7410a730981Q27180J610964K101930K889111K807013P58446k110790l474410k397243
7401A281220K0173J828102J487979r89872l501570l612080j551319p6253n76592
7392e690212j151613L2802J418715M55132j940111k229928N94045L420099L265976
7383a825095J026652j75656R75218K865280L222379J505143q37147j898395j031914
$$ y = [-6638715, -3207868, 447096, 1774122, 374414, -1436443, -1858188, -1698168, -2031474, -1741937, 459249, 2962167, 2895749, 304309, -1969524, -2571094, -3091626, -4605818, -5404894, -3715693, -742310, 891723, 554444, -342880, -973542, -2005869, -4009506, -6255522, -7259645, -5919536, -2430690, 1323595, 2874759, 1526687, -793456, -1730981, -903801, 707163, 2809093, 5698204, 8505217, 9263663, 7152873, 3678463, 1281220, 1301393, 3129495, 4617474, 3627602, 126032, -3486048, -5037367, -5113620, -5690212, -6841825, -6809023, -5390308, -4935176, -6875287, -9105215, -8511170, -5091071, -1825095, -798443, -974099, 1119, 2866399, 6088778, 7593921, 6756774, 4858379, 3826465]
7374C826465P26519J739670J137064o72960k353840k577471j310490j61150n40311
7365a86504j516255r12922J185149J954824q3277k455435k076440L37404J624969
7356b128487R93948O48532J724086K466282J329835m07914n94443O64972J332662
7347F029473K38725j623045k417178j377169O04445J985379K070664J363588M91264
7338G366146n18850j494396j564171l22018J113924J386928Q11184P53618J403430
7329H935795J495182K67033j415709j999033o14964K142369M116565L116185k76986
7320A5766437k423904q61841K106937K320013m12856k258983j189116L54169k93110
7311A3107746j994589k031017l12579R13690M56417p80925j624604j777536j286687
$$ y = [3826465, 4552984, 6292654, 7429718, 6756758, 4402918, 1825447, 514957, 353807, -186504, -1702759, -2615681, -1430532, 524292, 441015, -2014420, -4090860, -3753456, -2128487, -1134539, -486007, 1238079, 3704361, 5034196, 4626282, 4031839, 4696811, 6029473, 6268198, 4645153, 2227975, 850806, 1455251, 3440630, 5511294, 6874882, 7366146, 6847296, 5352900, 3788729, 3466711, 4580635, 5967563, 6778747, 7532365, 8935795, 10430977, 10698010, 9282301, 7283268, 6668304, 8810673, 12927238, 16043423, 15766437, 13342533, 12480692, 14587629, 16907642, 16494786, 14235803, 13046687, 13400856, 13107746, 11113157, 9082140, 8769561, 9683251, 10139668, 9358743, 7734139, 5956603, 4669916]
7302D669916k30283Q35200R24215m56949k458187l116637j110753K188826L372763
7293D618111J003674j924208j603472J099091J662363j332364l830431k202795
7285b510031J539875K970883J432227j02449m3521K20914n12241j452484j694991
7276a51818j594739j355892j8694K855737N456528N094467J454065k272528k318651
7267G148475J305036M213657K563792j945430l931040j349799J848731J349309
7259A1202731j754687l253626k086538j056504j867499k756768j666688Q61553
7251b378026L037951M065621L850935K122720p19717k927620k950698j188935
7243B912231O80743J588705J487568M95129j274935l121909l909184l118254j382814
$$ y = [4669916, 4439633, 5274833, 6199048, 5742099, 3283912, 167275, -943478, 1245348, 4618111, 5621785, 3697577, 2094105, 3193196, 4855559, 3523195, -307236, -2510031, -970156, 2000727, 3432954, 3330505, 3286984, 3507898, 2995657, 1543173, -151818, -1746557, -3102449, -3121143, -265406, 5191122, 10285589, 11739654, 9467126, 7148475, 8453511, 12667168, 15230960, 13285530, 9354490, 8004691, 9853422, 11202731, 9448044, 6194418, 4107880, 3051376, 1183877, -1572891, -3239579, -2378026, 659925, 4725546, 8576481, 10699201, 9979484, 7051864, 4101166, 2912231, 3592974, 5181679, 6669247, 7164376, 5889441, 2767532, -1141652, -4259906, -5642720]
7234e642720K06388J121168J581795J876422J838027J259887N85528N07448P27565
7225D061508j3283j980468l289504j963908J086662K618898J010677j604761k043041
7216b117220o868J839990J296205j092174l137071l284707j537337R13186K485880
7207d640116K372626J315271N35474k30783k264080m880294m945648j175421K846098
7198a1066873K821071p8743p27905K370834N048153L976853J067996o62282j574031
7189A175073k704481k346353N62809K715945R68147j775073o42743K977500L491549
7180D422373N52826m41994K089816K990859p48822m716830m164798q37350J226770
7171C72850J847802K364129J553204j311344l031000j065159J628979J260779
$$ y = [-5642720, -5436332, -4315164, -2733369, -856947, 981080, 2240967, 2826495, 3333943, 4061508, 4048225, 2067757, -1221747, -3185655, -2098993, 519905, 1530582, -74179, -2117220, -2124088, -284098, 1012107, -80067, -3217138, -6501845, -8039182, -7125996, -4640116, -2267490, -952219, -416745, -647528, -2911608, -7791902, -12737550, -13912971, -11066873, -8245802, -8324545, -9052450, -6681616, -1633463, 2343390, 3411386, 2749104, 1175073, -1529408, -3875761, -3312952, -597007, 371140, -1403933, -2046676, 930824, 4422373, 4975199, 4533205, 6623021, 9613880, 8865058, 4148228, -16570, -853920, 372850, 2220652, 4584781, 6137985, 4826641, 1795641, 730482, 2359461, 3620240]
7163C620240l96736L74683K144335J013603j739466j388300J890497L105604Q22619
7154I447079j071059o74486q10432k883678l897213j988887J30918j4066q00528
7145b562352k10924N50899M8469l33144O48762J226199j41054j415807j54279
7136b343231K247321K818644J774060J666665K927989L440410K127258K94822
7128A4953938o43616p80266q35425j040577j195208j212055j493556k614432m121751
7119A017052m238174k037236P28919J845740J957814L021520M033798K040761
7111H370194k264002m213919j907933Q80169P79336k76090O21551J924691P97218
7102D711215j167442l51806K378941K615010n99636l364829k899101p72855P56011
$$ y = [3620240, 3223504, 3598187, 5742522, 6756125, 5016659, 3628359, 5518856, 8624460, 9447079, 8376020, 7701534, 6891102, 4007424, 110211, -1878676, -1747758, -1761824, -2562352, -2773276, -2222377, -2173908, -2507052, -1858290, -632091, -773145, -2188952, -2343231, -95910, 2722734, 4496794, 6163459, 9091448, 12531858, 14659116, 14953938, 14310322, 13530056, 12694631, 11654054, 10458846, 9246791, 7753235, 5138803, 1017052, -3221122, -5258358, -4529439, -2683699, -725885, 2295635, 6329433, 8370194, 6106192, 1892273, -15660, 864509, 1643845, 1367755, 1989306, 3913997, 4711215, 3543773, 3191967, 5570908, 8185918, 7586282, 4221453, 1322352, 549497, 1305508]
7093A305508J891453L194485L395178J463155j058450j776878m39131J228758
7085I204078J869227J538497R55743O02615L35254m77775k070531l455978l207813
7076E293317j351595K97135K90367n09884o5588J822396K799509J159533j057222
7067H677968r0616M087968O614980L707690k009926m739432k922917k45175L43123
7058A3423663j11020O1289J88576n97021j227231q18657n82285j543821k402177
7049F391316j669335p0452J041157J678117J804252K63883k602918l646638j020877
7040B168505K433853K953941J159090L02032Q80502P73158l11718m82435N66536
7031A0443464J085497O28323N41304Q65933n2004k319398l706014k804221o74597
$$ y = [1305508, 3196961, 6391446, 9786624, 11249779, 10191329, 8414451, 7975320, 9204078, 11073305, 12611802, 13567545, 14170160, 14505414, 14027639, 11957108, 8501130, 5293317, 3941722, 4238857, 4529224, 4019340, 3953752, 5776148, 8575657, 9735190, 8677968, 8587352, 12675320, 19290300, 22997990, 20988064, 16248632, 13325715, 13080540, 13423663, 13312643, 13373932, 13562508, 12965487, 11738256, 10919599, 10337314, 8793493, 6391316, 4721981, 4651529, 5692686, 7370803, 9175055, 9438938, 6836020, 3189382, 2168505, 4602358, 7556299, 8715389, 9017421, 9897923, 10671081, 10359363, 9876928, 10443464, 11528961, 12157284, 12698588, 13564521, 13512517, 11193119, 7487105, 4682884, 4008287]
7022D008287J051305J559208L70150k036770l116584n68882L899675N895764L989346
7013A5051499J317145P70256J342386N78771j639922l358776l120631j128056
7005I812672J086890J646938J42973j490388j313433k24798m97440j919729k068087
6996E175598m33913P35518K92394j52589N20329R55688P2907q83009q52552j094873
6986D335498k646928l704083k087929J007715K312193R13066q83023j042838j78975
6977a975304J01946k11196K34591J684174K295224N03545k290518l027063j089678
6968c774279Q81688J001660N93217J154179J525942N67628J07096J822107L356181
6959G235419J705293j200160j073180J665869K639725Q11357o22742o84826j775866
$$ y = [4008287, 5059592, 6618800, 6988950, 4952180, 1835596, 1266714, 5166389, 11062153, 15051499, 16368644, 17138900, 18481286, 19060057, 17420135, 14061359, 10940728, 9812672, 10899562, 12546500, 12689473, 11199085, 9885652, 9660854, 9163414, 7243685, 5175598, 4741685, 5477203, 5769597, 5617008, 6137337, 7093025, 7165932, 6282923, 5430371, 4335498, 1688570, -2015513, -4103442, -3095727, -783534, 129532, -753491, -1796329, -1975304, -1873358, -2084554, -1849963, -165789, 2129435, 2632980, 342462, -2684601, -3774279, -2892591, -1890931, -1297714, -143535, 1382407, 1950035, 2057131, 3879238, 7235419, 8940712, 7740552, 6667372, 8333241, 10972966, 11784323, 11161581, 10476755, 8700889]
6950H700889l519826k105729K195283L589570J5659k715482l22479K669788O73063
6941I180736l398678l142060P71138K420556N18442q87330l42558n41721k054916
6932B523609j976778L48791J796216P87370n63817o55518m06065j42943J254302
6923B965167L047290K622797N5953j258540M1859J148403l0134j558849j151541
6914E882405J86185N95042O12442J412983K041259R53520j273585k909904l392452
6905D107895k944147j373473R13635K080916J045445m73024l3484J980054K760527
6896H064344R59535j447165j763711j09658P01213j060413l419285l129101k78058
6887a482299J690498J033272R1476J029867K047056O74361j637820k056146j547810
$$ y = [8700889, 5181063, 3075334, 5270617, 8860187, 8875846, 6160364, 5837885, 8507673, 9180736, 5782058, 2639998, 3411136, 5831692, 6350134, 5462804, 5120246, 4578525, 2523609, 546831, 895622, 2691838, 3479208, 2915391, 2259873, 1853808, 1710865, 2965167, 6012457, 8635254, 8691207, 7432667, 7474526, 8622929, 8592795, 7033946, 5882405, 6068590, 6663632, 7276074, 8689057, 10730316, 11683836, 10410251, 7500347, 4107895, 1163748, -209725, 703910, 2784826, 3830271, 3357247, 3323763, 5303817, 8064344, 9023879, 7576714, 5813003, 5703345, 6404558, 5344145, 1924860, -1204241, -1482299, 208199, 1241471, 1332947, 2362814, 4409870, 5084231, 3446411, 1390265, -157545]
6878a57545k857045m525987k487607K346473M001317L64968l416457k884908l26523
6869i943314M40738L88460J897796L107841J075892k047149j683737J623214K801334
6860b338925J85722k203743j126420J473934K067691K35530j943007k778552j771920
6851h199690N57100K420651J981179j96916j450467n55609P57039P70456L83266
6842c532991J199797K557063K562147J357266J068126K285037K666795K51145
6834A0414385l189645l974706j406556J185686R92021n99122n51165J077277J610289
6825E558464M58935J23575J739789K750655R27780j806397k220490o98421k75242
6816F558648j668082k472507j269963M91296J374535K017738L079779L370341
$$ y = [-157545, -3014590, -7540577, -10028184, -7681711, -3680394, -3315426, -6731883, -9616791, -9943314, -9502576, -9114116, -7216320, -4108479, -3032587, -5079736, -6763473, -5140259, -2338925, -2153203, -4356946, -5483366, -4009432, -1941741, -1706211, -3649218, -6427770, -8199690, -7642590, -5221939, -3240760, -3437676, -4888143, -5443752, -4686713, -3916257, -3532991, -2333194, 223869, 2786016, 4143282, 5211408, 7496445, 10163240, 10414385, 7224740, 3250034, 1843478, 3029164, 4021185, 3422063, 2870898, 3948175, 5558464, 6017399, 6140974, 7880763, 10631418, 11559198, 9752801, 7532311, 6833890, 6558648, 4890566, 2418059, 1148096, 1639392, 3013927, 5031665, 8111444, 11481785]
6808A1481785J802507l23638r64852m13798p62583k534328l773001k954350j197356
6799C60386m99733q49756n98503P51372J924536K295349K972041M273308L902455
6790A4531455r9919n464200p478727m817879j045545L58721q7061k12337P6798
6781d238694l17537q05610J78962K313488L630359L369341K523832J700459N25438
6772H880038o45261m90975J085172K155940J142197j090691k458662k271798j677757
6763D628203j773135k150125j682129l81868L02097n17304j567555r31213J186123
6754b886906K753369K984171L110476L539425K611216l48545k925978k726953
6746F110275q98145j40438o56978q08066n88836j263702k240158j754535m97093
$$ y = [11481785, 13284292, 12960654, 11995802, 11582004, 10819421, 8285093, 4512092, 1557742, 360386, -139347, -989103, -1587606, -836234, 1088302, 3383651, 6355692, 10629000, 14531455, 14431536, 8967336, 1488609, -3329270, -4374815, -4016094, -4103155, -4315492, -4238694, -4556231, -5361841, -5182879, -2869391, 760968, 4130309, 6654141, 8354600, 8880038, 8234777, 7743802, 8828974, 10984914, 12127111, 11036420, 8577758, 6305960, 4628203, 2855068, 704943, -977186, -1359054, -1056957, -1574261, -3141816, -4073029, -2886906, -133537, 2850634, 5961110, 9500535, 12111751, 11763206, 8837228, 6110275, 5212130, 5071692, 4414714, 3606648, 3017812, 1754110, -486048, -2240583, -2737676]
6737b737676r35132k644264k110411J618591M714534L988975J403457O02930J463777
6728E364781J154577r65461k636116k270347o69246O60930R08196j85128k132545
6719g70359l438545k966133j456387m53931p3100P33664J950226K215724J007329
6710c251512l33054l58694O45869J263702R04433N61736J516945L420943M101439
6701H471807J934390j723270l569746k221958Q1301L92210j398750l025404k994255
6692d053675j873576q20470j54044N37293J729507L440897M861346M761325K789522
6683A1218125M4114k001423k604301j641437M42302K078377J503927p02756j598903
6674F738025J41161J894700Q00139j816050k544204j232729o91328j460591r14922
$$ y = [-2737676, -3672808, -6317072, -8427483, -6808892, -2094358, 1894617, 3298074, 3901004, 5364781, 6519358, 5553897, 2917781, 647434, -21812, 639118, 1547314, 1362186, -770359, -4208904, -7175037, -8631424, -9085355, -9158455, -8424791, -6474565, -4258841, -3251512, -3584566, -3943260, -3297391, -2033689, -1129256, -567520, 949425, 4370368, 8471807, 10406197, 8682927, 5113181, 2891223, 2972524, 3364734, 1965984, -1059420, -4053675, -5927251, -6747721, -6901765, -6364472, -4634965, -1194068, 3667278, 8428603, 11218125, 11262239, 9260816, 6656515, 5015078, 5457380, 7535757, 9039684, 8336928, 6738025, 6879186, 8773886, 9574025, 7757975, 5213771, 3981042, 3289714, 1829123, 914201]
6665I14201J649748L011287J009580j810631k117078o54748k01443p99760n08544
6656D92612M34905o700j483010j154828J586781L499325J896053j787359m298293
6647h20514m401267k825843k54858K535633L762879K245533l92862j168837M54761
6638h65375J925822J220836m45109m94054J451646L128863K463840j86276k734682
6629E465511l538663k518015o67855Q74969J369370P46661k72679o40927J6138
6620H34510R30176J024367J40376q75129j206186p72603P0389J015335J793606
6611B954841K065423J566138K24186j757394l548550l694488j432029J808220
6603a813653L305502K110177K61315N0101J008436J020283k00498o47729P93561
$$ y = [914201, 2563949, 5575236, 6584816, 4774185, 2657107, 2002359, 1800916, 1001156, 492612, 927517, 920817, -562193, -1717021, -130240, 3369085, 5265138, 3477779, -820514, -5221781, -8047624, -8302482, -5766849, -2003970, 241563, -151299, -1320136, -865375, 1060447, 2281283, 1836174, 1342120, 2793766, 5922629, 8386469, 8200193, 5465511, 1926848, -591167, -1259022, -384053, 985317, 1731978, 1459299, 818372, 834510, 1764686, 2789053, 2929429, 2054300, 848114, 75511, 145900, 1161235, 2954841, 5020264, 6586402, 6810588, 5053194, 1504644, -2189844, -3621873, -1813653, 1491849, 3602026, 3863341, 3913442, 4921878, 5942161, 5741663, 5093934, 5887495]
6594E887495K532421K534222J074316J182J857p3685j255792k838876l118189
6585D744951j449427P36225J292575p5569j194314k08552J562533J174152j515204
6576E067370l072376j121491K246350L450970K222929J070896R51587L22777j487414
6567I651598k716110j879345l4055P91902L9028j370224k201504j435501R65941
6558A811730L062211K191047j754640n567354o181300l641275Q3352L406353N035986
6549a553890L721576K53859j866691k67879K867791L711875K061208P19163L71469
6540A0018481j182354m308451n787849l349862R03858L470255L620337K797915
6532F182330J860610R38116M52268L29691m56682j843934j777299O39063K739762
$$ y = [5887495, 8419916, 10954138, 12028454, 12029636, 12031493, 11957808, 10702016, 7863140, 4744951, 3295524, 4031749, 5324324, 5248755, 4054441, 3845889, 5408422, 6582574, 5067370, 1994994, 873503, 3119853, 6570823, 8793752, 9864648, 10816235, 11139012, 9651598, 6935488, 5056143, 5022088, 5813990, 5853018, 4482794, 2281290, 845789, 1811730, 4873941, 7064988, 5310348, -257006, -6438306, -10079581, -9996229, -6589876, -1553890, 2167686, 2421545, 554854, 286975, 3154766, 6866641, 8927849, 9647012, 10018481, 8836127, 4527676, -1260173, -4610035, -3706177, -235922, 3384415, 6182330, 8042940, 8981056, 9433324, 9763015, 9306333, 7462399, 5685100, 6324163, 9063925]
6523I063925J571678j728439l607885l134642k282220j839065n32672J627417
6515h61903K585385J666368P49268R39854R16041j06612n62711O07598J860754
6506G794042J759989J369145J730780J335940j129965l548849l107551q24287
6498E379244O2530p79098r00241J35092k5679k038706l219679j651346R24597
6489b113286J805320P45581o04256q98481J73603J655442J377365j662022m711632
6480d232366l847134K77504K595037P71973j508522n51214J790859J792518n7341
6471b968686o22379N10688J374735J620013J962345J079121k384843n681703m713020
6462i823729n76977J621247O14447L19879K534530L925606K298538N00486J090491
$$ y = [9063925, 10635603, 8907164, 5299279, 2164637, -117583, -1956648, -2489320, -861903, 1723482, 3389850, 4139118, 5078972, 5995013, 5888401, 5325690, 5933288, 7794042, 9554031, 10923176, 12653956, 13989896, 12859931, 9311082, 6203531, 5379244, 5441774, 4662676, 3762435, 3897527, 3871848, 1833142, -1386537, -3037883, -2113286, -307966, 437615, -166641, -1065122, -891519, 763923, 2141288, 479266, -4232366, -8079500, -7801996, -5206959, -4434986, -5943508, -6494722, -4703863, -2911345, -2968686, -3591065, -3080377, -1705642, -85629, 1876716, 2955837, 570994, -5110709, -9823729, -10400706, -8779459, -8165012, -7845133, -5310603, -1384997, 913541, 1414027, 2504518]
6453B504518J899499N67086o91634Q76123L195296K662985J74372q30938k59278
6444A0098029n42863j541945j165737n6289p51388k684892k841913j241554q89332
6435a617884k035440j542361J177967K718344J716912J289614L066119L644476
6427H417747L92892l334011k981156J97886J390641l99423j629843o7911K526540
6418D513362L569688K497549K55349j747775k106037o88087P16662N27800m66157
6409G072354o24678j15849j11168l73367k336K46363r82384k779504k937286j635809
6399b243664j337931k713532l398741j568431J597333L895820M508761L577075
6391B316690J356363j122727k219630j631300q65681r07248p61846P31138K846531
$$ y = [2504518, 4404017, 4971103, 4279469, 5155592, 8350888, 11013873, 11188245, 10357307, 10098029, 9555166, 8013221, 6847484, 6791195, 6039807, 3354915, 513002, -728552, -1617884, -3653324, -5195685, -4017718, -1299374, 417538, 1707152, 4773271, 8417747, 8810639, 5476628, 2495472, 2693358, 4083999, 3684576, 2054733, 1986822, 4513362, 8083050, 10580599, 10835948, 9088173, 6982136, 6294049, 7010711, 7538511, 7072354, 6447676, 6331827, 6220659, 5847292, 5844956, 6091319, 5108935, 2329431, -607855, -2243664, -3581595, -6295127, -9693868, -11262299, -9664966, -5769146, -1260385, 2316690, 3673053, 2550326, 330696, -1300604, -2166285, -3073533, -3835379, -3104241, -257710]
6382b57710L778975K754381O80444p21099k89003J280474J738054J9700j856628
6373G127588j387126M97101O56466j227855k036965l81643R72766m02450k656618
6364A161264k664693p09738N11588o4868j335333k190540j876324M15658L847044
6355b905942N198909K634571r21380j196473J456950K805759J110667p71303j43397
6346G268361J884834K636976J263663j290578l720156m673040l267257k20538
6338a17735K716571M661876N489687M214103J2416m920896o474759l659536k5728
6329A895999J160334O45336O40977J185883J190860R56576J213193J268592M87754
6320A0645504K14301J746670L510560K792907l89937l445815m626850m151856
$$ y = [-257710, 3521265, 6275646, 6956090, 6234991, 5945988, 7226462, 8964516, 8984216, 7127588, 5740462, 6237563, 6894029, 5666174, 3629209, 3247566, 4220332, 3817882, 1161264, -1503429, -2213167, -1701579, -1766447, -3101780, -5292320, -7168644, -6752986, -2905942, 2292967, 4927538, 4006158, 2809685, 4266635, 7072394, 8183061, 7411758, 7268361, 9153195, 11790171, 13053834, 11763256, 8043100, 3370060, 102803, -117735, 2598836, 7260712, 12750399, 16964502, 16976918, 12056022, 5581263, 1921727, 1895999, 3056333, 3701669, 4342646, 5528529, 6719389, 7675965, 8889158, 10157750, 10645504, 10859805, 12606475, 16117035, 18909942, 18520005, 15074190, 10447340, 6295484]
6312F295484k608097n80403N90063K0924j032734q94158l02322r61097j809958
6303a282298r7646L562070M822270J628583k506993l180132m95570K351559L626923
6294H428766L579679K172358o22222l022614k849495o98628O73775J99197n62466
6285G298350n40254o72436j441185j373179K60701J217498p55409l783420l621023
6276c410357K96908L393544J884524k072551l445474j203412Q44722L8016j447463
6267e121543l90513K370000L166605Q15841j917609k206439l32429J584135K207855
6258A75903J373858p21370l296557m566266k904154J279645N297998O197765L384554
6249F221376n17316j938095j24054J951949J366017r47121j943719j357556j926918
$$ y = [6295484, 3687387, 3106984, 3697047, 3717971, 2685237, 1791079, 1488757, 527660, -1282298, -1379944, 2182126, 7004396, 8632979, 6125986, 2945854, 2450284, 4801843, 8428766, 12008445, 14180803, 13558581, 10535967, 7686472, 6987844, 7661619, 7860816, 7298350, 6758096, 6085660, 4644475, 3271296, 3531997, 4749495, 3994086, 210666, -3410357, -3113449, 280095, 2164619, 92068, -3353406, -4556818, -3712096, -3674080, -5121543, -5512056, -3142056, 24549, 840390, -1077219, -3283658, -3616087, -2031952, 175903, 1549761, 828391, -2468166, -7034432, -9938586, -8658941, -3360943, 2836822, 6221376, 5704060, 3765965, 3641911, 5593860, 6959877, 6012756, 4069037, 2711481, 784563]
6240G84563m189823m386898J26447N799586O575678J754166l078707l044628R64125
6231A304509M803431N931852M377603J088668k523948m450919l567097j161927
6223E802172L44943K10091j58363M75481J485219J430877J0017j691154k527725
6214E381558k220603j080504L84520J277887O01911j278005k002109L30251L889365
6205E284271M252290K1178m420466l885469R40268M447202L420311L84064j014264
6196I429385q08475r57974j292625j67538J956258K506601L54338k758444m443096
6187C818430l639049o18197K979018M239202J525899k611442l514511l43884K471624
6178D307090J177541k252795l233091q67824J724114K333427J748745J063084
$$ y = [784563, -3405260, -7792158, -7665711, -1866125, 4709553, 6463719, 3385012, 340384, 1304509, 6107940, 12039792, 16417395, 17506063, 14982115, 10531196, 6964099, 5802172, 6147115, 6357206, 6198843, 6674324, 8159543, 9590420, 9600437, 7909283, 5381558, 3160955, 2080451, 2464971, 3742858, 4344769, 3066764, 1064655, 1394906, 5284271, 9536561, 9557739, 5137273, 1251804, 2192072, 6639274, 10059585, 10443649, 9429385, 8620910, 7662936, 6370311, 6202773, 8159031, 10665632, 11019970, 8261526, 3818430, 179381, -438816, 2540202, 6779404, 8305303, 5693861, 2179350, 1835466, 4307090, 5484631, 3231836, -1255, -869079, 855035, 3188462, 4937207, 6000291]
6170F000291o441j347895j609264l99157O76058N41540M55079J682646K893451
6161H886308J864329j109471l447905l484559j753268N06038K320721K617618
6153F399811Q05411j896680l282920k803198k035198k123454k274595j500663
6145h711486l47982J91806K59074L94251L05057k27980j32950J535474L454930
6136c279806L194529N79970j791929j799711r5853J383935J789225J360362L16107
6127A656829r62891j347136M2914K314010L279612J657293j667672m463300m873145
6118d363486k748034J13354J438652Q80673M39698J615818K909184J826532r61620
6109A150771j813123Q05772L702485L138210o5830j942260r28298P30447J025093
$$ y = [6000291, 5993850, 4645955, 3036691, 2637534, 3313592, 3855132, 4310211, 5992857, 8886308, 10750637, 9641166, 6193261, 2708702, 955434, 1461472, 3782193, 6399811, 7205222, 5308542, 2025622, -777576, -2812774, -4936228, -7210823, -8711486, -9059468, -8867662, -8608588, -8214337, -7909280, -8137260, -8270210, -6734736, -3279806, -85277, 494693, -1297236, -3096947, -3192800, -1808865, -19640, 1340722, 1656829, 693938, -653198, -610284, 1703726, 4983338, 6640631, 4972959, 509659, -4363486, -7111520, -6998166, -5559514, -4678841, -4239143, -2623325, 285859, 2112391, 1150771, -662352, 143420, 3845905, 6984115, 6918285, 4976025, 4047727, 4778174, 5803267]
6100E803267P74581J253493J705330R37454l54724q78393j146476k298150l187070
6091B609312j357079K660725M575424J462501l883455n817710k667889J321910
6083a096261J480484j422550k388470J155066N792012O179899J515901l706603
6075G509478n134397k902352n527J812528K893052L412725K535806J92954j834454
6066H479813j592309Q01035L208285L616451J968942m2841q93805q01874j110290
6057A3633407k233201l041929k629213j715381j480236j799766j740046j220995
6049b227360r45295j008505q15326k23521L21693O12919O46750J54394p15043
6040d199294p98220O02923K232052K510324J988360K100723K132899J98675k903796
$$ y = [5803267, 6577848, 7831341, 9536671, 10474125, 10119401, 9241008, 8094532, 5796382, 2609312, 1252233, 3912958, 8488382, 9950883, 6067428, 249718, -2418171, -1096261, 384223, -1038327, -3426797, -2271731, 3520281, 9700180, 11216081, 7509478, 2375081, -527271, -532798, 1279730, 4172782, 7585507, 10121313, 10314267, 8479813, 6887504, 7688539, 10896824, 14513275, 16482217, 16439376, 15545571, 14743697, 13633407, 11400206, 8358277, 5729064, 4013683, 2533447, 733681, -1006365, -2227360, -3172655, -4181160, -4996486, -5220007, -4898314, -4285395, -3638645, -3484251, -4199294, -4997514, -4394591, -2162539, 347785, 2336145, 4436868, 6569767, 6768442, 3864646]
6031C864646m018783k378668p44915p05912k71918J955700L573128K173624l01438
6022C145464l36811J865269L169738K259890M30307j287717k606813k438380j22903
6013D078044K294805K119778o6038j505873j653167k071104k551013j364837O38911
6004h0494N72664j242355j131982J545517K627406k5654k595730j463640Q87568
5995i06700L34932j907899j743451O65420J537985J75672k61636J333533K270361
5986A498217J089812o8276L95300Q97541R4468m30102P34182J788435M70002k166718
5976D302861l349509k494865j032237M14398K004740K667685R66033k054284l393457
5967a968635j927931L18250J233510J004346O94869L55615j68853n1609J246718
$$ y = [3864646, -154137, -2532805, -3277720, -3983632, -4255550, -2299850, 1273278, 3446902, 3145464, 2808653, 4673922, 7843660, 10103550, 10533857, 9246140, 6639327, 4200947, 4078044, 6372849, 8492627, 8426589, 6920716, 5267549, 3196445, 645432, -719405, -80494, 492170, -750185, -1882167, -336650, 2290756, 2265102, -330628, -1794268, -906700, -571768, -2479667, -4223118, -3557698, -2019713, -1844041, -2105677, -772144, 1498217, 2588029, 2519753, 2915053, 3812594, 3907062, 3476960, 4211142, 5999577, 6469579, 4302861, 953352, -1541513, -2573750, -2159352, -154612, 2513073, 3479106, 1424822, -1968635, -3896566, -3578316, -2344806, -1340460, -645591, -289976, -458829, -510438, 736280]
5958G36280K431165J803855j55663j234048m59990Q18635J023598J39964r82484
5949D121312j765252j644568k2804K356545L058262N74821l201806m728822k908912
5940d161224M9736J798951K108760J652362N63491o89601p08860R05527K213830
5931C732972J326963p31215j537941r85937j037543j878472j212335J649226L745829
5922C071547K512296k39956j046514j03745n76737k943531l682887p50894K802283
5913i58138K989870M82227p96183N98910K454532L128551L606352M435384L599780
5904A9541285l96054n070785o093221k487169K105258L477872J040789k130251
5896I987724k604984J25208L243762L576510R99803j776795k789734k705936k615895
$$ y = [736280, 3167445, 4971300, 4815637, 3581589, 3121599, 3940234, 4963832, 5103796, 4121312, 2356060, 711492, 688688, 3045233, 6103495, 6678316, 3476510, -1252312, -4161224, -4111488, -2312537, -203777, 1448585, 2012076, 1322475, 613615, 1519142, 3732972, 5059935, 4328720, 2790779, 1804842, 767299, -1111173, -2323508, -674282, 3071547, 5583843, 5343887, 4297373, 4193628, 3616891, 673360, -3009527, -3760421, -958138, 2031732, 2513959, 1717776, 2316686, 4771218, 7899769, 11506121, 15941505, 19541285, 19145231, 14074446, 7981225, 5494056, 7599314, 11077186, 12117975, 9987724, 7382740, 7507948, 10751710, 14328220, 15328023, 13551228, 10761494, 8055558, 5439663]
5887E439663j993918m68931K45249j249280k897115j520447K126164L866687J944485
5878E492557q89255j963432k032161k420179k041667J47583K258130K154603J218866
5869A925045J998901L334699J768586k373881m416148j982016J337204J128429
5861B720819j685383k676086l60584K331317K775833J889477J693456J883286
5853H572135P28036j611159k784374j492208O38850J322082O03185K47053P71233
5844F994833Q36597k15606r13145K59693K392308L020979J052639k181914m563720
5835F682664n019448l868161k169053q53572p0583O06599J202110J129987M30712
5826a928745M22974K012152L743446K960006q21818m842576o006566m083796j399026
$$ y = [5439663, 3445745, 2976814, 3222063, 1972783, -924332, -2444779, -318615, 3548072, 5492557, 4603302, 2639870, 607709, -1812470, -3854137, -3706554, -1448424, 706179, 1925045, 3923946, 7258645, 9027231, 6653350, 2237202, 255186, 1592390, 2720819, 1035436, -1640650, -2001234, 330083, 3105916, 4995393, 6688849, 8572135, 9300171, 7689012, 4904638, 3412430, 4051280, 5373362, 5976547, 6223600, 6994833, 7831430, 7615824, 6702679, 6962372, 9354680, 12375659, 13428298, 11246384, 6682664, 1663216, -2204945, -4373998, -5227570, -5298153, -4691554, -3489444, -2359457, -1928745, -1505771, 506381, 4249827, 7209833, 6388015, 1545439, -4461127, -8544923, -9943949]
5817i943949k2751j27188o96114p42740K85899K251049L879312L411565O58305
5808a046612k082023k311888k98658J575276K231027K699377L175648J945057
5800E887204j086697k372266P31587N092219N302768J392383j237691j2757J233708
5791A4930458j231032n048675n494871k319218P64486J636480J232163M34091
5783D903882j031190k679353l036564j654811M64168K324532L271401K537113
5775E099178K83852j587986j556081o05282l40309j89279J016444J927869M46052
5766D494458k052731j963271R42714K824268J463488q11342j245957o10964j123293
5757A917370k720997l415838j995853R30002L459253L435022N07981k545343k478292
$$ y = [-9943949, -9966700, -10093888, -10790002, -11532742, -11246843, -8995794, -5116482, -1704917, -1046612, -3128635, -5440523, -5739181, -4163905, -1932878, 766499, 3942147, 5887204, 4800507, 2428241, 3159828, 8252047, 13554815, 14947198, 13709507, 13696750, 14930458, 13699426, 8650751, 3155880, 836662, 1601148, 3237628, 4469791, 4903882, 3872692, 1193339, -1843225, -3498036, -3033868, -709336, 2562065, 5099178, 5383030, 3795044, 2238963, 1633681, 1293372, 1104093, 2120537, 4048406, 4494458, 2441727, 478456, 1421170, 4245438, 5708926, 4897584, 3651627, 3040663, 1917370, -803627, -4219465, -6215318, -5285316, -1826063, 1608959, 2116940, -428403, -2906695]
5748b906695K63183K298411K249819J895285K029150R71204j424026k153102J89884
5739C413113K457088J572409q72532j751829j323176j393766j021377J671525
5731B751455M918640M934756J524243j818054l047353l098019k511695m82224
5723C171749K245907L114056J357678r84368k345412l092077l165343j444896
5715a142706J460901K827577J677617L42460O41170J168814K73823p62707R1678
5706F578627K133785L050365K193117N60198j246798k841108k935638q22834J674915
5697H344629K006489K68822j269765j586575j581734j559776o15137J005299J375676
5688F387928j69120j545436q34112P87763P07787j402299l183396k605415p2594
$$ y = [-2906695, -2643512, -345101, 1904718, 3800003, 5829153, 6800357, 5376331, 3223229, 3413113, 5870201, 7442610, 6570078, 4818249, 3495073, 2101307, 1079930, 2751455, 7670095, 12604851, 14129094, 12311040, 9263687, 6165668, 3653973, 3171749, 5417656, 8531712, 9889390, 8905022, 6559610, 3467533, 302190, -1142706, 318195, 3145772, 4823389, 5165849, 5807019, 6975833, 7249656, 6486949, 6578627, 8712412, 11762777, 13955894, 14516092, 13269294, 10428186, 7492548, 6669714, 8344629, 10351118, 10619940, 9350175, 7763600, 6181866, 4622090, 4006953, 5012252, 6387928, 6218808, 4673372, 3839260, 4627023, 5334810, 3932511, 749115, -1856300, -1928894]
5679a928894K414305L165195J882497k66119j550646j279922m63693l57586p09968
5670I05169l37895Q52295J645064J352740N72844j64427j075299j842705j230484
5661F77302Q13627K047693O96796j590662j684489M68624J598999j62474k644408
5652B21008k964364j588969j061155j727534j213247J564243L991319K866792
5644H8093j026455l366406j671252J400992J560041j268076k852560n80570L043369
5635d672824M201167K886853J880937K086145J896103P29461P0481N29654N72574
5626A0180551q71625k673278l286375k413310k53763K800683M987040M058883
5618A2528806N12703k289844k451608j705582j950915k290793j454338n65596
$$ y = [-1928894, 485411, 3650606, 5533103, 5266984, 3716338, 2436416, 1972723, 1615137, 905169, 567274, 1419569, 3064633, 4417373, 4990217, 4825790, 3750491, 1907786, 677302, 1490929, 3538622, 4235418, 2644756, 960267, 1428891, 3027890, 2865416, 221008, -2743356, -4332325, -5393480, -7121014, -8334261, -6770018, -2778699, 88093, -938362, -4304768, -5976020, -4575028, -3014987, -4283063, -7135623, -7716193, -4672824, -471657, 2415196, 4296133, 6382278, 8278381, 9007842, 9078323, 9607977, 10180551, 9308926, 6635648, 3349273, 935963, 682200, 3482883, 8469923, 12528806, 13041509, 10751665, 8300057, 6594475, 4643560, 2352767, 898429, 332833]
5610C32833r41705j290284Q9690K062873K428179J368681L35938q54583k674006
5601H57616l219813o03638L043705L817195J735534L65911J041006J430659P7897
5592H546072j559075k212899k318084j762148K10138K096215J047542k179149
5584A868612l195583n02887J998058J114126j043431j301928m37169n12712n94430
5575b607344Q37826J923795L22980j897797r47680K355828L706220K233450J424521
5566G351799K726850L048373K33065l087556l576358k041566j378092j794655
5558A481860j157706R34376K355556J818899P60497J023308K082786J815585m20227
5549A0694934k668812k760109j074858m605q15380k146059j997580k31627J599612
$$ y = [332833, -608872, -1899156, -1809466, 253407, 2681586, 4050267, 4386205, 3531622, 857616, -2362197, -2965835, 77870, 3895065, 5630599, 5996510, 7037516, 8468175, 8546072, 6986997, 4774098, 2456014, 693866, 904004, 3000219, 4047761, 1868612, -1326971, -1829858, 168200, 1282326, 238895, -1063033, -1500202, -2012914, -2607344, -1769518, 154277, 477257, -1420540, -2368220, -12392, 3693828, 5927278, 7351799, 10078649, 13127022, 13360087, 10272531, 6696173, 4654607, 3276515, 1481860, 324154, 1258530, 3614086, 5432985, 6193482, 7216790, 9299576, 11115161, 10694934, 8026122, 5266013, 4191155, 4186550, 3371170, 1225111, -772469, -1004096, 595516]
5540E95516K140986J180032o22885k111030k268157j230802j68505L39784Q90003
5531a255058J570097J083787j101133k993318k346824J54786K010524K517764
5523c59375K902885L209014J927434p68787k248966j195251K20472k59350j314416
5514B113660j30424K971833M556282K657208p39525k352980j342790L53648O26347
5505H713259n77811j465099n74685J360569K115986P02236j331154j938125j150919
5496E854257n16506n48558k97966O51507J524858K066648L035652M057530K914133
5487A8741555j259728n590662o663593n156508m431747m880404l238445J549719
5479a0929813N466079M863734J917586J247094K969868L154769N10676j705880
$$ y = [595516, 2736502, 3916534, 3293649, 1182619, -1085538, -2316340, -2484845, -2145061, -1255058, 315039, 1398826, 297693, -2695625, -5042449, -4887663, -2877139, -359375, 2543510, 5752524, 7679958, 6911171, 4662205, 3466954, 3687426, 3428076, 2113660, 1983236, 4955069, 9511351, 12168559, 11429034, 9076054, 7733264, 8086912, 8713259, 8135448, 6670349, 6095664, 7456233, 9572219, 10274455, 8943301, 7005176, 5854257, 5337751, 4789193, 4491227, 5142734, 6667592, 8734240, 11769892, 15827422, 18741555, 17481827, 11891165, 5227572, 71064, -4360683, -9241087, -12479532, -10929813, -5463734, -600000, 1317586, 2564680, 5534548, 8689317, 9199993, 7494113]
5471G494113j184180l7587r56737k959135l410992k137940r25416k99494O70648
5462c746720K072425K842092K468990J374519j9797j214329j294272k11842L47298
5453B618364q51580k304586j799840j05165P1374j241628p76229K738200N715391
5444D064301M250934l29694k994315j325955J953729K775080K31432l130176m269843
5435A225493k306041J048728L128585K639601O02013j002809j225008n56920Q6502
5426C640144J04123o88855j763086j800277O2848K732854L821543K177415r33035
5417G353674l362069l944104k677600l31681J524379J438968j205m78831O62037
5408A83568J008486j015076k648096m31367L690483M131915j02454l443551j786214
$$ y = [7494113, 6309933, 6272346, 5315609, 2356474, -1054518, -3192458, -4117874, -4417368, -3746720, -1674295, 1167797, 3636787, 5011306, 4991509, 3777180, 2482908, 2271066, 2618364, 1766784, -537802, -2337642, -2442807, -2371433, -3613061, -4389290, -1651090, 4064301, 8315235, 7985541, 4991226, 3665271, 5619000, 8394080, 8625512, 5495336, 1225493, -1080548, -31820, 3096765, 5736366, 6338379, 5335570, 4110562, 3553642, 3640144, 3744267, 3055412, 1292326, -507951, -445103, 2287751, 6109294, 8286709, 7353674, 3991605, 47501, -2630099, -2961780, -1437401, 1567, 362, -478469, 183568, 1192054, 176978, -2471118, -2902485, 787998, 4919913, 4817459, 1373908, -412306]
5399d12306J768677K241805J67846n44312M73138K45956j619877k208145n08140
5390c95358J102641J213191J194114J727201J316221m45896j612607j346139j340427
5381A412941k237804j996201K60890K068979J615141Q45932J983549L750283L877013
5372A1580723K750525J575804m77120l824147n543158k952869J515493L101857
5364G727108J214212q45952j573664k210283k492726l44619L455238M751316J789662
5355A1470292j997714k765063r09700P90122J114473N59412l87854j223684j137641
5346E512643k39093J87968k67933l01426Q47552J864411J372877O3823n90389
5337H450433n93937r92562k070553l281196m254262m651639l609725o17279L171558
$$ y = [-412306, 1356371, 3598176, 3766022, 3221710, 3694848, 3940804, 2320927, 112782, -395358, 707283, 1920474, 3114588, 4841789, 6158010, 5712114, 4099507, 2753368, 1412941, -824863, -2821064, -2560174, -491195, 1123946, 1969878, 3953427, 7703710, 11580723, 14331248, 15907052, 15429932, 11605785, 6062627, 3109758, 4625251, 7727108, 8941320, 8095368, 6521704, 4311421, 1818695, 1474076, 4929314, 9680630, 11470292, 9472578, 6707515, 5797815, 6587937, 7702410, 8261822, 7873968, 6650284, 5512643, 5273550, 5461518, 5193585, 4892159, 5739711, 7604122, 8976999, 9040822, 8450433, 7856496, 6863934, 4793381, 1512185, -2742077, -7393716, -11003441, -11620720, -8449162]
5328h449162N426368M594256J136820k834166m838446l499706M25754M270563
5320c767719N108518J913274l276807o537591n394024j301558K015934K799332
5312h440641K477878K438569J804061k05561j839526j052060J240053K553868
5304a023359K401653J992063J431000M7536j246309r89810j58430r36180k655185
5295a137021k368924K18467J914157J013344k38812M48440K057632K586067K194320
5286F687670K045245J908816Q55821q92920k217948k326412j147513L58701L07748
5277E579208j918379l776907k333520J054294J883343j082260l809442k612194
5269g015857J270709M203597M494585K709411K65037r15781O9220R40621j295723
$$ y = [-8449162, -3022794, 1571462, 2708282, -125884, -4964330, -8464036, -8038282, -3767719, 1340799, 3254073, -22734, -6560325, -11954349, -13255907, -11239973, -8440641, -5962763, -3524194, -1720133, -1925694, -3765220, -4817280, -3577227, -1023359, 1378294, 3370357, 4801357, 4848893, 3602584, 2612774, 2454344, 1518164, -1137021, -3505945, -3287478, -1373321, -359977, -598789, -150349, 1907283, 4493350, 6687670, 8732915, 10641731, 11497552, 10604632, 8386684, 6060272, 4912759, 5271460, 5579208, 3660829, -116078, -2449598, -1395304, 488039, -594221, -4403663, -7015857, -5745148, -1541551, 2953034, 5662445, 5927482, 5011701, 5080921, 6021542, 4725819]
5260D725819m922753m722862j17115K850362M51945k845941j560092K362463L546018
5251b32156J866950J016968J110526n62451k839820j641792K438362L992898J191361
5242F340846j633493j436888r25398k955836n228926m062408j72850K754873L163545
5233d156535K362431J630236J104836P70168O95933O93026O96516Q93713J037443
5224E727767O03061j02693j92341K54240K40009m39951j033108j419366k168634
5215A468984k902059k427047p57476P57562J468326J756499J377445k82119k126278
5206a666163k035132j45531J071308P32192Q96881K887973M857391M614805K667950
5197A3881674P33944p79427j959454j892869j48485J543939J225086n06480j488652
$$ y = [4725819, -196934, -4919796, -5036911, -2186549, -1734604, -4580545, -6140637, -3778174, -232156, 1634794, 2651762, 3762288, 3199837, 360017, -1281775, 1156587, 5149485, 6340846, 4707353, 3270465, 2345067, -610769, -5839695, -9902103, -10074953, -7320080, -4156535, -1794104, -163868, 940968, 1711136, 2407069, 3100095, 3796611, 4690324, 5727767, 6330828, 6228135, 6035794, 6290034, 6530043, 6090092, 5056984, 3637618, 1468984, -1433075, -3860122, -4617598, -3860036, -2391710, -635211, 742234, 460115, -1666163, -3701295, -3846826, -2775518, -2043326, -1146445, 1741528, 6598919, 11213724, 13881674, 14615618, 13836191, 11876737, 9983868, 9835383, 11379322, 12604408, 12097928, 10609276]
5188A0609276j150813r32474j826135k977224k881116j209897O42537P62848j114443
5179g7441k860381k310071m3683J609504J914114J902981J406660j005291m330335
5170c793943m778322j079485K799480K868415N40528k58649P56180Q26265m16854
5161b536385m43740J322426K232207Q57716p76315p50259r265R4867K72988J183616
5151A447856J231210p92470k547200q10789L357977N327515L093983r4719m37367
5142I775996J491358K353880R37602r13165j576028j465723j343814r42192k41499
5133H076415m79868k337353m002111k834694R99640L995067L065647q83447l872944
5124A726352l119138K61959K987294L375391K443120J386934k85452k808505l873338
$$ y = [10609276, 9458463, 8525989, 6699854, 3722630, 841514, -368383, 274154, 1037002, -77441, -2937822, -5247893, -5291576, -3682072, -1767958, 135023, 1541683, 536392, -3793943, -8572265, -9651750, -6852270, -3983855, -3443327, -3701976, -2945796, -2119531, -2536385, -2980125, -1657699, 574508, 1432224, 655909, -94350, -103615, -8748, 264240, 1447856, 2679066, 1886596, -660604, -1471393, 1886584, 7214099, 10308082, 10213363, 9775996, 11267354, 13621234, 14558836, 13645671, 12069643, 10603920, 9260106, 8317914, 8076415, 7596547, 5259194, 1257083, -1577611, -577971, 3417096, 6482743, 5599296, 1726352, -1392786, -1130827, 1856467, 5231858, 7674978, 9061912, 8776460, 5967955, 2094617]
5115B094617j068394L578138M759143Q56235l198138k303459J978693M031554
5107A0728389J862989j530250l575992m665397m937762k803903J510685M326281
5099I15040K986100k66576j426115q7826R01160K254j505798k172414k061359
5090b715534j578225n92271P25184J618636J856169K021552K240106J682840N7243
5081E315700j228641m64732J891724L076544R89776k917674m575696j684813L312970
5072C715158N629067L458125k35412j672224p00387m5812r53618j534752J05428
5063G765573K697679L126018L11386l583848n808539n605196l785968j086443
5055e969338J935243M155813M461257K993594R07335q86289j898623j629855l16930
$$ y = [2094617, 1026223, 4604361, 9363504, 10219739, 7021601, 4718142, 6696835, 10728389, 12591378, 11061128, 7485136, 2819739, -2118023, -4921926, -3411241, 915040, 3901140, 3634564, 2208449, 2120623, 3021783, 3024037, 1518239, -654175, -2715534, -4293759, -4886030, -4160846, -2542210, -686041, 1335511, 3575617, 5258457, 5315700, 4087059, 3622327, 5514051, 8590595, 9580371, 6662697, 2087001, 402188, 3715158, 9344225, 12802350, 12566938, 10894714, 10194327, 10148515, 9194897, 7660145, 7765573, 10463252, 13589270, 13900656, 10316808, 4508269, -1096927, -4882895, -5969338, -4034095, 121718, 4582975, 7576569, 8483904, 7597615, 5698992, 4069137, 3752207]
5046C752207M40286m63010j599715r57101M90656M5072j798121j367800K057744
5037F00218M078293J606863k078925k211116M54285J719989Q46071M79063R14633
5028F409374k35065k620501k681062J83440J757394m78141l034707j622338K314365
5019g241L710946R17477k591773l108422p98943J469317J913844J531542K098181
5010E134928L164674K360924q12254l330393k568868k62740J63052r78449m15625
5001B455249K281317L732924K292923O23783J084436J989901Q34008j398768j843805
4992A2051968p5382J545365R71724j666745m495381n156263k691149R94330K724177
4983D202644J765873N58797J119947K401026K202699K75932j618235j882652o49545
$$ y = [3752207, 4192493, 3729483, 2129768, 1172667, 1663323, 1708395, -89726, -1457526, 600218, 4678511, 6285374, 4206449, 1995333, 2449618, 4169607, 5015678, 5494741, 6409374, 6174309, 3553808, 872746, 1056186, 2813580, 2335439, -699268, -2321606, -7241, 3703705, 4621182, 2029409, -1079013, -1877956, -408639, 1505205, 3036747, 5134928, 8299602, 10660526, 9848272, 6517879, 3949011, 3686271, 3849323, 2870874, 2455249, 4736566, 8469490, 10762413, 11386196, 12470632, 14460533, 15294541, 13895773, 12051968, 11976586, 13521951, 14493675, 12826930, 8331549, 3175286, 484137, 1478467, 4202644, 5968517, 6527314, 7647261, 10048287, 12250986, 12526918, 10908683, 9026031, 8376486]
4974H376486K87733p37390k825397k862399K43959L183410K555030K9505k91259
4965G959678J468309J392290j360924l050690j622248K24237p3899j197414j164721
4956B574618n42633k38169N07822J689528J290458j198746k854198j230763K110611
4947B108528L853866K682502l37963k909269k548182Q24018L362875J689721j760147
4938F965949k184115m00360j363291m806339m787379K3281L480839K148026M64222
4929d59167J906093K834627K31873j806940N99465L820870L214507J013838J085553
4920A2440719J458002q51086k813019o89507K321872J374711j336258r21524J058409
4911A2042319j77558l453978l662952o03470J448857R81011j64003j005316q81821
$$ y = [8376486, 8664219, 7926829, 5101432, 2239033, 2482992, 5666402, 8221432, 8250937, 7959678, 9427987, 10820277, 9459353, 6408663, 4786415, 5010652, 4936753, 3739339, 2574618, 2031985, 1793816, 2301638, 3991166, 5281624, 4082878, 1228680, -2083, 2108528, 5962394, 8644896, 8306933, 5397664, 2849482, 3673500, 7036375, 8726096, 6965949, 4781834, 4381474, 3018183, -1788156, -6575535, -6552254, -3071415, -923389, -459167, 1446926, 4281553, 4513426, 2706486, 3305951, 7126821, 10341328, 11355166, 12440719, 13898721, 13047635, 10234616, 9545109, 11866981, 13241692, 11905434, 10983910, 12042319, 11864761, 8410783, 4747831, 4144361, 5593218, 6574229, 6410226, 5404910, 4523089]
4902D523089J892990N878432N703537M57377l178897j633126n33794l508435m273382
4893E327791J341369N540764J676523k875199L94771N549587L834978L70896L006669
4884B4168149N521547M71704l030440L992048Q918208q37167q547582N886733
4876C6543200K3882716J6130942M339522L7055605R6226573R4017716m416425
4869C03779849j12538896j27089087n9118631k335464l92012j3078043l789519
4862a4561803R521643L627230p052493k772972O129393K966724m745585k942164
4854i830027K686483L12825n284933l665320J433376J179949j050424K102927
4846a2115144O343370L545855k876444m165544q46754J037320J748252M444294
$$ y = [4523089, 6416079, 12294511, 17998048, 18455425, 15276528, 13643402, 13109608, 9601173, 5327791, 6669160, 12209924, 13886447, 11011248, 11406019, 16955606, 20790584, 21161480, 24168149, 29689696, 30161400, 27130960, 31123008, 40041216, 39204049, 30656467, 36543200, 60425916, 76556858, 80896380, 117951985, 214178558, 308196274, 303779849, 191240953, 64151866, 5033235, 2697771, 2305759, -10772284, -14561803, -5040160, -1412930, -8465423, -11238395, -5109002, -2142278, -6887863, -9830027, -7143544, -6830719, -12115652, -15780972, -14347596, -13167647, -14218071, -12115144, -5771774, -2225919, -5102363, -9267907, -10114661, -9077341, -7329089, -2884795]
4838b884795O016159K347158k437238k091473J130685J304953m65790O14822L305046
4829F839527K970067M20840l10640R7204j588440l931758l206348n09105L18161
4820A099508n12351k99897K96312q97236k248925p89276K038093K518553O29499
4811A834280r71902j769818k684995k890938j608830o29316j181908j201461O03716
4802a0501172J563276m7087r29837J759890M848122M169468J401781M44910N24195
4793C233546j221675l290106k092398J417878L056392J799373M4323q57412j079066
4784A010855k92899J027036P24623j165442r96725K392135M339044J486563k309007
4775F216183k303129l79081m28391j061421L57778J101767j819061m160768n38705
$$ y = [-2884795, 3131364, 5478522, 3041284, 949811, 2080496, 3385449, 2919659, 3534481, 6839527, 9809594, 10230434, 9919794, 10016998, 8428558, 4496800, 1290452, 781347, 1099508, 587157, 287260, 583572, -313664, -2562589, -3351865, -1313772, 1204781, 1834280, 862378, -907440, -3592435, -6483373, -8092203, -8721519, -9903427, -11104888, -10501172, -8937896, -8984983, -9914820, -8154930, -3306808, 862660, 2264441, 2709351, 3233546, 2011871, -1278235, -3370633, -1952755, 1103637, 2903010, 2947333, 2089921, 1010855, 717956, 1744992, 2469615, 1304173, 307448, 2699583, 7038627, 8525190, 6216183, 3913054, 3533973, 3105582, 2044161, 2401939, 3503706, 1684645, -2476123, -3014828]
4766c014828N419489N926589J287906j832462j978015k977617m265162j655139
4758c089239K787494K373863k208090l190353O96446J943589j916785l441898
4750f044973J372688N447461K507062k477321k017548K064410L253674J101898
4742E207351l16967n20115j865766l541409k847812o06630J92122m45037l77070
4733e121333K75416q6855q50323k64874J049699J186269L73103L16848J350805
4724a771245K672753L810525L782293J129456k935473m257246j398232J459519
4716B492350N77574j561765p39311J619545Q28840k936409m539224j790756J595826
4707d453330J937834M17621M28645K934186O006101P224807N574555K153925o62258
$$ y = [-3014828, 2404661, 8331250, 9619156, 7786694, 5808679, 2831062, -1434100, -3089239, -301745, 2072118, -135972, -3326325, -2629879, -686290, -2603075, -6044973, -4672285, 775176, 3282238, 804917, -1212631, 851779, 4105453, 5207351, 4890384, 4370269, 2504503, -1036906, -3884718, -4491348, -4299226, -4744263, -5121333, -4845917, -4932772, -5783095, -6047969, -4998270, -3812001, -3438898, -3122050, -1771245, 901508, 4712033, 8494326, 9623782, 6688309, 2431063, 1032831, 2492350, 3069924, 1508159, 768848, 2388393, 3217233, 280824, -4258400, -6049156, -4453330, -2515496, -2097875, -1669230, 1264956, 7271057, 14495864, 20070419, 22224344, 21562086]
4698B1562086j700735k225537l566343m527946l125313k10106J014157q35173
4690F385090l615052m450223k690732K18309K508211L304689K915227K244258
4682F819777J735813J229420R18765J371918K103911J490743q87856l030878k866725
4673H884888q65457Q31039R74864j16905j451565j908790r46860L40078J17774
4664E859066j424677j916315m93069M86063q25124k442357j499260J100365J925679
4655G70371M0592k082784k315584r35376R69420K746812L641701L081466J813348
4646G729966J122945Q76052o6793j615036k403279k002428j427607j269887r46145
4637b212q5794P50527J006897O40527l10515j536412k058375j304352k66998j72408
$$ y = [21562086, 19861351, 17635814, 14069471, 9541525, 6416212, 6206106, 7220263, 6385090, 2770038, -1680185, -4370917, -4152608, -1644397, 1660292, 4575519, 6819777, 8555590, 9785010, 10703775, 12075693, 14179604, 15670347, 14782491, 11751613, 8884888, 8019431, 8850470, 9825334, 9708429, 8256864, 6348074, 5401214, 5741292, 5859066, 4434389, 2518074, 2025005, 2511068, 1685944, -756413, -2255673, -1155308, 770371, 810963, -1271821, -3587405, -4522781, -3553361, -806549, 2835152, 5916618, 7729966, 8852911, 9728963, 9662170, 8047134, 5643855, 3641427, 2213820, 943933, -2212, -88006, 662521, 1669418, 2309945, 1999430, 463018, -1595357, -2899709, -3166707, -3339115]
4627c339115m41906K56011J294481O58780j595190k732299r79412K092544L827387
4618i58719L599015K574304J606624O29138n14225j627631k296999k080507r97140
4609f6140P1330J78606l82144m15196M34665J268549J421642J182798O57246p52406
4599C598950k882750l951795k438541O83238K776627K515620J059252J52028J3377
4590A526006k86834j000141j338884j026948j054918k038915k661739j161923
4582i044296J893899L918204L566083K109448J154997P40365M29011M10795L78079
4573E556585p65827k591530k607838q9566J661631k56451l381816k922628J255197
4564d142243M628999M704782L478345K739917J367942j079734k181457o54942
$$ y = [-3339115, -3781021, -3525010, -2230529, -1571749, -3166939, -5899238, -6878650, -4786106, -958719, 2640296, 5214600, 6821224, 7450362, 6936137, 5308506, 3011507, 931000, -66140, 5190, 183796, -198348, -613544, -178879, 1089670, 2511312, 3694110, 4351356, 3598950, 716200, -3235595, -5674136, -4990898, -2214271, 301349, 1360601, 1512629, 1526006, 1239172, 239031, -1099853, -2126801, -3181719, -5220634, -7882373, -9044296, -7150397, -3232193, 333890, 2443338, 3598335, 4338700, 4767711, 5178506, 5556585, 4790758, 2199228, -408610, -498176, 1163455, 907004, -2474812, -5397440, -4142243, 486756, 5191538, 8669883, 11409800, 12777742, 11698008, 9516551, 8861609]
4556H861609P43751o54586k995611k838466n37141P66554K16747j83081N21008
4547C900784J027369N11562k38010p48442j574286k650710k921954k044774q14373
4538e552834L28208J635398K807186K992447K118711P99870q30231k602190l219270
4529a522705j830933j63416m03861j301721K90691L814424M916667K137634n31379
4520E405401j10162M75349k317524n852531m811872L34282L717449K631891O35693
4511A07976J243033L096895L319305K008663R71755N96441L10371J63055n6568
4502A1760926j410181l563896l861585r44047K329951K208607p87568k727799
4494C004408j762395q9347k98927k012471k850572j353977J630257L778947L530601
$$ y = [8861609, 9605360, 8950774, 5955163, 3116697, 2579556, 3346110, 3562857, 3379776, 3900784, 4928153, 5439715, 5201705, 4453263, 2878977, 228267, -2693687, -4738461, -5552834, -5224626, -3589228, -782042, 2210405, 4329116, 5128986, 4298755, 1696565, -1522705, -3353638, -3517054, -3920915, -5222636, -4931945, -1117521, 3799146, 5936780, 5405401, 5295239, 5770588, 3453064, -2399467, -7211339, -6877057, -3159608, -527717, 107976, 1351009, 4447904, 7767209, 9775872, 10747627, 11344068, 11654439, 11817494, 11760926, 10350745, 6786849, 2925264, 1981217, 4311168, 6519775, 5732207, 3004408, 1242013, 1152666, 853739, -1158732, -4009304, -5363281, -3733024, 45923, 3576524]
4485C576524J958941J664108L078136L261351q4859m791726o698765n019149k535967
4476e591406r36536Q84110L476714M947246L796641J328154l06896o94637m44321
4467F459069L75546J503003J604786j18143k311619k921518j661008N7854R69233
4458C957203P98118M6007j97259Q99326K439980K280638m6078k105799j540335
4449F531801Q49581K443714K146658O90698j409080l980151n628215m393601n11819
4440c260414L144913M109061K721041J004938J57297j78617p43408j435682j306232
4431D212897K07174K134233K711558J570918K95322J29106K03161q09122k333639
4422H321608k922028k872357l578577m433809k996301R37666L813781K604251
$$ y = [3576524, 5535465, 7199573, 10277709, 13539060, 13454201, 8662475, 1963710, -3055439, -5591406, -6527942, -5643832, -2167118, 2780128, 6576769, 7904923, 7598027, 6903390, 6459069, 6834615, 8337618, 9942404, 9824261, 7512642, 4591124, 2930116, 2987970, 3957203, 4755321, 4801328, 4604069, 5503395, 7943375, 10224013, 10177935, 8072136, 6531801, 7381382, 9825096, 11971754, 12662452, 11253372, 7273221, 1645006, -2748595, -3260414, -115501, 3993560, 6714601, 7719539, 7876836, 7698219, 6954811, 5519129, 4212897, 4420071, 6554304, 9265862, 10836780, 11132102, 11261208, 11464369, 10655247, 8321608, 5399580, 2527223, -1051354, -5485163, -8481464, -7543798, -3730017, -1125766]
4414a125766r54937k464686l98588K548565L466467K467562J296163N19627m44394
4405D910013j499443j830426j525635j589906j997503j351266O49571K003316
4397b231279J243883J41296J186701L073863J797360l176105o921525n037914
4389i923720O76313M797729M850155K758344R27954j50337o13563l26925J74187
4380C170137r9057q61566p79574J33891J84013j226576k227412j015086J488781
4371a232449K682879J269553j599157l564309l003277m53165J618556J322632
4363b958737k59234m10365J316952K263208N25151k090402k469843l35964J754813
4354b664421J936584Q96846L37920Q75428J627084J193426q31627k915861k807860
$$ y = [-1125766, -2080703, -4545389, -4943977, -2395412, 1071055, 3538617, 4834780, 5354407, 4910013, 3410570, 1580144, 54509, -1535397, -3532900, -4884166, -4234595, -2231279, -987396, -846100, 340601, 3414464, 5211824, 2035719, -4885806, -9923720, -9247407, -4449678, 400477, 3158821, 4086775, 3936438, 3322875, 2995950, 3170137, 3071080, 2209514, 1429940, 1563831, 1747844, 521268, -1706144, -2721230, -1232449, 1450430, 2719983, 1120826, -2443483, -5446760, -5899925, -4281369, -2958737, -3217971, -3628336, -2311384, -48176, 476975, -1613427, -4083270, -4419234, -2664421, -727837, 169009, 506929, 1382357, 3009441, 4202867, 3371240, 455379, -2352481]
4345b352481l40230J950186K040315J113676J358698K112591P91826k451948l956707
4336B65926j532600K259945L650381K555666J556598J320572J19419k229874l117757
4327D848276j074130J436473J138779j536515l222929k260844l86891K76787j29239
4318i10233l46045k07750m27034j005283j122304l47882R56237K277291L183852
4309B050849L022088J272223j522745l779500m208646k890844q88978Q61995K020537
4300d063021K521822K362872J854778J650503K008966K144340R88932j160290
4292H308902k507909j910450m87733o1136m95902r9127J405088K170100J195287
4283G517120J97285J032709K535150J897299j279062m246853m543566k549757
$$ y = [-2352481, -2692711, -742525, 1297790, 2411466, 3770164, 5882755, 6674581, 4222633, 265926, -1266674, 993271, 4643652, 7199318, 8755916, 10076488, 10195907, 7966033, 4848276, 3774146, 5210619, 6349398, 4812883, 1589954, -670890, -1057781, -780994, -910233, -1256278, -1464028, -1891062, -2896345, -4018649, -4366531, -3410294, -1133003, 2050849, 5072937, 6345160, 4822415, 1042915, -3165731, -6056575, -6945553, -6083558, -4063021, -1541199, 821673, 2676451, 4326954, 6335920, 8480260, 9469192, 8308902, 5800993, 3890543, 3402810, 3341674, 2845772, 2746645, 4151733, 6321833, 7517120, 7714405, 8747114, 11282264, 13179563, 11900501, 7653648, 3110082, 560325]
4275E60325k57758J077146J386991J010688L15753m87919j616173l142883l965067
4266e118897k540814O27864K585501J449774n96592J24613L476893N205862K767197
4257G981401q63388j168162J716097L520678K008098n02816j390512j416142k278511
4248G606743k986810j600033P62487R35667j464513l287933k465266o02945J44926
4239b957677K78708J215490K245409J562030n01461j427578K45111L056666M282334
4230G999032K691501m76096k853167l196866k321258j620662j125466Q8629J920494
4221A106141L113623L147078K648534J656198o22497l565872m633925k508013
4213C41267P53685K193283J422312K09097k86804k72173m7434M91380J275761
$$ y = [560325, 302567, 1379713, 2766704, 3777392, 4093145, 3605226, 1989053, -1153830, -5118897, -7659711, -7031847, -4446346, -2996572, -3593164, -3468551, 8342, 5214204, 7981401, 7118013, 5949851, 7665948, 11186626, 13194724, 12691908, 11301396, 9885254, 7606743, 4619933, 3019900, 3782387, 4718054, 3253541, -34392, -2499658, -3102603, -2957677, -2678969, -1463479, 781930, 2343960, 1842499, 414921, 660032, 3716698, 7999032, 10690533, 10214437, 7361270, 4164404, 1843146, 222484, -902982, -814353, 1106141, 4219764, 7366842, 10015376, 11671574, 11049077, 7483205, 2849280, 341267, 1094952, 3288235, 4710547, 4919644, 4632840, 4360667, 4313233, 4804613, 6080374]
4204F080374J848454J529496k49049k880285m115780k444619J31059K25831j697578
4195a572097j531303J859064M023872J422470k995727m191620k121755k97302
4187e404398M66129K058419M018000L433269M4609k713692k433592k55843J721814
4178I34715K595565J979672N5721j454129r85127J95727l94519k428523l177793
4169b678691j682487M27718K031997L386499M047423K975687P32885j043904j953854
4160F243273k247896j264642P26243J191563o02066r88017J988003L418421r18890
4151G545992n555210k915500L069494K862105k02596P461057K4917337L0823998
4143F8006677J2125099j4662938k4227269j4911549n266275m741399n222866m04760
$$ y = [6080374, 7928828, 9458324, 9209275, 6328990, 2213210, -231409, -100350, 125481, -1572097, -3103400, -1244336, 2779536, 4202006, 1206279, -2985341, -5107096, -5404398, -4938269, -2879850, 1138150, 4571419, 4616028, 1902336, -531256, -787099, 934715, 3530280, 5509952, 5565673, 4111544, 3126417, 3322144, 2927625, 499102, -2678691, -4361178, -3933460, -1901463, 1485036, 5532459, 8508146, 9241031, 8197127, 6243273, 3995377, 2730735, 3456978, 4648541, 4046475, 3058458, 5046461, 8464882, 7545992, 1990782, -924718, 2144776, 5006881, 4804285, 12265342, 37182679, 68006677, 80131776, 65468838, 41241569, 26330020, 21063745, 16322346, 11099480, 10694720]
4135A0694720L640466J361489k394930j915336j35672j774977m402975l316100
4127A756685l4839O94697j083435j432744O09126K059382R64513j429156l085137
4118i80908l108633j571985P30072K528410L058081K470396J180164k53252q68292
4109C184053m06560k56663j411388k100172l839L570221M784893K661499K01601
4100A0223645m04350m63305j580324k698932j970453M12219K538612K579541q3872
4091H552781l886404n406067k836885J137898K442576J057451K13578O74609J1222
4082A960759k095141k516276j70567J540273J75110j658744n85833K234938L270753
4073B155272J830076O3464o50548o06046k19792J29458l85632j873268k910763
$$ y = [10694720, 14335186, 15696675, 13301745, 11386409, 11250737, 9475760, 5072785, 1756685, 1721846, 2416543, 1333108, -99636, 509490, 2568872, 3533385, 2104229, -980908, -4089541, -5661526, -4931454, -2403044, 655037, 3125433, 4305597, 4052345, 3184053, 2777493, 2520830, 1109442, -990730, -994569, 2575652, 7360545, 10022044, 10223645, 9819295, 9355990, 7775666, 5076734, 3106281, 3518500, 6057112, 8636653, 8552781, 4666377, -739690, -3576575, -2438677, 3899, 1061350, 1274928, 1949537, 1960759, -134382, -2650658, -2821225, -1280952, -1105842, -2764586, -3350419, -1115481, 2155272, 3985348, 4048812, 3398264, 2792218, 2572426, 2701884, 2316252, 442984, -2467779]
4064b467779k286931o26168P78074J623363K170998K315341J805077M03041k127824
4055A587192m709872m363365L04833N456495N559949Q92879k557268j546914O21992
4046A245921M33485n95556L8674R41459j29635j782788j611138m70098j93464
4037b123140L03969K487116M177429K532734q69371k404150k177110k791803l809365
4028d673691k545873L46731J308727j19091p14076N17660P86235r86882j861880
4019g942140k4206J911125J308450j12346P46488L377327M645906L358931J192459
4010H461994l14675j470875l024569m501426m541852k549789L49339K304131K649928
4001b637794K134611J213454m03835j888373j053699K313061M796312L498231
$$ y = [-2467779, -4754710, -5380878, -4602804, -2979441, -808443, 1506898, 3311975, 3715016, 1587192, -3122680, -7486045, -7181212, -1724717, 3835232, 4728111, 2170843, 623929, 1245921, 1679406, 1083850, 1122524, 2063983, 1934348, 151560, -1459578, -1929676, -2123140, -1819171, 667945, 4845374, 7378108, 6508737, 4104587, 1927477, -864326, -4673691, -7219564, -6872833, -5564106, -5683197, -6397273, -5879613, -5093378, -6080260, -7942140, -7966346, -6055221, -4746771, -4859117, -4112629, -735302, 3910604, 7269535, 8461994, 8147319, 6676444, 3651875, -849551, -5391403, -7941192, -7591853, -5287722, -2637794, -503183, 710271, 306436, -1581937, -2635636, -322575, 4473737, 7971968]
3993G971968L11745q95520j16947o12607l039250m251388k519676j26650O07760
3984b670565O15368J574716K812622K809699J811938R53986L05959m52925p64848
3975F995950l06543k52996j712480l608673l661399j222352J888805L249867K058543
3966C428722k12924j219550j94791J246107J387332P20709O24327O71608m43173
3957F008367j783422r76087J511997K121195n77634l473662l575287k205963k013527
3948d964023k327588q97742J359288J245191j405212k910828r70240K173247L022598
3939e675309J140802j215702k157936j337010Q02605L236878M264368K779068
3931A837764r7356j740945r37591O24296N43491r77729j167625J527559M749128
$$ y = [7971968, 8283713, 7388193, 7271246, 6658639, 3619389, -631999, -3151675, -3278325, -2670565, -2055197, -480481, 2332141, 5141840, 6953778, 7907764, 8213723, 7760798, 6995950, 6689407, 6436411, 4723931, 1115258, -2546141, -3768493, -1879688, 1370179, 3428722, 3215798, 1996248, 1801457, 3047564, 4434896, 5155605, 5779932, 6451540, 6008367, 4224945, 3248858, 4760855, 6882050, 6304416, 2830754, -744533, -2950496, -4964023, -7291611, -8189353, -6830065, -5584874, -6990086, -9900914, -10871154, -8697907, -5675309, -4534507, -5750209, -7908145, -9245155, -8442550, -5205672, -941304, 1837764, 1740408, -537, -938128, -313832, 229659, -748070, -1915695, -388136, 4360992]
3922D360992M630329O53279l377516l725649q66675J701669J834741N01502m43298
3913E269374n34676k21262M98842J718320K511186J642915m40215j603023p17408
3904H124053O24445K56474j337101j592380K59008J686804K48816k803713l848812
3895A617594j373784K250716L530021J400192k090319l852597k334802J293154
3887D40175M168388M200303J705348j293020k993761k925882j792504p64496n44520
3878B00031o99496l30612L71541J32191j277832k053718p06470J476698J985392
3869i02275P38094L07824K156847M342794M019285J180303j417981j785952q60102
3860G778837o62711j286966j010679O96172J919105R92264r56584j828498j840896
$$ y = [4360992, 8991321, 9644600, 6267084, 2541435, 1674760, 3376429, 5211170, 5712672, 5269374, 4734698, 4513436, 5012278, 6730598, 9241784, 10884699, 10444484, 8841461, 8124053, 8748498, 9004972, 7667871, 6075491, 6334499, 8021303, 8270119, 5466406, 1617594, 243810, 2494526, 6024547, 7424739, 5334420, 1481823, -852979, 440175, 4608563, 8808866, 10514214, 9221194, 6227433, 3301551, 1509047, 744551, 200031, -499465, -830077, -458536, -326345, -1604177, -3657895, -4364365, -2887667, -902275, -164181, 143643, 2300490, 6643284, 10662569, 11842872, 10424891, 8638939, 7778837, 7116126, 5829160, 4818481, 5514653, 7433758, 8426022, 7469438, 5640940, 3800044]
3851C800044k619079l576853k285787J128721L195238K044734J79700L80926J638506
3842C886150J680015J021387J298524J531958k13142k564260k133768J084084
3834E590948L121988J370418k278599m252205l067870J39271K940019L211910
3826F775880J078426q22462n05852O09816J7051j821473k318616r35872M30080
3817B506978Q77913J291489J769391J289554J37077j78344L40466K23100o41816
3808G615808j031134j137241k175073l249231k003333J306734L680175L559600
3800F566305J890274q13953m504767o789198m798690m32812J175111o36027j106158
3791i449915J872986M464593L772416K075517J263524q51760m708928n502131
$$ y = [3800044, 1180965, -2395888, -4681675, -3552954, -357716, 1687018, 1866718, 2247644, 3886150, 5566165, 6587552, 7886076, 9418034, 9204892, 6640632, 4506864, 5590948, 8712936, 10083354, 7804755, 3552550, 484680, 623951, 3563970, 6775880, 7854306, 7031844, 6525992, 7135808, 7152859, 5331386, 3012770, 2076898, 2506978, 3384891, 4676380, 6445771, 7735325, 7872402, 7694058, 8034524, 8257624, 7615808, 6584674, 5447433, 3272360, 23129, -1980204, -673470, 3006705, 6566305, 8456579, 7642626, 3137859, -3651339, -8450029, -8882841, -7707730, -8343757, -9449915, -7576929, -3112336, 660080, 2735597, 3999121, 3147361, -1561567, -7063698]
3783g063698p27336M050431K990450r23145j139981J825530K279098o41077k289294
3774a639022p20164J296396K073910K606912K510811J99015k833482l345383j867645
3765a718652j514088j735256O60413M362274M249036J47796j979313N19362L009611
3756F001183J685365p50502r78475o30876j699981j810794Q32722K357423j144249
3747C861816o247551o449943j657347K311113K400025R72632L22308p9890l41188
3738d908025J045848L762383M820211K832019K05991m98345R0578J04746m15154
3729G040252k26985P36250J562393K018459K355617K044399L19745k126297l399492
3720A0324341k650030j062220k12816k92691n20562n79971p64470j068735j064690
$$ y = [-7063698, -7791034, -3740603, -750153, -1673298, -2813279, -987749, 1291349, 650272, -1639022, -2359186, -1062790, 1011120, 3618032, 6128843, 6327858, 3494376, 148993, -1718652, -3232740, -4967996, -4307583, 54691, 4303727, 4451523, 2472210, 2991572, 6001183, 7686548, 6936046, 5957571, 5326695, 3626714, 1815920, 2648642, 5006065, 3861816, -2385735, -8835678, -10493025, -8181912, -5781887, -4809255, -4486947, -4566837, -4908025, -3862177, -99794, 4720417, 7552436, 7758427, 7260082, 7350660, 7455406, 7040252, 6813267, 7549517, 9111910, 11130369, 13485986, 15530385, 15850130, 13723833, 10324341, 7674311, 6612091, 6399275, 6106584, 5586022, 5006051, 4241581, 3172846, 2108156]
3711B108156o16052L291N46196O68103j22050j302973q89452J962022M439335
3702F796576K965234j194968k643607N52932L643742K088338j767825k673395
3694G767027m59921O43212p84689j855721q62234M32676N96430M97930N70047
3685F544757k03502j608946j986475j539040k259221l709050k911624K51575J887718
3676e533808L64596o50835J664536M192715K776622r99099k296241j66590K066545
3667A418441K239628J159679k48506j865479k656086j338151R76260J463911p08930
3658D40767l360360m094373k501397K35281K356291K446514P71163o80454n88942
3649d975510Q5014j2191m56154k72181R6189j20869l34738L7434J6754r10238
$$ y = [2108156, 1492104, 1495395, 2041591, 2709694, 2587644, 1284671, 395219, 2357241, 6796576, 9761810, 8566842, 5923235, 6476167, 10119909, 12208247, 10440422, 7767027, 7307106, 7950318, 7165629, 5309908, 4447674, 4880350, 5476780, 5974710, 6544757, 6341255, 4732309, 2745834, 1206794, -1052427, -4761477, -7673101, -7421526, -5533808, -5169212, -5820047, -4155511, 37204, 2813826, 1814727, -481514, -648104, 1418441, 3658069, 4817748, 4569242, 2703763, 47677, -1290474, -314214, 1149697, 440767, -2919593, -7013966, -9515363, -9280082, -6923791, -4477277, -3706114, -4386568, -4975510, -4890496, -4902687, -5358841, -5631022, -5534833, -5655702, -5990440, -5953006, -5936252, -6846490]
3639f846490q52526J603276L994589K806822j111054l411646k247356N316J148965
3630d910104J882464L316015M680216M689388L120372L16728k962747m880070
3622E252262l915068j347750j11636p66172j002001L82858J747225J754243J461928
3613C455889J800633J523928l51467k139045j784270j15540M67996m07443j009197
3604A441484n20179j3725k55735k94148R51259K631621K569925L3009k782612
3595C760899k903731k49023K023692J539858k06359k31969J570515K602011J575147
3586I481040j15249j161156j963535k787551k650660j272547k30664p63196j892082
3577c355600k073654j449513j099297j058944l94323J355807L661270N323536
$$ y = [-6846490, -7699016, -6095740, -2101151, 705671, -405383, -3817029, -6064385, -6059069, -4910104, -3027640, 288375, 4968591, 9657979, 12778351, 13095079, 10132332, 5252262, 1337194, -10556, -122192, -888364, -1890365, -1507507, 239718, 1993961, 3455889, 5256522, 6780450, 6428983, 4289938, 2505668, 2390128, 2858124, 2450681, 1441484, 921305, 907580, 651845, 357697, 1308956, 3940577, 6510502, 6543511, 3760899, 857168, 608145, 2631837, 4171695, 3965336, 3733367, 5303882, 7905893, 9481040, 9365791, 8204635, 6241100, 3453549, 802889, -469658, -700322, -1463518, -3355600, -5429254, -6878767, -7978064, -9037008, -9431331, -8075524, -4414254, 909282]
3569I09282M962852K258334r19447j964514n95703J029117J596351J925137K235870
3560A1437279Q19044k733905n340777m099723n74084J350612P95022J64044O95095
3551B512607Q31775o34046k427904k717266j407999K69574J224610J118507N83264
3542f46878R25288K488582L515496K138214o24700j717415j86648J401576M38833
3533G732348k399521m296690l626112j196189J037633J756780J308683J258765
3525A575697K318408K944510J295877j520435k137971M48063K943674J904407
3517I772230j655477l636780k010879J228999K977602K217162J17844j765856
3509G244845k766859l044136k714862j387950R46524K817625K345417j29859j855556
$$ y = [909282, 5872134, 8130468, 7211021, 5246507, 4650804, 5679921, 7276272, 9201409, 11437279, 12256323, 9522418, 4181641, 81918, -492166, 858446, 1653468, 1817512, 2512607, 3344382, 2710336, 282432, -2434834, -3842833, -3573259, -2348649, -1230142, -646878, 278410, 2766992, 6282488, 8420702, 7796002, 6078587, 5891939, 7293515, 7732348, 5332827, 1036137, -2589975, -3786164, -2748531, -991751, 316932, 1575697, 3894105, 6838615, 8134492, 6614057, 4476086, 4924149, 7867823, 9772230, 8116753, 4479973, 2469094, 3698093, 6675695, 8892857, 9010701, 7244845, 4477986, 1433850, -1281012, -2668962, -1722438, 1095187, 3440604, 3310745, 1455189]
3500A455189j074906O15329O37258r40963j866421j081939K03375N41341k90953
3491a802690j605467k049639m2722M082834O771425M542133j203250n147021m378139
3482h32536j251154P99075J332640J219087q3837k725208m040679j393654L389507
3473c586759N578842L437801j03167j799341j583904j130317j131714j079297
3465a397856l84079J102626K806323L377121J875799q50190k849308k999750j468622
3456g87936J040558L201872L178228P50114j465402j216085j86526j404906l785691
3447f75774l275801L06515K197090k347k536347j758442J20630m95289j955202
3438h074967k92625L450326M371063J363011j650917k182737j805445j575769
$$ y = [1455189, 380283, 995612, 1632870, 691907, -1174514, -2256453, -2053078, -1511737, -1802690, -3408157, -5457796, -5500518, -1417684, 5353741, 9895874, 8692624, 3545603, -832536, -2083690, -1284615, 48025, 1267112, 1183275, -1541933, -5582612, -6976266, -3586759, 1992083, 5429884, 5326717, 3527376, 1943472, 813155, -318559, -1397856, -1781935, -679309, 2127014, 5504135, 7379934, 6529744, 3680436, 680686, -787936, 252622, 3454494, 6632722, 7382836, 5917434, 4701349, 4514823, 3109917, -675774, -3951575, -3645060, -1447970, -1450317, -3986664, -5745106, -5624476, -6119765, -8074967, -8367592, -4917266, -546203, 816808, -834109, -3016846, -4822291, -6398060]
3430f398060J29530L434562N139102L588620J583851J654735J930894K3254k161986
3421H924502j592948L28278R3744j494060m76331K888805L416377q20188m544091
3412F724088k567677K635634M509297J279419k853748m274005l537130k308793
3404c92915o20241J472371K448972J482187J47628K20114J153920J296808L36034
3395G544878j000765k461084l826650m092193k901137j773554j916990j814316
3387a2241811O22406M224460N632362L934439J417053l44445k020079l584606
3379b360221l200298n55788J567194J067643m82364p10710j17920l96326q98606
3370f087396K85653K699499L760578K373637R0937j243948j223363l58489O08051
$$ y = [-6398060, -6268530, -2833968, 2305134, 5893754, 7477605, 9132340, 11063234, 11086488, 8924502, 7331554, 7659832, 7753576, 6259516, 5783185, 8671990, 12088367, 11268179, 6724088, 4156411, 6792045, 11301342, 12580761, 9727013, 5453008, 1915878, -392915, -1013156, 459215, 2908187, 4390374, 4538002, 4758116, 5912036, 7208844, 7544878, 6544113, 4083029, 256379, -3835814, -6736951, -8510505, -10427495, -12241811, -11619405, -7394945, -1762583, 2171856, 3588909, 3244464, 1224385, -2360221, -5560519, -6116307, -4549113, -3481470, -3963834, -4674544, -4792464, -5188790, -6087396, -5801743, -3102244, 658334, 3031971, 3122908, 1878960, 655597, 297108, 905159]
3361I05159Q94745L32937l26366m75420m01243l58501K3340O65771P72624M52544
3351B485590Q07673J450726L69675k236980k975787n35200J257427p34419l061576
3342c172871o18873M516067N201440q6069m754495l615437M39684J724559m96417
3333h62412k545891j791961J109429L634526L357326J78730k541758j277992K676978
3324A936975M372496K037067p41626q99220q845l49780p45697N07485J766146
3315G875001P92562j019894r88525J13027m26022k220635k318456l39732P91465
3306B258791l09080j292818O4093K313345K329609m21514l129213k994813n45963
3297a727563R13996p04733l541950m025196j296248K196374M165853M344845K928926
$$ y = [905159, 1799904, 2132841, 1806475, 1331055, 929812, 571311, 594651, 1260422, 2033046, 2485590, 3293263, 4743989, 5113664, 2876684, -99103, -634303, 623124, -111295, -3172871, -3791744, 724323, 5925763, 5839694, 1085199, -2530238, -2090554, -365995, -862412, -3408303, -5200264, -4090835, -456309, 2901017, 3079747, 537989, -740003, 1936975, 6309471, 8346538, 7604912, 6705692, 6696847, 6347067, 5601370, 6108855, 7875001, 8667563, 7647669, 6659144, 6772171, 6346149, 4125514, 1807058, 1467326, 2258791, 1949711, 656893, 720986, 3034331, 5363940, 4942426, 1813213, -1181600, -1727563, -813567, -1518300, -5060250, -9085446, -10381694, -8185320, -4019467, 325378, 3254304]
3288C254304M7416k478406j934047J202118K806481O65196k204243k062040K77807
3279d25414J408835M13802r55464j476366r95531P14324K912367L228979P93067
3270E618599j558399j052492P51825O77997q02441q13060O98212J145707J18185
3261D784133j63304Q25622J083376j3818o18495J03918O71818K23843k15438j16769
3251F564886k92465p29791l32389N67980K31979j250325j525540L07883K122567
3242E664785J892483J36111j572814k377281j836297p4157J302283O87674q81089
3233B941698j025044O6877Q8759r13492k79181K230494L123191O35089k129067
3224D739324j788138O83014K344510K548399K219331J312852k79176j227095o92993
$$ y = [3254304, 3301720, 823314, -1110733, 91385, 2897866, 3563062, 1358819, -703221, -425414, 983421, 1397223, 441759, -1034607, -2030138, -1315814, 1596553, 4825532, 5618599, 4060200, 3007708, 3759533, 4437530, 3635089, 2822029, 3520241, 4665948, 4784133, 4620829, 5446451, 6529827, 6516009, 5897514, 6001432, 6673250, 6897093, 6681655, 6564886, 6272421, 5542630, 5210241, 5778221, 6010200, 4759875, 3234335, 3542218, 5664785, 7557268, 7693379, 6120565, 3743284, 1906987, 1832830, 3135113, 3822787, 2941698, 1916654, 1983531, 2072290, 1158798, 879617, 3110111, 6233302, 6868391, 4739324, 2951186, 3634200, 5978710, 8527109, 10746440, 12059292, 11780116, 10553021, 9860028]
3215I860028o3791n91816j239448j040972j278784k603357k428272J188328M937203
3206F739119L859743j209417m206425k111226J511391K418842J290213J094357
3198I386597J792861R76716j486502k768548j280924J048138J756864J127166
3190A0552368P90708N09962j165351l500974l740251j311987R30298J080868R68470
3181E114111K301969K835593o3216m010446m164177m01398K487461J772804l61485
3172E511216j417791j698791j782389j063483k27648j148782k777756j417676
3164f023100K892368M803744J329129l211369l481157m92203J404887J430523
3156a347178J588910J710667L08058j440869j364547n72203j446943k634947r12968
$$ y = [9860028, 9796237, 9204421, 7964973, 6924001, 5645217, 3041860, 613588, 1801916, 6739119, 10598862, 9389445, 5183020, 3071794, 4583185, 7002027, 8292240, 9386597, 11179458, 12156174, 10669672, 7901124, 6620200, 7668338, 9425202, 10552368, 11343076, 11853038, 10687687, 7186713, 3446462, 2134475, 3064773, 4145641, 5114111, 7416080, 10251673, 10188457, 6178011, 2013834, 1612436, 4099897, 5872701, 5511216, 4093425, 2394634, 612245, -451238, -678886, -1827668, -4605424, -6023100, -3130732, 1673012, 3002141, -209228, -3690385, -4182588, -2777701, -1347178, 241732, 1952399, 2260457, 819588, -544959, -1117162, -2564105, -5199052, -6112020]
3147f112020K743490M027864K125583O89346J457912J709154n70632l196127l429954
3138e55384j896378q47150q54208r12862k27470J106405J958395O95362k504948
3129d038238m464184k489545J591072L774450L594580L817587M699535L087222
3121I572479j740783n735465n628547l190657j602252p79272R45670L056075L713737
3112a389015K717985J201168k07023j001377k63270J582189K250522Q39418l41435
3103E389162N53612J511701r0967k696930k776940p56963m30039k396036k639807
3094d333207P92057L838120K221391j735195k177129J724069M709392L205451
3086H244949j49599j545842j696809l125861m558862k657855J748636M100514
$$ y = [-6112020, -3368530, 659334, 2784917, 3474263, 4932175, 6641329, 6070697, 2874570, -555384, -2451762, -3298912, -4153120, -5065982, -5293452, -4187047, -2228652, -1533290, -4038238, -8502422, -10991967, -9400895, -5626445, -2031865, 1785722, 6485257, 9572479, 7831696, 2096231, -3532316, -6722973, -8325225, -9104497, -8158827, -5102752, -1389015, 1328970, 2530138, 2323115, 1321738, 1058468, 2640657, 4891179, 5730597, 5389162, 5942774, 7454475, 7363508, 4666578, 1889638, 1132675, 702636, -1693400, -4333207, -3541150, 296970, 2518361, 783166, -1393963, 330106, 5039498, 8244949, 8095350, 6549508, 4852699, 1726838, -2832024, -5489879, -3741243, 359271]
3078C59271L022208J892664K270852R73017l467357o309371l076707L005272N187714
3069C857563K480449m81358j169301j174146j329086n81264J73433j343150l784776
3060c351636l165381K03185J416966q15437j651628J552083M312089K425193r01662
3051B3772m67405K359004K299234j049140k905117q99648K056638K631229R41004
3042D989571q26513q86538J132249L560047L552464M32950k829528l298951j699678
3033D126073l54644M05592J096988O13223j607296k870052o76786K589494K694273
3024F016865Q0804j262144o05215r23106k622283k466692J70418J496230j82323
3015b97446j248904R36210L117401J415904k113314k755954n34935M81356r28450
$$ y = [359271, 3381479, 5274143, 7544995, 8518012, 5050655, -1258716, -4335423, -1330151, 3857563, 6338012, 5856654, 4687353, 3513207, 2184121, 1602857, 1776290, 433140, -3351636, -6517017, -6313832, -4896866, -5712303, -7363931, -5811848, -1499759, 925434, 23772, -443633, 1915371, 4214605, 3165465, 260348, -639300, 1417338, 4048567, 4989571, 4163058, 3276520, 4408769, 7968816, 11521280, 11954230, 9124702, 5825751, 4126073, 3771429, 4177021, 5274009, 5887232, 4279936, 1409884, 733098, 3322592, 6016865, 6097669, 4835525, 4230310, 3307204, 684921, -1781771, -1611353, -115123, -297446, -1546350, -610140, 2507261, 3923165, 1809851, -946103, -1481038, -999682, -1928132]
3006a928132j707631j06541J583684J225228M29831J709495M031765L886607L72398
2997I496704l075103k881295J51773K083263J090043n48821l50166O04367k69177
2988F301588k621021l510124j850207K43785R59856J035296J556775J907645J341084
2979E364677O13673M19618r4103j475351k207166r32583P69935K95935j881905
2970H72730k539534k40034K724167L578908K366395R21998J2907r55734k033077
2961D708726k173355q81183P59310J466412J476029J807742K129671Q63614k115400
2952H041566m417106l978843j756609L1082J237002L069736M726609L785640L69992
2943A1109069k109214j628524k54374m33091j196045n23853P58630O38650p7848
$$ y = [-1928132, -3635763, -3742304, -2158620, -933392, -503561, 1205934, 5237699, 9124306, 9496704, 6421601, 3540306, 3692079, 5775342, 6865385, 6316564, 5966398, 6570765, 6301588, 3680567, 170443, -1679764, -1435979, -476123, 559173, 2115948, 4023593, 5364677, 5978350, 6397968, 6303865, 4828514, 2621348, 1688765, 2458700, 2754635, 872730, -1666804, -1906838, 817329, 4396237, 6762632, 7684630, 7697537, 6741803, 4708726, 2535371, 1654188, 2413498, 3879910, 5355939, 7163681, 9293352, 10156966, 8041566, 3624460, -354383, -2110992, -2079910, -842908, 2226828, 6953437, 10739077, 11109069, 8999855, 7371331, 7116957, 6683866, 5487821, 4963968, 5722598, 6361248, 6283400]
2934F283400R26321K831102K197292j517045m540606l980749j318400P34017J921103
2925C536435K940208K828907O27513j978569k494853j190971l15912m38791j67773
2916C346194P89322R23580m48654k098095k830705k593273j435589M98806J711948
2907b136466N83254j558981j386173J329552K614235J68972k702295j897904J340665
2898c645141K765148J722269J101471J596746P41573j976725l532664k255624
2890c482947m48896l01302o34451O5129N46354n11008j353160R7606K285139K168291
2880a569245J01721p35695P67589K372704K098364N75925n08431m26051L67823
2871C044704O56374o85875l058453m027764k233161N42859J809436J670364J681498
$$ y = [6283400, 7209721, 10040823, 12238115, 10721070, 6180464, 2199715, 881315, 1615332, 3536435, 6476643, 9305550, 9933063, 7954494, 5459641, 4268670, 3952758, 3513967, 3346194, 4135516, 5059096, 4610442, 2512347, -318358, -2911631, -4347220, -3848414, -2136466, -1553212, -3112193, -4498366, -3168814, -554579, -385607, -3087902, -4985806, -3645141, -879993, 842276, 1943747, 3540493, 4282066, 2305341, -1227323, -3482947, -3931843, -4233145, -4867596, -4802467, -4256113, -4767121, -6120281, -6022675, -3737536, -1569245, -1467524, -2203219, -1435630, 937074, 3035438, 3611363, 3102932, 2676881, 3044704, 3701078, 3015203, -43250, -4071014, -6304175, -5761316, -3951880, -2281516, -600018]
2862f00018J727230O90369p00234o41033O23151J315191J287802J592395J347826
2853F642679j284494m850213n256782j630498K113222K857825J946306J633920
2845B171965J410634J96473q31080l60809M29182L4018n56582K37920J619686
2836D351407J870481J199612O79607j10776j808009l068558k395869r85801r74583
2827a242489j856349j534382j55359J77853q07506j069450L06906J860055K293547
2818b027174J934490J326063N44049K17808J069847K069962J229528j208223k490535
2809B665815j076772J228264J793719K55980j773403k704918j883829K00588J849726
2800E55170J463546m06056j393606k47053J720685K557533J778823J08861j373410
$$ y = [-600018, 1127212, 1817581, 1117347, 476314, 1099465, 2414656, 3702458, 5294853, 6642679, 5358185, 507972, -4748810, -6379308, -4266086, -1408261, 538045, 2171965, 3582599, 3779072, 2947992, 2587183, 3016365, 3050383, 2493801, 2731721, 4351407, 6221888, 7421500, 8101107, 7990331, 6182322, 3113764, 717895, -267906, -1242489, -3098838, -4633220, -4788579, -4610726, -5418232, -6487682, -6180776, -4320721, -2027174, -92684, 1233379, 1777428, 1995236, 3065083, 5135045, 6364573, 5156350, 2665815, 1589043, 2817307, 4611026, 4867006, 3093603, 388685, -1495144, -1294556, 555170, 2018716, 1612660, 219054, -27999, 1692686, 4250219, 6029042, 6137903, 4764493]
2791D764493j214303J490283M978047N372909J212978l755716m514130r81937
2783G352624K025128J200366j329864j712877K5153N28316j395356k766186j055215
2774B872089J500816P39842l189816n474157l086907J167862K783265J589740
2766a097266J042964K532462L487309J613107j478263k345860j57294K465167
2758F062326K713611N87200j620179k132717j272946k59093N88221J532530J993207
2749H192160J030819p45000j509097q96163n26952j173534j458420n07191L40991
2740B747613J65805N29677K558576M066106K634180o0455n09500J076388J257759
2731A4466149j006779l077955l166694k412948j804286o17816R94108J181757
$$ y = [4764493, 3550190, 5040473, 10018520, 15391429, 16604407, 12848691, 8334561, 7352624, 9377752, 10578118, 9248254, 7535377, 7560530, 8088846, 6693490, 3927304, 2872089, 4372905, 5112747, 1922931, -3551226, -6638133, -5470271, -2687006, -1097266, -54302, 2478160, 5965469, 7578576, 6100313, 3754453, 3597159, 6062326, 8775937, 9363137, 7742958, 5610241, 4337295, 4078202, 4666423, 6198953, 8192160, 9222979, 8477979, 6968882, 6072719, 5545767, 4372233, 2913813, 2406622, 2747613, 2913418, 3443095, 6001671, 10067777, 12701957, 12641502, 12132002, 13208390, 14466149, 13459370, 10381415, 7214721, 4801773, 2997487, 2379671, 3373779, 4555536]
2723D555536m87309j990394k116753j867922j540426K01622K776270K784379r56645
2714A358358m601981m277057j269230O22456N39049K74474N31463O95126R17087
2705e210255J497081J440085K28363m71751M87636J156226l03858j763805l19089
2696c259367K242692J720191j515077k767625n60219J039894q46431l284974k259163
2687i490079J226463K905631J322007p02294j38533K584112M131707J975073k347548
2678A466539m245353j360272L095268M184281J501845j174170j816628j953869
2670c02359k293117r90864J978638K978528K32529k333685o35632K884310K727737
2661D246085j087596l075009q18563J655606N85938j855189j513471J223799K572948
$$ y = [4555536, 4068227, 2077833, -38920, -1906842, -3447268, -3245646, -469376, 2315003, 1358358, -3243623, -7520680, -8789910, -8167454, -7628405, -7353931, -6822468, -6127342, -5210255, -3713174, -2273089, -2044726, -2516477, -2028841, -872615, -1176473, -2940278, -3259367, -1016675, 703516, -811561, -3579186, -4139405, -3099511, -3945942, -7230916, -9490079, -8263616, -5357985, -4035978, -4738272, -4876805, -2292693, 1839014, 3814087, 1466539, -2778814, -4139086, -1043818, 3140463, 4642308, 3468138, 1651510, -302359, -2595476, -3586340, -1607702, 1370826, 1603355, -730330, -1365962, 1518348, 4246085, 3158489, 83480, -735083, 920523, 1506461, -348728, -1862199, -638400, 1934548]
2652A934548J508668R16262K549049M196118L148588J03552k174847k509397j673345
2643G999196k67567J385325J778498n28236l751506l759558M92293M691481M284463
2634A2324389J06626l269818l344050j383667N16837J283757M44289j318840j596909
2625C762614R02750L330391J813109k479173m257787j756130P98528O8152j273406
2616I09048O61014M460387N622194L181526K44265r40321q73802m16702J85162
2607A3032771M1922j714343l917164m449993l307123k291953j887228r59065M51175
2598e001001P69195k34874p68242J0855O38464l3575q85569m37466Q61040J511451
2588c569722J067808L45695K42956R21926J593364J135593k29522l85602K003084
$$ y = [1934548, 3443216, 4359478, 6908527, 11104645, 14253233, 14356785, 12181938, 9672541, 7999196, 7731629, 9116954, 10895452, 10367216, 6615710, 2856152, 3348445, 8039926, 12324389, 12431015, 9161197, 5817147, 4433480, 4950317, 6234074, 6678363, 5359523, 3762614, 4665364, 7995755, 9808864, 7329691, 3071904, 1315774, 2114302, 2182454, 909048, 1570062, 6030449, 11652643, 14834169, 15078434, 14138113, 13264311, 12847609, 13032771, 13074693, 11360350, 7443186, 2993193, -313930, -2605883, -4493111, -5452176, -5001001, -4231806, -4466680, -5234922, -5224067, -4585603, -4619178, -5504747, -5942213, -5081173, -3569722, -2501914, -2156219, -1913263, -991337, 602027, 1737620, 1508098, 1122496, 3125580]
2579C125580M724904M174081L49440k833125k886261j778957k278521l718054
2571a120913l521024j258240J112816K097135J693330K10180j956313l505956
2563f248985k890425j42141K859318M126929L169533J135360k58721l17799j6680
2554A416389m02151o11938R30248L232819L020240n32421l698414k902013L83587
2545H36346K062468J263085N24378Q60182L65525j683015k794045j082112J344941
2536A697753J109587j641812l391310j859506J275302K616503J016893j343931
2528e20521j693805J00388J695186J559236Q00120R06321J098004k16595k214284
2519A514050k370679l69842J287771J239307J267452K972073M670908L701309
$$ y = [3125580, 7850484, 12024565, 12374005, 9540880, 6654619, 4875662, 2597141, -1120913, -4641937, -5900177, -4787361, -2690226, -996896, -786716, -2743029, -6248985, -9139410, -9281551, -6422233, -2295304, 874229, 2009589, 1750868, 1433069, 1416389, 1014238, 402300, 1332548, 4565367, 7585607, 7053186, 3354772, 452759, 836346, 2898814, 4161899, 4686277, 5546459, 5911984, 4228969, 1434924, 352812, 1697753, 2807340, 1165528, -2225782, -4085288, -2809986, -193483, 823410, -520521, -2214326, -2113938, -418752, 1140484, 1940604, 2846925, 3944929, 3728334, 1514050, -856629, -1226471, 61300, 1300607, 2568059, 5540132, 10211040, 13912349]
2511A3912349L75945k529640l408384k923449j986070o53623Q85538J835931J701119
2502G209716P80748k66484p13753p5407J015759R10638q95225k399515j444722
2493D121755J076584K212613R66891o88236j005862n48273l46957Q101J069980
2484F866596J750510M94770k320277m388196l728075m43415L285079M675212K682294
2475H874498o79015k253214j330875p9279K981J23450J417933K171817K93720
2466H542016k556208k353077J562655M785641L051949k512993o676416n781515
2458a937948j119266K938136L360508R80138j118178j350901j041044j887338
2450a175893l359202l801960l011757j902614m14575J943684L836581L118477
$$ y = [13912349, 14288294, 11758654, 8350270, 5426821, 3440751, 2787128, 3672666, 5508597, 7209716, 7990464, 7723980, 7010227, 6934820, 7950579, 8861217, 7965992, 5566477, 4121755, 5198339, 7410952, 8377843, 7689607, 6683745, 6135472, 5788515, 5796616, 6866596, 8617106, 9111876, 6791599, 2403403, -1324672, -1768087, 1516992, 6192204, 8874498, 8195483, 5942269, 4611394, 4532115, 4535096, 4658546, 6076479, 8248296, 8542016, 5985808, 3632731, 5195386, 9981027, 13032976, 10519983, 3843567, -1937948, -3057214, -119078, 3241430, 4221568, 3103390, 1752489, 711445, -1175893, -4535095, -8337055, -11348812, -13251426, -13666001, -11722317, -7885736, -4767259]
2442d767259M20098j078422k71356L94783n46376p07016J998810M980021M190593
2433D613876J53734k826162k666903j175879q0321Q24024J205330k28358k414251
2424b594910j861999J947877M285645J311046l849464m785200l84570L975396
2416a956179L768638M35076j764326j203585N03476J547579J586169J049734L63820
2407D330402j30518l01701k93050j47895L00448Q63611Q62398M7706q57719j157635
2397C516047j242212j824467k436439j767730L38306K202540K173216N46183j008079
2388D97365j505838j380992j333812j332426j045348n92762k67897J90278J353631
2379e417801L011724L865422K808683M30659j262608r65006L12814K96267j727106
$$ y = [-4767259, -4347161, -5425583, -5696939, -5302156, -5848532, -6555548, -4556738, 423283, 4613876, 4767610, 1941448, -725455, -1901334, -1981655, -1157631, 47699, -180659, -2594910, -4456909, -2509032, 1776613, 3087659, -761805, -5547005, -5931575, -1956179, 1812459, 2247535, 483209, -720376, -216900, 1330679, 2916848, 3966582, 4330402, 4199884, 3898183, 3605133, 3457238, 3757686, 4621297, 5483695, 5531401, 4673682, 3516047, 2273835, 449368, -1987071, -3754801, -3416495, -1213955, 959261, 1505444, 497365, -1008473, -2389465, -3723277, -5055703, -6101051, -6693813, -6961710, -6771432, -5417801, -2406077, 1459345, 4268028, 4698687, 3436079, 2471073, 2783887, 3080154, 1353048]
2370A353048l724151l192657l41569J933040J498599m74902j182937J73696J587486
2361b370347J179974k51826n07355Q36270J830982R54627p02229r69083M24367
2352D25380J738264J895181J682463J844704J595398K03321j202308j053147J95830
2343G325086P60954J58661p25284j710849l112542l584610j110922L103142M739221
2334E842857J985553j647707k277152q69509o69218j617708j106928R06868J666450
2325B213506L92107n77217j7060M15586k17209j58936J644744L086478K048279
2316H830278k95280j647547k088118k820346l022642j006188K160375L202815
2308C313347J088358j540251k148142j518438j843909k937455k285028J089812
$$ y = [1353048, -2371103, -5563760, -5905329, -3972289, -2473690, -2948592, -4131529, -3957833, -2370347, -1190373, -1442199, -1949554, -1113284, 717698, 1672325, 970096, 1013, 425380, 2163644, 4058825, 5741288, 7585992, 9181390, 9384711, 8182403, 7129256, 7325086, 8086040, 8244701, 7519417, 5808568, 2696026, -888584, -1999506, 1103636, 5842857, 7828410, 6180703, 3903551, 3034042, 2364824, 747116, -359812, 547056, 2213506, 2605613, 2028396, 2011336, 2426922, 2209713, 2050777, 3695521, 6781999, 8830278, 8534998, 6887451, 4799333, 1978987, -1043655, -2049843, 110532, 3313347, 4401705, 2861454, 713312, -805126, -2649035, -5586490, -7871518, -6781706]
2300f781706M517752M702805K031828p1868j87269p35792l343777n058170k392007
2291g318204K555698M264696J673855o79871j7450J088544L25344r5073J868933
2282C666472L349647R69024l096338m248000k431377j013299m32214J547216M054297
2273B365428L391366m53883k940299j810380R2234L55818M60619J474720J038708
2264C974331k075510m363079k475314J270404K395986J060498J014631L090490
2256C892437M146322K308175o18099k472805l229241l286954k084173K21760J752405
2247F29827J133055n44782j271347p21851j08260o278L86726J726404L203825
2238D427319L385496K047728M21753n03097j045309j614607j422374K38189K028331
$$ y = [-6781706, -2263954, 2438851, 4470679, 4398811, 4211542, 3475750, 131973, -4926197, -7318204, -4762506, -497810, 1176045, 496174, 478724, 1567268, 1892612, 1797539, 3666472, 7016119, 7985143, 4888805, 640805, -1790572, -2803871, -3236085, -1688869, 2365428, 5756794, 5302911, 2362612, 552232, 644466, 1000284, 1460903, 2935623, 3974331, 1898821, -2464258, -4939572, -3669168, -1273182, -212684, 801947, 3892437, 8038759, 10346934, 9728835, 7256030, 4026789, 739835, -1344338, -1122578, 629827, 1762882, 1218100, -53247, -775098, -883358, -889636, -502910, 1223494, 4427319, 7812815, 9860543, 10282296, 9779199, 8733890, 7119283, 5696909, 5935098, 7963429]
2229G963429J756888m11981j869398j143880L69911J040559J250124J629587J042106
$$ y = [7963429, 9720317, 9308336, 7438938, 6295058, 6664969, 7705528, 8955652, 10585239, 11627345]
$$ [...]
##END NTUPLES=NMR SPECTRUM
##END=
